##TITLE=31Pdec_PR192_5T
 D2O, 24 sc
 28.10.2020
##JCAMPDX= 6.0         $$ Bruker NMR JCAMP-DX V2.0
##DATA TYPE= NMR SPECTRUM
##DATA CLASS= NTUPLES
##ORIGIN= UXNMR, Bruker Analytische Messtechnik GmbH
##OWNER= root
$$ XWIN-NMR		Version 3.5
$$ Wed Oct 28 13:49:30 2020 Russian Standard Time (UT+4h)  she@DPX200
##.OBSERVE FREQUENCY= 81.013821
##.OBSERVE NUCLEUS= ^31P
##.ACQUISITION MODE= SIMULTANEOUS
##.ACQUISITION SCHEME= undefined
##.AVERAGES= 24
##.DIGITISER RES= 17
##SPECTROMETER/DATA SYSTEM= spect
##.PULSE SEQUENCE= zgpg30
##.SOLVENT NAME= D2O
##.SHIFT REFERENCE= (INTERNAL, D2O, 0, 182.463)
##AUDIT TRAIL= $$ (NUMBER, WHEN, WHO, WHERE, WHAT)
$$ ##TITLE= Audit trail, XWIN-NMR		Version 3.5
$$ ##JCAMPDX= 5.01
$$ ##ORIGIN= Bruker BioSpin GmbH
$$ ##OWNER= she
$$ F:/spectra/data/she/nmr/P31/1/pdata/1/auditp.txt
$$ ##AUDIT TRAIL=  $$ (NUMBER, WHEN, WHO, WHERE, WHAT)
(   1,<2020-10-28 13:48:44.57 +0400>,<she>,<DPX200>,
      <created by zg, POWCHK disabled, PULCHK disabled
       configuration hash MD5:
       00 E9 B6 7A A2 85 ED C7 34 08 36 98 17 FE 4E 26
       data hash MD5: 32K
       9A 36 42 01 E7 F1 4B 7A 71 98 B0 9E 83 4E 9B 54>)
(   2,<2020-10-28 13:48:47.17 +0400>,<she>,<DPX200>,
      <Start of raw data processing
       efp BC_mod = 2 LB = 1 FT_mod = 6 PKNL = 1 PHC0 = -2396.788 PHC1 = 132.0008 SI = 64K 
       data hash MD5: 64K
       DA 18 95 81 52 0E 14 C8 A5 9F 07 0E 40 68 9C 8A>)
(   3,<2020-10-28 13:48:59.70 +0400>,<she>,<DPX200>,
      <pk PHC0 = -31.88403 PHC1 = 0 
       data hash MD5: 64K
       F7 A6 4E 46 23 FC DA B2 81 D2 51 83 08 7F 3B B7>)
$$ ##END=
$$ 
$$ hash MD5
$$ AD C1 4E 2D A4 F5 9C FD 0F EF E1 85 1A 60 31 1B
##$RELAX= 
##$RELAX= 
##$RELAX= 
##$RELAX= 
##$RELAX= 
##$RELAX= 
##$RELAX= 
##$RELAX= 
$$ Bruker specific parameters
$$ --------------------------
##$DU= <F:/spectra>
##$EXPNO= 1
##$NAME= <P31>
##$PROCNO= 1
##$TYPE= <nmr>
##$USER= <she>
##$AMP= (0..31)
100 100 100 100 100 100 100 100 100 100 100 100 100 100 100 100 100 100 
100 100 100 100 100 100 100 100 100 100 100 100 100 100 
##$AQSEQ= 0
##$AQ_mod= 1
##$AUNM= <au_zg>
##$AUTOPOS= <>
##$BF1= 81.014009
##$BF2= 200.13
##$BF3= 200.13
##$BF4= 200.13
##$BF5= 200.13
##$BF6= 200.13
##$BF7= 200.13
##$BF8= 200.13
##$BYTORDA= 1
##$CFDGTYP= 0
##$CFRGTYP= 5
##$CHEMSTR= <none>
##$CNST= (0..31)
1 1 145 1 1 1 1 1 1 1 1 1 1 1 1 1 1 1 1 1 1 1 1 1 1 1 1 1 1 1 1 1 
##$CPDPRG= <waltz16>
##$CPDPRG1= <>
##$CPDPRG2= <waltz16>
##$CPDPRG3= <>
##$CPDPRG4= <mlev>
##$CPDPRG5= <mlev>
##$CPDPRG6= <mlev>
##$CPDPRG7= <mlev>
##$CPDPRG8= <mlev>
##$CPDPRGB= <>
##$CPDPRGT= <>
##$D= (0..31)
0 1 0 0 0 0 0 0 0 0 0 0.03 2e-05 3e-06 0 0 0 0 0 0 0 0 0 0 0 0 0 0 0 0 
0 0 
##$DATE= 1603878523
##$DBL= (0..7)
120 120 120 11 120 120 24 19 
##$DBP= (0..7)
150 150 150 150 150 150 150 150 
##$DBP07= 0
##$DBPNAM0= <>
##$DBPNAM1= <>
##$DBPNAM2= <>
##$DBPNAM3= <>
##$DBPNAM4= <>
##$DBPNAM5= <>
##$DBPNAM6= <>
##$DBPNAM7= <>
##$DBPOAL= (0..7)
0.5 0.5 0.5 0.5 0.5 0.5 0.5 0.5 
##$DBPOFFS= (0..7)
0 0 0 0 0 0 0 0 
$$ [...]
##$SUBNAM2= <"">
##$SUBNAM3= <"">
##$SUBNAM4= <"">
##$SUBNAM5= <"">
##$SUBNAM6= <"">
##$SUBNAM7= <"">
##$SUBNAM8= <"">
##$SUBNAM9= <"">
##$SW= 369.568048894756
##$SWIBOX= (0..15)
0 1 3 0 0 0 0 0 0 0 0 0 0 0 0 0 
##$SW_h= 29940.119760479
##$TD= 32768
##$TD0= 1
##$TE= 0
##$TE2= 300
##$TE3= 300
##$TEG= 300
##$TL= (0..7)
0 120 53 12 22 120 120 120 
##$TP= (0..7)
150 150 150 150 150 150 150 150 
##$TP07= 0
##$TPNAME0= <>
##$TPNAME1= <>
##$TPNAME2= <>
##$TPNAME3= <>
##$TPNAME4= <>
##$TPNAME5= <>
##$TPNAME6= <>
##$TPNAME7= <>
##$TPOAL= (0..7)
0.5 0.5 0.5 0.5 0.5 0.5 0.5 0.5 
##$TPOFFS= (0..7)
0 0 0 0 0 0 0 0 
##$TUNHIN= 0
##$TUNHOUT= 0
##$TUNXOUT= 0
##$USERA1= <user>
##$USERA2= <user>
##$USERA3= <user>
##$USERA4= <user>
##$USERA5= <user>
##$V9= 5
##$VALIST= <valist>
##$VCLIST= <CCCCCCCCCCCCCCC>
##$VD= 0
##$VDLIST= <DDDDDDDDDDDDDDD>
##$VPLIST= <PPPPPPPPPPPPPPP>
##$VTLIST= <TTTTTTTTTTTTTTT>
##$WBST= 1024
##$WBSW= 4
##$XGAIN= (0..3)
0 0 0 0 
##$XL= 0
##$YL= 0
##$YMAX_a= 17594
##$YMIN_a= -9590
##$ZGOPTNS= <>
##$ZL1= 120
##$ZL2= 120
##$ZL3= 120
##$ZL4= 120
##$ABSF1= 0
##$ABSF2= 0
##$ABSG= 0
##$ABSL= 0
##$ALPHA= 0
##$AQORDER= 0
##$ASSFAC= 0
##$ASSFACI= 0
##$ASSFACX= 0
##$ASSWID= 0
##$AUNMP= <proc_1d>
##$AZFE= 0.1
##$AZFW= 0.5
##$BCFW= 0
##$BC_mod= 2
##$BYTORDP= 0
##$COROFFS= 0
##$CY= -3
##$DATMOD= 1
##$DC= 0
##$DFILT= <>
##$DTYPP= 0
##$F1P= 0
##$F2P= 0
##$FCOR= 1
##$FTSIZE= 65536
##$FT_mod= 6
##$GAMMA= 0
##$GB= 0
##$INTBC= 1
##$INTSCL= 5.30512e-09
##$ISEN= 30
##$LB= 1
##$LEV0= 0
##$LPBIN= 0
##$MAXI= 10000
##$MC2= 0
##$MEAN= 0
##$ME_mod= 0
##$MI= 50
##$NCOEF= 0
##$NC_proc= -6
##$NLEV= 6
##$NOISF1= 182.463
##$NOISF2= 159.3651
##$NSP= 0
##$NTH_PI= 0
##$NZP= 0
##$OFFSET= 182.463
##$PC= 4
##$PHC0= -2428.672
##$PHC1= 132.0008
##$PH_mod= 1
##$PKNL= yes
##$PPARMOD= 0
##$PSCAL= 0
##$PSIGN= 0
##$REVERSE= no
##$SF= 81.014009
##$SI= 65536
##$SIGF1= 159.3651
##$SIGF2= -187.1042
##$SINO= 113.3802
##$SIOLD= 16384
##$SREGLST= <1H.CDCl3>
##$SSB= 0
##$STSI= 65536
##$STSR= 0
##$SW_p= 29940.119760479
##$SYMM= 0
##$S_DEV= 0
##$TDeff= 32768
##$TDoff= 0
##$TI= <>
##$TILT= no
##$TM1= 0
##$TM2= 0
##$TOPLEV= 0
##$USERP1= <user>
##$USERP2= <user>
##$USERP3= <user>
##$USERP4= <user>
##$USERP5= <user>
##$WDW= 1
##$XDIM= 65536
##$YMAX_p= 405048342
##$YMIN_p= -14098968
$$ End of Bruker specific parameters
$$ ---------------------------------
##NTUPLES= NMR SPECTRUM
##VAR_NAME=  FREQUENCY,     SPECTRUM/REAL,   SPECTRUM/IMAG
##SYMBOL=    X,             R,               I
##VAR_TYPE=  INDEPENDENT,   DEPENDENT,       DEPENDENT
##VAR_FORM=  AFFN,          ASDF,            ASDF
##VAR_DIM=   65536,         65536,           65536
##UNITS=     HZ,            ARBITRARY UNITS, ARBITRARY UNITS
##FACTOR=    0.456856943014862, 1,           1
##FIRST=     14782.0589164895, 0,            0
##LAST=      -15158.0608439895, 0,           0
##MIN=       -15158.0608439895, -14098968,   0
##MAX=       14782.0589164895, 405048342,    0
$$ Real data points
##PAGE= N=1
##DATA TABLE= (X++(R..R)), XYDATA
$$ [...]
38437G06623P29531K11569R23328Q61871o04200j620427r38105J92549P2793j119269
38427e83737j942905j560057k81778R80937J315659M77781o99709j064683m33447
38418c791939L92198Q00592Q38990N93068K979o04338o69267k45961J14053L81500
38408b188125R54450J423703P23691r57405j723547m05763J578335K020800Q33473
38399B259612k26444k72601j32810m71410o89828k65321J41138j82355p24357
38390e64376o56361l13479n61949j087096o84835O90996J527659Q87129k34073
38381i96385n11745l05382q54624j992912k110445n14070J431403K046920J307361
38372b499879M07621Q9004K25360N77916R70144Q69872j84210j551349j801485
$$ y = [706623, 1436154, 1647723, 2571051, 3432922, 2828722, 1208295, 270190, 462739, 535532, -583737, -2526642, -4086699, -4368477, -3387540, -2071881, -1594100, -2293809, -3358492, -3791939, -3399741, -2599149, -1760159, -1167091, -1164112, -1768450, -2437717, -2683678, -2569625, -2188125, -1233675, 190028, 913719, -43686, -1767233, -2172996, -594661, 1426139, 2259612, 2033168, 1760567, 1627757, 1156347, 466519, 201198, 342336, 159981, -564376, -1220737, -1534216, -2096165, -3183261, -3868096, -3177100, -1649441, -762312, -996385, -1508130, -1813512, -2668136, -4661048, -6771493, -7285563, -5854160, -3807240, -2499879, -2092258, -2003254, -1777894, -1199978, -229834, 640038, 455828, -1095521, -2897006]
38363b897006n42670P92575O84508m77258j024574l52016M74702N63722M66194
38354b311823R74797J646069J544165Q14590L16180N8374o24620j416860j081534
38345h0662M35477J442694Q19301l83111o54620k05493j73570n68045m99413O0354
38335A92912K34394k34517o89378o96436m19309n2331J54944k66740j073948q93667
38325c744076Q26810K222779J307604p51377j110722K59757N46567j052616j787451
38316c282725n7937J577747N00164j516507j097914J243772J944735k2126j843311
38307b554102j336285K76430Q81400L74895j08481j60547j01808r3054j34341
38298b955893k28957r9412N03340J016020N58792n52606q48056L55723J976935
$$ y = [-2897006, -3439676, -2647101, -1962593, -2439851, -3464425, -3816441, -3341739, -2778017, -2311823, -1337026, 309043, 1853208, 2667798, 2983978, 3042352, 2417732, 1000872, -80662, 354815, 1797509, 2616810, 2233699, 1579079, 1373586, 1200016, 631971, 132558, 192912, 427306, 192789, -496589, -1193025, -1612334, -1664665, -1509721, -1776461, -2850409, -3744076, -2917266, -694487, 613117, -138260, -1248982, -989225, -442658, -1495274, -3282725, -3340662, -1762915, -1262751, -2779258, -3877172, -2633400, -688665, -710791, -2554102, -3890387, -3613957, -2732557, -2357662, -2466143, -2626690, -2728498, -2821552, -2955893, -3184850, -3284262, -2780922, -1764902, -1206110, -1758716, -2606772, -2251049, -274114]
38289b74114K502866J501979l86622k044660k287739p89342J078384J423715K33864
38280I58331n80937N200P01975J54448p99629n88107L82621L13785j027415j799120
38270b278848q37633O79487J086437N15050K48706O10590P91157M31836L0573
38261A277355k80540r83771j754593j206145R27135K544753J658977o19349j393819
38252A70003O711J335334R37669j57861m49603k88668o41471j068297n93295L93818
38242c55660O83621P3247o58281j037157j027008m95119L92530R01917P81377
38233g40533P17853Q92780L77054r09276j276770L9560J008158j21855j504675
38224a517704l61860K267451K854221Q52950p99421o72091n75146j599247k051344
$$ y = [-274114, 2228752, 3730731, 3344109, 1299449, -988290, -1777632, -699248, 724467, 958331, 377394, 382594, 1084569, 1239017, 439388, -148719, 233902, 547687, -479728, -2278848, -3116481, -2436994, -1350557, -835507, -586801, 23789, 814946, 1246782, 1277355, 996815, 13044, -1741549, -2947694, -2020559, 524194, 2183171, 1563822, 170003, 176714, 1512048, 2449717, 2291856, 1842253, 1553585, 912114, -156183, -749478, -355660, 327961, 401208, -257073, -1294230, -2321238, -2816357, -2423827, -1521910, -740533, -22680, 870100, 1247154, 337878, -938892, -899332, 108826, -13029, -1517704, -1879564, 387887, 3242108, 4095058, 3295637, 2623546, 2048400, 449153, -1602191]
38215a602191p56379P16239Q56162N65082Q97069Q76399m27293j716306j447219
38206b038437l48562o077l18229j56053O11575J300337J562407J191896J0547
38197A809404j152581r61972J20537R5188j053772p41900J754668L171251J018317
38188D059140k230526k781796j070394j53360m06049J81230J511625J370884l04499
38179A76255j009258J25562J095268N63182m01800p95343j052040j190747k85227
38170b774148J287792J582880J38275r76831k99174R19956R42988K1330o17843
38161B25225o85028n21474j71429K20066J89102j35959k1001M76807L61265o17881
38151f80307j475116j547707j117126k56094J221641K386552J808013Q4515m43045
$$ y = [-1602191, -2358570, -1642331, -786169, -221087, 675982, 1552381, 1125088, -591218, -2038437, -2386999, -2393076, -2711305, -2867358, -2255783, -955446, 606961, 1798857, 1809404, 656823, -305149, -184612, -89424, -1143196, -1885096, -130428, 3040823, 4059140, 1828614, -953182, -2023576, -2176936, -2582985, -2401755, -890130, 480754, 176255, -833003, -707441, 387827, 951009, 549209, -246134, -1298174, -2488921, -2774148, -1486356, 96524, 234799, -742032, -1041206, -121250, 821738, 843068, 225225, -459803, -981277, -1152706, -932640, -743538, -879497, -900498, -423691, -62426, -680307, -2155423, -3703130, -4820256, -5076350, -3854709, -1468157, 339856, 424371, -18674]
38142a8674O62351R42561r87192k830514j945983N67748J486569L6985j459925
38133c546074j050243P06639K017120J854221N66815o50738q92385m71817l03233
38124a769695l31783L18674J411344J411884j6805j020742k53433R95179Q83569
38115A628192j57722m79211L3403K40829q92Q3611L32131j15156r10324q01446
38105a46585R2997K39282o96190j016461L90734K080612J877335j97777k025406
38096E98541k082005r97650l30388n81207r13736m80417O03216J617851J970364
38087e95431J387208P4104r64733o44844N42198O94080o64609j305857L54964
38078a122920K044399N99776k635280l041094L43460L021898J608714j489054
$$ y = [-18674, 643677, 1586238, 599046, -2231468, -4177451, -3609703, -2123134, -2086149, -3546074, -4596317, -3889678, -1872558, -18337, 548478, -102260, -994645, -1466462, -1769695, -2101478, -1782804, -371460, 1040424, 1023619, 2877, -250556, 744623, 1628192, 1470470, 991259, 1024662, 1265491, 1264599, 1348210, 1680341, 1565185, 654861, -146585, -53588, 185694, -510496, -1526957, -1136223, 944389, 2821724, 2623947, 598541, -1483464, -2481114, -2811502, -3392709, -4306445, -4786862, -4183646, -2565795, -595431, 791777, 865881, -98852, -743696, -201498, 492582, -172027, -1477884, -1122920, 921479, 1521255, -1114025, -4155119, -3811659, -789761, 818953, -670101]
38070f70101k303059r72274q2532P2549R12414J925513J343128l88431j179258
38061a342051q06585p37854r44582j28161J130113Q28942o78604p54659J065133
38052b368308J971978L56222j626777j505559M4912R69128R76942J007114J078528
38043I04180N42746m42007j110580j115536n09711M54871R40633Q8619j414498
38034a661283j644848p8550J409823J097113k85038q30389k733J124696J382576
38025E11367M42812j073337j894042j241725O6954N92275L29861M49187J039078
38016g77570R97003L78641N73375J469952R67541j428303l033793j866169J58257
38007b561066K36231r88584q46958Q91442J907837J122772j11029n31595l68587
$$ y = [-670101, -2973160, -3945434, -4027966, -3955417, -3043003, -1117490, 225638, -162793, -1342051, -2148636, -2886490, -3831072, -3959233, -2829120, -2000178, -2678782, -3433441, -2368308, -396330, -40108, -1666885, -3172444, -3127532, -2158404, -1181462, -174348, 904180, 1446926, 1004919, -105661, -1221197, -1730908, -1276037, -335404, -246785, -1661283, -3306131, -3384681, -1974858, -877745, -1162783, -1993172, -1995905, -871209, 511367, 954179, -119158, -2013200, -3254925, -3187971, -2595696, -2265835, -1816648, -777570, 219433, 598074, 1171449, 2641401, 3608942, 2180639, -853154, -2719323, -2561066, -2324835, -3313419, -4160377, -3268935, -1361098, -238326, -349355, -880950, -1249537]
37998a249537o9941M10782Q05378O14464J59020J77141M13584k2041j013814j549157
37988a324121j340497r71082n98219R2741Q20034R91616Q58394J008588J060622
37979E98076L85617l01651J23674J024613Q14715k40306l30018O82545Q48966
37970C606231m89685j420644o19007M94598K16998p38884p11244K30634Q24195
37961A393192P42685N43265L02439k01754n68230l44908L187j89689o57474p69378
37951B53335n72912l08762L23005J309577J565249L59694j136811j168139J57215
37942G81451J108849P54625j91651p90929q71001n94910j46526R6377l9122n8264
37932D8899M08187O43558k59311j763682k311491j323062K77681J429109J756612
$$ y = [-1249537, -1319478, -908696, -103318, 511146, 670166, 847307, 1260891, 1238850, 225036, -1324121, -2664618, -3635700, -4233919, -4141178, -3321144, -2329528, -1471134, -462546, 598076, 983693, 682042, 805716, 1830329, 2645044, 2404738, 2074720, 2757265, 3606231, 3116546, 1695902, 1076895, 1571493, 1788491, 1049607, 338363, 568997, 1393192, 2135877, 2679142, 2981581, 2779827, 2211597, 1866689, 1869876, 1680187, 1022713, 253335, -319577, -628339, -305334, 1004243, 2569492, 2929186, 1792375, 624236, 781451, 1890300, 2644925, 2453274, 1662345, 791344, 196434, 49908, 146285, 107163, 48899, 457086, 1100644, 841333, -922349, -3233840, -4556902, -4279221, -2850112, -1093500]
37923a093500J209658Q4658o82286m61281j7972l37782o75991M12211K184282
37914F21997K143069r4032j747192r13526N63222Q6120j681250k157753r82259
37905d161604j57422n19818o81261K61210J252083J247037Q12367P76394P31952
37896d39062L9949o98378m07684P49559J485863J031998j11965j032642j400828
37887g83190j442904j270416o50001L66359R03420J06910j334364j529347P9154
37878e554379J598399J303669L13047P64067K054123J507657j108733k640195
37870a762345j188361R95098J099936p8122n8435R98167R04081n48987j344276
37861i83244q23212n18903j049779j021401J02030O37868m41248j465252n83174
$$ y = [-1093500, 116158, 200816, -481470, -942751, -960723, -1298505, -1974496, -1562285, 621997, 2765066, 2671034, 923842, 10316, 573538, 659658, -1021592, -3179345, -4161604, -4319026, -4838844, -5520105, -5258895, -4006812, -2759775, -1947408, -1171014, -439062, -399113, -1097491, -1505175, -755616, 730247, 1762245, 1650280, 617638, -783190, -2226094, -3496510, -4146511, -3780152, -2876732, -2769822, -4104186, -5633533, -5554379, -3955980, -2652311, -2339264, -1575197, 478926, 1986583, 877850, -1762345, -2950706, -1955608, -855672, -933794, -992229, 5938, 910019, 361032, -983244, -1806456, -2325359, -3375138, -4396539, -4294509, -3656641, -4097889, -5563141, -6146315]
37852f146315J375029K326549J904793J200128N69488l94003j308385j231375
37844a704091k62074N11008N42191J64395l19384p10037m06307Q80089K086857
37835G82647J774491J03463j335930j609859j170797n87567J11418P28707Q68934
37826c34493Q29210J205434J417633J92775k003471k762548j002156J097311R14171
37817d46134j002868j928812q89659M06438N30577K40317P01751J353830Q47847
37808a86713o42185j438417o76151M84001M22764q03870j582881q18345P90516
37799d451281J744207J478717O40357l1268l98593n03024j82349M94416R04317
37790c04501N60168p7198o9623O64667J033157J15249j508559k286490j533914
$$ y = [-6146315, -4771286, -2444737, -539944, 660184, 1229672, 835669, -472716, -1704091, -1966165, -1455157, -912966, -748571, -1067955, -1777992, -2184299, -1304210, 782647, 2557138, 2660601, 1324671, -285188, -1455985, -2043552, -1932134, -1203427, -334493, 494717, 1700151, 3117784, 3310559, 1307088, -1455460, -2457616, -1360305, -446134, -1449002, -3377814, -4267473, -3861035, -3330458, -3090141, -2388390, -1034560, -186713, -828898, -2267315, -2943466, -2459465, -2036701, -2840571, -4423452, -5241797, -4451281, -2707074, -1228357, -588000, -619268, -1017861, -1520885, -1703234, -1208818, -304501, 255667, 178469, 108846, 773513, 1806670, 1921919, 413360, -1873130, -3407044]
37781c407044k15860L72953K45738M60368J432748K280063K011833P29517o67716
37772C242600j425294j269802m14848L49380J99734n98600q23828j14824L06678
37763e48804l48440q33919J58961J382638O31883j408805j629971O75801K235931
37754C15275N32281k274563k416173J40038K057142J463135k90367j487983j998458
37745c959673j907238o34831J489412K654784J916060P09822O48151J015060J35758
37736B067305j592025k024958n27042R89849Q22862k41190l90808N21017J054740
37727F79750N00958k18980j08641N27071P58485L59687j43672l15352j47699J34252
37717B025859J64878l16951r04606p25459K37463P15283p0969r56240n05230M93035
$$ y = [-3407044, -3622904, -3249951, -3004213, -2543845, -1111097, 1168966, 3180799, 3910316, 3242600, 1817306, 547504, 132656, 482036, 681770, 83170, -740658, -855482, -548804, -897244, -1731163, -1572202, -189564, 442319, -966486, -2596457, -1920656, 315275, 847556, -1427007, -3843180, -3703142, -1646000, -182865, -473232, -1961215, -3959673, -5866911, -6501742, -5012330, -2357546, -441486, 268336, 916487, 1931547, 2067305, 475280, -1549678, -2076720, -1086871, -264009, -505199, -896007, -374990, 679750, 1180708, 961728, 853087, 1380158, 2138643, 2498330, 2354658, 2039306, 1891607, 2025859, 2190737, 1873786, 969180, 243721, 481184, 1196467, 1125498, 169258, -335972, 157063]
37707A57063J33427j194186r45856J371629K685959O84295k452004k966730p84273
37698c310676Q18034J29890j155565j139365k38920K53311K03857K12160M57301
37689c769973Q39965J337321J624569J157917J610j165405j891921j928272p27863
37680d522052J579735L060482J873569o23140j074909R65290K007969j63543k932295
37671A71106k726402k59033J028789L27271q2018P29645Q27238r63215k690523
37662c637142j996259N36672K249916J695250j27087j327794j043124P7409Q07949
37653b764210O53925J48711r9683o4662K65565J175210K177261J718493p23904
37644B486706l018718k570043J99390K300680K029518N75763l36958n04179l92829
$$ y = [157063, 290490, -903696, -1849552, -477923, 2208036, 2892331, 440327, -2526403, -3310676, -2492642, -2362752, -3518317, -4657682, -4896602, -4643291, -4439434, -4227274, -3769973, -2930008, -1592687, 31882, 1189799, 1191409, 26004, -1865917, -3794189, -4522052, -2942317, 118165, 1991734, 1368594, 293685, 1258975, 3266944, 3103401, 171106, -2555296, -2814329, -1785540, -1458269, -1540287, -810642, 16596, -946619, -3637142, -5633401, -5096729, -2846813, -1151563, -1278650, -2606444, -3649568, -3572159, -2764210, -2110285, -1961574, -2061257, -2125919, -1860354, -685144, 1492117, 3210610, 2486706, -532012, -3102055, -2902665, -601985, 1427533, 2003296, 1666338, 1162159, 769330]
37635G69330j5897M60374L85083k28416m37553k5383j31071j309567k228614j477615
37625d239329L22881J450502J363847Q68981N83152L92366J33591j05716j93904
37616E76371P2896P97546J398164R37788m40112j309680r02153k49559m48792
37607D32469q23473j47360J090020J239614J703j129565r78628j4984O27085M87876
37597G84757j11752o22484p09016m79403k21647J85529J034745J741070J054889
37588B656688r82314k402377j735913o7718O84795N49050P93632J264892O72975
37579A433710o98987r42728M42387J612248J204629J85537j17378j03673p14722
37570B301023j507387j410889n63515J1072P1657K70180Q35344J196435R22814
$$ y = [769330, 753433, 1213807, 1598890, 1370474, 932921, 907538, 776467, -533100, -2761714, -4239329, -3916448, -2465946, -1102099, -233118, 350034, 742400, 875991, 770275, 576371, 649267, 1446813, 2844977, 3782765, 3342653, 2032973, 1130820, 881261, 432469, -391004, -538364, 551656, 1791270, 1792973, 663408, -315220, -330204, 296881, 784757, 673005, 50521, -658495, -1137898, -1359545, -1174016, -139271, 1601799, 2656688, 1674374, -728003, -2463916, -2531634, -1846839, -1297789, -504157, 760735, 1433710, 734723, -208005, 234382, 1846630, 3051259, 3236796, 3119418, 3015745, 2301023, 793636, -617253, -1180768, -1169696, -1098039, -827859, 7485, 1203920, 2126734]
37561B126734K91155j70928k52767j27218j05531l32300o58317q67158q92523
37552i88853o57300m9769N93354N19081k88418o12324L60893J509606J204117
37543A590387j89038q41315k52941L45112L77264O13222J113129P38073m78717
37534C015176p37281N08253J134205l16590j867753r31413J562714K389463N93332
37525E350106j587191k077833j122060n1792L24033p5005o98749o73572J2792
37516e99271J39486q20482j317849Q3826K030843K042007K88887p27048j31031
37507I89368K98320n60390j380585q32298L32334P86970M95108j592n92648r00180
37497a365593j24093J376907J885918Q07377k26396K8795L54652p65012k369628
$$ y = [2126734, 2417889, 2246961, 1994194, 1866976, 1761445, 1429145, 770828, -96330, -988853, -1646153, -1695922, -1102568, -583487, -871905, -1484229, -1123336, 386270, 1590387, 1401349, 560034, 307093, 652205, 1029469, 1642691, 2755820, 3493893, 3015176, 2277895, 2786148, 3920353, 3603763, 1736010, 804597, 2367311, 4756774, 5350106, 3762915, 1685082, 563022, 511230, 835263, 760258, 61509, -612063, -599271, -459785, -1280267, -2598116, -2514290, -483447, 1558560, 1847447, 1120399, 989368, 1287688, 727298, -653287, -1485585, -1153251, -366281, 128827, 127235, -465413, -1365593, -1489686, -112779, 1773139, 2580516, 2354120, 2382915, 2737567, 1972555, -397073]
37488c97073k403360q81538L54803M54644K16053K88686N14374Q78431J447627
37479D72647J478389K49749j237931j132814M84565J395259K94063j539458k283320
37470a818851j784283q41207K99127J470124J724067N11517q64898n63894J161328
37461g06970K113757J129592m75080r84114n60504m52154q22244p43221l2718
37452a533656L55936J3987j54022N03453J122256O13800n39988r82022n55392
37443a155648l81143r16089j218795m67383Q37118J623819J392725K77678j155822
37434a163540j822620q35445J102773J979189R07413n73857n36929P77396J545808
37425A380188R60667n25k42324J24163K77916k13624r46748j016365k0766J040816
$$ y = [-397073, -2800433, -3681971, -3327168, -2872524, -2656471, -2367785, -1853411, -974980, 472647, 1951036, 2200785, 962854, -169960, 314605, 1709864, 2003927, 464469, -1818851, -3603134, -4444341, -4145214, -2675090, -951023, -439506, -1304404, -1868298, -706970, 1406787, 2536379, 2061299, 1077185, 516681, 64527, -757717, -1500938, -1533656, -1177720, -1163733, -1317755, -814302, 307954, 921754, 381766, -600256, -1155648, -1536791, -2452880, -3671675, -4139058, -3301940, -1678121, -285396, -7718, -1163540, -2986160, -3821605, -2718832, -739643, 167770, -406087, -943016, -165620, 1380188, 2340855, 2340330, 2098006, 2222169, 2500085, 2286461, 1339713, 323348, 302582, 1343398]
37415A343398N81438j326184k501266j491136J55520O2052j292578j244428Q33417
37406d879767K424170J660965l6224m31771K92915N37450J15668L7103K98253
37397A8762L2401m80113q0606Q90280N74521j425421k922872k088433m1957Q67263
37387d656175L08125q6849N41043J238786R69751K4649o69135p06282k67674L04162
37377b999599O71306P38128Q34354J115957Q86494n54547k316969k426112m83300
37368d534288J395791J278040J0278k14980Q66011J447536N88293m88447m50423
37359a02189K71458M76989Q109l76460l00758q1533o8483l15271o88366q75711
37349b052215n47730J71791P28776Q93362J041262J377881J429929P73304k23977
$$ y = [1343398, 1924836, 598652, -1902614, -3393750, -3238230, -3176178, -4468756, -5713184, -4879767, -2455597, -794632, -830856, -1262627, -969712, -432262, -316594, -279491, 18762, 51163, -428950, -509556, 380724, 955245, -470176, -3393048, -5481481, -5523438, -4656175, -4348050, -4434899, -3893856, -2655070, -1685319, -1660670, -2329805, -3036087, -3303761, -2999599, -2328293, -1590165, -755811, 360146, 1246640, 692093, -1624876, -4050988, -4534288, -3138497, -1860457, -1850179, -2065159, -1199148, 248388, 836681, 348234, -102189, 169269, 646258, 654367, 277907, -22851, -104384, -172867, -488138, -1176504, -2052215, -2599945, -2428154, -1699378, -806016, 235246, 1613127, 3043056, 3816360, 3592383]
37340C592383r30551j303399j610762j653624r78176K31352J083823R11506l6173
37331f93621q41813p09012L51933J452322J596499O49319o12370j351062j252019
37322a409824m33805O00869R94016L16779o04346n37985L61925P10848P7928l53085
37312b76680J16713M61524j67264p52589j15214Q80449O20855n84880j057153
37303h74239m59323J9733n1744R2765N39498L91713l16552l16143P11641J406784
37293A144133R22622K14274K65154N36311J98507m34879p92415j139952j641343
37284g27588j467665j57995J063961P41608o81520j484200r49809J46871R02453
37275b613884J004029M55307l38696n29759J64674Q23637O60793L86508R54251
$$ y = [3592383, 2661832, 1358433, -252329, -1905953, -2884129, -2652777, -1568954, -657448, -693621, -1535434, -2244446, -1892513, -440191, 1156308, 1805627, 1193257, -157805, -1409824, -1843629, -1242760, -248744, 68035, -536311, -1074296, -712371, -1523, 76405, -276680, -159967, 301557, 134293, -618296, -733510, 146939, 767794, 182914, -874239, -1333562, -1313829, -1365573, -1272808, -733310, -341597, -658149, -974292, -262651, 1144133, 2066755, 2281029, 2546183, 3082494, 3281001, 2846122, 2053707, 913755, -727588, -2195253, -2353248, -1289287, -547679, -1229199, -2713399, -3663208, -3516337, -2613884, -1609855, -1154548, -1493244, -2023003, -1858329, -1034692, -373899, 12609, 966860]
37266I66860J528715M33152j981489l240491j944646M97396J979687K126057J726058
37257B091299J027366j16869j161141j285766o65255k63529m50692o88156n15516
37248b028259j2493O91007J467975J672770N91707j182063j833119n83023R16157
37239b99341N59613j278449k129062p67905J224880J780637R78550L75408N89642
37230A033973Q53726O02314K06525N7846k6803k48174m94152p79414j258542j597492
37220a650193j134427N286P21001L34263m51797n21977J99747Q22309P26233K47388
37210g02167J79876P88473J303549O15678j194428k404425j512697O70969J867769
37201c87403J272672L50499L26391L55196p95970k386027k487237p18614J104503
$$ y = [966860, 2495575, 2928727, 947238, -2293253, -4237899, -3740503, -1760816, 365241, 2091299, 3118665, 3001796, 1840655, 554889, -110366, -373895, -824587, -1512743, -2028259, -2040752, -1349745, 118230, 1791000, 2382707, 1200644, -632475, -1215498, -299341, 260272, -1018177, -3147239, -3915144, -2690264, -909627, 68923, 444331, 1033973, 1887699, 2490013, 2696538, 2754384, 2727581, 2479407, 1985255, 1205841, -52701, -1650193, -2784620, -2779334, -2058333, -1724070, -2175867, -2697844, -2498097, -1675788, -949555, -702167, -522291, 266182, 1569731, 2185409, 990981, -1413444, -2926141, -2255172, -387403, 885269, 1235768, 1562159, 1917355, 1121385, -1264642, -3751879, -4470493, -3365990]
37192c365990J144332m28389j722756j072528J263612L207780K968003J046164
37184C040228m72832n91504k53602l04554j48551O43394Q87531m80314k239082
37175H0714k260252n41906Q80495Q29584J07738k75622l57991l99928k03399K81137
37165a859430P00241R51201J189128J113437K81376q27291j199027q10664n68161
37156a029190o75923m41217J57604K79678m1081L42315J528455J878542N06980
37147B506163j101515j243746l99007k2942j66721j4199J73759l84061j044298
37138a696567m07634J165363J698514N79061m41526N9938J060349P75384o34869
37129B158013j377538n92753N88198O50689m04275j147499n03154Q44696J081952
$$ y = [-3365990, -2221658, -2650047, -4372803, -5445331, -4181719, -973939, 1994064, 3040228, 2567396, 1975892, 1722290, 1417736, 1269185, 1912579, 2800110, 2319796, 80714, -2179538, -2721444, -1840949, -1011365, -903627, -1179249, -1537240, -1937168, -2140567, -1859430, -1159189, -207988, 981140, 2094577, 2375953, 1548662, 349635, -461029, -1029190, -1705113, -2146330, -1988726, -1709048, -1750129, -1407814, 120641, 1999183, 2506163, 1404648, 160902, -238105, -261047, -427768, -441967, -268208, -652269, -1696567, -2104201, -938838, 759676, 1338737, 897211, 957149, 2017498, 2792882, 2158013, 780475, 187722, 775920, 1426609, 1022334, -125165, -628319, 216377, 1298329]
37120A298329n58757k564670k630406l51387K189509K746337J267577m58801j046443
37111a08712p40400m94514m98198q4861J022188J888552J259680p43114k358367
37102h57746k032805k29133J162657J058749J39026m50031m93309l73282q8918
37093b164792N49692J073632O48364o44858j554029j080185K69913J089214P28304
37084a084745o7186k00493M01525P20177p249j117097j129457L55038J899388
37075b30099J887668N48300m77424m03104o2087k16559l19941K95134J000507
37066B022395P64605j46152n61002j95445J17449j32421n66850p87089p78309
37057b62819m61628J20767K53794o15652j552794j078596M87101J288879Q12648
$$ y = [1298329, 739572, -1825098, -4455504, -4806891, -2617382, 128955, 1396532, 937731, -108712, -849112, -1343626, -1841824, -1926685, -904497, 984055, 2243735, 1500621, -857746, -2890551, -3119684, -1957027, -898278, -759252, -1209283, -1702592, -2075874, -2164792, -1615100, -541468, 106896, -537962, -2091991, -3172176, -2902263, -1813049, -1084745, -1151931, -1352424, -950899, -230722, -237971, -1355068, -2484525, -2129487, -230099, 1657569, 2205869, 1728445, 1325341, 1263254, 1046695, 726754, 1021888, 2022395, 2787000, 2640848, 2079846, 1884401, 2001850, 1869429, 1302579, 515490, -262819, -724447, -603680, -349886, -965538, -2518332, -3596928, -3109827, -1820948, -1008300]
37048a008300N54985J173172J155495l78785j653663r00926O78640Q55765j06847
37039C69536l84158J2899m01536j373489j059204N40080J202940J10551q53825
37030a836206l44645M02547K9160o44867l16832N62006P97654K92638m68497j389117
37020b916159j962188j040162J136008K213484P69992j289650j300811M11375
37012c978111J493472J275337J074761J306610Q27242p05950j992404k028512
37004b727555j183513l8958J232102K046531J594982K72006n17341l44728j43624
36995A89902l39771k08067M54582P02370J75378j75439P2697o2979r24833j028735
36985a144895N16662J911936R85739j408753k493965j516948l58888k93868m05136
$$ y = [-1008300, -453315, 719857, 1875352, 1496567, -157096, -1058022, -379382, 476383, 369536, -14622, -1723, -403259, -1776748, -2835952, -2295872, -1092932, -982381, -1836206, -2180851, -1778304, -1749144, -2394011, -2710843, -2148837, -1351183, -1058545, -1527042, -2916159, -4878347, -5918509, -4782501, -2569017, -1799025, -3088675, -4389486, -3978111, -2484639, -1209302, -134541, 1172069, 1999311, 1293361, -699043, -2727555, -3911068, -3950026, -2717924, -671393, 923589, 1195595, 678254, 333526, 189902, -149869, -357936, 96646, 799016, 974394, 798955, 871652, 808673, -116160, -1144895, -628233, 1283703, 2269442, 860689, -1633276, -3150224, -3509112, -3802980, -4208116]
36976d208116K90817J187099J485896J592519J949036J826970O33742o29090p19930
36967C408943k14561n53696j465962j204521N17035J650903O09186j493730k412116
36958a158519j554926j03388Q79936J245638J118543O69566L71066M75936L76111
36949B319963n53642j643074j596275m81626J85949l62437j076076p60417K23644
36940c743991P18168M58428J57158L48800Q50593J122296P47545j32771o70969
36931a44743j47652Q69223J007852M0266o82844l24549Q1535n97525j509800j008029
36921b416266O54136J499644O90129l39573n9981J060253J417927N15134n35049
36912B486354o09920k8241k8926r50610j560738p38965O65335Q07578l64023q23348
$$ y = [-4208116, -3917299, -2730200, -1244304, 348215, 2297251, 4124221, 4757963, 4128873, 3408943, 3194382, 2640686, 1174724, -29797, 487238, 2138141, 2747327, 1253597, -1158519, -2713445, -2816833, -1936897, -691259, 427284, 1096850, 1467916, 1943852, 2319963, 1766321, 123247, -1473028, -1954654, -1768705, -2131142, -3207218, -3967635, -3743991, -3025823, -2567395, -2410237, -2061437, -1210844, -88548, 658997, 526226, -144743, -292395, 576828, 1584680, 1624946, 942102, 617553, 699088, 101563, -1408237, -2416266, -1762130, -262486, 427643, 88070, 28089, 1088342, 2506269, 3021403, 2486354, 1876434, 1848193, 1819267, 868657, -692081, -1431046, -765711, 41867, -322156, -1145504]
36902a145504M41671J658592Q63670j058678j694071o21732L53140J55468l51406
36893a398850k56311N6303p8926n94029j128739j417263j015149K90582J701729
36884c840653K156546J817130J546840J119879l11117j975393j882274j2058J097863
36875b83237J4627j404395r54288O27710J165253L71570m12821p59876j208954
36866b844411j390219l60326J269115J615683K75399r39586n61516O46456J066370
36857a223035M25078j78171J46779J103087J621315J032609j14976o43266l08000
36848A861420j47779p84955j260270n69789M54311K90901p35492q60842K25493
36839a527002Q01275j26570j275004j155678j53215N75305R87600J603210K003713
$$ y = [-1145504, -703833, 954759, 1818429, 759751, -934320, -1556052, -1202912, -1047444, -1398850, -1655161, -1598858, -1677784, -2271813, -3400552, -4817815, -5832964, -5542382, -3840653, -1684107, 133023, 1679863, 2799742, 2488625, 513232, -1369042, -1381100, -283237, -268610, -1673005, -2627293, -1999583, -834330, -462760, -875581, -1635457, -2844411, -4234630, -4594956, -3325841, -1710158, -1434759, -2374345, -2935861, -2289405, -1223035, -797957, -976128, -829349, 273738, 1895053, 2927662, 2812686, 2169420, 1861420, 1713641, 928686, -331584, -901373, -447062, -156161, -891653, -1752495, -1527002, -725727, -852297, -2127301, -3282979, -3436194, -2860889, -1873289, -270079, 1733634]
36830A733634J337878j63728j413887j870296j675397q38771N38156J532451J182902
36821C62942l7065o91749l44623J13921J59093L15415P78864P02228l59661j359343
36811c59978j118076o3420M27809j1992m41957j08637O18604Q72854L08581n50648
36801d26860p37786J60967J251250J105294l70653j586967j365923m78656j47635
36792b596969n783R28075J947584J350648o49769j794369j006625K04509L66885
36783a255814J78052P61169J411345P62682q24565j694445j128953J84737J381261
36774b24531J916846J412496J64759p26455p54604p66031j275707j165981M01854
36765a017354J941302J560758L5455m34796R0885l30519j610877j304557J046343
$$ y = [1733634, 3071512, 2907784, 1493897, -376399, -2051796, -2890567, -2352411, -819960, 362942, 325877, -365872, -710495, -596574, -437481, -122066, 656798, 1359026, 999365, -359978, -1478054, -1541474, -1113665, -1125657, -1567614, -1676251, -1057647, -184793, 123788, -426860, -1164646, -1003679, 247571, 1352865, 982212, -604755, -1970678, -2449334, -2596969, -2602752, -1674677, 272907, 1623555, 973786, -820583, -1827208, -1622699, -1255814, -1077762, -316593, 1094752, 1857434, 1032869, -661576, -1790529, -1605792, -224531, 1692315, 3104811, 3269570, 2543115, 1788511, 1022480, -253227, -1419208, -1017354, 923948, 2484706, 2520161, 2085365, 2176250, 1845731, 234854, -1069703, -23360]
36756b3360K359622M77216k323071k484196j20208J560780Q56283o54943p95897
36747a147774M56670J296474L78948j519763k193019o89241J130363Q91893p71765
36738b167214r87889Q22222J703048k99230k798408k433045K37891J844338J143631
36729b934656P7038K25073Q35300P41623J36288k70648l77139l52165k37054k69245
36719b425585p18618j214824j057387k38718O13397J173466J461884J226492K98046
36710h81847o38073o80459L651M94490M96044M06115L28362J03509k8718M1926
36700c55000m00674j662546k267937o84461J864111K490931P30432p50000j68017
36691a203161R33811N01931q09972j050790j73492K44812k47098n20600l2837
$$ y = [-23360, 2336262, 2813478, 490407, -1993789, -2113997, -553217, 303066, -351877, -1147774, -691104, 605370, 984318, -535445, -2728464, -3417705, -2287342, -1395449, -2167214, -3155103, -2332881, -629833, -929063, -3727471, -6160516, -5922625, -4078287, -2934656, -2857618, -2632545, -1797245, -1055622, -919334, -1189982, -1567121, -1919286, -2156340, -2425585, -3144203, -4359027, -5416414, -5655132, -5041735, -3868269, -2406385, -1179893, -881847, -1519920, -2200379, -2196728, -1702238, -1206194, -800079, -471717, -368208, -396926, -355000, -755674, -2418220, -4686157, -5370618, -3506507, -1015576, -285144, -1035144, -1203161, -269350, 232581, -577391, -1628181, -1801673, -1556861, -1803959, -2324559, -2357396]
36682b357396L30722o2130m72817p1759O23081N37124j92366l19158N33428J071325
36672c79946K67497p25941j3137J951332K533026O94952j308555j267776k63798
36663A487654n90735j817985j571417L70951J624869R79063q4095k66133k82916
36654a50744p74592p76805K24527P38766m39851j962767j801414j83008J128658
36645c997230J452550J291879P04300n02153j500829j242046k24920K13242J05193
36636c700014N91547J567010J504699j5023j335942j019159K37877Q34206M12831
36627i21968j14353K456P12264J496442J664944P18289r02386j720969o63946
36618B70773J405773K301261R35179j381347k478706j765667m91647J90824M40809
$$ y = [-2357396, -2026674, -2088804, -2561621, -2633380, -2010299, -1473175, -1665541, -1984699, -1451271, -379946, -112449, -838390, -851527, 1099805, 3632831, 4327783, 3019228, 1751452, 1487654, 896919, -921066, -2492483, -2121532, -496663, 482400, 398305, 132172, -150744, -925336, -1702141, -1477614, -738848, -1178699, -3141466, -4942880, -5125888, -3997230, -2544680, -1252801, -548501, -1050654, -2551483, -3793529, -4018449, -3805207, -3700014, -3108467, -1541457, -36758, -51781, -1387723, -2406882, -2169005, -1334799, -921968, -1036321, -1033865, -321601, 1174841, 2839785, 3558074, 2655688, 934719, 270773, 1676546, 3977807, 4912986, 3531639, 1052933, -712734, -1204381, -1013557, -572748]
36609e72748P25362O51535k69849j325194j263962j16779P66663N73410j17844
36600i49406n28949o71058p26125l86274N66608J645281K140753J801391Q09351
36591C701572l76099j047785q25114k97131l16665o65311m32395L02381N09427
36582E52880Q5727P9210N94512K97947j117965j854492p28253P72781Q64662L03340
36572a49651P17433J447563O85372r86252j108825N90686J508973K46166j190909
36563A760556n97617J078668J402817J13825q83761o24068k52659q67261j673053
36554e42553j159300N62870J608327O31484j381465k210408j063680N88230J012227
36545a954268L30553P8955J056926K305966K267848O12253j244037j559047l07624
$$ y = [-572748, 152614, 804149, 534300, -790894, -2054856, -2171635, -1404972, -831562, -949406, -1478355, -2149413, -2875538, -3261812, -2695204, -1049923, 1090830, 2892221, 3701572, 3325473, 2277688, 1452574, 1155443, 838778, 173467, -258928, 43453, 552880, 638607, 717817, 1312329, 1610276, 492311, -1362181, -2090434, -1317653, -452991, -149651, 567782, 2015345, 2700717, 1714465, 605640, 1196326, 2705299, 2951465, 1760556, 1162939, 2241607, 3644424, 3758249, 2874488, 2250420, 1997761, 1130500, -542553, -1701853, -1138983, 469344, 1100828, -280637, -2491045, -3554725, -2966495, -1954268, -1623715, -1544760, -487834, 1818132, 4085980, 4698233, 3454196, 1895149, 1587525]
36536A587525O40894m0254j105100m07521J690086K441469O45154j566595j924015
36527A961643j087549q88836j184584o84202J91653j91731j678613k159603o02470
36518f324292J613022K654938K019664K74839j467713j785765k07517J668985
36510a553839J809448M77567k93741J17284K83422m78131q95223j50452N08980
36501a74685j72263j343519j371913j84447R71295J304538R56857L46552p7274
36492B55141M8506M66705L76185n22526j601679k131823j834478o17222J193965
36483d367226K333376J672406O0759l98733O81843J358499L28184j197798j509083
36474a037773o30862N51826J753136K541170J772146n37225k165189j411781K79198
$$ y = [1587525, 2228419, 2188165, 1083065, 675544, 2365630, 4807099, 5452253, 3885658, 1961643, 874094, -14742, -1199326, -1883528, -1691875, -1883606, -3562219, -5721822, -6324292, -4711270, -2056332, -36668, 238171, -1229542, -3015307, -3222824, -1553839, 255609, 733176, 439435, 556719, 840141, 362010, -533213, -683665, -174685, -346948, -1690467, -3062380, -3246827, -2275532, -970994, -14137, 332415, 255141, 303647, 770352, 1146537, 624011, -977668, -3109491, -4943969, -5561191, -4367226, -2033850, -361444, -300685, -699418, -17575, 1340924, 1669108, 471310, -1037773, -1668635, -1116809, 636327, 3177497, 4949643, 4412418, 2247229, 835448, 1114646]
36465A114646M55517n95013o04529P48320J312338M6373j300555r26293M67739
36456G18543R83209J46406q87409j014327j67880R39644J404344P46428n77830
36447B291128j445519j160078j89020L42666j49513j066126j241512l33646N93603
36438b358017L54740o28347p56337M11722J374676R01188q0825M2662J046399
36429C07861J346000O43198L73001J224942J779721N23808j784256k923193j989221
36420d98139k62621P34588R57103J040197P23235o31757k208561k091861o5637
36411b303453J492046P68770p51901n45361R74323J154384n87630j897267j292258
36402b988347j10285L00677O99923J732917J975101K57153j889674k296452j231657
$$ y = [1114646, 1570163, 975150, 370621, 1118941, 2431279, 2477652, 1177097, 250804, 718543, 1701752, 1848158, 960749, -53578, -221458, 718186, 2122530, 2868958, 2291128, 845609, -314469, -503489, -160823, -310336, -1376462, -2617974, -2951620, -2358017, -2003277, -2631624, -3387961, -2976239, -1601563, -700375, -781200, -738538, 307861, 1653861, 2297059, 2670060, 3895002, 5674723, 6198531, 4414275, 1491082, -498139, -760760, -26172, 930931, 1971128, 2694363, 2062606, -145955, -2237816, -2303453, -811407, -42637, -794538, -1339899, -365576, 788808, 201178, -1696089, -2988347, -3098632, -2797955, -2098032, -365115, 1609986, 1867139, -22535, -2318987, -3550644]
36393c550644l26429J85892R03467J204759K90502o74321q1089J157513Q74625
36384a5725n94795q35236N33981J163775j10005j474997j224687j55917L84003
36375b329603P26353J583325K105941R80448j329272k829267k256706l70042Q94891
36366b823932L89595r32903j001972O83511K206037J922226Q02589N78349Q46516
36357B670016K44262n92896j22837P41494k39227k247490j944383R53071K552943
36348B014953P35963j544526j150310M70225L28393j089796j262557j10741M31745
36339a176651P6030J60648P37485O02057k36019o73160o54489q61790q33853K20884
36329b638858J310239Q61653m11536m30729P71719J190766L75698K2762P61607
$$ y = [-3550644, -3877073, -3691181, -2787714, -1582955, -1292453, -1966774, -2047863, -890350, -15725, -610520, -1445756, -911775, 252000, 141995, -1333002, -2557689, -2713606, -2329603, -1603250, -19925, 2086016, 3066464, 1737192, -1092075, -3348781, -3718823, -2823932, -2434337, -3367240, -4369212, -3685701, -1479664, 442562, 1245151, 1823500, 2670016, 2914278, 2321382, 2198545, 2940039, 2700812, 453322, -1491061, -537990, 2014953, 2750916, 1206390, 56080, 526305, 854698, -235098, -1497655, -1608396, -1176651, -1100621, -939973, -202488, 399569, 163550, -509610, -1164099, -2025889, -2859742, -2638858, -1328619, -466966, -878502, -1309231, -537512, 653254, 1028952, 1051714, 1813321]
36320A813321J076391R9435r48770r34946l12396K96758R80425J289196K06928
36311C566342j773507k581511j536277l99323m46920n86186K95631J179561Q56303
36302a425887K58759Q34616J899562J688866J43235j326454k168323k810605k881948
36293e788179j362663J341871L170952K749539Q68650p27407j180621q58419n21914
36284b308191m66501k37318P33891K047644K393494J156994n78174j307499r10647
36275E23693m32865n16360r21738j274615j360674q81925J72860J046115J001487
36266b644022N13657P05897J552643J692573M07578j119059j216356R9427J122665
36257A115003N71794r10145j669310j101373j76651J75585L74142J115599J665377
$$ y = [1813321, 2889712, 2989147, 2040377, 1105431, 793035, 1089793, 2070218, 3359414, 3566342, 1792835, -788676, -2324953, -2724276, -3171196, -3757382, -3461751, -2282190, -1425887, -1167128, -332512, 1567050, 3255916, 3399151, 2072697, -95626, -2906231, -5788179, -7150842, -5808971, -2638019, 111520, 980170, 252763, -927858, -1786277, -2308191, -2774692, -3012010, -2278119, -230475, 2163019, 3320013, 2741839, 1434340, 523693, 90828, -425532, -1347270, -2621885, -3982559, -4864484, -4691624, -3645509, -2644022, -2130365, -1424468, 128175, 1820748, 2228326, 1109267, -107089, -7662, 1115003, 1686797, 776652, -892658, -1994031, -2170682, -1995097, -1620955, -505356, 1160021]
36248A160021O71965j331777j970145l08819J468575R66631j074662k016627j065411
36239c500249J65876M82289M40699O65024P33305L74940K05480M74614M10615
36230D52593l37646q32387l96497R6899l45664j067074p83122K90468Q07481M32714
36220a682235J13397K64425J90496l73754n67732N5940M80041k60589j329843
36211c109854j106441M19316J561011J292063M25771K4761j28841n46778n58605
36202a727597O54683K006706J347766j302390l140325k183962J788O63965k13995
36193c893361l42818J067426K234542J818844Q55610O98842P59099k60020j956853
36184I81311k614802j539109K12431J214734Q85464m09884j609836j562782j78803
$$ y = [1160021, 1831986, 500209, -1469936, -1778755, -310180, 656451, -418211, -2434838, -3500249, -3334373, -2852084, -2411385, -1746361, -1013056, -638116, -432636, 41978, 452593, 114947, -717440, -1113937, -1017038, -1362702, -2429776, -3212898, -2922430, -2114949, -1682235, -1568838, -1304413, -1113917, -1487671, -2055403, -1999463, -1519422, -1780011, -3109854, -4216295, -3796979, -2235968, -943905, -518134, -493373, -622214, -1168992, -1727597, -1072914, 933792, 2281558, 979168, -2161157, -4345119, -4343331, -3679366, -3893361, -4236179, -3168753, -934211, 884633, 1740243, 2439085, 3198184, 2938164, 981311, -1633491, -3172600, -2960169, -1745435, -859971, -1269855, -2879691, -4442473, -4621276]
36175d621276J228092J412639O70059J27373M9604j58837n98435o81979k68316
36166b841076P9505J03968J92029N26656P47229O66335N53440N05652K84941j9924
36156G98755O9769N79402R03078P20780L63965J5360o26222j472902j672769p63893
36146a084677L98531N94213k27503r98392r11571j91326M50368O49586N48384
36137g72387L77079J72365K0874K96692J119566J639770P65599j041728j785747
36128G92083n81245Q12286L93101j163059j741874j111486p39781p52253K11690
36119c880538J946724K370049J014549n337L43146L26260r45094j317085N49601
36110D02275K032554N17976j899706j597076N11137N87247j440143j775649N30081
$$ y = [-4621276, -3393184, -1980545, -1310486, -1183113, -1133509, -1292346, -1890781, -2572760, -2841076, -2761571, -2657603, -2465574, -1938918, -1191689, -525354, 28086, 533738, 818679, 798755, 868524, 1447926, 2351004, 3071784, 3435749, 3451109, 2824887, 1351985, -320784, -1084677, -686146, -91933, -319436, -1317828, -2229399, -2420725, -1970357, -1320771, -772387, -395308, -222943, -202069, 94623, 1214189, 2853959, 3619558, 2577830, 792083, 210838, 1023124, 1416225, 253166, -1488708, -2600194, -3339975, -4092228, -3880538, -1933814, 436235, 1450784, 1445447, 1788593, 2114853, 1169759, -147326, 402275, 2434829, 2952805, 1053099, -543977, -32840, 554407, -885736, -2661385, -2131304]
36101b131304J826815J60988j360770Q6925K271418J643976j039930k308677j278904
36092b129463k157L48291M89513P16820L36962n50303q22847n8751J012065J671962
36082A012092J591569N01081j187977k023945j211774j3885P7971k37624O07153
36073h85339K009100J848238J2964j196693n70050M00719J85750n38929m37675
36064H28085L09551O45348K99298l09741r22332j237172p35099L66204Q09412
36055E3554o6713j114916q63869L42361Q26512o6428j170229j104503J27141J340176
36045a696914J463146M57932p46200j105269l68615Q00341J514218J319049L51651
36036A989339p18531r74403p1342J115563J250169J33979j028623j173415n36421
$$ y = [-2131304, -304489, -143501, -1504271, -1417346, 854072, 2498048, 1458118, -850559, -2129463, -2131620, -1783329, -1293816, -576996, -240034, -790337, -1613184, -1671935, -659870, 1012092, 2603661, 3104742, 1916765, -107180, -1318954, -1332839, -1254868, -1492492, -885339, 1123761, 2971999, 2984963, 1788270, 1218220, 1618939, 1804689, 1265760, 828085, 1137636, 1782984, 2082282, 1772541, 850209, -386963, -1122062, -755858, 53554, -13159, -1128075, -1991944, -1649583, -823071, -889499, -2059728, -3164231, -3037090, -1696914, -233768, 224164, -522036, -1627305, -1995920, -1195579, 318639, 1637688, 1989339, 1270808, 296405, 225063, 1340626, 2590795, 2724774, 1696151, 522736, -13685]
36027a3685K4283J41360r8965n96684r93003o13162N55534J351613Q26275k61092
36017C22474m06947M15313P69287O9506n25566r9349M70488K8416p91644n10364
36007b58386O80452J066468J73807l70218N34473J538009Q64962q61791j522615
35998A845161o49814J82603N6861r9620M93107J024186N86133k71069o15474o46586
35988A905488q97319q87327j0737R18612N63809q22303j627706j088395M0873
35979a905005R02768J296722J070329J46336p21862n86628Q5397j74821j484509
35970a371273k122455r95272P76308J556271J285755R24718Q17754O89365N28318
35961B089489M51022K06434l46811p72544p49027n98105m67033J64247J268540
$$ y = [-13685, 10598, 151958, 52993, -543691, -1536694, -2149856, -1594322, -242709, 583566, 322474, -84473, 330840, 1100127, 1169633, 644067, 544718, 1015206, 1043622, 251978, -258386, 422066, 1488534, 1662341, 1292123, 1826596, 3364605, 4229567, 3367776, 1845161, 1195347, 1377950, 1434811, 1335191, 1828298, 2852484, 3438617, 3167548, 2552074, 1905488, 1008169, 120842, 110105, 1028717, 1592526, 770223, -857483, -1945878, -1905005, -1002237, 294485, 1364814, 1511150, 789288, 202660, 288057, 113236, -1371273, -3493728, -4489000, -3712692, -2156421, -870666, 54052, 871806, 1561171, 2089489, 2540511, 2746945, 2400134, 1627590, 878563, 280458, -186575, -22328, 1246212]
35952A246212J503723m1006k010039k220623o34640O57296M29392k48685J6616
35943a301754Q97180J078858J92144q49656j083074m69240K45746L64371j6292
35934i41717j34773L95073R76886R09353M88152M56193O32158J54586r13238j437063
35924E85610r78340m67530n13587l06088P73898J563774O43328j182854j642713
35915a524502j80768J249441R77977k12722m68792O40444J908227K091948R43273
35906E424526q44015k076559j988958j272829j445299k545670k486394J38992
35898g096206L513396M495440K575169J62313q64880r25783q80775n39410J79040
35889F18304M18967j96564p77344p53257p59898r93609m57593Q81982J167686
$$ y = [1246212, 2749935, 2708929, 698890, -1521733, -2156373, -1499077, -1069685, -1318370, -1301754, -404574, 674284, 866428, 16772, -1066302, -1535542, -1289796, -925425, -941717, -1076490, -681417, 295469, 1204822, 1692974, 2149167, 2781325, 2935911, 2022673, 585610, -392730, -860260, -1373847, -1679935, -906037, 657737, 1301065, 118211, -1524502, -1705270, -455829, 522148, 309426, -159366, 481078, 2389305, 4481253, 5424526, 4580511, 2503952, 514994, -757835, -2203134, -4748804, -7235198, -7096206, -3582810, 912630, 3487799, 3650112, 2785232, 1859449, 978674, 439264, 618304, 1037271, 840707, 63363, -689894, -1449792, -2443401, -2900994, -2019012, -851326]
35880h51326l04843j093781Q50615L351194K844881o4170j493559l37561M47890
35871C349340q67108k068887j078897N92268O66618k24621j79070N66077M37470
35862A193190m89875p31345L1606O16407K48487o53385j233269p48744Q96670
35853h70258K339372J698235o27958j692766k3979J835700R38665j495296j906796
35844A94919J89029J775457J140146j1084J69519R96362R60812L5605r54356j702174
35834B794235k045813j495565j76198P53482N26292j66910k28983M29894J083728
35825A474162J156279N72725k80899p02853l41026K42675K97131o674j3445J88267
35815B586342J04781Q8025P86327J489425P68760j027241j769576o20605O84290
$$ y = [-851326, -1156169, -2249950, -1399335, 1951859, 4796740, 4732570, 3239011, 2901450, 3349340, 2482232, 413345, -665552, -73284, 593334, 368713, 189643, 755720, 1193190, 703315, -28030, 3576, 619983, 868470, 215085, -1018184, -1766928, -870258, 1469114, 3167349, 2539391, 846625, 822646, 2658346, 3597011, 2101715, 194919, 383948, 2159405, 3299551, 3288467, 3457986, 4454348, 5415160, 5450765, 4496409, 2794235, 748422, -747143, -923341, -169859, 356433, 189523, -39460, 390434, 1474162, 2630441, 3203166, 2922267, 2219414, 1878388, 2121063, 2418194, 2411520, 2398075, 2586342, 2691123, 2779148, 3565475, 5054900, 5823660, 4796419, 3026843, 2406238, 3090528]
35806C090528N36974k28922L035J001229J249249L35210o80198r35295o55222
35797C716588m61552n59095o08249j10782Q63040J351199N32313r25120j473580
35788B324762p68366j5648K8375O8563O84650J098589N17544l77904m29382K82754
35778C413937P93073P41881N27995M03092K88814K38028M41381R42546J603918
35769I394665K030293J607014L50786m19227O10766K774131M082697L884670L269696
35760B7585491K801259J973141J315889K523079N466564P587351P640285P563076
35752F4456135R063337J1154182J3167717J7193927K4719954L3803259M2677186
35745B16235697N2173026N9401530N3084588K4153501j8703509n2481493o2084587
$$ y = [3090528, 3627502, 3398580, 3401615, 4402844, 5652093, 5987303, 5307105, 4371810, 3716588, 3255036, 2695941, 2087692, 1976910, 2839950, 4191149, 4723462, 3798342, 2324762, 1556396, 1540748, 1569123, 1637686, 2322336, 3420925, 3938469, 3560565, 3131183, 3413937, 4207010, 4948891, 5476886, 5879978, 6168792, 6406820, 6848201, 7790747, 9394665, 11424958, 13031972, 13382758, 12963531, 13574297, 16348428, 20431125, 24315795, 27585491, 30386750, 32359891, 33675780, 36198859, 41665423, 49252774, 56893059, 64456135, 73519472, 84673654, 97841371, 115035298, 139755252, 173558511, 216235697, 268408723, 327810253, 380894841, 405048342, 386344833, 333863340, 271778753]
35738B71778753n3339595m1400383l3229977k6563898j9865959j4992174j2013326
35731G0373441q705317n372109m685015o304708o580864m402300k767038l280962
35723B8275128l471081j531139K01681p89898k889386l076571j686605j222925
35715A3809204j943413j898691o69519l149o69002j240899n44193O32307R57195
35706H429840K91190n92562r95920o20700K41794O93433K33153l14132P3863P33213
35696H173172J8964j972283l066747k044347m27477j68075q57925o76714P21959
35687b99473J837809J552902L98516m58148n15019p9971K42151J42069P069M35677
35677C263582J079176P23496q40617j969413j283017K19504O15963o5820k62903
$$ y = [271778753, 218439158, 177038775, 143808798, 117244900, 97378941, 82386767, 70373441, 61668124, 56296015, 51611000, 45306292, 38725428, 34323128, 31556090, 28275128, 24804047, 23272908, 23474589, 22684691, 19795305, 16718734, 15032129, 13809204, 11865791, 9967100, 9297581, 9294432, 8625430, 7384531, 6840338, 7472645, 8429840, 8721030, 8128468, 7132548, 6511848, 6753642, 7447075, 7680228, 7366096, 7439959, 8173172, 8192136, 6219853, 3153106, 1108759, 681282, 513207, -344718, -1021432, -299473, 1538336, 3091238, 3489754, 3031606, 2516587, 2436616, 2678767, 2820836, 2827905, 3263582, 4342758, 5066254, 4225637, 2256224, 973207, 1192711, 1808674, 1742854, 1479951]
35668A479951K42026O8322r83269j244524o8521P71674j04878j311182q26794
35659a977195Q76352J722616J120960K77175l2207j78588l80812l17771o6336
35650A044194p0666j45771K56004P87855M80491o15190j271554q26991k5305J88008
35640a98925k02962o33919o43375n393J059536J658599R72384o13996j786951
35631c95002j753188p82077N12212J557608J664632N63379q56926j343460q34809
35622a667631k45181J27677O83024J112384N65752n16057m92239R11283J826410
35613B305422R95029k88258k60479O44757P61309j81153j036627j226312j167453
35604E46235j058234o61740j60005j2769q9372j4957j31681q99900j530261o63011
$$ y = [1479951, 1721977, 1790299, 807030, -437494, -506015, 265659, 160781, -1150401, -1977195, -1100843, 621773, 1742733, 2019908, 1987701, 1809113, 1428301, 1110530, 1044194, 973528, 827757, 1083761, 1871616, 2352107, 1736917, 465363, -361628, -386933, -198925, -401887, -1035806, -1679181, -1684574, -625038, 1033561, 2005945, 1391949, -395002, -2148190, -2930267, -2418055, -860447, 804185, 1367564, 510638, -832822, -1667631, -1912812, -1785135, -1102111, 10273, 576025, 59968, -432271, 479012, 2305422, 3300451, 3012193, 2751714, 3396471, 4157780, 3976627, 2940000, 1713688, 546235, -511999, -1173739, -1333744, -1346513, -1435885, -1450842, -1582523, -2482423, -4012684, -4675695]
35594d675695J381292K424326J141145j073779j778162m27920J168913J163113
35586f76767k38171j201575n19279R88438J580090Q03810j11674j61051R3836
35577E57657k84990r10225o59236M27443J062580N80034j97994k94930R5126J44125
35567E19590l40978p84181o99929j88464L63096P09725P88106N53995L9882m15563
35557E45279l48085J26449J46639p28494j445520n65006J448725K289897Q12121
35548B282005j172625j190942O18431J877348J189331m27551j314009j092593
35540G69395m91227j85865k58546k93968J80273J005964J301121N48825n21444
35531B054528q24511l73898k7106j07864k69046m39255p36648o30632M45767J636280
$$ y = [-4675695, -3294403, -870077, 271068, -802711, -2580873, -3008793, -1839880, -676767, -914938, -2116513, -2635792, -1647354, -67264, 736546, 624872, 463821, 557657, 272667, -637558, -1296794, -869351, 193229, 773263, 575269, 280339, 375465, 519590, 178612, -605569, -1305498, -1493962, -1130866, -421141, 366965, 920960, 960842, 545279, 197194, 323643, 470282, -258212, -1703732, -2268738, -820013, 1469884, 2282005, 1109380, -81562, 536869, 2414217, 3603548, 3175997, 1861988, 769395, 278168, 92303, -166243, -460211, -279938, 726026, 2027147, 2575972, 2054528, 1230017, 856119, 829013, 721149, 452103, 12848, -723800, -1354432, -908665, 727615]
35521G27615J320922m47721j652507j027186L31575Q25006M92370K81863L38752
35512A190689K56271K00535N06529O90087N4575j052166j625253j372124p55369
35503a906226K6722J069321J923034J788806O81809m26750q17862p12806n79014
35494A047034l80554J15686O55798N75314l55164j356155j286505p9854R13450
35485a50950O24248j48624N9976Q68648M10171j472204k356498p19062J498684
35476a385611J588160m4085r20200m68445l00556p94699k97202J628819K785414
35467A791595J535184n90728j136668j23767N34746K5370p11197p95540l20531
35458B08464L53237R54006J046881M40177k75061m35836k85045l66224l52734
$$ y = [727615, 2048537, 1600816, -51691, -1078877, -747302, 77704, 570074, 851937, 1190689, 1446960, 1647495, 2154024, 2844111, 2898686, 1846520, 221267, -1150857, -1906226, -1879504, -810183, 1112851, 2901657, 3583466, 3156716, 2338854, 1626048, 1047034, 666480, 782166, 1437964, 2013278, 1658114, 301959, -984546, -1064400, -150950, 473298, 324674, 384650, 1253298, 1663469, 191265, -2165233, -2884295, -1385611, 202549, 158464, -761736, -1230181, -1530737, -2325436, -2622638, -993819, 1791595, 3326779, 2736051, 1599383, 1475616, 2010362, 2035732, 1324535, 528995, 208464, 561701, 1515707, 2562588, 3002765, 2727704, 2291868, 2006823, 1640599, 1287865]
35449A287865L76719J251888R37410o46999j950203j741569m11866R60824J756894
35440A820963J603308J99723j810027k724261j640343R2002L70089r36283j836559
35431d861388q73389J074630K078464J516782M65337O9969L07433M96480M12403
35422F86721L52854L33508q2957r53752j541792j217442l73831J55536K69248
35413b371907M16978M85556o4184q70370p29009M97251J250847N03301m73355
35404a354892O4883J494286J553358l07198k131193k308611j494248r76395p10358
35395f170368r7344N34026N98901N29356R59204J292725N90917n56536o67218
35386b986337K91051Q76796O06077O26985J426063J609798P8634j930710k395220
$$ y = [1287865, 1664584, 2916472, 3853882, 3206883, 1256680, -484889, -896755, 64069, 1820963, 3424271, 3623994, 1813967, -910294, -2550637, -2458635, -2088546, -3024829, -4861388, -5734777, -4660147, -2581683, -1064901, -599564, -529595, -222162, 274318, 686721, 1039575, 1373083, 1290126, 336374, -1205418, -2422860, -2796691, -2641155, -2371907, -1954929, -1469373, -1533557, -2403927, -3132936, -2635685, -1384838, -881537, -1354892, -1290009, 204277, 1757635, 1450437, -680756, -2989367, -4483615, -5460010, -6170368, -6267712, -5733686, -5134785, -4605429, -3646225, -2353500, -1762583, -2319119, -2986337, -2695286, -1818490, -1212413, -585428, 840635, 2450433, 2529067, 598357, -1796863]
35377a796863j270540k62697k66207m52883O7202Q84725R95718J57942q67591
35368b811194j124784l28444R14131J707965J705418J157340K60226r14797j728741
35359a162880j140751Q01482K375478J958458l4657j730517j896461p68760O60942
35350i37666J318112N30583j146840j997702j028614O42614J294868Q90967N74223
35341A40545N30509M7872o84272p44823l27000m31364p17450J14343J548900J375131
35331H52391o78081j982496r19604P03288P75248P3233K37280O42983j48077j369215
35321a813050j173712K62567J261775J371840J189368M44059j140225j992152
35313a589530n91335J468625J398444k98228o21829Q15651J183079o37815k241240
$$ y = [-1796863, -3067403, -3330100, -3596307, -4049190, -3981988, -3097263, -2101545, -1943603, -2811194, -3935978, -4264422, -3350291, -1642326, 63092, 1220432, 1480658, 565861, -1162880, -2303631, -1502149, 873329, 2831787, 2797130, 1066613, -829848, -1598608, -937666, 380446, 911029, -235811, -2233513, -3262127, -2619513, -1324645, -433678, 140545, 671054, 718926, 34654, -710169, -1037169, -1468533, -2185983, -2071640, -522740, 852391, 174310, -1808186, -2727790, -2024502, -1249254, -1176021, -938741, -295758, -443835, -1813050, -2986762, -2724195, -1462420, -90580, 1098788, 1542847, 402622, -1589530, -2180865, -712240, 686204, 387976, -233853, 581798, 1764877, 1127062, -1114178]
35304a114178j825304o17564J34253J153397K473730K197903K0090j203861J52128
35295A370594J531864L89071j561631j512951l61558n95444j508971o59509J348823
35286a559712J782116O22620L08752J069061P47979o68955o36329J170980J752136
35277D588648k74679k317985k069539q27301n96408p41914J91014J553069J759289
35268A264194P82041l73898j287085j732345j173412p743K24242q59619j633850
35259d797475j112667m82723n87166j09495J809127L295616K502062Q16714O26447
35250A960440J373337Q21257q06777j161081J80684J080236L98929n61038o29039
35241B656948l47156l19729j23484L04036J6158j252149k207156j761510n68075
$$ y = [-1114178, -2939482, -3557046, -3422793, -2269396, 204334, 2402237, 2422327, 1218466, 1370594, 2902458, 3291529, 1729898, 216947, -144611, -740055, -2249026, -2908535, -1559712, 222404, 845024, 1153776, 2222837, 2970816, 2301861, 1665532, 2836512, 4588648, 4313969, 1995984, -73555, -900856, -1497264, -2239178, -2048164, -495095, 1264194, 2046235, 1672337, 385252, -1347093, -2520505, -2528248, -2304006, -3163625, -4797475, -5910142, -6392865, -6980031, -7089526, -5280399, -1984783, 517279, 1333993, 1960440, 3333777, 4155034, 3348257, 2187176, 2367860, 3448096, 3847025, 3285987, 2656948, 2309792, 1990063, 1866579, 2170615, 2186773, 934624, -1272532, -3034042, -3602117]
35232c602117M0204k16794o06706n41009j17497J91696J55885J69960P32727J398219
35222b395432J055206k60266r42859j12249R00965O38994k24566l89561l34916
35213b064684j012081j371721L365J654806R41354j298964j409536J293367L087798
35204a76296J463805j277488j932069q45691r4959J89540R15305J398446N48097
35195A88690o08976l07903R23386J088654o0511r10043o19461J68875Q15320J009936
35185A687967J73308j573248k468128j180196P88068R86492k46785m64629P73053
35176a524098J323362K61966o52905k02634K98204l56262r32154P3000J616206
35167i5315J514927k96503j769226j567668m19607K44664m1015n27617j83571
$$ y = [-3602117, -3561913, -3778707, -4385413, -4926422, -5043919, -4852223, -4696338, -4526378, -3793651, -2395432, -1340226, -1600492, -2543351, -2655600, -1754635, -1115641, -1340207, -1729768, -2064684, -3076765, -4448486, -4445121, -2790315, -1848961, -3147925, -4557461, -3264094, -176296, 1287509, 10021, -1922048, -2767739, -2862698, -2673158, -1757853, -359407, 188690, -420286, -728189, 195197, 1283851, 1223340, 313297, -306164, -137289, 678031, 1687967, 1861275, 288027, -2180101, -3360297, -2572229, -1585737, -1832522, -2297151, -1524098, -200736, 61230, -591675, -794309, -496105, -852367, -1784521, -1711521, -95315, 1419612, 1123109, -646117, -2213785, -2633392, -2388728, -2429743, -2957360, -3140931]
35158c140931J016256J732333Q07875r11090j436506m51315K47303l52723q68995
35149c357793O9944J432245J440791L95014p2780K67069K81406k19370l32217
35140i5691j46025q36504k277147k541211o54964J725354K431308J389576J10971
35131h94333l93765j22193O15808J217532P41084r38531k307641j747883K65478
35122c564444J637381J332056M36051K88012O80672O26615J03286l907N11239
35113B046961O44936l95387j851740k158843r02949O23221J063595O12955M09393
35104I2142P19385O61193k12044j028153p87395K71177J120870J247237Q49519
35095B933931J87464n38469r48550q32583n26978l51327k1304O86307J148684
$$ y = [-3140931, -2124675, -392342, 415533, -495557, -1932063, -2383378, -2136075, -2488798, -3357793, -3287849, -1855604, -414813, -19799, -92579, 174490, 455896, 236526, -95691, -241716, -1078220, -3355367, -5896578, -6551542, -4826188, -2394880, -1005304, -894333, -1288098, -1410291, -794483, 423049, 1164133, 225602, -2082039, -3829922, -3564444, -1927063, -595007, -158956, 129056, 809728, 1436343, 1539629, 1535722, 2046961, 2691897, 2296510, 444770, -1714073, -2617022, -1993801, -930206, -317251, 92142, 811527, 1472720, 1260676, 232523, -554872, -283695, 837175, 2084412, 2933931, 3121395, 2582926, 1634376, 801793, 274815, -76512, -97816, 588491, 1737175]
35086A737175P22144n2411k22546q1627o29165j489122j086754P45927K080824
35077A724445J584472L21338j66606j11925n07684j102707j045422o35839p17492
35068f57420r29369l30387N76031K72567j262449k150052j103319R73988K293806
35059b316604K063154P73844m42056n25800N65172J491400R39259o06441j403389
35050E38539o97876N69116J209274Q57834k74002j509312j697687m29473Q85039
35041e48548O35806n09345n96981K94918J36472j311186j598506M01565K221726
35032h74079J416350p25058j362965l27190L83078J71288K44479R26896J046240
35023H99039P2500j084973j604577j535286r90341M9531J087365J458402J242574
$$ y = [1737175, 2459319, 2406908, 2184362, 2102735, 1473570, -15552, -1102306, -356379, 1724445, 3308917, 3630255, 3463649, 3351724, 2844040, 1741333, 695911, 60072, -657420, -1586789, -1917176, -1341145, -1068578, -2331027, -4481079, -5584398, -4610410, -2316604, -253450, 520394, 78338, -447462, 117710, 1609110, 2548369, 1941928, 538539, -159337, 409779, 1619053, 2476887, 2202885, 693573, -1004114, -1433587, -548548, 87258, -422087, -1019068, -724150, -587678, -1898864, -3497370, -3095805, -874079, 542271, -182787, -1545752, -1872942, -1489864, -1318576, -1074097, -147201, 899039, 971539, -113434, -1718011, -3253297, -4243638, -4194107, -3106742, -1648340, -405766]
35014d05766Q24343Q795j204170j632559l58533J300177J158049o40849j720347
35005b670860q94950M18363O60329K42071M03055J254777J801135J176962n14169
34996A876713k016371j738417L77443K202462J817294M5722r14977p62871q90941
34987c943j317506n29785J271371J633103k99649j931297q88555J482495K211560
34978A627794P77061q65471j251583n83380L22227O91177k1511j319184j667729
34969b290599m25620J027572J208262N82536L57632K65684o79111j906181j745923
34960c605748l2292J489782J556704P92336M10569O26889P83480L41869n79821
34951A783768j324704j329741p88764l64346j66548K66206Q08347O67471j00474
$$ y = [-405766, 418577, 427372, -776798, -2409357, -2767890, -1467713, -309664, -950513, -2670860, -3565810, -3147447, -2487118, -2245047, -1841992, -587215, 1213920, 2390882, 1876713, -139658, -1878075, -1500632, 701830, 2519124, 2564846, 1649869, 886998, -3943, -1321449, -1851234, -579863, 1053240, 753591, -1177706, -2066261, -583766, 1627794, 2404855, 1539384, 287801, -295579, 26648, 717825, 696314, -622870, -2290599, -2716219, -1688647, -480385, 102151, 459783, 725467, 46356, -1859825, -3605748, -3638040, -2148258, -591554, 200782, 611351, 1238240, 2021720, 2363589, 1783768, 459064, -870677, -1659441, -2023787, -2190335, -1924129, -1115782, -448311, -548785]
34942e48785l17542L38175N67136k52426o23877N94965J799638Q92200j164240
34933A285244j535716K53489J766326J301579j47712q44378l13787Q86749J786888
34924D438682J296798n67457j891909r83297J019348J592825N32913p0711O97215
34915F064407J712269K311339K842046K736155J232267J30106K071870N668469
34907B4768928O774163N512619O676097J1379071J5049057J7477781K6680010
34900A14317726M4312686N3558107L4579129p875127m4292073n1881556l7031172
34893A05687720k1492966j5567663j3656824r844550o064875n140807n211031
34886B8709004l908426k236960j652787j403793q30805q77389j607082j415087
$$ y = [-548785, -866327, -528152, 38984, -213442, -837319, -242354, 1557284, 2449484, 1285244, -250472, 3017, 1769343, 3070922, 2923210, 2078832, 1765045, 2651794, 4438682, 5735480, 5168023, 3276114, 2292817, 3312165, 4904990, 5437903, 5367192, 6064407, 7776676, 10088015, 12930061, 15666216, 16898483, 17028589, 19100459, 24768928, 31543091, 37055710, 43731807, 55110878, 70159935, 87637716, 114317726, 158630412, 212188519, 246767648, 238892521, 194600448, 142718892, 105687720, 84194754, 68627091, 54970267, 45125717, 39060842, 33920035, 28709004, 24800578, 22563618, 20910831, 19507038, 18676233, 17798844, 16191762, 14776675]
34878A4776675k79587n76103k869497m089675k135165O14618R81624l80261r39630
34869E102999o45511j015826j545354o46068P84005M05800j250406j136909J300986
34860A353716K919363J711490k29160k20475J028905J043000n05656j694210j325527
34851D081446j66430M91042K02435n63180q95357k01046R61414J228624Q6017
34842E224965j390354j926296j499667q30916j93446M66578Q39058O02714J33260
34833A425896N8487L10117K81878k13126o97784o83552k21817J28420j96368j031034
34823h38883j349918m68781P04437N90068p27408j302694n3030J547078J502472
34814c96659K8331j039041q65158j93437L75433J137712K125469K502315J725721
$$ y = [14776675, 14497088, 13920985, 11051488, 6961813, 4826648, 5441266, 6422890, 6042629, 5102999, 4457488, 3441662, 1896308, 1250240, 2034245, 2440045, 1189639, 52730, 1353716, 4273079, 5984569, 5755409, 5534934, 6563839, 7606839, 7101183, 5406973, 4081446, 3915016, 4406058, 4608493, 4045313, 3149956, 2948910, 3910324, 5138948, 5224965, 3834611, 1908315, 408648, -422268, -615714, -149136, 689922, 1292636, 1425896, 1484383, 1794500, 2076378, 1863252, 1165468, 481916, 260099, 388519, 192151, -838883, -2188801, -2657582, -1953145, -1363077, -2090485, -3393179, -3446209, -1899131, -396659, -368328, -1407369, -2272527, -2465964, -2090531, -952819, 1172650, 3674965, 5400686]
34805E400686M92323j40669j29211l13629j067589j670689j281571j84644M71315
34796A576322J60233m63928p39904q73334j017366m97334Q39907J428550n3103
34787C60043k087080j936684K38581J461891N38523l01204N19002J196772l8482
34778d8638j438383m97626J721368K210281P33596l41299k56187n75828j728277
34769b20993k007266o32571Q43413J020817L99290r7662m24246n61938j31033
34760a812189N40093N74201J77356M25463J147511R39587l42208j169723r34057
34751d53966p77119j155485q80429M12060J117859L04018o19714l41177K52559
34742b141394O7951k5420J032881K185206J823021M03106n08515p04666r00880
$$ y = [5400686, 5893009, 5752340, 5623129, 5309500, 4241911, 2571222, 1289651, 1105007, 1576322, 1736555, 1272627, 532723, -340611, -1357977, -1855311, -1015404, 413146, 360043, -1727037, -3663721, -3425140, -1963249, -1424726, -1725930, -1206928, -10156, -48638, -1487021, -1984647, -263279, 1947002, 2680598, 2339299, 2083112, 1507284, -220993, -2228259, -2860830, -2017417, -996600, -597310, -694972, -1119218, -1681156, -1812189, -1272096, -697895, -520539, -95076, 1052435, 1992022, 1649814, 480091, -453966, -1231085, -2386570, -3266999, -2854939, -1737080, -1433062, -2052776, -2393953, -2141394, -2073443, -2098863, -1065982, 1119224, 2942245, 3345351, 2836836, 2132170, 1231290]
34733A231290q80279j04891O88715N14648K91K50742O29861j71370j476264j366023
34723f83280K22505J459070J588377J583475J672249O74313j496550k902292k289444
34714a71577r55136o16153q49563j61250J346871K004625J014416m74839j006642
34705A30752o58866o20415j211058j182348M14073K237027J896444o08429k301071
34696a903891j103129J166851J369718m81076j602622q45239r9344q60300j836390
34687f195422j225721M49661J352348R72821K32805k32791m08180m8500R96317
34678d106662J783604J023517r70541k237041j492199M02800J792813K196589
34670a607120K130926J620186J33410j940315k968668j934867J18151J345640
$$ y = [1231290, 351011, 246120, 934835, 1449483, 1449774, 1700516, 2330377, 2159007, 682743, -683280, -460775, 998295, 2586672, 4170147, 5842396, 6516709, 5020159, 2117867, -171577, -1126713, -1742866, -2592429, -2753679, -1406808, 597817, 1612233, 1137394, 130752, -528114, -1148529, -2359587, -3541935, -3127862, -890835, 1005609, 397180, -1903891, -3007020, -1840169, -470451, -951527, -2554149, -3399388, -3498732, -4359032, -6195422, -7421143, -6971482, -5619134, -4646313, -4413508, -4646299, -5054479, -5102979, -4106662, -2323058, -1299541, -2270082, -4507123, -5999322, -5596522, -3803709, -1607120, 523806, 2143992, 2277402, 337087, -2631581, -4566448, -4448297, -3102657]
34662c102657J285145Q17438M10461k12488p16234j29053J270674J632850J72861
34653A428997j231781n87325J094283J122266q62949k271613j252983Q13281J400072
34644c47752J45730j068814p37240O60463J588175J229960R6176p59911p61847
34635D4940q9913O51612P73879j04521j421227j734979l36225J356675J258731
34626C98972l87999j046129M74951K129164J630095k26408j025106l39110K65715
34617A874145J36610J29786M60439K21233o20727p45135L68514J449791J305713
34608D580369L15864n90230j195450j562032j463952r67659o79643q20111q26831
34599c209675l17646L08249N58853M23836R3525j82300k0456M75586L47505q13822
$$ y = [-3102657, -1817512, -1000074, -589613, -802101, -1518335, -1647388, -376714, 1256136, 1428997, 197216, -390109, 704174, 1826440, 963491, -1308122, -2561105, -1747824, -347752, -202022, -1270836, -2008076, -1347613, 240562, 1470522, 1566698, 806787, 44940, -44973, 606639, 1380518, 1275997, -145230, -1880209, -2216434, -859759, 398972, 10973, -1035156, -560205, 1568959, 3199054, 2972646, 1947540, 1608430, 1874145, 2010755, 2140541, 2600980, 2822213, 2201486, 1456351, 1824865, 3274656, 4580369, 4896233, 4306003, 3110553, 1548521, 84569, -883090, -1562733, -2382844, -3209675, -3527321, -3219072, -2660219, -2236383, -2142858, -2325158, -2345614, -1870028, -1522523, -2336345]
34589b336345j582609m77805J345007J359762l60968j007880N27213J799079P31620
34580b926j138278j309035j30883L96250J00065K97437Q94457M68851r83289j708660
34570c116011q22648N63909J180368J072292Q69112P80723P35782O87083N25785
34561B476395K28901M376j78548p48644j593946j678594n63761M36601o3516j266966
34551b947702j199069L06732J339821P54642l51413m92093K55589Q71907R21706
34542e39880O63136L24816q147k09627l42644p50396j495175j951330j363795
34533e673042K04723J715384K099353J385065O24020M22289k896j475285k930853
34524c631242k358268O6054J605360P35299m97902L89818K346917K369233K09174
$$ y = [-2336345, -3918954, -4396759, -3051752, -1691990, -2052958, -3060838, -2533625, -734546, -2926, -1141204, -2450239, -2581122, -2184872, -2084807, -1787370, -892913, -424062, -1407351, -3116011, -3938659, -3374750, -2194382, -1122090, -252978, 527745, 1263527, 1950610, 2476395, 2705296, 2709672, 2531124, 1782480, 188534, -1490060, -2053821, -1617220, -1680736, -2947702, -4146771, -3840039, -2500218, -1745576, -2096989, -2589082, -2333493, -1461586, -539880, 123256, 448072, 439925, 230298, -112346, -862742, -2357917, -4309247, -5673042, -5468319, -3752935, -1653582, -268517, 355503, 777792, 774896, -700389, -3631242, -5989510, -5923456, -4318096, -3582797, -4080699, -3690881, -1343964, 1025269, 1234443]
34515A234443j298113o14063N52672M06659k82582l7622P21650O30177k54377
34506A058844o66109p4531Q72010J399115J100796j34337j724121k344400j261308
34497a774041N11334J207593L30692r38983j175206m3481J525781K059628Q23668
34488B526985j154748j842041n35794J140885J305136K08499m90365k88422j93658
34479F76477o09055n37647N10528J272839N38299p50578o27816R91929J941757
34470C406733N80474k116465l741474l024284p40020J344938J881442P95618o13127
34461b226165p67012M15416J235481L92063j062761j040070N89888J762575J208953
34452E08368J58789K62741J136414J254120M08783k43266k30654l46061j069761
$$ y = [1234443, -63670, -677733, -125061, 281598, -984, -38606, 683044, 1313221, 1058844, 392735, 318204, 1190214, 2589329, 3690125, 3555788, 1831667, -512733, -1774041, -1262707, -55114, 275578, -663405, -1838611, -1882092, -356311, 1703317, 2526985, 1372237, -469804, -1005598, 135287, 1440423, 1648922, 1158557, 870135, 676477, 67422, -470225, 40303, 1313142, 1851441, 1100863, 473047, 1464976, 3406733, 3987207, 1870742, -1870732, -4895016, -5635036, -4290098, -2408656, -1613038, -2226165, -2993177, -2577761, -1342280, -950217, -2012978, -3053048, -2463160, -700585, 508368, 667157, 929898, 2066312, 3320432, 3729215, 3485949, 3255295, 2909234, 1839473]
34443A839473j703741j501737p27863j15381M8514j04327l76952m51689K324P84395
34433b306984J172611Q41733L44803K96674N08911M36434J32483J09818L79004
34424A915487L16028l58892j052150j104893p10871n25564o22054m98799r7077
34415b738785j7918m09472m09108O30761J924375K140882J184108J27954m38980
34406A993817r05252j430446j424445n97557M72296J251710J791754J934507J052502
34397D138886p56191k202981k341885j709585j167515n89338L06154Q00027J89056
34388c333372p36450o82407R7992K18770n41169q49893P1156J262058J457357
34379c035958P73755L23027O17769R59363M45892o80417j128405l20512M94879
$$ y = [1839473, 135732, -1366005, -2093868, -2209249, -2160735, -2265062, -2642014, -3093703, -3091379, -2306984, -1134373, -292640, 52163, 348837, 857748, 1294182, 1426665, 1536483, 1915487, 2231515, 1872623, 820473, -284420, -995291, -1520855, -2142909, -2641708, -2738785, -2756703, -3166175, -3575283, -2944522, -1020147, 1120735, 2304843, 2432797, 1993817, 1088565, -341881, -1766326, -2363883, -1891587, -639877, 1151877, 3086384, 4138886, 3382695, 1179714, -1162171, -2871756, -4039271, -4628609, -4322455, -3522428, -3333372, -4069822, -4752229, -4654237, -4435467, -4976636, -5826529, -5755373, -4493315, -3035958, -2262203, -1939176, -1321407, -362044, 83848, -596569, -1724974, -2045486, -1550607]
34370a550607j09023j355677j176197M09786R82729l74468j245545K96812K215624
34361a906566J471159j068147j797058K10455K112380J708997P6336p94021n64556
34352e51021N7462N64711N34476j62134o02962J94643J369739J069011o64094
34343A809831j797258j306644k14824N77043J225342J371853J21079j776813k205104
34334b195495r16074K8133j66153J50747J564696K031961N14797q63996m55808
34325c07192N6587r64396j688565M827K270551J892441n22967j695413q70474
34316a824601j29334k37033L8095P04984L41432o97672l66676J225840J377632
34307D32667q78925l018950k769239r52911O43722J744275K491713K164578O60670
$$ y = [-1550607, -1659630, -3015307, -4191504, -3781718, -2798989, -3173457, -4419002, -4122190, -1906566, -435407, -1503554, -3300612, -3090157, -977777, 731220, 807556, 13535, -551021, -493559, 71152, 605628, 443494, -159468, 35175, 1404914, 2473925, 1809831, 12573, -1294071, -1508895, -931852, 293490, 1665343, 1786422, 9609, -2195495, -3111569, -3083436, -3249589, -3098842, -1534146, 497815, 1012612, 148616, -307192, -250605, -1215001, -2903566, -2898739, -628188, 1264253, 741286, -954127, -1824601, -1953935, -2190968, -2152873, -1447889, -1106457, -1804129, -2170805, -944965, 432667, -446258, -3465208, -6234447, -7187358, -6543636, -4799361, -2307648, -143070, 517600]
34298E17600n51987n42196l72916r90419j295619m4550J690988J863253L69350
34289F43504j090175j435203r19175O8889J338006K210419J869592M88695q95727
34280B278825j571612j467105n86446Q91302K069348J902312M94690q93772j308150
34271A809392r62737n37424k85956j52385k10135m83819o21562k45285M43425
34262a246486Q12419N70681M9268l02431k93125J80825J083168J754854J211465
34253C820638m60387j661370j135744K40781O26790k26642r07902o21199j1494
34244c36529L18940N12024M49105k85462j085325p44302L50420M26582o70277
34235a064824r77805J43273O72067m76941j249552J2026J465648R62531p6104
$$ y = [517600, -34387, -576583, -949499, -1939918, -3235537, -3280087, -1589099, 274154, 643504, -446671, -1881874, -2801049, -2732160, -1394154, 816265, 2685857, 3174552, 2278825, 707213, -759892, -1346338, -455036, 1614312, 3516624, 4011314, 3117542, 1809392, 846655, 309231, 23275, -129110, -339245, -823064, -1444626, -1689911, -1246486, -434067, 136614, 185882, -116549, -409674, -228849, 854319, 2609173, 3820638, 3360251, 1698881, 563137, 803918, 1430708, 1204066, 296164, -325035, -336529, -17589, 494435, 943540, 658078, -427247, -1171549, -821129, -394547, -1064824, -2042629, -1899356, -1227289, -1704230, -2953782, -2941756, -1476108, -513577, -589681]
34226e89681O61871J895683R15736j248387j222276Q89266J618299O021j198693
34217A727839p22705n74756j510846j194980J178911K536698P45785j696711j619521
34208a130286J30465Q82736M50104J55981k39900j382512j824835l8523K277192
34199g19578K152691j17296j449621n96383N88386N04928j74895k60216K24030
34190A52046N73872K83753p96681k071452k175370m99829J628024K447130J896221
34181A437714J038274J46635j068380j992663j660821m54773L45056M00347K45810
34172a562801j06152q18340r84472L20104J965904J789890j84755j485806n55173
34163a621601J332501K070685J175115l88188j590146j859127j107247J68058
$$ y = [-589681, 72190, 1967873, 2883609, 1635222, 412946, 1302212, 2920511, 2926532, 1727839, 1005134, 430378, -1080468, -2275448, -1096537, 1440161, 2185946, 489235, -1130286, -999821, -117085, 333019, 489000, 249100, -1133412, -2958247, -2996770, -719578, 1433113, 1315817, -133804, -730187, -141801, 363127, 188232, -71984, 152046, 725918, 1009671, 212990, -1858462, -4033832, -4533661, -2905637, -458507, 1437714, 2475988, 2622623, 1554243, -438420, -2099241, -2554014, -2208958, -1808611, -1562801, -1668953, -2487293, -3471765, -3151661, -1185757, 604133, 419378, -1066428, -1621601, -289100, 1781585, 2956700, 2568512, 978366, -880761, -1988008, -1819950]
34155a819950J293534K024394K225490J343140p63943k743544k844702j191131
34147b476712K67413K98609k76602j52470O22946R94256M28405n00190q66974
34138a661319m75531p7301l00121n62512J39557J380026J558169M12306l55641
34129E7633J52161M94820m08031r87295L40080J904913J026691j544113k600509
34120a563650j414755m14642q86516j319614o39767N2161R428K55342J215977
34111d706036J561863P82473L74601R36664O59779j370857k837644j546894R35450
34102e210601J665376O95395K21778N98660L02083o94015n81923J058539K313986
34093C69278J805241M51499k91244k83854j34915j34000l47150p05013o43918
$$ y = [-1819950, -526416, 1497978, 3723468, 5066608, 4302665, 1559121, -1285581, -2476712, -2209299, -1910690, -2187292, -2339762, -1716816, -722560, -294155, -794345, -1661319, -2136850, -2214151, -2514272, -3076784, -2937227, -1557201, 968, 413274, 57633, 209794, 704614, 296583, -690712, -350632, 1554281, 2580972, 1036859, -1563650, -2978405, -3393047, -4279563, -5599177, -6238944, -6186783, -6177355, -5922013, -4706036, -3144173, -2361700, -1987099, -1050435, -390656, -1761513, -4599157, -6146051, -5210601, -3545225, -2849830, -2628052, -2029392, -1727309, -2421324, -3003247, -1944708, 369278, 2174519, 2626018, 2334774, 2050920, 1916005, 1782005, 1434855, 729842, 85924]
34084H5924K88879J286047R58053n56822j438780n97375R58747J675232J187757
34075C847662p9218j751297l053420k760422q53391P28754M30382n71419m0846
34066d103215J776499K359424P82843q48713p24548J1404m42317j296100n60994
34057c045717J275858J692362J63686r44100j32628J098535J077971O26502J108342
34048B920811J650002N11501j921292l664350l868383l035234j297424J265437
34040g438932L094065K412390R6690r71109K34318J701405J527452K80410n10741
34031D25948n17191l54628m17668o90594q02531o4402J474364K180020O30967
34022A864285j830850k302046k70107J721831J767497P26656j6029n73744j205926
$$ y = [85924, 374803, 1660850, 2618903, 2062081, 623301, 25926, 984673, 2659905, 3847662, 3768444, 2017147, -1036273, -3796695, -4650086, -3921332, -3490950, -4062369, -4103215, -2326716, 32708, 815551, -33162, -757710, -746306, -1188623, -2484723, -3045717, -1769859, -77497, 86189, -857911, -990539, 107996, 1185967, 1812469, 2920811, 4570813, 5082314, 3161022, -503328, -4371711, -7406945, -8704369, -7438932, -4344867, -1932477, -1835787, -2806896, -2572578, -871173, 656279, 936689, 425948, -91243, -445871, -863539, -1554133, -2356664, -2421066, -946702, 1233318, 1864285, 33435, -2268611, -2538718, -816887, 950610, 1677266, 1661237, 1087493, -118433]
34013a18433j097436O0301J005032P84806J56997m9137l07296r63227j166381
34004a694774m68418K46713N89332J450288K709632K448758J06061j913408j761789
33995A712395r38617j277140j590177k05757J364204P27630j063596j098708O38092
33986a731674J652583J185938N40638p4952j364979k200419r14305J000655N59116
33977a347399j423767j124831J754935K998528P37539j396611k67523J870107
33969A800978J541226l87605q92592P7260L97448p1127K15823J029869O14546
33960D325826r71686j695147p90125K65342K74525j97041k92134k13194n13012
33951A93354j022144r60111K22944K022003K792200J282677j338032k131189N8256
$$ y = [-118433, -1215869, -1155568, -150536, 634270, 791267, 742130, 434834, -528393, -1694774, -2163192, -1916479, -1327147, 123141, 2832773, 5281531, 5387592, 3474184, 1712395, 773778, -503362, -2093539, -2299296, -935092, -207462, -1271058, -2369766, -1731674, -79091, 1106847, 1647485, 1572533, 207554, -1992865, -2907170, -1906515, -1347399, -2771166, -3895997, -2141062, 857466, 1595005, 198394, -69129, 1800978, 3342204, 2954599, 2062007, 2139267, 2536715, 2465588, 2681411, 3711280, 4325826, 3354140, 1658993, 868868, 1134210, 1408735, 1211694, 919560, 706366, 193354, -828790, -1788901, -1565957, 456046, 3248246, 4530923, 3192891, 1061702, 1119958]
33942A119958K769094K804299P1925k700207l369354k181265o69135l7292m51158
33933b643135r97059n25958R02852J925542J699389R64243O26453L60740m00602
33924A912465j135506j113838p33946o99391o69014r1886L70170j94408j097099
33915c452453p99293O92108J692261J169038k1653m20398L72337J426970J395579
33906B054496q1968j591505j283452O00978J707777Q24934l15234J94357J355809
33897C466192R12545j012738k215364j777799q59198l37684J15047N33501L17480
33888h58018l16678l73725J56436K82594p8454R630N24029L67276m27599m65312
33878a179821M54000O86145m46552j266758l91046J085351J486634J013190P01087
$$ y = [1119958, 3889052, 6693351, 6765276, 4065069, 695715, -1485550, -2154685, -2191977, -2643135, -3640194, -4166152, -3263300, -1337758, 361631, 1325874, 1952327, 2313067, 1912465, 776959, -336879, -1070825, -1770216, -2439230, -2531116, -2160946, -2355354, -3452453, -4251746, -3559638, -1867377, -698339, -719992, -1140390, -768053, 658917, 2054496, 1972528, 381023, -902429, -301451, 1406326, 2231260, 1916026, 2110383, 3466192, 4378737, 3365999, 1150635, -627164, -1486362, -1824046, -1708999, -1175498, -858018, -1174696, -1548421, -1391985, -1109391, -1187845, -1178215, -654186, -286910, -714509, -1179821, -725821, -39676, -486228, -1752986, -2144032, -1058681, 427953, 1441143, 2142230]
33869B142230L12931r32061k455803k860244j815044q3033J692126K967431K841783
33860A810316J107171p62929j136757l68473m1081m53274m43597L82022R21375
33851A014773M44856k40912k09681O9660m26284j495579j775537o18079Q50827
33842b385956J079034K24885Q3646J463301K546686J140574j855660l058703j079552
33833a841745J496001J718012J39319o91107k43132j25999q09717q79356J65413
33824a072311Q14929J77857l53918N59736J809884J459726k86331j489667j285598
33815C34307o09537l45406l44038l66698n37605n51460K06426J274227J207235
33806B67451j85057j020375P0106J659980J422777m17618j438442o25908M31892
$$ y = [2142230, 2455161, 1523100, -932703, -3792947, -5607991, -5691024, -3998898, -1031467, 1810316, 2917487, 2154558, 1017801, 649328, 608247, 154973, -288624, 93398, 1014773, 1459629, 1218717, 1009036, 1078696, 652412, -843167, -2618704, -3236783, -2385956, -1306922, -1082037, -998391, 464910, 3011596, 4152170, 2296510, -762193, -1841745, -345744, 1372268, 1511587, 820480, 577348, 451349, -358368, -1237724, -1072311, -257382, -79525, -433443, 126293, 1936177, 3395903, 3109572, 1619905, 334307, -275230, -620636, -964674, -1331372, -1868977, -2420437, -2214011, -939784, 267451, 82394, -937981, -867875, 792105, 2214882, 1797264, 358822, -267086, 164806]
33797A64806L71409K2533M64058Q63386n9198j543892j679122k87762Q44771N37823
33787c01188n25253j188856j105826m34325N32433J197607J137456Q11933Q14956
33778I38937O63845l28426j307196q51602L99484L71493q97126j002253O11827
33769a401017J160413q82460k552282o98162K671900L050394K30166j596406l75600
33760c93054J214252N80583j051463j457997r32010o99817j64044J619585L251144
33751A967179K520416q6887j865965j621261p34201m53849k13590P45460J745193
33742B002495J677519O61604k65002o07430p61202j068652j202909p37069L853
33733b96793J94433k23899j53774J045290K052028J049639j297577k098266k19715
$$ y = [164806, 536215, 558748, 1022806, 1886192, 1826994, 283102, -1396020, -1683782, -839011, -301188, -826441, -2015297, -3121123, -3555448, -3023015, -1825408, -687952, 123981, 938937, 1602782, 1274356, -32840, -884442, -484958, -113465, -1010591, -2012844, -1401017, -240604, -1123064, -3675346, -4373508, -1701608, 1348786, 1578952, -17454, -393054, 821198, 1401781, 350318, -1107679, -2039689, -2739506, -2903550, -1283965, 1967179, 4487595, 4400708, 2534743, 913482, 179281, -274568, -488158, 257302, 2002495, 3680014, 4341618, 4076616, 3469186, 2707984, 1639332, 436423, -300646, -296793, -102360, -326259, -480033, 565257, 2617285, 3666924, 2369347, 271081, 51366]
33724E1366J780972J216206q05702j239530J30034N89737r53048k279687j551709
33715c061361l3035M07657K95751R90272J806192J165275l71463q26209j81031
33706A92048m00325j860537k364765o66810J309537J337875K29325L21890J717796
33697a83966K250551R30572o63575q60516j04942J59549l44591p84509q35656
33688d37083j068913j681469j780224n40085J266330J721807J31662j660876j267770
33679e316621J052266K469509J366287l48262m8202J566830J408148j185647l034614
33670b070306j513062J661464K811342J216927m82314l70471M62744K06448q92200
33661A030572j231690l88777M17162K50513k81791j63347L25011p4091j569484
$$ y = [51366, 1832338, 3048544, 2242842, 1003312, 1133346, 1723083, 770035, -1509652, -3061361, -3094396, -2686739, -2390988, -1400716, 405476, 1570751, 1199288, 373079, 192048, -208277, -2068814, -4433579, -5100389, -3790852, -2452977, -2223652, -1901762, -183966, 2066585, 2997157, 2333582, 1473066, 1368124, 1527673, 1183082, 398573, -437083, -1505996, -3187465, -4967689, -5507774, -4241444, -2519637, -2387975, -4048851, -5316621, -4264355, -1794846, -428559, -776821, -825023, 741807, 2149955, 964308, -2070306, -3583368, -1921904, 889438, 2106365, 1624051, 1253580, 1716324, 1922772, 1030572, -201118, -589895, -172733, 77780, -204011, -367358, -42347, -116438, -1685922]
33652a685922k571688j653495L85829J518709J251122R50561J298140J185902
33644F79158o685p98067J39081J468494J040965n83636q90950N66788J503118
33635C118266O37407m83987m28399k11429j009390j566287j60778K140309K677273
33626D712985J063916n05264p06672n72194j144733j746821j487244q28394m90032
33617a704453o1515R68679J718976R63656p34351j436825m59991P06761N39091
33608E00028n62646j205044j043438p90895o24917N5402J133158J391673L53326
33599g93353o05489j09346J028563Q99284o24586j709806j268108j96288M43274
33590b935855Q28639J248198J137855L08398k31697Q8450K11632o82259j366967
$$ y = [-1685922, -4257610, -5911105, -5525276, -4006567, -2755445, -1804884, -506744, 679158, 672473, -125594, 13487, 1481981, 2522946, 1939310, 1048360, 1615148, 3118266, 3755673, 3271686, 2843287, 2631858, 1622468, 56181, -104597, 2035712, 4712985, 5776901, 5271637, 4564965, 3992771, 2848038, 1101217, -386027, -1214421, -1704453, -1765968, -797289, 921687, 1885343, 1150992, -285833, -745824, -39063, 500028, -62618, -1267662, -2311100, -3101995, -3726912, -3671510, -2538352, -1146679, -793353, -1398842, -1508188, -479625, 419659, -204927, -1914733, -3182841, -3379129, -2935855, -2107216, -859018, 278837, 587235, 355538, 443988, 655620, -26639, -1393606]
33581a393606m29384J082254J042459l14024p19421M54121J280645N07669n53348
33572I57365l32087O10672O88378m90266k015385k749954j785732R64145L815829
33563c37035M214774J628248j461378k400472j241100Q4935L53414k73099j166186
33554e97899j645372j188819j62333M34598N91943J377529K585134K116982p20798
33545B790965l126939k311607L14617J201084q3404q18156M9320N78320j82427
33536a588227l74462J098222K180294Q93513j356581j995323j077567m96986o56288
33527c373405l94502M70368R04809P43392Q90708J376807J117618p8079r56323
33518G01393p79708l83949o24566j018220p51598q6906J46097j52612l99314l11935
$$ y = [-1393606, -1822990, -740736, 301723, -12301, -731722, -277601, 1003044, 1510713, 957365, 625278, 1235950, 1924328, 1434062, -581323, -3331277, -5117009, -4152864, -337035, 3877739, 5505987, 4044609, 1644137, 403037, 487972, 841386, 568287, -597899, -2243271, -3432090, -3594423, -3159825, -2567882, -1190353, 1394781, 3511763, 2790965, -335974, -2647581, -2332964, -1131880, -1215284, -2033440, -1984120, -1405800, -1588227, -1962689, -864467, 1315827, 2209340, 852759, -1142564, -2220131, -2717117, -3373405, -3767907, -3297539, -2392730, -1649338, -758630, 618177, 1735795, 1657716, 701393, -78315, -462264, -1086830, -2105050, -2856648, -2943554, -2797457, -2950069, -3349383, -3661318]
33508c661318j41017r5753j06564j00072r0590K30L14421Q10800J211552J204443
33498f53868O47927k88277j057822j016685j16454P14493L63468j012017j754435
33489d173670n38607J784852L023711K364516J180849P13928K90910j013506k173242
33480A459741j583060K558K37691j057339j427394J70761J425472L88252j134791
33471a518109l42268J955644K395675J21374k096130j974359l96771P04896R34910
33462b15138Q13323L10136o68087j448421j428290j004672q03518o72215j84409
33453e301291M93278R10544R63883P30981K64734j06935j1649J61522l62413j246322
33443c503668j153084O4672P10096j93402j061643j6365K017003K366037L65815
$$ y = [-3661318, -3802335, -3898088, -4004652, -4104724, -4195314, -4195084, -3880663, -3069863, -1858311, -653868, -5941, -294218, -1352040, -2368725, -2485179, -1770686, -1407218, -2419235, -4173670, -4712277, -2927425, 96286, 2460802, 3641651, 4355579, 4646489, 3632983, 1459741, -123319, -120761, 116930, -940409, -2367803, -2197042, -771570, -383318, -1518109, -1860377, 95267, 2490942, 2612316, 516186, -1458173, -1854944, -1150048, -215138, 598185, 908321, 240234, -1208187, -2636477, -3641149, -4444667, -5116882, -5301291, -4808013, -3897469, -2933586, -2202605, -1937871, -2044806, -2056455, -1894933, -2257346, -3503668, -4656752, -4592080, -3881984, -4075386, -5137029, -5153394, -3136391, -770354, -404539]
33434d04539j784789k016492o52003P13302J255118J176083Q50492N01144L32113
33425b9571M47165P28880R39205Q35351L02133m00731p29688m94260j49579j55938
33415A292967m16427o81852r74264j136658o41115M41573R82076K57684p54800
33406a630816p03236Q1592K47888k53459j82357O72695R68343N7115q28336m43923
33396b014494O54301J080400N05687k59998m28461J62771J055365J363306N62956
33387B681833o60868j088278n93764j25381M876M26216R90817M44521j342350
33378G37622k438776j407336N43038J360481R43928O09018P65570P81802M13413
33369B308760k03194j261586k458464k366821m58976J183380M52710j223879o52040
$$ y = [-404539, -2189328, -4205820, -4857823, -4144521, -2889403, -1713320, -862828, -361684, -29571, 417594, 1146474, 2085679, 2921030, 3223163, 2822432, 2092744, 1598484, 1448905, 1292967, 876540, 194688, -779576, -1916234, -2557349, -2115776, -1133700, -876016, -1630816, -2334052, -2252460, -2004572, -2258031, -2440388, -1767693, -799350, -742235, -1570571, -2014494, -1360193, -279793, 225894, -34104, -462565, -299794, 755571, 2118877, 2681833, 2020965, 932687, 338923, 213542, 218418, 644634, 1635451, 2079972, 737622, -1701154, -3108490, -2565452, -1204971, -261043, 347975, 1113545, 1895347, 2308760, 2105566, 843980, -1614484, -3981305, -4440281, -3256901, -2804191, -4028070, -4680110]
33360d680110K064643L351555J549545p02692p75059K12217N1099n69153M15192
33351I17237K322255K213580o49124l398072l235452p61111J257402J354974N92529
33342F14218O22413J390585J333682j90315j566948r57417Q79337J357184k86936
33333C195803j896818j568957j34365O26779N83229N34466K94581o43206j499896
33324e08384j179304j88167K05149J19045N06925J025870N37424n71100p32431
33315g84973J69502O50142K31931K2363L48901M7960j214187k005993j411302
33306c945656l75428J25013M20888P44717M47254k63916J49585J861070K567397
33297A730924R14691r03211k90707J604902J636457m73803j930520j187198L06776
$$ y = [-4680110, -2615467, 736088, 2285633, 1582941, 807882, 1020099, 1071198, 502045, 917237, 3239492, 5453072, 4803948, 1405876, -1829576, -2590687, -1333285, 21689, 614218, 1236631, 2627216, 3960898, 3770583, 2203635, 1246218, 2125555, 3482739, 3195803, 1298985, -269972, -404337, 222442, 805671, 1340137, 1634718, 991512, -508384, -1687688, -1875855, -1670706, -1551661, -1044736, -18866, 518558, -52542, -784973, -615471, 34671, 266602, 288965, 637866, 685826, -528361, -2534354, -3945656, -4321084, -4196071, -3775183, -3030466, -2583212, -2847128, -2697543, -836473, 1730924, 2645615, 1742404, 1451697, 3056599, 4693056, 4219253, 2288733, 1101535, 1408311]
33288A408311Q61489N75303R4388n26330j017889p12823J40438L74349k53157
33279I44079o89685n01878m99651q58503m34847J054951J884517P25898j160987
33270D63894j692396q41898r8100J33331O91674J555525J526051L27823o04958
33261A460946j79149P18562N90435m68755j079292p51455n03315j032366j381439
33252b625828l32475J491133K172839J149332K8374K60316J147664J086753j21472
33243D256636j365585j955442j949776j248139J51684J227892Q51346l59613o83131
33234a074128P5635L14173o39647j369112o95761N70518J220668J351365J266569
33225A020280K96286j682155k907839j815225M84087J637319J186556M13471j63090
$$ y = [1408311, 2269800, 2845103, 2939491, 2413161, 1395272, 682449, 822887, 1197236, 944079, 254394, -247484, -747135, -1605638, -2040485, -985534, 898983, 1624881, 463894, -1228502, -2070400, -2168500, -2035169, -1343495, 212030, 1738081, 2065904, 1460946, 1281797, 2000359, 2590794, 2122039, 1042747, 291292, -212023, -1244389, -2625828, -2958303, -1467170, 705669, 1855001, 1883375, 2143691, 3291355, 4378108, 4256636, 2891051, 935609, -1014167, -2262306, -2110622, -882730, -31384, -390997, -1074128, -998493, -684320, -1323967, -2693079, -3388840, -2818322, -1597654, -246289, 1020280, 1316566, -365589, -3273428, -5088653, -4604566, -2967247, -1780691, -1367220, -1530310]
33216a530310r32975j311740j92255J612414J784804o1267j535744r11898O12341
33207b466630J223477J156826J477987J752682R06965n00139q92631k38727j30689
33198B289121j188495k039001j426812m2337O06368L03967J11406N69444Q91359
33189G5020J80868j163770j804340j075173K82203J141950J274896J200519J129671
33180A241844P43540j3453o25439p20969n55050m83553m23745j81626J05337K73223
33170f39891N28616J030956J306179O90788n87685j308833n78873R62653J660895
33161C064805O93564q82982j310038k73984O96651K56010r48062j207574j72821
33152h4431O47148l7534j593015k342217j592617j88737O97203P82089O71067
$$ y = [-1530310, -2463285, -3775025, -3967280, -2354866, -570062, -631329, -2167073, -3078971, -2466630, -1243153, -86327, 1391660, 3144342, 4051307, 3551168, 2658537, 2419810, 2289121, 1100626, -938375, -2365187, -2407524, -1801156, -1497189, -1385783, -816339, 75020, 255888, -907882, -2712222, -3787395, -3505192, -2363242, -1088346, 112173, 1241844, 1985384, 1971931, 1346492, 625523, 70473, -413080, -836825, -1018451, -913114, -639891, -111275, 919681, 2225860, 2916648, 2328963, 1020130, 441257, 1403910, 3064805, 3758369, 2875387, 1565349, 1291365, 1988016, 2244026, 1295964, 88390, -84431, 562717, 525183, -1067832, -3410049, -5002666, -5191403, -4494200, -3712111, -3041044]
33143c041044R53940J450606J426916O08255k97312m74070j82399m08542j308722
33134a272372j781418r52125N45607J317235Q59077m9862l86028J18155Q79849
33125g21882J054335L22347p19275j117461o29307M6757K33110P4703J09996L99954
33115i46723M87431P2375n89671r48204p11437j75031Q2165n8175j07540J35487
33105b759323O9520o16763q95476K99034J980728J990255K03965r85549j81648
33096h95257R25639M01039p44117l32475J187502J345210l01246j385848m63988
33087b63541Q64565O41798n51837r02250k64534k2816o10612q09227L05769J829076
33077B16391K006103L68639j581316j959149o01165Q17870Q81416K7250m57904
$$ y = [-3041044, -2087104, -636498, 790418, 1398673, 1101361, 627291, 444892, 36350, -1272372, -3053790, -4005915, -3460308, -2143073, -1283996, -1333858, -1719886, -1601731, -721882, 332453, 654800, -64475, -1181936, -1811243, -1764486, -1531376, -1456673, -1346677, -946723, -459292, -386917, -976588, -1924792, -2636229, -2811260, -2729095, -2787270, -2894810, -2759323, -2689803, -3306566, -4202042, -3903008, -1922280, 67975, 271940, -713609, -895257, 30382, 431421, -312696, -645171, 542331, 1887541, 1586295, 200447, -263541, 601024, 1242822, 690985, -211265, -475799, -498615, -1109227, -1918454, -1612685, 216391, 2222494, 2591133, 1009817, -949332, -1550497, -732627, 148789, 176039, -281865]
33068b81865l53161m15996q01061q20977k34282M18876Q25918J088646R05638
33059C31736o5773r57722m37676R80754J210861k08568j219301n84260O4704q09814
$$ y = [-281865, -635026, -1051022, -1852083, -2673060, -2907342, -2488466, -1662548, -573902, 331736, 265963, -691759, -1129435, -148681, 1062180, 853612, -365689, -949949, -885245, -1695059]
$$ [...]
##END NTUPLES=NMR SPECTRUM
##END=
