##TITLE=31Pdec_PR192_5NaT
 D2O, 24 sc
 27.10.2020
##JCAMPDX= 6.0         $$ Bruker NMR JCAMP-DX V2.0
##DATA TYPE= NMR SPECTRUM
##DATA CLASS= NTUPLES
##ORIGIN= UXNMR, Bruker Analytische Messtechnik GmbH
##OWNER= root
$$ XWIN-NMR		Version 3.5
$$ Tue Oct 27 10:10:14 2020 Russian Standard Time (UT+4h)  she@DPX200
##.OBSERVE FREQUENCY= 81.013821
##.OBSERVE NUCLEUS= ^31P
##.ACQUISITION MODE= SIMULTANEOUS
##.ACQUISITION SCHEME= undefined
##.AVERAGES= 24
##.DIGITISER RES= 17
##SPECTROMETER/DATA SYSTEM= spect
##.PULSE SEQUENCE= zgpg30
##.SOLVENT NAME= DMSO
##.SHIFT REFERENCE= (INTERNAL, DMSO, 0, 182.463)
##AUDIT TRAIL= $$ (NUMBER, WHEN, WHO, WHERE, WHAT)
$$ ##TITLE= Audit trail, XWIN-NMR		Version 3.5
$$ ##JCAMPDX= 5.01
$$ ##ORIGIN= Bruker BioSpin GmbH
$$ ##OWNER= she
$$ F:/spectra/data/she/nmr/P31/1/pdata/1/auditp.txt
$$ ##AUDIT TRAIL=  $$ (NUMBER, WHEN, WHO, WHERE, WHAT)
(   1,<2020-10-27 10:09:13.81 +0400>,<she>,<DPX200>,
      <created by zg, POWCHK disabled, PULCHK disabled
       configuration hash MD5:
       00 E9 B6 7A A2 85 ED C7 34 08 36 98 17 FE 4E 26
       data hash MD5: 32K
       04 A5 86 5C 0E 14 66 CC 23 2F 0E BF 98 F6 EF 28>)
(   2,<2020-10-27 10:09:18.76 +0400>,<she>,<DPX200>,
      <Start of raw data processing
       efp BC_mod = 2 LB = 1 FT_mod = 6 PKNL = 1 PHC0 = -2362.747 PHC1 = 23.80069 SI = 64K 
       data hash MD5: 64K
       B5 A6 AD 27 9D AB 8F C5 37 E2 4D A3 B6 66 6C 52>)
(   3,<2020-10-27 10:09:36.04 +0400>,<she>,<DPX200>,
      <pk PHC0 = -3.700776 PHC1 = -25.6 
       data hash MD5: 64K
       3A 6B 70 77 59 6E B0 B9 1C 96 EE 69 F1 78 97 C8>)
(   4,<2020-10-27 10:09:39.32 +0400>,<she>,<DPX200>,
      <abs ABSG = 5 
       data hash MD5: 64K
       7F 12 3C CF 89 32 FA 80 EE A6 0D 4D 33 23 34 40>)
$$ ##END=
$$ 
$$ hash MD5
$$ DB 78 29 39 FB 09 65 98 35 57 86 53 5C 29 6F 58
##$RELAX= 
##$RELAX= 
##$RELAX= 
##$RELAX= 
##$RELAX= 
##$RELAX= 
##$RELAX= 
##$RELAX= 
$$ Bruker specific parameters
$$ --------------------------
##$DU= <F:/spectra>
##$EXPNO= 1
##$NAME= <P31>
##$PROCNO= 1
##$TYPE= <nmr>
##$USER= <she>
##$AMP= (0..31)
100 100 100 100 100 100 100 100 100 100 100 100 100 100 100 100 100 100 
100 100 100 100 100 100 100 100 100 100 100 100 100 100 
##$AQSEQ= 0
##$AQ_mod= 1
##$AUNM= <au_zg>
##$AUTOPOS= <>
##$BF1= 81.014009
##$BF2= 200.13
##$BF3= 200.13
##$BF4= 200.13
##$BF5= 200.13
##$BF6= 200.13
##$BF7= 200.13
##$BF8= 200.13
##$BYTORDA= 1
##$CFDGTYP= 0
##$CFRGTYP= 5
##$CHEMSTR= <none>
##$CNST= (0..31)
1 1 145 1 1 1 1 1 1 1 1 1 1 1 1 1 1 1 1 1 1 1 1 1 1 1 1 1 1 1 1 1 
##$CPDPRG= <waltz16>
##$CPDPRG1= <>
##$CPDPRG2= <waltz16>
##$CPDPRG3= <>
##$CPDPRG4= <mlev>
##$CPDPRG5= <mlev>
##$CPDPRG6= <mlev>
##$CPDPRG7= <mlev>
##$CPDPRG8= <mlev>
##$CPDPRGB= <>
##$CPDPRGT= <>
##$D= (0..31)
0 1 0 0 0 0 0 0 0 0 0 0.03 2e-05 3e-06 0 0 0 0 0 0 0 0 0 0 0 0 0 0 0 0 
0 0 
##$DATE= 1603778953
##$DBL= (0..7)
120 120 120 11 120 120 24 19 
##$DBP= (0..7)
150 150 150 150 150 150 150 150 
##$DBP07= 0
##$DBPNAM0= <>
##$DBPNAM1= <>
##$DBPNAM2= <>
$$ [...]
##$SUBNAM3= <"">
##$SUBNAM4= <"">
##$SUBNAM5= <"">
##$SUBNAM6= <"">
##$SUBNAM7= <"">
##$SUBNAM8= <"">
##$SUBNAM9= <"">
##$SW= 369.568048894756
##$SWIBOX= (0..15)
0 1 3 0 0 0 0 0 0 0 0 0 0 0 0 0 
##$SW_h= 29940.119760479
##$TD= 32768
##$TD0= 1
##$TE= 0
##$TE2= 300
##$TE3= 300
##$TEG= 300
##$TL= (0..7)
0 120 53 12 22 120 120 120 
##$TP= (0..7)
150 150 150 150 150 150 150 150 
##$TP07= 0
##$TPNAME0= <>
##$TPNAME1= <>
##$TPNAME2= <>
##$TPNAME3= <>
##$TPNAME4= <>
##$TPNAME5= <>
##$TPNAME6= <>
##$TPNAME7= <>
##$TPOAL= (0..7)
0.5 0.5 0.5 0.5 0.5 0.5 0.5 0.5 
##$TPOFFS= (0..7)
0 0 0 0 0 0 0 0 
##$TUNHIN= 0
##$TUNHOUT= 0
##$TUNXOUT= 0
##$USERA1= <user>
##$USERA2= <user>
##$USERA3= <user>
##$USERA4= <user>
##$USERA5= <user>
##$V9= 5
##$VALIST= <valist>
##$VCLIST= <CCCCCCCCCCCCCCC>
##$VD= 0
##$VDLIST= <DDDDDDDDDDDDDDD>
##$VPLIST= <PPPPPPPPPPPPPPP>
##$VTLIST= <TTTTTTTTTTTTTTT>
##$WBST= 1024
##$WBSW= 4
##$XGAIN= (0..3)
0 0 0 0 
##$XL= 0
##$YL= 0
##$YMAX_a= 7557
##$YMIN_a= -7217
##$ZGOPTNS= <>
##$ZL1= 120
##$ZL2= 120
##$ZL3= 120
##$ZL4= 120
##$ABSF1= 182.463
##$ABSF2= -187.1042
##$ABSG= 5
##$ABSL= 3
##$ALPHA= 0
##$AQORDER= 0
##$ASSFAC= 0
##$ASSFACI= 0
##$ASSFACX= 0
##$ASSWID= 0
##$AUNMP= <proc_1d>
##$AZFE= 0.1
##$AZFW= 0.5
##$BCFW= 0
##$BC_mod= 2
##$BYTORDP= 0
##$COROFFS= 0
##$CY= -3
##$DATMOD= 1
##$DC= 0
##$DFILT= <>
##$DTYPP= 0
##$F1P= 0
##$F2P= 0
##$FCOR= 1
##$FTSIZE= 65536
##$FT_mod= 6
##$GAMMA= 0
##$GB= 0
##$INTBC= 1
##$INTSCL= 5.30512e-09
##$ISEN= 30
##$LB= 1
##$LEV0= 0
##$LPBIN= 0
##$MAXI= 10000
##$MC2= 0
##$MEAN= 0
##$ME_mod= 0
##$MI= 50
##$NCOEF= 0
##$NC_proc= -7
##$NLEV= 6
##$NOISF1= 182.463
##$NOISF2= 159.3651
##$NSP= 0
##$NTH_PI= 0
##$NZP= 0
##$OFFSET= 182.463
##$PC= 4
##$PHC0= -2366.448
##$PHC1= -1.799311
##$PH_mod= 1
##$PKNL= yes
##$PPARMOD= 0
##$PSCAL= 0
##$PSIGN= 0
##$REVERSE= no
##$SF= 81.014009
##$SI= 65536
##$SIGF1= 159.3651
##$SIGF2= -187.1042
##$SINO= 113.3802
##$SIOLD= 16384
##$SREGLST= <1H.CDCl3>
##$SSB= 0
##$STSI= 65536
##$STSR= 0
##$SW_p= 29940.119760479
##$SYMM= 0
##$S_DEV= 0
##$TDeff= 32768
##$TDoff= 0
##$TI= <>
##$TILT= no
##$TM1= 0
##$TM2= 0
##$TOPLEV= 0
##$USERP1= <user>
##$USERP2= <user>
##$USERP3= <user>
##$USERP4= <user>
##$USERP5= <user>
##$WDW= 1
##$XDIM= 65536
##$YMAX_p= 501591198
##$YMIN_p= -17853826
$$ End of Bruker specific parameters
$$ ---------------------------------
##NTUPLES= NMR SPECTRUM
##VAR_NAME=  FREQUENCY,     SPECTRUM/REAL,   SPECTRUM/IMAG
##SYMBOL=    X,             R,               I
##VAR_TYPE=  INDEPENDENT,   DEPENDENT,       DEPENDENT
##VAR_FORM=  AFFN,          ASDF,            ASDF
##VAR_DIM=   65536,         65536,           65536
##UNITS=     HZ,            ARBITRARY UNITS, ARBITRARY UNITS
##FACTOR=    0.456856943014862, 1,           1
##FIRST=     14782.0589164895, 0,            0
##LAST=      -15158.0608439895, 0,           0
##MIN=       -15158.0608439895, -17853826,   0
##MAX=       14782.0589164895, 501591198,    0
$$ Real data points
##PAGE= N=1
##DATA TABLE= (X++(R..R)), XYDATA
$$ [...]
38281g569419J618375M993041M894737P98393l461151m281740k031492O15645
38273d423611K036078K078578J048949q3824r099R01338N65503j340708k113449
38264a340245k94503J343410J58132j468037J63538L247393K656797j566632l725696
38255h25843j439764P16619r77229l297222j768713J777564K408754K35922r5486
38246c265398K833343N088828L601316K62328j713909k229481k850950l097974
38238a371897j084431K542349L961840Q54442l681682m263985l74499K472379
38230i45484M26425k773489j280502L549282M852026R90996j878895J06408K402032
38221E448799Q4788l742561l390238p3051Q68994o74775m00020J820923J881160
$$ plain form
38281 -7569419 -5951044 -958003 3936734 4735127 1273976 -3007764 -5039256 -4423611
38273 -4423611 -2387533 -308955 739994 656170 647071 1548409 2113912 773204 -1340245
38264 -1340245 -1634748 -291338 -133206 -1601243 -1437705 1809688 4466485 2899853 -825843
38255 -825843 -2265607 -1548988 -2526217 -5823439 -7592152 -5814588 -3405834 -3169912 -3265398
38246 -3265398 -432055 4656773 8258089 8520417 6806508 4577027 1726077 -1371897
38238 -1371897 -2456328 86021 4047861 4902303 1220621 -3043364 -3417863 -945484
38230 -945484 -519059 -3292548 -4573050 -1023768 3828258 4819254 2940359 3046767 5448799
38221 5448799 5533587 1791026 -1599212 -1672263 -803269 -1478044 -1878064 -57141 1824019
38212A824019k47544Q5496L410823M307510O47666k507281j560995j61074j947624
38203C850996l757125j679080J272912P7146l487119l815273p22218J228350J083929
38194e947482K038085L953174K603832k310388m969233j871918K894736M042281
38186D33087K276902J338480J398749o7346k790958l652378j813950j25982n87339
38177c590735j249010O33469L954452M582126J002104k840028k132577K162958
38169B522759M035043N93729l486452k330341K539763M021097o43705o029534
38161A222359n813935m93185M208916M331240R47918k145252k249399j0982J258048
38152A255728o22464l457482l009459J148993M618651L991645J017537p03713
$$ plain form
38212 1824019 1576475 1661971 5072794 9380304 10027970 7520689 5959694 5798620 3850996
38203 3850996 93871 -1585209 -312297 -235151 -3722270 -7537543 -8259761 -7031411 -5947482
38194 -5947482 -3909397 43777 2647609 337221 -4632012 -6503930 -3609194 433087
38186 433087 2709989 4048469 5447218 5379872 2588914 -1063464 -2877414 -3003396 -3590735
38177 -3590735 -4839745 -4206276 -251824 4330302 5332406 2492378 359801 2522759
38169 2522759 6557802 7151531 3665079 1334738 3874501 7895598 7251893 1222359
38161 1222359 -4591576 -5084761 -875845 3455395 4403313 2258061 8662 -2320 1255728
38152 1255728 633264 -2824218 -5833677 -4684684 -66033 3925612 4943149 4239436
38144D239436o15074m44852o92273o79179o56687j046612o17321J782442M353529
38135E623409M000678O20342k744302l883632l199309j670150L65551K085757
38127A198344K271594J249002Q31659J652889K209014J145101r88959k711336
38119F857308k976854j431566J122112K457981J017991j517403j873323J71635
38111C827881J193522q56643l494911l243045l31412K191834K605273J567542
38103C460041M369j672471k471190j191310J502216K913007J253445j887464l000887
38094a090244p27282K219625K069893j134214l127745q22011L392201M774554
38086E554777K623821N85086P27569Q89221q70095k617788j840761J92071M89252
$$ plain form
38144 4239436 3624362 3179510 2487237 1808058 1151371 104759 -512562 1269880 5623409
38135 5623409 9624087 10244429 7500127 3616495 417186 -1252964 -887413 1198344
38127 1198344 3469938 4718940 5550599 7203488 9412502 10557603 9568644 6857308
38119 6857308 3880454 2448888 3571000 6028981 7046972 5529569 3656246 3827881
38111 3827881 5021403 4164760 669849 -2573196 -2904608 -712774 1892499 3460041
38103 3460041 3464410 1791939 -679251 -1870561 -368345 2544662 3798107 1910643 -1090244
38094 -1090244 -1817526 402099 2471992 1337778 -1789967 -2611978 780223 5554777
38086 5554777 8178598 8763684 9491253 10380474 9510379 6892591 5051830 5243901 5733153
38077E733153q48932j168234J73815J046849L70498k79436L78881J157939L58756
38068F923289j650233k957253k357240l60824J453353J722531M46956r67661j154736
38059A098182j16094J182354J936320J662529Q1683k161252l323396k203531M78029
38050a365176L049319M368454L631703K98515m240103o455421m378608m89915
38042e581232J358055R06875P74762J709904J869956O64961j33743K98459N68736
38033B436733J0565n7569Q08206Q85502o29393j802923r96260M94392O74468k02712
38023A621009p82287r67552j227067j016890K12134J562304J847095J191437K88925
38014B729108o37025j055571k829J959067K496345P58652j028758r64445l74982
$$ plain form
38077 5733153 4884221 3715987 3889802 4936651 5307149 5027713 5406594 6564533 6923289
38068 6923289 5273056 2315803 -41437 -402261 1051092 2773623 3220579 2252918 1098182
38059 1098182 982088 2164442 4100762 5763291 5844974 3683722 360326 -1843205 -1365176
38050 -1365176 1684143 6052597 9684300 9982815 5742712 -712709 -5091317 -5581232
38042 -5581232 -4223177 -3316302 -2541540 -831636 1038320 1703281 1569538 1867997 2436733
38033 2436733 2447298 2389729 3197935 4083437 3454044 1651121 654861 1149253 1823721 1621009
38023 1621009 838722 -128830 -1355897 -2372787 -2160653 -598349 1248746 2440183 2729108
38014 2729108 2092083 1036512 1033683 2992750 5489095 6247747 5218989 4254544 3879562
38005C879562j130683k137361j324030N06413J002814L79015Q73532K546239K915134
37996G510635J056633q34444p81482L22394M06645r70661k468403k796779k081047
37987f36509j549313j831432j896374p13208M27445n20607k320173j228153K943143
37978g325181N318281L054289J33050J204258M045070L295744p03248k759082
37970F263181j342733q6399q16790j179543j53578j70782j986810k642489p42698
37961b858641R16647L89292j43168J217644K472284J436129n33730j398543j672318
37952a74404k017752r86099J863687L773778K736953O20969m50969j437603l029919
37943H98641k766830O01496L416589K249779l98649l10130J479327J203564o88795
$$ plain form
38005 3879562 2748879 611518 -712512 -206099 796715 1175730 2049262 4595501 7510635
37996 7510635 8567268 7732824 6951342 7273736 7680381 6709720 4241317 1444538 -636509
37987 -636509 -2185822 -4017254 -5913628 -6626836 -6199391 -6719998 -9040171 -10268324 -7325181
37978 -7325181 -2006900 1047389 1180439 2384697 6429767 9725511 9022263 6263181
37970 6263181 4920448 4834049 4017259 2837716 2684138 2513356 526546 -2115943 -2858641
37961 -2858641 -1941994 -1552702 -1695870 -478226 1994058 3430187 2896457 1497914 -174404
37952 -174404 -2192156 -3178255 -1314568 2459210 5196163 5817132 5366163 3928560 898641
37943 898641 -1868189 -1266693 2149896 4399675 4001026 3690896 5170223 6373787 5684992
37934E684992r55834m9433j011136l011841k288279Q37042K040465K64302j119416
37925C90862q73253j429829k886575j926280J381555K141458j107399k829667
37917g139128Q20391N227219M266572k96420k092797L4160J436101l40042k407700
37908d91644j679641R81549K698106K027397k12897j924263j428185O86258J944534
37899B601214J108500l18967p27406o52789q88139o16039L53488j44902l049972
37890b335012m844675j839726L571633N303692J928688j743442j941468m08707
37882b309017j06567n22173R1778Q80246M1661j568975j711781n85380k77409
37873f067617p88497K64127L404690N538644L972653L25812j540960n23589Q91526
$$ plain form
37934 5684992 4729158 4679725 3668589 656748 -1631531 -794489 1245976 1510278 390862
37925 390862 -482391 -1912220 -4798795 -6725075 -5343520 -3202062 -4309461 -7139128
37917 -7139128 -6318737 -1091518 3175054 2878634 785837 819997 2256098 1916056 -491644
37908 -491644 -2171285 -1189736 1508370 3535767 3322870 1398607 -29578 656680 2601214
37899 2601214 3709714 3390747 2663341 2010552 1122413 506374 859862 714960 -2335012
37890 -2335012 -7179687 -9019413 -5447780 -144088 1784600 41158 -1900310 -2309017
37882 -2309017 -2415584 -2937757 -2845979 -1965733 -1924072 -3493047 -5204828 -5790208 -6067617
37873 -6067617 -6856114 -6591987 -3187297 2351347 6324000 6649812 5108852 4585263 5476789
37864E476789O10849l97986k97776L81702n25667l235616m892032k820437J849391
37855c850783M835568L228966j140348l612132k130622K69713m33525l485003
37847f318166m029595O0570M767702N178225J959421j95454P57843K366785K067484
37838F614815J01258k214208l956647l659796j24620M508086N533688J510749
37830H313325l164081l697861q00230J248979O02110q69357j169242k73831J019062
37821A208874K061391K137339R06124q85986k134530k461707j888327l95495J276203
37812a76114J628221L91178p16076m02321M29373N90497N79994J083740J326759
37803D735251P68229N22962J016436M20576j967258l178834q79405J931381Q71893
$$ plain form
37864 5476789 6087638 5689652 5391876 5773578 5247911 2012295 -2879737 -5700174 -3850783
37855 -3850783 984785 4213751 3073403 -538729 -2669351 -2399638 -2833163 -6318166
37847 -6318166 -10347761 -10287191 -5519489 -341264 1618157 1422703 2180546 4547331 6614815
37838 6614815 6716073 4501865 545218 -3114578 -3239198 1268888 6802576 8313325
37830 8313325 5149244 1451383 651153 1900132 2502242 1632885 463643 189812 1208874
37821 1208874 3270265 5407604 6313728 5427742 3293212 831505 -1056822 -1452317 -176114
37812 -176114 1452107 1843285 1127209 724888 1154261 1744758 2324752 3408492 4735251
37803 4735251 5503480 6026442 7042878 7463454 5496196 2317362 1437957 3369338 4241231
37794D241231k623804l032907P78775L935058K969296J1511j742208k282748k610584
37785c56380k194335q58147m9905j70021M83074K284471K841339R81175q50421
37776B110850m29596R16816J220166J166059J710136J269153j334845l496446
37768C132293k156842J116182K129698J50425j569935r12380O50943P71886j009746
37759B302524l244035l706700j236661K172329K666744k96653k309521j82122
37751c834095K815510J811165j742461k198177J180860L093153P86490j956568
37743d4123j447553M04736M02322k83992J118186L290541K411133j570934m238222
37734D2094k639633R35264K154144Q231k230512j139704K511328M391419J976175
$$ plain form
37794 4241231 1617427 -1415480 -636705 3298353 6267649 6279160 4536952 2254204 -356380
37785 -356380 -2550715 -3408862 -3458767 -3628788 -3145714 -861243 1980096 2961271 2110850
37776 2110850 1681254 2598070 3818236 4984295 6694431 7963584 6628739 3132293
37768 3132293 975451 2091633 4221331 4371756 2801821 1889441 2540384 3312270 2302524
37759 2302524 -941511 -4648211 -5884872 -3712543 -1045799 -1342452 -3651973 -3834095
37751 -3834095 -1018585 792580 -949881 -3148058 -1967198 1125955 1912445 -44123
37743 -44123 -1491676 -1086940 -684618 -968610 149576 3440117 5851250 4280316 42094
37734 42094 -2597539 -1662275 491869 500100 -1730412 -2870116 -358788 4032631 6008806
37725F008806j944156k807024m36983J053930m93052k419300j809163J85256P63975
37716a897711j58977o42644j48715L57831O72504J244489J547883Q38293p3187
37707A739766O381K91213q24650k624375k633784m52886J456314J425797P88924
37698h27300J349376K436730J998941l12843k551982k801285j289676j6765l84387
37689b399191j367037o17760K307256M774742M132852J182629r03513p97118l84887
37680E927973j612580l577399l782574j479181J300870K073583P66083k17588
37672f00813R20684K776315K452641k23552k164636j465750o0097j61603m44738
37663A028451J203429K961854J267439k880039m395147j559737J493716J427583
$$ plain form
37725 6008806 4064650 1257626 820643 1874573 1381521 -1037779 -2846942 -2661686 -1897711
37716 -1897711 -2056688 -2699332 -2848047 -2490216 -1817712 -573223 974660 1812953 1739766
37707 1739766 1746147 2037360 1212710 -1411665 -4045449 -4498335 -3042021 -1616224 -827300
37698 -827300 522076 2958806 4957747 4644904 2092922 -708363 -1998039 -2014804 -2399191
37689 -2399191 -3766228 -4383988 -2076732 2698010 6830862 8013491 7109978 6312860 5927973
37680 5927973 4315393 737994 -3044580 -4523761 -3222891 -1149308 -383225 -600813
37672 -600813 319871 3096186 5548827 5325275 3160639 1694889 1634792 1473189 1028451
37663 1028451 2231880 5193734 6461173 3581134 -814013 -2373750 -880034 547549
37655E47549M73597J704391L335445J844016j669160k783548m56228J756199J155376
37646E907637j022387k506900k846212k403945j101909N51008J087494K4062j135624
37637c446776q28874O48924J843036J828007O99051p33223j357833p06261K86866
37628a767083K88312o03974r62559O248J558350K483338K201134R54582k24805
37619C933543k09040N67900L5362k435732m043968j995943J945753L376789J401067
37610B575731n44438k69662N12269J13433m02065k45491r89359l110491l778188
37601f138261j176521J837819J822490j7683m04088M63695J21440j155379j091293
37592e737781R958K2260m97229O46562K294306J235807j518184j488685J478139
$$ plain form
37655 547549 1021146 2725537 6060982 7904998 6235838 3452290 2996062 4752261 5907637
37646 5907637 4885250 2378350 -467862 -2871807 -3973716 -3422708 -2335214 -2311152 -3446776
37637 -3446776 -4275650 -3626726 -1783690 44317 743368 10145 -1347688 -2053949 -1767083
37628 -1767083 -1478771 -2082745 -3045304 -3039056 -1480706 1002632 3203766 4158348 3933543
37619 3933543 3724503 4292403 4327765 1892033 -2151935 -4147878 -2202125 1174664 2575731
37610 2575731 2031293 1761631 2273900 2387333 1985268 1739777 750418 -2360073 -6138261
37601 -6138261 -7314782 -5476963 -3654473 -3672156 -4076244 -3612549 -3491109 -4646488 -5737781
37592 -5737781 -5727823 -5705563 -6202792 -5556230 -3261924 -2026117 -3544301 -5032986 -3554847
37583c554847K262836q67204k903593n08265K229261Q93949j681996n55647K760442
37574a925064L197654P51907l53207N93710M34179j247090j562989l95032p85004
37565a290936k599010j959908J634965L650309J961219O3212K57258l02116l098021
37556a683028l817897L81020M352458K190739k843094k930359K038356M539820
37548B228015J243605k802671k908154p79994M51392J189771K148319J292844
37540B063127k068947m128602j661156K727083M433409L398618K668306K543172
37532I975010Q46986k008057k908592j111728N94220M80003J37061J038733J823471
37523H867107O11580k041046m009667m052770k378964J1243J716851J712332M01013
$$ plain form
37583 -3554847 -1292011 -2159215 -5062808 -5571073 -3341812 -2447863 -4129859 -4685506 -1925064
37574 -1925064 1272590 2024497 1671290 2265000 2699179 1452089 -110900 -505932 -1290936
37565 -1290936 -3889946 -5849854 -4214889 -564580 1396639 1459851 1717109 1414993 -1683028
37556 -1683028 -5500925 -5119905 -767447 1423292 -1419802 -4350161 -2311805 2228015
37548 2228015 3471620 668949 -2239205 -3019199 -2567807 -1378036 770283 2063127
37540 2063127 -5820 -4134422 -5795578 -3068495 1364914 4763532 7431838 9975010
37532 9975010 10821996 8813939 5905347 4793619 5387839 5867842 6004903 7043636 8867107
37523 8867107 9478687 7437641 3427974 -624796 -3003760 -2992517 -1275666 436666 837679
37514H37679q26464j185201p96756J69162J212208Q84465j443949l408059j834349
37505f391264K483322M935153L060699k86706j328753m35620n11870k134405l031907
37496c641351j684250Q43516K536750K412772J081037K61369J113588K362387
37488E285818J398508j753469l421130j081649K574343L007297P9465k168013
37480C921170j573457l26061p35240j620169p06377J370785J742975n26731k773955
37471a227060j858096J735614L957543J873084k540078m705396l150141o32371
37463f546901O50495J796147L590692L672069N48197k349513j024013K424706
37455B761879K495946j104804l016330p94736J710977J312560M17091J863051
$$ plain form
37514 837679 11215 -1173986 -1970742 -1801580 -589372 295093 -1148856 -4556915 -6391264
37505 -6391264 -3907942 1027211 4087910 3801204 2472451 2036831 1524961 -609444 -3641351
37496 -3641351 -5325601 -4482085 -1945335 467437 1548474 1809843 2923431 5285818
37488 5285818 6684326 4930857 1509727 428078 3002421 6009718 6089183 3921170
37480 3921170 2347713 2021652 1286412 -333757 -1040134 330651 2073626 1546895 -1227060
37471 -1227060 -3085156 -1349542 2608001 4481085 1941007 -2764389 -5914530 -6546901
37463 -6546901 -5896406 -4100259 -509567 3162502 3710699 1361186 337173 2761879
37455 2761879 5257825 4153021 1136691 341955 2052932 3365492 3782583 5645634
37447E645634L351183J290842k807018m254133j937488P40511R44461o89107j858906
37438D25979j000633J633871L639528K277678j799821m319204k788290o7831q886
37429b007609j724634j679596K48063J051515J84760L12144K028781K115759j299962
37420g70779n105772m897665l81438M660227O533267M576391J021725j139631
37412D496325q71208p2507j156487l816256n366456m163097j327217R68812J701394
37403i606697J446202J585228K829737L868787K498036r19133k814241j073239
37395b185320J504749J087076j516354k503625j159833j43068k11060P61901L043899
37386a321635L801079J813526n92652j747075k822537m144938l371012L13317
$$ plain form
37447 5645634 8996817 10287659 7480641 3226508 1289020 2029531 2973992 2284885 425979
37438 425979 -574654 1059217 4698745 6976423 5176602 857398 -1930892 -1998723 -2007609
37429 -2007609 -3732243 -5411839 -5163776 -4112261 -3927501 -3615357 -1586576 529183 -770779
37420 -770779 -5876551 -10774216 -11155654 -6495427 37840 4614231 5635956 4496325
37412 4496325 3625117 3552610 2396123 -1420133 -6786589 -10949686 -12276903 -11308091 -9606697
37403 -9606697 -8160495 -6575267 -3745530 123257 2621293 1702160 -1112081 -2185320
37395 -2185320 -680571 406505 -1109849 -3613474 -4773307 -4916375 -5127435 -4365534 -1321635
37386 -1321635 2479444 4292970 3700318 1953243 -869294 -5014232 -8385244 -8071927
37378h071927L819954M531774L657957K694079K96110l980096o397033l774591
37370g223773J069094K961561J473103O0924j38941r07932k243642j858633N00620
37361f307619K320823K373846K042502K167180J743063K85402j228173k044730
37353A352294j843716K92315M117061O059562K721707l426500o070593l483860
37345b81730n97638j278875l072983k172412M74480J662124J535452K496968M161819
37336B927205L583517K12888k821764k882445p85937J023658J378059P27784p4096
37327C288869n31483o94491j006196j621466j893902j015238Q07619K208116J872442
37318A414270q4767j967767k050255n47690M88004k05881j361115j120564J15536
$$ plain form
37378 -8071927 -4251973 279801 3937758 6631837 6927947 2947851 -3449182 -7223773
37370 -7223773 -6154679 -3193118 -1720015 -1659091 -1798032 -2705964 -4949606 -6808239 -6307619
37361 -6307619 -3986796 -1612950 429552 2596732 4339795 4625197 3397024 1352294
37353 1352294 -491422 -199107 3917954 9977516 12699223 9272723 3202130 -281730
37345 -281730 -879368 -2158243 -5231226 -7403638 -6929158 -5267034 -3731582 -1234614 2927205
37336 2927205 6510722 6723610 3901846 1019401 233464 1257122 2635181 3362965 3288869
37327 3288869 2757386 2062895 1056699 -564767 -2458669 -3473907 -2666288 -458172 1414270
37318 1414270 1329503 -638264 -2688519 -3236209 -2748205 -2954086 -4315201 -5435765 -5320229
37309e320229N09735l9350K38092J808033K834281K066015O01458k61662r41649
37300A494724j962419k195917m83678K135564L464876K704540P93834r74701j646881
37291C329942q72622M49136P15056k72813q61029j04527P02146K86413m24002
37282B947700j02379M40319l56942j899753k180279q81248L49326M48895n9585
37273a293946l96638k53837M94805J361326J096227n13466j560164n70058Q74817
37264g60934M36009r73800m84722J799508K535468K26305k643633l460352k456433
37255e782584o98981J809165M310176M454380J548744j656856k680540k603115
37247a299611l257649l520339j618636Q05126Q38113n89090J08761L139628M710057
$$ plain form
37309 -5320229 -4810494 -4849844 -4611752 -2803719 30562 2096577 2698035 2436373 1494724
37300 1494724 -467695 -2663612 -3147290 -1011726 2453150 5157690 5951524 4976823 3329942
37291 3329942 2457320 2906456 3621512 3348699 2487670 2383143 3085289 3371702 2947700
37282 2947700 2845321 3285640 2928698 1028945 -1151334 -2032582 -1683256 -1234361 -1293946
37273 -1293946 -1690584 -1944421 -1449616 -88290 1007937 494471 -1065693 -1635751 -760934
37264 -760934 -324925 -1298725 -1783447 16061 2551529 2777834 134201 -3326151 -5782584
37255 -5782584 -6481565 -4672400 -362224 4092156 5640900 3984044 1303504 -1299611
37247 -1299611 -4557260 -8077599 -9696235 -8891109 -8052996 -8642086 -8533325 -5393697 -683640
37238f83640K944630L10442j008903j995591l112528j972586K047867M514507
37230A044198J743265k622390k165472K399841L873923l87150m305344k580925
37222c000054J198624O21651l287999l924710L85007M031446K956299K46101M64289
37213c09346K680936K748204K852k099228j159201J447345L000216K338376J35228
37204H785382k059905k780317j786325l78647J29890j24124l47033n25586r40844
37195b7509j105371o46439m69706j311023j833832l16696K131465K512048K81794
37186g85269j737736j468074j42446L99585O17260J579140K222103P92544j810123
37177c33016k568063l17665K615836L217654J050983j701418k651143j256545
$$ plain form
37238 -683640 2260990 2571432 1562529 -433062 -3545590 -5518176 -3470309 1044198
37230 1044198 2787463 165073 -2000399 399442 4273365 3886215 -419129 -3000054
37222 -3000054 -1801430 -1179779 -4467778 -8392488 -8007481 -3976035 -1019736 -773635 -309346
37213 -309346 2371590 5119794 5122646 3023418 1864217 3311562 6311778 8650154 8785382
37204 8785382 6725477 3945160 2158835 1780188 1910078 1785954 1438921 913335 -27509
37195 -27509 -1132880 -1779319 -2249025 -3560048 -5393880 -5710576 -3579111 -1067063 -785269
37186 -785269 -2523005 -3991079 -4133525 -3733940 -3116680 -1537540 684563 1477107 -333016
37177 -333016 -2901079 -3218744 -602908 2614746 3665729 1964311 -686832 -1943377
37169a943377J059244K503608K648419K413084K328411J533422q84159m013207
37161E645445n459996l706980J83429L258052L152278L49565j996284j210102
37153B15407J743430L167227J094382k317405l683695k468232p51219J04490N47268
37144b348347Q89425N39156k17430K86229K459734L843614K054188j454386k805343
37135C246840r30142R17293j45164k544031k871969j060154O2926o7576J248650
37126b143327M612898N869198J905000l478007l821374P97110L519275L35557
37118G596330m466457m586281J17732M710168N879553M150645R73466k715009
37110A1660147n280772m926552k185338J05552M7910j291577j467837N05064K985001
$$ plain form
37169 -1943377 -884133 1619475 4267894 6680978 9009389 10542811 9658652 5645445
37161 5645445 185449 -3521531 -3338102 -80050 3072228 3421793 1425509 215407
37153 215407 1958837 5126064 6220446 3903041 219346 -2248886 -3000105 -2895615 -2348347
37144 -2348347 -1458922 -919766 -1137196 -850967 1608767 5452381 7506569 6052183 3246840
37135 3246840 2316698 3233991 3088827 544796 -2327173 -3387327 -3324401 -3391977 -2143327
37126 -2143327 2469571 8338769 10243769 6765762 2944388 3741498 7260773 7596330
37118 7596330 3129873 -1456408 -1338676 3371492 9251045 13401690 14375156 11660147
37110 11660147 6379375 1452823 -732515 -626963 -579053 -1870630 -3338467 -2833403 151598
37101A51598L134618J64564k870871k258000J020856J940234j107370l068686
37093b893057L34151N273402M915693l39808l857500l231929k813370m692131
37085g304549m382574J032407O559943O163343J632866q74878o9351M16324p80276
37076B393255j390704p03176o28984j284070m04399J971677K713607Q28801o14490
37067B881517L91778J489423J73363j868800j648354J63237M65158j269642k391702
37058a614022j319222K59401R2853j509866k348194j291000N34771J543878J791008
37049c860393K395445L173176K385994m05208k774212k348892j96691Q12275K69135
37040e49371K30364J162140R92192r44405j985231k6395K842504K901677j91957
$$ plain form
37101 151598 3286216 3450780 579909 -1678091 -657235 1282999 175629 -2893057
37093 -2893057 -2558906 2714496 7630189 7290381 3432881 200952 -2612418 -7304549
37085 -7304549 -11687123 -10654716 -4094773 2068570 3701436 2826558 2757207 3173531 2393255
37076 2393255 1002551 299375 -329609 -1613679 -2018078 -46401 2667206 3496007 2881517
37067 2881517 3273295 4762718 4936081 3067281 1418927 1582164 2047322 777680 -1614022
37058 -1614022 -2933244 -2673843 -2580990 -4090856 -6439050 -7730050 -7195279 -5651401 -3860393
37049 -3860393 -1464948 1708228 4094222 3689014 914802 -1434090 -1630781 -818506 -549371
37040 -549371 -319007 843133 1835325 890920 -1094311 -1120706 1721798 4623475 4431518
37031D431518l108058l071558o94878J338567J271261j80377q45660K79717J721822
37022A142354J599595M12338L7531L06863p46798k750176k355717J446030M389684
37013C481704K298148k715081m943520k821708j65051J31591k46633J195958L503033
37004b81559L875609J737457q74346k135743j966445j070736R2064J109904J368318
36995A854523O75894k13180m38711l91449j257112k732499k515031M80074L514486
36986a023005L026104k13930j871205k14180J827855J764050R92669J148539P93687
36977F230584j067535j632840J244169L983928J848190l144121m596272j422842
36969A443261Q47197r25962l147320k091162M79044J235789N07492K17978l383
$$ plain form
37031 4431518 1323460 -1748098 -2442976 -1104409 166852 -13525 -859185 -579468 1142354
37022 1142354 2741949 3154287 3191818 3498681 2751883 1707 -2354010 -907980 3481704
37013 3481704 5779852 3064771 -1878749 -4700457 -4865508 -4733917 -4980550 -3784592 -281559
37004 -281559 3594050 5331507 4457161 2321418 354973 -715763 -623699 486205 1854523
36995 1854523 2530417 2317237 1878526 1487077 229965 -2502534 -5017565 -4537491 -1023005
36986 -1023005 2003099 1789169 -82036 -296216 1531639 3295689 4288358 5436897 6230584
36977 6230584 5163049 3530209 4774378 8758306 10606496 7462375 2866103 1443261
36969 1443261 2290458 1364496 -1782824 -3873986 -3394942 -2159153 -1651661 -1433683 -1437066
36960a437066j247890k440119k084923p54675O81201K884965N571750N945052
36952G118295K696441r53621j600880o79087j385212k821476j730299J331054
36944A975215K391031K81451k007522k361560j795786j188208K31087K130602
36936c43690K435570P43522p29023q08874r03988j606345j011998J681903L842159
36927C299236L028470O18143o55953q18586j618743k827509k452065j21911K146525
36918E97607K549954J154040r37250k594832k918209j750467k3309J203096J837045
36909h82325K259616K297449J558408K91613r43695j953138k476239j858718k16054
36900a923083Q74966K65443p56557j1109K242908L334813J806179o92043j774188
$$ plain form
36960 -1437066 -2684956 -5125075 -7209998 -7964673 -7283472 -4398507 1173243 7118295
36952 7118295 9814736 8861115 7260235 6581148 5195936 2374460 644161 1975215
36944 1975215 4366246 4647697 2640175 278615 -1517171 -2705379 -2474292 -343690
36936 -343690 2091880 2835402 2106379 1297505 393517 -1212828 -2224826 -542923 3299236
36927 3299236 6327706 6945849 6289896 5471310 3852567 1025058 -1427007 -1548918 597607
36918 597607 3147561 4301601 3364351 769519 -2148690 -3899157 -3922466 -2719370 -882325
36909 -882325 1377291 3674740 5233148 5524761 4581066 2627928 151689 -1707029 -1923083
36900 -1923083 -1048117 -782674 -1539231 -1550340 692568 4027381 5833560 5141517 3367329
36891C367329j083271K52789J532495K429964K030752k30179k910095l644555
36883A745229k227752j013863j540110k257042q87409K064337L814155K830181
36875B527726L20690j580321j644843K14728K817878L778383J609634j801042
36867F242833k732359l25256K217098K046618J59183r43304r66151j170995j687677
36858B839990j764659j527764j377925p52292N06863R26522j95193p86979P84039
36849a347398K200909N27980k351518k149201O29334J145313j592257k616181
36841e553019Q50140M355149K881380j493106k932499k42637K447355K043797
36833B356560m02037k461215k979765j946694r6619J249458J467929J376102J597186
$$ plain form
36891 3367329 2284058 2536847 4069342 6499306 8530058 8299879 5389784 1745229
36883 1745229 -482523 -1496386 -3036496 -5293538 -6180947 -4116610 -302455 2527726
36875 2527726 2848416 1268095 -376748 -162020 2655858 6434241 8043875 6242833
36867 6242833 3510474 3185218 5402316 7448934 7608117 6664813 5698662 4527667 2839990
36858 2839990 1075331 -452433 -1830358 -2582650 -2075787 -1149265 -1344458 -2131437 -1347398
36849 -1347398 853511 1381491 -970027 -3119228 -2489894 -1344581 -2936838 -5553019
36841 -5553019 -4702879 -347730 2533650 1040544 -1891955 -2134592 312763 2356560
36833 2356560 1954523 -506692 -3486457 -5433151 -5529770 -4280312 -2812383 -1436281 160905
36824A60905J300660r0349j365027j311494n28864K20396J604348L586263L795350
36815G372188Q44029k536314k932862j326823j079502k031080r38650K397374
36807b31640L935501J389136k273236k984478n61598J992086K145415l27629l442775
36798c59218m236415j603013J810051K459065N77345n31736J76296K33363j490273
36789b964535k344906k52305K574583K868810J080393J93150J178378K159149
36781D492717J394809q61260l043628l505529j698541R02158J906876P95847n60948
36772a77499p61650n49474p50705n99775M04143R21880p2189j216485q14709N34002
36762c082461J350193J754452K284161J817415n66423k886284k499959k71951
$$ plain form
36824 160905 1461565 1371216 6189 -1305305 -1834169 -1613773 -9425 3576838 7372188
36815 7372188 8216217 5679903 2747041 1420218 340716 -1690364 -2629014 -231640
36807 -231640 3703861 5092997 2819761 -164717 -726315 1265771 3411186 3083557 -359218
36798 -359218 -4595633 -6198646 -4388595 -1929530 -1352185 -1883921 -1707625 -1474262 -2964535
36789 -2964535 -5309441 -5561746 -2987163 -118353 962040 1155190 2333568 4492717
36781 4492717 5887526 5026266 1982638 -1522891 -3221432 -2319274 -412398 383449 -177499
36772 -177499 -939149 -1488623 -2239328 -2839103 -2434960 -1513080 -1585269 -2801754 -3616463 -3082461
36762 -3082461 -1732268 22184 2306345 4123760 3557337 671053 -1828906 -2100857
36754b100857P15240J71996P48295K912700L459231N41684k963435l277859p12176
36745e05181J411122J349260K77533j11443N47033J436564J187902j091209m162532
36736C39049m865342j726636K209472K409978j167148l614158j677819J617890
36728f474714J344072j974368k947940O73950M462942L764856N16681K3744K643110
36719B032333L225402q39885n364654n207239j175973J829433J607219L82798
36711c510566N29194J554757J703018M99119r91519j429844n12866M45372k43260
36702a956595k161385k643735l02394K594056L063402J523116N51336M65298o97796
36693D35303k845323l022612j83300K279704R71268k551451l709031p36607L595076
$$ plain form
36754 -2100857 -1385617 -1213621 -465326 2447374 5906605 6448289 3484854 206995 -505181
36745 -505181 905941 2255201 2532734 2421291 2968324 4404888 5592790 4501581 339049
36736 339049 -4526293 -6252929 -4043457 -1633479 -2800627 -6414785 -8092604 -6474714
36728 -6474714 -5130642 -7105010 -10052950 -9379000 -4916058 -1151202 -634521 -610777 2032333
36719 2032333 5257735 4417850 -946804 -6154043 -7330016 -5500583 -3893364 -3510566
36711 -3510566 -2981372 -1426615 276403 775522 -215997 -1645841 -2158707 -1713335 -1956595
36702 -1956595 -4117980 -6761715 -7064109 -4470053 -1406651 116465 667801 1133099 435303
36693 435303 -2410020 -5432632 -5615932 -3336228 -2364960 -4916411 -8625442 -9362049 -5766973
36684e766973N603736M147015N97419k883878m623981m176600k495894j029625
36676a0628781l92552p5433O82922K048035L468070M089927L427110J871059M00524
36667D890881m08910q62029j382551j553473m84675J677267L101290J947104j082145
36658E842759k789726j140243J724968J843612j183476l388565j932590R83362
36650c9899J672650L25159j50884P34538P59357n18785r16696N4295r6866k179063
36640c56194k985996k37941L072234K628703q07435k511592m08344K755361L632092
36631D780888J748631j353277l790240l775192q67461K494292K860479N0446k328960
36622a80394j597290O11670J012684q00433k255265j532640K42477O53940j047224
$$ plain form
36684 -5766973 -163237 3983778 4581197 1697319 -2926662 -7103262 -9599156 -10628781
36676 -10628781 -11021333 -11096766 -10413844 -8365809 -4897739 -807812 2619298 4490357 4890881
36667 4890881 4481971 3619942 2237391 683918 199243 1876510 4977800 6924904 5842759
36658 5842759 3053033 1912790 3637758 5481370 4297894 909329 -1023261 -39899
36650 -39899 1632751 1957910 1807026 2541564 3300921 2782136 1865440 1919735 1822869 -356194
36640 -356194 -3342190 -3580131 -507897 2120806 1313371 -1198221 -1606565 1148796 4780888
36631 4780888 6529519 5176242 1386002 -2389190 -3256651 -762359 2098120 2148566 -180394
36622 -180394 -1777684 -1166014 -153330 -953763 -3209028 -4741668 -4499191 -3845251 -4892475
36613d892475k953039k421075Q76763M138094M377171J914731k64629n67971m65917
36604b58347j476349k370191j072242J761016L117058J424494j691428l634837
36596d200826l382335j388623J603516M537623N623518L492577p84183l714177
36588A787090k490238J722816M419953K498095j994751m006705j442209K498014
36580B992065L638394J839531K6283m63007q64145j612043j157171P56834J513483
36571F670224n34286k887353k400452l25922l39500k359802k557189J4830J300744
36562c418706j184694l701389j709149K950701M617194J921511j228557k111029
36554c864118j822141j095785J405877M751408M432406j158769o445872n142032
$$ plain form
36613 -4892475 -7845514 -10266589 -9389826 -5251732 -874561 1040170 775541 207570 -258347
36604 -258347 -1734696 -4104887 -5177129 -3416113 -299055 1125439 -565989 -4200826
36596 -4200826 -7583161 -8971784 -7368268 -2830645 2792873 6285450 5501267 1787090
36588 1787090 -703148 1019668 5439621 7937716 5942965 1936260 494051 2992065
36580 2992065 6630459 8469990 8496273 8033266 7169121 5557078 4399907 5156741 6670224
36571 6670224 6135938 3248585 848133 522211 182711 -2177091 -4734280 -4719450 -3418706
36562 -3418706 -4603400 -8304789 -10013938 -7063237 -2446043 -524532 -1753089 -3864118
36554 -3864118 -5686259 -6782044 -5376167 -624759 3807647 2648878 -3796994 -8939026
36546h939026J082595M853910L015493k93271p32003N67486L34820j219585j214161
36537b543742R26358K344961R22768j434797j066447K393928M850640K721786
36529I115455j877669l217607M33534M025957K441922k395047m328649j555917
36521B641979J520260J065815j457042k614062j768343m61270N72467J409418
36513I09222J462019J96605j462044k068719j426837l75610L93792N15061k2451
36504a878962l77270K99967J089062L06073j140094j81368L214965M533487J064133
36495F929993l211958k895631Q72259K327556j61166k263256q16560J986176K864947
36486E632360J852857M90366j090106k997451l911056k744721l85913J631090
$$ plain form
36546 -8939026 -7856431 -3002521 12972 -280299 -1012302 -444816 -109996 -1329581 -2543742
36537 -2543742 -1617384 727577 1650345 215548 -850899 1543029 6393669 9115455
36529 9115455 7237786 4020179 4453713 8479670 10921592 8526545 4197896 2641979
36521 2641979 4162239 5228054 3771012 1156950 -611393 -1072663 -500196 909222
36513 909222 2371241 2567846 1105802 -962917 -2389754 -2765364 -2371572 -1856511 -1878962
36504 -1878962 -2256232 -1956265 -867203 -561130 -1701224 -1882592 1332373 5865860 6929993
36495 6929993 3718035 822404 1694663 4022219 3861053 1597797 781237 2767413 5632360
36486 5632360 7485217 7975583 6885477 3888026 -23030 -2767751 -3153664 -1522574
36478a522574K611698K098364l6052k102844j833474q7568k69775k731517l422104
36469g295846l34620K627244J666418n88951N81411L937874M006514l27415m394142
36460a21513m841241l075710r94965J779178M861364N672324L308411M80241n34235
36451F533854q75355k009010k700003j598465k23573n31822j530460j098212M85762
36442c547284J549977K060236K787894K700009K94815l129840m601363l668511
36434e554067k597151k294377j014463K056351M552126L811850M07387k606159
36426c238503k951904o58947K618458M667886L917483R43130j446281q85806J536261
36417D501777K058857j145253m974697m626092J18397L888512K375640j854288
$$ plain form
36478 -1522574 1089124 3187488 3151436 1048592 -784882 -872450 -1142225 -3873742 -7295846
36469 -7295846 -7630466 -5003222 -3336804 -3925755 -3344344 593530 4600044 4272629 -121513
36460 -121513 -4962754 -8038464 -9033429 -7254251 -2392887 3279437 6587848 7068089 6533854
36451 6533854 5658499 3649489 949486 -648979 -872552 -1404374 -2934834 -4033046 -3547284
36442 -3547284 -1997307 62929 2850823 5550832 5845647 2715807 -1885556 -5554067
36434 -5554067 -8151218 -10445595 -11460058 -9403707 -4851581 -1039731 -632344 -3238503
36426 -3238503 -6190407 -6849354 -4230896 436990 4354473 5297603 3851322 2965516 4501777
36417 4501777 6560634 5415381 440684 -4185408 -4067011 -178499 2197141 342853
36409C42853k844241M50800L000422J322212j670940j654264N29944Q17811j389407
36400a094810k527975o56795J648378J241184j184959k157128J76274L782596
36392g73235M738813J406357l377989n035950k421956J075426K143027J208296
36384a037211K27798o57835j803660j683183P51256K968019K039975j94474L66904
36375I77589K905219K184988k875943o327239l290596L195240O504749M605502
36367G879509Q58248j171754q57418J31298m59393l180083n246730l253832J613097
36358c687058M124554K158027m27075k98014K24661j791732l767875j736420K247161
36349b953771K778598k84315j936108k97205J286968R31567R66311K350950K008462
$$ plain form
36409 342853 -2501388 -2050588 949834 2272046 601106 -1053158 -523214 294597 -1094810
36400 -1094810 -3622785 -4279580 -2631202 -1390018 -2574977 -4732105 -4555831 -773235
36392 -773235 3965578 5371935 1993946 -3042004 -5463960 -4388534 -2245507 -1037211
36384 -1037211 -809413 -1467248 -3270908 -4954091 -4202835 -1234816 805159 610685 977589
36375 977589 3882808 6067796 3191853 -3135386 -6425982 -3230742 3274007 7879509
36367 7879509 8737757 7566003 6708585 6839883 6380490 3200407 -2046323 -5300155 -3687058
36358 -3687058 437496 2595523 2168448 1870434 2095095 303363 -3464512 -5200932 -2953771
36349 -2953771 -175173 -459488 -2395596 -2692801 -1405833 -474266 492045 2842995 4851457
36340D851457j421450l950888k002998J841462K736080N00456j275907j143124
36332A35088q10836j231473j371747p70769k81031k2114R14065K355446K772824
36323A689453J582295m0126j060542j652861j902780j123765P09728K215644K275758
36314B692804J398075M60994q03826k738788m074506l232191j130794n67056k151448
36305a0146736k917814m58415L268367M477443K777922J103449Q93423O00386
36297d01975n26496o65602R45809J766377j47437k537724k257363j72797O63520
36288c333688K49473J175778L594911M574035K670201k82522k374379l447322
36280B826487l330833j538237O11142Q19531m31952k78441J489979J570871j146623
$$ plain form
36340 4851457 3430007 -520881 -2523879 -682417 2053663 2554119 1278212 135088
36332 135088 -675748 -1907221 -3278968 -4049737 -4330768 -4352882 -3438817 -1083371 1689453
36323 1689453 3271748 3231622 2171080 518219 -1384561 -2508326 -1798598 417046 2692804
36314 2692804 4090879 4551873 3748047 1009259 -3065247 -6297438 -7428232 -7995288 -10146736
36305 -10146736 -13064550 -13522965 -10254598 -5777155 -2999233 -1895784 -1002361 -401975
36297 -401975 -928471 -1594073 -648264 1118113 970676 -1567048 -3824411 -3997208 -3333688
36288 -3333688 -3084215 -1908437 1686474 6260509 8930710 8648188 6273809 2826487
36280 2826487 -504346 -2042583 -1431441 -611910 -1043862 -1322303 167676 1738547 591924
36271E91924l007192j197569J682542J869539K72615L36794K209249K927137J226399
36262F911438j329580l276414m217536l481015p62370K169221K966911J727574
36254G08229M51759N8143M0370L02675R62287R94706n02034k274238k475097j522884
36244c256084r71968n09535J037811K607631K161113M46068j03665J84114j030953
36235E64532k923961j865770K001624L561275M52762k599569p58801L343874L557043
36226E333009n56514l386195j585268J764599K118828p43419l416682l295844
36218c767486p57089K052165L324002K693775J003448n88737j194402n05484O27964
36209B888156L64705j963990m051763k969219M30753J985485J19300j564672L00187
$$ plain form
36271 591924 -2415268 -3612837 -1930295 -60756 211859 548653 2757902 5685039 6911438
36262 6911438 5581858 2305444 -1912092 -5393107 -6155477 -3986256 -1019345 708229
36254 708229 1159988 1218131 1258501 1561176 2523463 3518169 3016135 741897 -1733200 -3256084
36244 -3256084 -4228052 -4737587 -3699776 -1092145 1068968 1515036 1411371 1595485 564532
36235 564532 -2359429 -4225199 -2223575 1337700 1790462 -809107 -1567908 1775966 5333009
36226 5333009 4776495 1390300 -194968 1569631 3688459 2945040 -471642 -3767486
36218 -3767486 -4524575 -2472410 851592 3545367 4548815 3960078 2765676 2260192 2888156
36209 2888156 3252861 1288871 -2762892 -5732111 -5301358 -3315873 -3196573 -4761245 -4461058
36200d461058L467126L403014K63250j506670j24082J172926k83586k321371j463109
36191a853560J737238L549066K055203j071958l292755l643084k454363m93988
36183e468201R76695O52647j227622k452855j197753J371087K163517K84695j246428
36174f144218P54303M927848O396317K773730k703639n061470l156450K4421J564286
36165f24872J359025J002466J506598K389325K250650L13545k200472k988450
36157C007815j678752p04412j766651k798427q66808K730469L530241M43015k140674
36148b44184m57662L174035L630774J3459l593548l831353j664553J57163P92100
36139b023769J097699J234646L74382j359520k218319r40252J226381J884685
$$ plain form
36200 -4461058 -993932 2409082 2672332 1165662 1041580 2214506 1930920 -390451 -1853560
36191 -1853560 -116322 3432744 5487947 4415989 1123234 -2519850 -4974213 -5468201
36183 -5468201 -4491506 -3838859 -5066481 -7519336 -8717089 -7346002 -5182485 -4897790 -6144218
36174 -6144218 -5389915 -462067 5934250 8707980 6004341 942871 -2213579 -2189158 -624872
36165 -624872 734153 1736619 3243217 5632542 7883192 8196737 5996265 3007815
36157 3007815 1329063 624651 -1142000 -3940427 -4807235 -2076766 1453475 1896490 -244184
36148 -244184 -701846 2472189 6102963 6116422 2522874 -1308479 -2973032 -2815869 -2023769
36139 -2023769 -926070 308576 682958 -676562 -2894881 -3835133 -2608752 -724067
36131g24067P76677N4189N70632N68l175223n590648k740837L485521N718714
36122a624474J182244l779007k639250J902144K597043j045920k715473J26294
36114e996399K690185J447502l43447Q30410K257747L4618l461750k972379J047858
36105d465655L146269J331979q18587p59612l53726j289603j794667k43694J535018
36096c712278J229470k35899n14901M46653Q56947L6144j014201j273811o53134
36087d835010R8252j20644j392581j874601N9328K830512L215794J073631m91768
36078a437087k18609k60007j448117j253094J147476K100357o21167l073727r34065
36069e998040L172894L522859J39636k038544j322779m29819j93480J351050L293225
$$ plain form
36131 -724067 52610 106799 677431 677999 -2497224 -8087872 -10828709 -7343188 -1624474
36122 -1624474 -442230 -4221237 -6860487 -4958343 -2361300 -3407220 -6122693 -5996399
36114 -5996399 -3306214 -1858712 -2202159 -1371749 885998 920616 -2541134 -5513513 -4465655
36105 -4465655 -1319386 12593 -805994 -1565606 -1919332 -3208935 -5003602 -5247296 -3712278
36096 -3712278 -2482808 -2718707 -3233608 -2786955 -1930008 -1893864 -2908065 -4181876 -4835010
36087 -4835010 -4736758 -4857402 -6249983 -8124584 -8065256 -5234744 -2018950 -945319 -1437087
36078 -1437087 -1655696 -1915703 -3363820 -4616914 -3469438 -1369081 -1990248 -5063975 -5998040
36069 -5998040 -2825146 697713 837349 -1201195 -2523974 -2953793 -3147273 -1796223 1497002
36060A497002J896818k261056l591071k71388K318556J34652l184681k614338
36052f075506M92115J759103J022747J015393J664836R14309o35720p19877K64491
36043b98109K56690l26214L45951J361787K80678k130301k557029l32919J809221
36034a590245K024348Q81349j031572l347877m083254j466226K375112L393687
36026b844678J418209J39154J214900K537838K704577K746259K640478P76652
36018A1333389j809460j470249J860030L258430J76158l377218l260105j499461
36010E211514k122026m337585m536650k441273n76110M91294J864430K746722
36002c699684J631393O0615Q33576L047510L142433O46902j214312p74267P3421
$$ plain form
36060 1497002 3393820 1132764 -2458307 -2729695 -411139 -276487 -3461168 -6075506
36052 -6075506 -5583391 -3824288 -2801541 -1786148 -121312 792997 157277 -562600 -298109
36043 -298109 -41419 -367633 -21682 1340105 1620783 -509518 -3066547 -3399466 -1590245
36034 -1590245 434103 1315452 283880 -3063997 -7147251 -8613477 -6238365 -2844678
36026 -2844678 -1426469 -1287315 -72415 2465423 5170000 7916259 10556737 11333389
36018 11333389 9523929 8053680 9913710 13172140 13348298 9971080 6710975 5211514
36010 5211514 3089488 -1248097 -5784747 -8226020 -8802130 -8310836 -6446406 -3699684
36002 -3699684 -2068291 -2007676 -1174100 1873410 5015843 5662745 4448433 3674166 3747587
35993C747587m61517j880082l263890m054425k802064J321867N478255N412088
35985C497819J369907j997673k266095j588070j533253m98417J727049J804497
35977E15764j511331l970717k045291J263200J380567m13157J33537K462928K430804
35968B46304P3428k73070K175659K909465j94506l009341j646128J699763K602037
35959D583611O54693j416682k204724j949072n59958J515595K153106L52424j246694
35950A882299K14343K994615K710883j321335m901223m349195n59251K708445
35942f20419K588913q57448m440667l946151J299337O238630N157501r44900n014992
35933e40196k637793K911046N540607L407585p55122l839844m370538k067593
$$ plain form
35993 3747587 3286070 1405988 -1857902 -5912327 -8714391 -7392524 -1914269 3497819
35985 3497819 4867726 2870053 603958 -984112 -2517365 -3015782 -1288733 515764
35977 515764 -995567 -4966284 -7011575 -5748375 -4367808 -4780965 -4647428 -2184500 246304
35968 246304 319732 46662 2222321 5131786 4937280 1927939 281811 1981574 4583611
35959 4583611 5238304 3821622 1616898 -332174 -892132 623463 2776569 3128993 1882299
35950 1882299 2096642 5091257 7802140 6480805 1579582 -2769613 -3328864 -620419
35942 -620419 1968494 1111046 -3329621 -7275772 -5976435 262195 5419696 4474796 -540196
35933 -540196 -3177989 -266943 5273664 8681249 7926127 4086283 -284255 -2351848
35925b351848J766211M141437L034958m8924j884231j514927p43100r45383j308664
35916A45529n79832Q61218J393976R4946k003314k555563k90013L049377M137315
35907D253639K070014k95244j96335J033049k13366m390252p356341n104151J279786
35898h919201O394945O103083J785399j444855q44783Q10366m27897l397583l138730
35889c079256J249470M229865J648910k829651l066405N55907K533592J124838
35881B367270O6046J386116K379657J266352M02087J180976O84645k840097n374531
35872A518521k772307K029719K844905m35685k016148O35410L412413K561965
35864G778793P2101m52177M98562P5719j814218k602932j338284O4904j75490
$$ plain form
35925 -2351848 -585637 3555800 6590758 6541834 4657603 3142676 2399576 1454193 145529
35916 145529 -434303 426915 1820891 1915837 -87477 -2643040 -2933053 116324 4253639
35907 4253639 6323653 6028409 5832074 6865123 6651757 2261505 -5094836 -10198987 -8919201
35898 -8919201 -2524256 3578827 5364226 3919371 3074588 3884954 3457057 59474 -3079256
35889 -3079256 -1829786 2400079 4048989 1219338 -1847067 -1291160 1242432 2367270
35881 2367270 2433316 3819432 6199089 7465441 7867528 9048504 9733149 6893052 1518521
35872 1518521 -1253786 775933 3620838 3185153 1169005 1804415 5216828 7778793
35864 7778793 7850894 7398717 7897279 7972998 6158780 3555848 2217564 2282468 2106978
35855B106978j566594k421222j607822Q30512L482238M069853J673210j426414
35847E140739j851255M00464J496920r70084m098381l280728J353587M904351
35839C095613M082882P81318j539828k222119k427171k181053r63159K56677K59603
35830h57237o4007Q24542K077769J673967Q5712l89470K34272l57579k245128
35821I82841k474693k6178J973536R73715j134640j243894M75063J839935K152430
35812C518115J759335J63893k521594l928505k260333N42927J392518N76917O54216
35803a02511J912977K281106J163078Q6969k48960n78313r38605q15113j010580
35794A750048k314051k867357m84033K766007K587020o48343j846585O88173K152574
$$ plain form
35855 2106978 540384 -1880838 -3488660 -2658148 824090 4893943 6567153 5140739
35847 5140739 3289484 3689948 5186868 4216784 118403 -3162325 -1808738 3095613
35839 3095613 7178495 7959813 6419985 4197866 1770695 -410358 -1373517 -1116840 -857237
35830 -857237 -921244 -96702 1981067 3655034 3740746 3351276 3585548 3227969 982841
35821 982841 -1491852 -1518030 455506 1429221 294581 -949313 -474250 1365685 3518115
35812 3518115 5277450 5441343 2919749 -1008756 -3269089 -2726162 -1333644 -756727 -102511
35803 -102511 1810466 4091572 5254650 5341619 5092659 4514346 3575741 2760628 1750048
35794 1750048 -564003 -3431360 -3915393 -1149386 1437634 789291 -1057294 -369121 1783453
35785A783453j017902m887939l644398J676575M792293K938579m21204j333631
35777a14174q85R68126K85937j033802j092569Q75702L273424L547352J548603
35768H257714N0775O16960R59519j155478l298689j475943K944262L967618m03338
35759A0463400m609471l161576J521677K690687j100675m323583k634157J290379
35751A36681K082432q00197k904363j221785K221612L761335K658661P88022o02543
35742F119855j723265k447500j860941q467J501611J426440M08284j59232J4698
35733C271483J65001j98145p96521j141615r00396K29784K390250M953369O268313
35724A4241523M710124O30326l077393l544863j298593K69586o48410k072430
$$ plain form
35785 1783453 765551 -4122388 -7766786 -6090211 -1297918 1640661 1219457 -114174
35777 -114174 -115059 853067 1139004 105202 -987367 -111665 3161759 6709111 8257714
35768 8257714 8308489 8925449 9884968 8729490 5430801 3954858 6899120 10866738 10463400
35759 10463400 5853929 2692353 4214030 6904717 5804042 1480459 -1153698 136681
35751 136681 2219113 1418916 -1485447 -2707232 -485620 3275715 5934376 6722398 6119855
35742 6119855 4396590 1949090 88149 79682 1581293 3007733 3416017 3256785 3271483
35733 3271483 3436484 3238339 2441818 1300203 399807 629591 3019841 7973210 14241523
35724 14241523 18951647 19581973 16504580 12959717 11661124 11930710 11282300 9209870
35716I209870j668384m06041n62651j686906j551882j59382O11491Q93151K528939
35707G208205M701063M087441M99784j861480p06084Q64928k19632k037739j542714
35698A0993772J97715P97755J459398M133202O224227L883003p05895j364119
35690B5619058K901513O704499O960540O819262R254663J2548878J4956373J8587406
35682A04352192K5080549L2272839L9423760N0657424O6689027P6636321O6609607
35675D61721719L6815184L054295k0535271l4010356m4402973n2809314n4813988
35668B95019296n0012861m3646301l8734882l2716866k3762499j5462334j1847165
35661G8836388j1107500q492922l785261j443617l448637o232705n999663l637622
$$ plain form
35716 9209870 7541486 7135445 6572794 4885888 3334006 3174624 3786115 4679266 7208205
35707 7208205 11909268 15996709 16496493 14635013 13928929 14793857 14574225 12536486 10993772
35698 10993772 11191487 11989242 13448640 17581842 23806069 27689072 26983177 25619058
35690 25619058 28520571 35225070 42185610 49004872 58259535 70808413 85764786 104352192
35682 104352192 129432741 161705580 201129340 251786764 318475791 395112112 461721719
35675 461721719 498536903 501591198 481055927 447045571 402642598 349833284 295019296
35668 295019296 245006435 201360134 162625252 129908386 106145887 90683553 78836388
35661 78836388 67728888 59235966 55450705 54007088 50558451 44325746 38326083 34688461
35653C4688461k257235k545175l160854l750064m591599m500226k216661O23856
35645A2290503R47555j257335k672819j321996J027198J794015N94572j440671
35637I961022l123281l177951j068923J230520Q15332j638973j841875J762487
35629B918358M668878K336381k932423m994435k295997Q82836J179497n5486l27218
35620A380391L96316J021723J296796R66944m72768j832006p30811K310049L183286
35611G519920j1249l214402j735736K741220M478646J908182q69314q69665l0495
35602I917107q21861k032464j556623m96667j227285k990715k739672P5082K433016
35593E59918J850842n61958j953338j294693j81578n38902k128461k696694r10722
$$ plain form
35653 34688461 32431226 29886051 26725197 22975133 18383534 13883308 11666647 12290503
35645 12290503 13238058 11980723 9307904 7985908 9013106 10807121 11401693 9961022
35637 9961022 6837741 3659790 2590867 3821387 4636719 2997746 1155871 2918358
35629 2918358 7587236 9923617 6991194 1996759 -299238 583598 1763095 1707609 1380391
35620 1380391 1776707 2798430 4095226 5062170 4589402 2757396 2026585 4336634 7519920
35611 7519920 7508671 4294269 2558533 5299753 9778399 11686581 10817267 9947602 9917107
35602 9917107 9095246 7062782 5506159 5009492 3782207 791492 -1948180 -1873098 559918
35593 559918 2410760 1848802 -104536 -1399229 -1580807 -2119709 -4248170 -6944864 -7855586
35584g855586J490536J902278Q69384J368168L520918L439610m99051l706198
35576E30059j609627K825862L034398j058755k989468n5101K800692J497556q79151
35567D096465o8745K119561J517605j061661j646027l0636N08067p47372j314079
35558C373178n51798o08318j989426k361792n78114J522447K090269J179196o53579
35549A422063k816995l617033j672824J463412K952948K676915K414840J695965
35541D519291j292137m834793m719539r16511J814471J341066R09130K446725
35533g32297K740687l79621l276854k294736J47944J90233o37999J153335L859291
35524G69983L152275r5203j023864R27087J294726j490158l427300j669290J103437
$$ plain form
35584 -7855586 -6365050 -4462772 -3593388 -2225220 1295698 4735308 4236257 530059
35576 530059 -1079568 1746294 4780692 3721937 732469 677368 3478060 4975616 4096465
35567 4096465 4027720 6147281 7664886 6603225 4957198 4926562 5434629 4687257 3373178
35558 3373178 2821380 2213062 223636 -2138156 -2716270 -1193823 896446 2075642 1422063
35549 1422063 -1394932 -5011965 -6684789 -5221377 -2268429 408486 2823326 4519291
35541 4519291 3227154 -1607639 -6327178 -7243689 -5429218 -4088152 -3179022 -732297
35533 -732297 2008390 1628769 -1648085 -3942821 -3794877 -3604644 -4242643 -3089308 769983
35524 769983 3922258 3827055 2803191 3730278 5025004 3534846 107546 -1561744 -458307
35515d58307J134503j391920l715112l875779j396415K546058M726790K766308
35507C36126q35712j121109J982441K977357q01524m626933l304767J237634L331037
35498h25450J674736m18905j059242j346318j597107n76245J097987Q37320j442565
35489c655789k239436K76906K829938J482798k417440l878253j180560K006080
35481f775756K046695J13106k65489J508974K947189K821966K524623K573266
35473G494574J022290k646180m727292j731563L685307N066061O17896m183311
35465D597782l735715P85923L674714J936191j950986l642640j465806K405688
35457B605151M214728K253968j322941k925721j854956q36430j807451l114260
$$ plain form
35515 -458307 676196 -715724 -4430836 -8306615 -9703030 -7156972 -2430182 336126
35507 336126 -499586 -1620695 361746 3339103 2537579 -2089354 -5394121 -4156487 -825450
35498 -825450 849286 430381 -628861 -1975179 -3572286 -4148531 -3050544 -2213224 -3655789
35489 -3655789 -5895225 -5618319 -2788381 -1305583 -3723023 -7601276 -8781836 -6775756
35481 -6775756 -4729061 -4615955 -4881444 -3372470 -425281 2396685 4921308 7494574
35473 7494574 8516864 5870684 1143392 -588171 3097136 8163197 8781093 4597782
35465 4597782 862067 1647990 5322704 7258895 5307909 1665269 199463 2605151
35457 2605151 6819879 9073847 7750906 4825185 2970229 2133799 326348 -2787912
35449b787912k277295J38590J468799P95315l08927n22406k48740k31905m02247
35440d376728n47682q87223j480467j877876j605563l84974J920031M596156N588543
35431I44217L255691j037352l598866k548813l1271Q57911J80687L70133J967314
35422C59651K660419J205323j69348P91947K282643P36350l320540n112366k207811
35413b773732J845906K492137K29877j148887n86312m09139j552715j913929j72402
35404c989196J899430K299361J530159R50009L70252j020300k754708l636995
35396d351988l189358j515806J107518L568201M172412K595289L49169j424162
35388A311275k941514l761011k191959J537681L873477K296966o79560r06819
$$ plain form
35449 -2787912 -5065207 -4926617 -3457818 -2662503 -2971430 -3493836 -3742576 -3974481 -4376728
35440 -4376728 -4924410 -5811633 -7292100 -9169976 -10775539 -11160513 -9240482 -4644326 944217
35431 944217 4199908 3162556 -436310 -2985123 -3016394 -2158483 -1977796 -1607663 359651
35422 359651 3020070 4225393 4056045 4847992 7130635 7866985 4546445 -565921 -2773732
35413 -2773732 -927826 1564311 1794188 645301 58989 -350150 -1902865 -3816794 -3989196
35404 -3989196 -2089766 209595 1739754 2689763 3060015 2039715 -714993 -4351988
35396 -4351988 -7541346 -9057152 -7949634 -4381433 -209021 2386268 2735437 1311275
35388 1311275 -1630239 -5391250 -7583209 -6045528 -2172051 124915 -554645 -1461464
35380a461464J270872J742617r54656l559592l002591k55157J927618K541846
35372a750507K089923Q78126n99935r69824M58799K147863J944284o9304j626188
35363B503237j129092N67071J393275L82798j531402k644224k109525n64433O44542
35354b487753P51489J31246l05090j83205l2253m17365q55483k54237J307273
35345b345378K165187J293541L1859J70305J043438N38433j319355k255961j505242
35336b183173r87965j801387k217342p43165J261245J970144J908158K218856
35328e74629K163175P43676j029106j926491k601746l336122k089437J836501
35320f814179M612133K709390r88800r57879K385454L543785Q40102j774076k222440
$$ plain form
35380 -1461464 -190592 1552025 597369 -2962223 -5964814 -6219971 -4292353 -1750507
35372 -1750507 339416 1217542 617607 -352217 106582 2254445 4198729 4129425 2503237
35363 2503237 1374145 1941216 3334491 3717289 2185887 -458337 -2567862 -3132295 -2487753
35354 -2487753 -1736264 -1605018 -1910108 -2093313 -2125566 -2542931 -3398414 -3652651 -2345378
35345 -2345378 -180191 1113350 1145209 1315514 2358952 2897385 1578030 -677931 -2183173
35336 -2183173 -3171138 -4972525 -7189867 -7933032 -6671787 -4701643 -2793485 -574629
35328 -574629 1588546 2332222 1303116 -623375 -3225121 -6561243 -8650680 -6814179
35320 -6814179 -2202046 507344 -481456 -1439335 946119 4489904 5330006 3555930 1333490
35311A333490k952659m481811l144000J664037M461159K157349l37364J767853
35303D68054M776868K795496j923175k642493M95814J089739k305408l881318
35295a126423o44644K813206K291920K74241N65110J884562J185047n30628l43753
35286F368638J182953J136568p55501k183480k351714k415787k279407m06089
35278a703819K823740M437085K527691j235212l580331k918741k41442K148656
35270B257627K427004O92361j066889j121769r2648o272j273296j812277K03851
35261B07692L559591M920846K478065j972856m826532m195179j298297J354452
35253B27782K347760J757750K43924j284743j774653j091323o73544j750833l087874
$$ plain form
35311 1333490 -1619169 -6100980 -9244980 -7580943 -3119784 -962435 -1299799 468054
35303 468054 5244922 8040418 6117243 3474750 3970564 5060303 2754895 -1126423
35295 -1126423 -1771067 1042139 3334059 3608300 4173410 6057972 7243019 6712391 6368638
35286 6368638 7551591 8688159 7932658 5749178 3397464 981677 -1297730 -1703819
35278 -1703819 1119921 5557006 8084697 6849485 3269154 350413 108971 2257627
35270 2257627 4684631 5376992 4310103 3188334 3095686 3089414 1816118 3841 207692
35261 207692 3767283 8688129 11166194 9193338 4366806 171627 -1126670 227782
35253 227782 2575542 4333292 4577216 3292473 1517820 426497 -247047 -1997880 -5085754
35244e085754k218135Q28860K924834J840411p88293j745553k35186J797696K436398
35235b44722J513573J78677j11472J237138K864520K413520l69698k636943k011952
35226B832641K2363L55434j033098j222536Q96626K768963J860234j040621l385046
35217B054960l988740l265500j709631L32105K106077K916502K793197K018766
35209C257736O37330q69908j227418K54714K314304K718554O82075k144224l204914
35200B418249j636451N38631L70402k236880l675160j176584K649230K619679
35192a28884j575896m253696j619378K711107L116402R0676j370615K1776M86978
35183b521530j626411k572306L70849L402683J243221m493551o567386j760931
$$ plain form
35244 -5085754 -7303889 -6475029 -3550195 -1709784 -2498077 -4243630 -4478816 -2681120 -244722
35235 -244722 1268851 1447528 1336056 2573194 5437714 7851234 7481536 4844593 2832641
35226 2832641 2855004 3210438 2177340 954804 1851430 4620393 6480627 5440006 2054960
35217 2054960 -1933780 -5199280 -6908911 -6576806 -4470729 -1554227 1238970 3257736
35209 3257736 3895066 3025158 1797740 2052454 4366758 7085312 7767387 5623163 2418249
35200 2418249 781798 1320429 1690831 -546049 -4221209 -5397793 -2748563 -128884
35192 -128884 -1704780 -5958476 -7577854 -4866747 -1750345 -1659669 -3030284 -3008508 -2521530
35183 -2521530 -4147941 -6720247 -6349398 -2946715 -1703494 -6197045 -12764431 -14525362
35175a4525362M662085N740767J370847k472087j834286R34499J596024N0576
35167d476937m11643J337527K645042J531250k15865j97917P28545L81844o78979
35158F42867l10197R40462M53197j633519k173879m39520K50046j768982k978009
35149g017534L4157M640225N365305J392136k853106l808657j996048N39340K617613
35140a086569L413393K467614R15959M91032R36717N56557o48195j012215n38167
35131E496126j055880k351832j682755J237840K409486m95776l514600j695992
35123a653383L102356M483649Q58600k557332j936169r0166r82920l089135k346502
35114d211002O86384J492511j030926k552712K8329L677063L503957m51114l633725
$$ plain form
35175 -14525362 -9863277 -4122510 -2751663 -5223750 -7058036 -6123537 -4527513 -4476937
35167 -4476937 -4888580 -3551053 -906011 625239 409374 211457 940002 1321846 642867
35158 642867 332670 1273132 1726329 92810 -2081069 -2520589 -2270543 -4039525 -7017534
35149 -7017534 -6983377 -2343152 3022153 4414289 1561183 -2247474 -4243522 -3704182 -1086569
35140 -1086569 2326824 4794438 5710397 6201429 7138146 7694703 7046508 6034293 5496126
35131 5496126 4440246 2088414 405659 1643499 4052985 3557209 42609 -1653383
35123 -1653383 1448973 5932622 6791222 4233890 2297721 2207555 1224635 -1864500 -4211002
35114 -4211002 -3524618 -2032107 -3063033 -5615745 -5587416 -1910353 1593604 1142490 -2491235
35105b491235l039816j52804J943877K105283J324531Q82833R44187N16799j108931
35096I24724k759753k335154o178J275335o4395j506224k61853K079086K116767
35087e37645M19922M08586K057434J738081j104323k403715l21194J492775J63437
35078A913358j710720j100993J96189m28142j167383N06410K375748J116739j456244
35069B44962j502102k3165m85106j772719m13634J792363J39094l608956k712104
35060h341367K841872M965236L29113l998840j962811K262426K069179j180545
35052c015737k137239p00171k71305n15731J166220L466114L025205P15493K7135
35043A759984O66774k93499k079562j178298J886054K813743P04496q51587m09309
$$ plain form
35105 -2491235 -5531051 -5683855 -3739978 -1634695 -310164 572669 1516856 2033655 924724
35096 924724 -1835029 -4170183 -4176361 -2901026 -2965421 -4471645 -4733498 -2654412 -537645
35087 -537645 -117723 290863 2348297 4086378 2982055 578340 257146 1749921 1913358
35078 1913358 202638 -898355 -702166 -1130308 -2297691 -1791281 584467 1701206 244962
35069 244962 -1257140 -1280305 -1765411 -3538130 -3951764 -2159401 -2020307 -5629263 -8341367
35060 -8341367 -5499495 -534259 -205146 -4203986 -6166797 -3904371 -1835192 -3015737
35052 -3015737 -5152976 -5853147 -6124452 -6640183 -5473963 -2007849 1017356 1732849 1759984
35043 1759984 2426758 2133259 53697 -1124601 761453 3575196 4279692 3428105 3018796
35034C018796n59215j963991j332583K324733M611570K134054k123612l298927
35026B810825j299094O55568J579644K833714M087298L108780m04854l768588
35018I603293m676855l564916j977067l53110J444783K597875J948304K2623j019533
35009D025397r9244J199763Q19476q53265j742922j202300n23760n20338o20726
35000D82081m67003l20180K49746J736226K679996J162346j432816j695574P3393
34991B468215l31620l874985n617871k067630L145480M642151K585530N70849
34983A520119k94582q08099l42597J266891J402491j184345l011517j437619J21251
34974b768007j755350l309877K63856N143239M114548r80898j886788K015829
$$ plain form
35034 3018796 2459581 495590 -836993 1487740 6099310 8233364 6109752 2810825
35026 2810825 1511731 2167299 3746943 6580657 10667955 13776735 13371881 9603293
35018 9603293 4926438 1361522 -615545 -968655 476128 3074003 5022307 5044930 4025397
35009 4025397 3926153 5125916 5945392 5092127 3349205 2146905 1623145 1102807 482081
35000 482081 15078 -305102 -55356 1680870 4360866 5523212 4090396 2394822 2468215
34991 2468215 2136595 -1738390 -7356261 -9423891 -6278411 -1636260 949270 1520119
34983 1520119 1225537 417438 74841 1341732 2744223 1559878 -1451639 -2889258 -2768007
34974 -2768007 -4523357 -7833234 -7569378 -2426139 1688409 707511 -1179277 836552
34966H36552K895637j532704l982103k86065L960628L560113J414255J177134
34958H043447N46687k466728m041949j454698J092131j98136j670865Q58152L799490
34949D507531J746738k895605l867855j159590K95291n51724n37993Q91010J214356
34940c57841K64539L21941J454240J756425J408999J914110K282834M48032k354582
34931G138697k763826k71820K373253K989781J524961r09836k375776j333318
34923F372116Q25602J197290M37083K182236O098131P251887M521741K724914
34915C1611000L503764K394969j001552J56791P027696J0182451N951738N218733
34907F5045590J4526702K2594352K2443703L1912394O5457885R4243435O9198272
$$ plain form
34966 836552 3732189 2199485 -1782618 -2068683 1891945 5452058 6866313 8043447
34958 8043447 8590134 6123406 2081457 626759 1718890 1520754 -150111 708041 4507531
34949 4507531 6254269 3358664 -509191 -1668781 -1373490 -1925214 -2463207 -1572197 -357841
34940 -357841 -93302 228639 1682879 3439304 4848303 6762413 9045247 9493279 7138697
34931 7138697 4374871 4103051 6476304 9466085 10991046 10081210 7705434 6372116
34923 6372116 7197718 8395008 8832091 11014327 17112458 24364345 28886086 31611000
34915 31611000 35114764 37509733 36508181 36664972 43692668 53875119 59826857 65045590
34907 65045590 79572292 102166644 124610347 156522741 221980626 316224061 385422333
34900C85422333j0506573q3641316r6425390o1149003k7604248j8493295j8445091
34893F9157417j2657746o229361o012993p519792n904454m255210n073963m751278
34885A6752620j372120Q51138q74662l101177k441731p82476r99791k218995k138423
34876C674383n60412J364889K728813K715075J183133m45438r75514j368991k673787
34867E642151l544419k519440q94633k61790O15103K906637M121051J723539j715991
34858F072208j771482R37527J894007l32184k870417l482638k343958K29324L501939
34849A834326M626699J548341l107919n002308l800970j951728M06034M288577
34841a158948P156278N178112k33335l619074l098437j653351j055453M280J544094
$$ plain form
34900 385422333 374915760 291274444 194849054 133700051 106095803 87602508 69157417
34893 69157417 56499671 50270310 44257317 36737525 30833071 26577861 21503898 16752620
34885 16752620 15380500 16231638 15356976 12255799 9814068 9031592 8031801 5812806 3674383
34876 3674383 3113971 4478860 7207673 9922748 11105881 10660443 9684929 8315938 5642151
34867 5642151 2097732 -421708 -1316341 -1578131 -963028 1943609 6064660 7788199 6072208
34858 6072208 4300726 5238253 7132260 6800076 3929659 447021 -1896937 -1667613 1834326
34849 1834326 6461025 8009366 4901447 -100861 -3901831 -5853559 -5447525 -1158948
34841 -1158948 5997330 11175442 10942107 7323033 4224596 2571245 1515792 1520072 3064166
34832C064166J541105K30163J27146J155829O55938j269753j489087M68831J549026
34823F033364P03050K11280P97422O05572l07521J32585J072293m54322l168501
34814E625222k613541M30205R1856m077497m944150L33905M512049J600708l498363
34805b539606l378933J69441O28650j797918j587664J949943L912591K209832
34797d33664j8037j75393J029989K368175L105042J916713j089757k490653J03849
34788D316264L408505K777259n93764j998827j125792j544562l196356k152976
34780a10249J698517L416622J066086j136962j97965P71368j566858m707577m191645
34771d958663k48950L359396M708781M310803K308195j238298m319975m529254
$$ plain form
34832 3064166 4605271 4835434 4962580 6118409 6774347 5504594 4015507 4484338 6033364
34823 6033364 6736414 6947694 7745116 8350688 8043167 8175752 9248045 8793723 5625222
34814 5625222 3011681 3441886 3533742 -543755 -5487905 -5154000 -641951 958757 -2539606
34805 -2539606 -5918539 -5749098 -5120448 -6918366 -8506030 -6556087 -2643496 -433664
34797 -433664 -451701 -627094 402895 2771070 5876112 7792825 6703068 4212415 4316264
34788 4316264 7724769 10502028 9908264 7909437 6783645 5239083 2042727 -110249
34780 -110249 1588268 5004890 6070976 4934014 4736049 5507417 3940559 -767018 -4958663
34771 -4958663 -5207613 -1848217 2860564 7171367 9479562 8241264 3921289 -607965
34763f07965k321532l06273L06116L73752M18229n3728p23322j64540J850366
34754a228897L308795K333895j77983j426222j72230J581783J053373j574994
34746C697520l091802j422894J425150K011094K21765p44474P66327K373123J227294
34737F463103j735312l068623j530369N39213O75559n63638p19734J240673L661780
34728D962652M012490J434843k345952m354839k984914K66089K077324Q92391
34720C960084j322377j806184p43669n23926j618395j826313l17759N73748m78837
34711d103628p61363K097802N043660L389128j433562l163741j27826K084202
34703C024672o69237m733340m478895n28008K169019J842093Q75563O97963K13598
$$ plain form
34763 -607965 -2929497 -3235770 -2929654 -2555902 -2137673 -2191401 -2914723 -3079263 -1228897
34754 -1228897 2079898 4413793 4235810 2809588 2637358 4219141 5272514 3697520
34746 3697520 605718 -817176 607974 2619068 2840833 2096359 2862686 5235809 6463103
34737 6463103 4727791 1659168 128799 668012 1343571 779933 60199 1300872 4962652
34728 4962652 8975142 10409985 8064033 3709194 724280 990369 3067693 3960084
34720 3960084 2637707 831523 87854 -436072 -2054467 -3880780 -4198539 -3624791 -4103628
34711 -4103628 -4864991 -2767189 2276471 5665599 4232037 1068296 940470 3024672
34703 3024672 2355435 -2377905 -6856800 -7384808 -5215789 -3373696 -2498133 -1800170 -1586572
34694a586572r20190j340865p45314n24680j031163p51097J085140L077919L504581
34685G67759K143334J2178j420401q87246J397623L280522K835051O82971j086928
34676G724863j632236j493005q89266J83190P98009Q0380j111134j411420j241656
34667A007725j756009k199485q98667J443886K198254O71432j066321j523315
34659b122500j413093j392038o35400J349028L395454M104170L223319J228478
34651G737418j045544k288367j854493r51770r89274j179981j0597J429672O08907
34642A455971j884480k304865P93097M126832M126498J211476j840132l399424
34634B284973l251111j535007P24184J655142P33424l34567n3306R38656J324828
$$ plain form
34694 -1586572 -2506762 -3847627 -4592941 -5117621 -6148784 -6899881 -5814741 -2736822 767759
34685 767759 2911093 2923271 1502870 615624 2013247 5293769 8128820 8811791 7724863
34676 7724863 6092627 4599622 3710356 3893546 4691555 4771935 3660801 2249381 1007725
34667 1007725 -748284 -2947769 -3846436 -2402550 -204296 467136 -599185 -2122500
34659 -2122500 -3535593 -4927631 -5563031 -4214003 -818549 3285621 6508940 7737418
34651 7737418 6691874 4403507 2549014 1597244 607970 -572011 -582608 847064 1455971
34642 1455971 -428509 -2733374 -1940277 2186555 6313053 7524529 5684397 2284973
34634 2284973 -966138 -2501145 -1776961 -121819 611605 277038 223732 1162388 2487216
34625B487216R44617K74760l87620n21279K11319P24619l69448k132653k202641
34616i71110n82940M15805L74982J189208K444367R38737l127320m301072K41863
34607c377480N163212L908168j970844n461415l814364m40185J442702J820675
34599b729531J215276l0795K8990K792724N260894L137704k041182m105564j470803
34590B057713M31307j919482m319124j844612K727352K794947k034065n251851
34582g357815k686603K183360L632798J193345p36060O32091L118193L212286
34574C191595J037485l19986K57017M37161j251374k512865j050960J087347M56851
34565A332271j913057j857347J055737K652021R52167q61308j97525P38278m42331
$$ plain form
34625 2487216 3431833 3706593 3318973 2797694 3009013 3733632 3364184 1231531 -971110
34616 -971110 -1554050 -1138245 -763263 425945 2870312 3809049 681729 -3619343 -3377480
34607 -3377480 1785732 5693900 3723056 -1738359 -5552723 -5992908 -4550206 -2729531
34599 -2729531 -1514255 -1545050 -1516060 1276664 6537558 9675262 7634080 3528516 2057713
34590 2057713 2489020 569538 -3749586 -5594198 -2866846 -71899 -2105964 -7357815
34582 -7357815 -10044418 -7861058 -4228260 -3034915 -3770975 -3138884 -20691 3191595
34574 3191595 4229080 3909094 4166111 4603272 3351898 839033 -211927 875420 1332271
34565 1332271 -580786 -2438133 -1382396 1269625 2221792 1360484 1162959 1901237 1458906
34556A458906j512841L02335K430033K52960n040371p083537k994117K992392
34548i194240N490453L862091Q11644j621293k700907k091612m92194L61799J3586
34539e560673J84024J825225K888316J123212k052012k969191o76617J898826
34531c338890K137804R42380O37408J215217N19325k114238m111490k519325J976910
34522d654899N133654L776060m17201k853272j537923Q36985Q71337j063236j891648
34513a800143m16383J357117J487902N44982R349K3429m1056j61216k32006r18857
34503a46882k340113k873131j197422J139927J422601k14449r32017L32861J214711
34494c593914l7491j316129L18666L820611M963982J767543k954328m918086k905026
$$ plain form
34556 1458906 -53935 248400 2678433 2931393 -2108978 -9192515 -12186632 -9194240
34548 -9194240 -3703787 158304 969948 -651345 -3352252 -5443864 -5936058 -5574259 -5560673
34539 -5560673 -5376649 -3551424 -663108 460104 -1591908 -4561099 -5237716 -3338890
34531 -3338890 -1201086 -258706 378702 1593919 2113244 -994 -4112484 -6631809 -4654899
34522 -4654899 478755 4254815 3837614 984342 -553581 283404 1154741 91505 -1800143
34513 -1800143 -2216526 -859409 628493 1173475 1182824 1206253 1165197 1003981 771975 -146882
34503 -146882 -2486995 -5360126 -6557548 -5417621 -3995020 -4209469 -5141486 -4808625 -3593914
34494 -3593914 -3631405 -4947534 -4628868 -808257 4155725 5923268 2968940 -1949146 -4854172
34485d854172O32419K648903K411999J434243J084425J005490K69275p40486q80583
34476C011513l31263m26149j263337j392195m34747O9663n40844o13208Q79921
34467a040646K120814J344840J7345L85160J446047O37815j454297j724725L52578
34458B084931J894479J272323J17379j65387m70939j247509r45751Q77935J795584
34449E213045J74983j792684j299182P95010J586807N36901n06888o14655m14562
34440C678775j76427K04247n5173j331728j633831J104192M856147M883842J39653
34431A1669697m601270m573872p50932K167545J832205M1332p59297m59928m19111
34422D146369j151378j782216j348712m6716R12520O03591n89990j419273j127492
$$ plain form
34485 -4854172 -4221753 -1572850 839149 2273392 3357817 4363307 4632582 3892096 3011513
34476 3011513 2680250 2254101 990764 -401431 -836178 -766515 -1307359 -1920567 -1040646
34467 -1040646 1080168 2425008 2442353 2827513 4273560 4911375 3457078 1732353 2084931
34458 2084931 3979410 5251733 5369112 5203725 4732786 3485277 2539526 3417461 5213045
34449 5213045 5388028 3595344 2296162 3091172 4677979 5214880 4707992 4093337 3678775
34440 3678775 3502348 3706595 3651422 2319694 685863 1790055 6646202 11530044 11669697
34431 11669697 7068427 2494555 1743623 3911168 5743373 5784705 5025408 4565480 4146369
34422 4146369 2994991 1212775 -135937 -182653 729867 1333458 743468 -675805 -1803297
34413a803297o3225R37837J265826O24654q71053k285178k143685P7947K820238
34404a439936L543476J391892j593853k488876o77095J582422K006824R31831
34396C256685L24460P90115J002133J62718o19772k61457L69806j22217j195510
34387C706961j057166M76353J549190Q89563p05357j923808k392759j863156K80327
34378a039852L183705L696911j88518n569006p017265l280964J027050J814600
34370g373339R50025K550840N739027N349775J47m900067m251866J6671K428814
34361E10027J670690Q43469J269336O53083k023394l901192k486817L93689J236803
34352a834306l59497j771076j081724J145340L129808L430380J773498n86916
$$ plain form
34413 -1803297 -1866522 -928685 337141 961795 90742 -2194436 -4338121 -4260174 -1439936
34404 -1439936 2103540 3495432 1901579 -587297 -1264392 318030 2324854 3256685
34396 3256685 3581145 4371260 5373393 5536111 4916339 4654882 5024688 4902471 3706961
34387 3706961 2649795 3126148 4675338 5564901 4859544 2935736 542977 -1320179 -1039852
34378 -1039852 2143853 5840764 5652246 83240 -6934025 -10214989 -9187939 -7373339
34370 -7373339 -6423314 -3872474 1866553 7216328 7216475 2316408 -1935458 -1918787 510027
34361 510027 2180717 3024186 4293522 4946605 2923211 -977981 -3464798 -3071109 -1834306
34352 -1834306 -2193803 -3964879 -5046603 -3901263 -771455 2658925 4432423 3845507
34344C845507j866203j729650j375886j241597k07698K047640L688573L069916
34336F230602R12800j178814k682302l255354k013396L28265Q74908j221536k182288
34327d187115J229016N741285N179149o94612n569235n092749j518049J155553
34319c756757K314121L016700K854640J215094p78886j878477k336301k333525
34311a683391j085085Q68837J121746q02460j777604K97859K760866K119280m80192
34302A339856j281643J56377R14877j87072j255621j100821r38475j678787k215390
34293f246699j274961Q83652L067806M022581K904886M16509j165464q42507o84700
34284A081103k454002l879370j725630K405495L634257J108782q90713p665Q85051
$$ plain form
34344 3845507 1979304 249654 -1126232 -2367829 -2575527 -527887 3160686 6230602
34336 6230602 7143402 5964588 3282286 26932 -1986464 -1658199 -783291 -2004827 -4187115
34327 -4187115 -2958099 2783186 7962335 7267723 1698488 -3394261 -4912310 -3756757
34319 -3756757 -1442636 1574064 4428704 5643798 4864912 2986435 650134 -1683391
34311 -1683391 -2768476 -1899639 -777893 -1580353 -3357957 -3060098 -299232 1820048 1339856
34302 1339856 58213 214590 1129467 942395 -313226 -1414047 -2352522 -4031309 -6246699
34293 -6246699 -7521660 -6638008 -3570202 452379 3357265 3773774 2608310 1765803 1081103
34284 1081103 -1372899 -5252269 -6977899 -4572404 -938147 170635 -720078 -727743 157308
34275A57308n89459j969470n30627J702721J491397k5497L69803K115176J860810
34266D582162p29929k554858k194935j450423j491003j173001K4851O46127l2594
34257d373603o41816k41199J38732l92449j059174j097131r45004p11157M76079
34248h846722K380621L026736J658348L36084P81300J487344K20263k066454k445116
34239c467596l86390J686510K072108J615283J498010J319797K63813j301606
34231C299929k366882k521406j936567q74939J29426K54757p16467j853617k027876
34222h613642j178620j10994P80109J869442L148925L405203J503633j460370
34214f56314k454634O1057L673185M448106J748507j046897j123855K77362K79670
$$ plain form
34275 157308 -432151 -2401621 -2932248 -1229527 261870 236373 606176 2721352 4582162
34266 4582162 3852233 1297375 -897560 -2347983 -3838986 -5011987 -4987136 -4341009 -4373603
34257 -4373603 -5015419 -5256618 -5117886 -5510335 -6569509 -7666640 -8611644 -9322801 -8846722
34248 -8846722 -6466101 -3439365 -1781017 -1444933 -663633 823711 1043974 -1022480 -3467596
34239 -3467596 -3853986 -2167476 -95368 1519915 3017925 4337722 4601535 3299929
34231 3299929 933047 -1588359 -3524926 -4399865 -4270439 -4015682 -4732149 -6585766 -8613642
34222 -8613642 -9792262 -9903256 -9123147 -7253705 -4104780 -699577 804056 -656314
34214 -656314 -3110948 -3049891 623294 5071400 6819907 5773010 4649155 4926517 5206187
34205E206187j213838j697680j85782J175541K78582j858161k457496o84822J304744
34196a32725J101763j000328k344713j042742J839706L579708K813613N40704
34188E354986j557370k641745k484396j121795N87487J242803O08162J3603K32290
34179B34025K36704p83484j600753q75797L05523j060j298840j364734O6123Q74793
34169d207500p147j131293j006078R5754J358385K397646K462032Q35382j246637
34160d49456j362707M69942J328406j84193j529492j24777K547457L035673N52774
34151D283627k679800m401189l655255o86440K338164K143226j508262m028626
34143h194555j482682L431165M605108J050565k045449j111404J342432J549835
$$ plain form
34205 5206187 3992349 2294669 2108887 3284428 3563010 1704849 -752647 -1437469 -132725
34196 -132725 969038 -31290 -2376003 -3418745 -1579039 2000669 4814282 5354986
34188 5354986 3797616 1155871 -1328525 -2450320 -1862833 -620030 -11868 1735 234025
34179 234025 470729 -312755 -1913508 -2789305 -2483782 -2484842 -3783682 -5148416 -5082293 -4207500
34169 -4207500 -4214647 -5345940 -6352018 -6256264 -4897879 -2500233 -38201 797181 -449456
34160 -449456 -1812163 -1342221 -13815 -198008 -1727500 -1852277 695180 3730853 4283627
34151 4283627 1603827 -2797362 -6452617 -7139057 -4800893 -2657667 -4165929 -8194555
34143 -8194555 -9677237 -6246072 -1640964 -590399 -2635848 -3747252 -2404820 -854985
34135h54985j78221j450645j998770k749515k820549q23257J909277K593535J204726
34126e168404N61998J953847L280952K456038M91981l07649J92985J78009r71509
34117B668248j606694l11787J862557K618436J197812j004874k234152j781841
34109A407705Q7324K279081K894047P14728k703874l928524j623620J700228L029796
34100C856891K466929J964021J926973J247284k90432j965898l713665n315061
34092A77042m859203j132313K871058K585634j444429l413958k60648L920761
34084a556056L913040N85563j289926k07472R17360j20002k007493k398244o53081
34075b816311K259629M727291N060348K606418j293437m248670m703713k633822
$$ plain form
34135 -854985 -1033206 -2483851 -4482621 -7232136 -10052685 -10875942 -8966665 -6373130 -5168404
34126 -5168404 -4606406 -2652559 628393 3084431 3576412 3268763 3461748 3639757 2668248
34117 2668248 1061554 749767 2612324 5230760 6428572 5423698 3189546 1407705
34109 1407705 1495029 3774110 6668157 7382885 4679011 750487 -873133 827095 3856891
34100 3856891 6323820 8287841 10214814 11462098 11171666 9205768 5492103 177042
34092 177042 -4682161 -5814474 -2943416 -357782 -1802211 -5216169 -5476817 -1556056
34084 -1556056 2356984 2942547 1652621 1445149 2362509 2242507 235014 -2163230 -2816311
34075 -2816311 -556682 4170609 9230957 11837375 10543938 6295268 1591555 -1042267
34067a042267O45804K750727J774423j283455l069440k064967m38167k47387j99866
34058c174595J348524K591771J065591j516905j501908N61794O97920j632692
34050a560500k393023K30241K646933J645545p49892j131603j71174p86254k921912
34041e191639l586633j307801J956098L148228J114050k171611l012585m765L399653
34032e657005K755875r52008k367024J30853K088986O80234o19405J296718L093412
34023D50636J000803j669216O1139L354982J754689l051177l001045K578763M764603
34014F244177p10284o223022m242456J333747K437321o81707j869047J42318J332273
34005b236680O29088R18906K396080J779712j244085k707944p92914J292150M59115
$$ plain form
34067 -1042267 -396463 2354264 4128687 2845232 -224208 -2289175 -2727342 -2974729 -3174595
34058 -3174595 -1826071 765700 1831291 314386 -1187522 -625728 72192 -1560500
34050 -1560500 -3953523 -3723282 -1076349 569196 -180696 -1312299 -1483473 -2269727 -5191639
34041 -5191639 -8778272 -10086073 -8129975 -4981747 -3867697 -6039308 -9051893 -9056658 -5657005
34032 -5657005 -2901130 -3853138 -6220162 -6089309 -4000323 -3320089 -3939494 -2642776 450636
34023 450636 1451439 -217777 -156638 3198344 4953033 1901856 -1099189 1479574 6244177
34014 6244177 5533893 -689129 -4931585 -3597838 -1160517 -1842224 -3711271 -3568953 -2236680
34005 -2236680 -1607592 -688686 1707394 3487106 2243021 -464923 -1257837 34313 493428
33996D93428k105656l441049k405118K84141K970339L508793J303415j142988
33988e34695j308816n22794j467364k984638j833645J170580K157823J197963
33980d125586K159899M850039M152375q52859l933738j438725J704322M89738
33972C005465j930184n67431K304164J615683j114186p88302J716293J223632
33964E465134k092987k973432n14320P06853o54639q28779R99774O46370k795395
33955b041421m247207j409467R78581l57358j382532J517286M333208K275137
33947c33773j402713o09144L317590M116059J038180q17522L77963J099254k29677
33938F556217p22339P82782J153628j135084k772331j186246R54763J56756k282077
$$ plain form
33996 493428 -1612228 -5053277 -7458395 -7174254 -4203915 -695122 608293 -534695
33988 -534695 -1843511 -2366305 -3833669 -6818307 -8651952 -7481372 -5323549 -4125586
33980 -4125586 -1965687 2884352 7036727 6183868 2250130 811405 2515727 3005465
33972 3005465 1075281 507850 2812014 4427697 3313511 2525209 4241502 5465134
33964 5465134 3372147 398715 -115605 591248 -63391 -892170 107604 753974 -2041421
33955 -2041421 -6288628 -7698095 -6719514 -7076872 -8459404 -6942118 -2608910 -333773
33947 -333773 -1736486 -2345630 971960 5088019 6126199 5308677 5686640 6785894 6556217
33938 6556217 5833878 6616660 7770288 6635204 3862873 2676627 3631390 3788146 1506069
33929A506069k620129m09766J525609J527825M57520p21610j966099k742476j860893
33920e303950N99766K631226K478006Q38339j8357O78046R68006j050846l746556
33911a926320l234227J131918M694253L028363j890200l947289q61962L246574
33903B41110L762824J015728j562003k146649j346528j26967P74151L90888j356518
33894c53964k681003j996916m88962n61714j985178j992903L92421K675979K763154
33885d229086K125735K915312L819769K026090j485557k464453J28371J961570
33877D797751l13258l826458l756293m50919J552772K86449j891199k717398k164981
33868h483534k18836L298562O144688N123340J213015q96295K77978R34289j388255
$$ plain form
33929 1506069 -1114060 -1523826 1783 1529608 1987128 1265518 -700581 -3443057 -5303950
33920 -5303950 -4704184 -2072958 405048 1243387 1225030 1903076 2871082 1820236 -1926320
33911 -1926320 -5160547 -4028629 665624 3693987 1803787 -2143502 -3005464 241110
33903 241110 4003934 5019662 3457659 1311010 -35518 -162485 611666 1002554 -353964
33894 -353964 -3034967 -5031883 -5520845 -6082559 -8067737 -10060640 -9668219 -6992240 -4229086
33885 -4229086 -2103351 811961 4631730 6657820 5172263 2707810 2836181 4797751
33877 4797751 4484493 658035 -3098258 -3549177 -1996405 -1709956 -3601155 -6318553 -8483534
33868 -8483534 -8702370 -5403808 740880 5864220 7077235 6180940 6458918 7393207 6004952
33859F004952l881158l831453l068975l406267k326606K002872N452717L345881
33851B91963j745097l391786l71364L207795M815138M775831K582491j759428
33843H405543m230731j394085K653103J208562l905645m379077J145883M699510
33835D203063J980456j412583m11314J491689j02360k344487j005415J558334
33827C957383J003654j258088j495312p49413j972862l559624k238901M48674
33819e864489Q69508o9923Q20326K571888K162616P66708J381770K366381L12195
33810E316980k535194j385896J873965R97363l326136l523508K124187N818499
33802E360260K490847k544130k806958m08171p71988l163681l071411n02030N38253
$$ plain form
33859 6004952 2123794 -1707659 -4776634 -8182901 -10509507 -8506635 -3053918 291963
33851 291963 -1453134 -4844920 -5216284 -2008489 2806649 7582480 10164971 8405543
33843 8405543 4174812 2780727 5433830 6642392 2736747 -1642330 -496447 4203063
33835 4203063 6183519 4770936 4359622 5851311 5748951 3404464 2399049 3957383
33827 3957383 4961037 3702949 2207637 1458224 -514638 -4074262 -6313163 -5864489
33819 -5864489 -4994981 -5064904 -4244578 -1672690 489926 1256634 2638404 5004785 5316980
33810 5316980 2781786 1395890 3269855 4267218 941082 -2582426 -458239 5360260
33802 5360260 7851107 5306977 2500019 2091848 1319860 -1843821 -4915232 -5417262 -4879009
33793d879009r06403j781274n10511J070801J342281R62698Q92327Q76915M52406
33784b479769r2923j44676N13280J293705J083700l23758j369511o82550N75114
33775a627388L56573p89308o67589M34190R8062j488369j192129J658178L716768
33766D98988L101290K159308K548171J968020j108606l644058k863890j175991
33758A483232j837206l031760j432696J018326j29504l749655m079913K38460
33750a1520716L920881L015225O0306o62643J074615K710644K819483J494967
33742B912762q17428k829159k606172n5171K208584J896334k64168j906250j807174
33733c267842l61627J426602K430552J936740N43910l11590j80247L5758k14135
$$ plain form
33793 -4879009 -5785412 -7566686 -8077197 -7006396 -5664115 -4701417 -3809090 -2932175 -2479769
33784 -2479769 -2572692 -2717368 -2204088 -910383 173317 -150441 -1519952 -2202502 -1627388
33775 -1627388 -1270815 -2060123 -2727712 -2293522 -2195460 -3683829 -4875958 -3217780 498988
33766 498988 3600278 5759586 8307757 10275777 9167171 5523113 2659223 1483232
33758 1483232 -353974 -3385734 -4818430 -3800104 -3929608 -7679263 -11759176 -11520716
33750 -11520716 -7599835 -4584610 -4524304 -5186947 -4112332 -1401688 1417795 2912762
33742 2912762 2095334 -733825 -3339997 -3395168 -1186584 709750 445582 -1460668 -3267842
33733 -3267842 -3629469 -2202867 227685 2164425 2708335 2396745 2216498 2252256 2038121
33724B038121l47041N4952N08897O75685Q37917Q66517J01954j141558j376901
33715B218543p0331J272496J065056l18254j345650j380900j130348j525297k560236
33706c774921k852062o59884L625862O524652M901867L42236k248030r22339J080936
33697F018317N59616j184377j422687q49073j781476l171139j743515K070763
33689a503571L733601J306926j357412l89478K378226K625647J65368j503377
33681E455930j130320j045946k399735l088346j790941n72811j220921j846179
33673g639269q7766K441178K456197M93919J79495K243408L296920J406821q94875
33664C896028r08144K57152M25332K02394R22651R70913j925201n790106n959159
$$ plain form
33724 2038121 1691080 1746032 2254929 2930614 3768531 4635048 4737002 3595444 2218543
33715 2218543 2148212 3420708 4485764 4167510 2821860 1440960 310612 -1214685 -3774921
33706 -3774921 -6626983 -7286867 -3661005 2863647 7765514 8107750 5859720 4937381 6018317
33697 6018317 6577933 5393556 3970869 3121796 1340320 -1830819 -3574334 -1503571
33689 -1503571 2230030 3536956 2179544 1790066 4168292 6793939 6959307 5455930
33681 5455930 4325610 3279664 879929 -2208417 -3999358 -4572169 -5793090 -7639269
33673 -7639269 -7727035 -5285857 -2829660 -2335741 -2156246 87162 3384082 4790903 3896028
33664 3896028 2987884 3245036 3670368 3872762 4795413 5766326 3841125 -1948981 -7908140
33655g908140j773224K082122K068059L02688O53273L002165M109668K647458
33647E184069N14562l98570k48401J50523O09112P70308j86150j917818k372904
33638B104731m17052J822413J113907k467887n184621m264568j128270J173415
33630g247932K085451L072348M053115L129279J76214j918912r79134J328277
33622C698706J808592Q240j717450j802282j147074j016666r72372R8060J722600
33613F80354J922021j48860k488980k279458M05643K335844J364162n93799n54467
33604F42460Q72539O17604j518443k152308K41709K578785J750518q61999j957763
33595B13102j156801m10366k28842M09791J330711J261483J86808q78904j903672
$$ plain form
33655 -7908140 -9681364 -7599242 -5531183 -5228495 -4575222 -1573057 2536611 5184069
33647 5184069 5698631 5300061 5051660 5202183 5811295 6581603 6395453 4477635 2104731
33638 2104731 1687679 3510092 4623999 2156112 -3028509 -7293077 -8421347 -7247932
33630 -7247932 -5162481 -2090133 1962982 5092261 5268475 3349563 2370429 3698706
33622 3698706 5507298 5515538 3798088 1995806 848732 -167934 -1140306 -1042246 680354
33613 680354 2602375 2453515 -35465 -2314923 -1909280 426564 1790726 1196927 642460
33604 642460 1514999 2132603 614160 -1538148 -1296439 1282346 3032864 2170865 213102
33595 213102 -943699 -1354065 -1582907 -1173116 157595 1419078 1605886 726982 -1176690
33586a176690l165981l289350q29122K522132L365905J366207l70968j14638K91098
33577a401407r77722k660923k491316l90790J865479K801224K042597K81936p94063
33568a724985J00902J872406J882540o03062l272115l712101k018545J82607J750344
33559e542009K258184J670830O90524K29238p8801j473116l609006m168206j929093
33550a1951455J187146K320157R56370r09470j101173Q79082L537008M568419
33542e13916L140475R35576j25130o50023k386834m484359l905670r5314L505764
33533d579431L789825J527092o36444j466745j051764L04994J411757M91230j985012
33524b194498k705195J84164L933895M597704K139606j99062m93320L27342Q52521
$$ plain form
33586 -1176690 -4342671 -7632021 -8461143 -5939011 -2573106 -1206899 -1577867 -1692505 -1401407
33577 -1401407 -2379129 -5040052 -7531368 -7922158 -6056679 -3255455 -1212858 -930922 -1724985
33568 -1724985 -1624083 248323 2130863 1527801 -1744314 -5456415 -7474960 -7292353 -5542009
33559 -5542009 -3283825 -1612995 -922471 -693233 -772034 -2245150 -5854156 -10022362 -11951455
33550 -11951455 -10764309 -8444152 -7487782 -8397252 -9498425 -8619343 -5082335 -513916
33542 -513916 2626559 3562135 3437005 2786982 400148 -4084211 -7989881 -8085195 -4579431
33533 -4579431 -789606 737486 101042 -1365703 -2417467 -2112473 -700716 -209486 -2194498
33524 -2194498 -4899693 -4715529 -781634 3816070 5955676 5756614 5263294 5590636 6443157
33515F443157Q07063M17641j39473o10186r10295j171995j133322n29085m24761
33506B748744k308226n064716n213590j682347K025435K497568R70295O47071
33498e379766J582068J496726K51093n7835J103765J998497J570279M40982q13741
33489B192068j893272j666369N31802K796535K571865N25266k93160Q00266J183620
33480F748621p19172k940828k885003n80470K020819L295293K663433N58966j534778
33471F626881k142524j373109o03489o54785j217917j670038j371328J31069J937475
33462c37765J915453m06519k391426j756376M3922M18505q7423N65035J554913
33453d81681O51186r84482j96699K272227K441427L7798p67946J111272J287400
$$ plain form
33515 6443157 7250220 7667861 7528388 6918202 6007907 4835912 3702590 3173505 2748744
33506 2748744 440518 -4624198 -9837788 -11520135 -9494700 -6997132 -6026837 -5379766
33498 -5379766 -3797698 -2300972 -2049879 -2107714 -1003949 994548 2564827 3005809 2192068
33489 2192068 298796 -1367573 -835771 1960764 4532629 5057895 4764735 5565001 6748621
33480 6748621 6029449 3088621 203618 -376852 1643967 4939260 7602693 8161659 6626881
33471 6626881 4484357 3111248 2507759 1852974 635057 -1034981 -2406309 -2275240 -337765
33462 -337765 1577688 1171169 -1220257 -2976633 -2932711 -2514206 -2601629 -2036594 -481681
33453 -481681 169505 -814977 -1011676 1260551 3701978 3739776 2971830 4083102 5370502
33444E370502k286822m742866j701468L332146M067474O62629j602423q94106
33436B205066m63686k193926l576686k044535J342560L760786L742540J636508
33428D408627j105730k531991j663786K18073R11368j05851j450802j794352q47006
33419c961450J023248K732514K571750l5674l072477l651463j216378J950614
33411c659316L222798J874081o79076k080091r96083J463470K866537K251905
33403D264225P34226p26256k227231l147384k042954M38888J269593m48443j460145
33394c345481O13906L058268K334282N8488K39308K186661J389065k833102n786930
33385b085535m453122j347273L77049J391413L179143M108681J957055j686535
$$ plain form
33444 5370502 3083680 -1659186 -3360654 -28508 4038966 4701595 3099172 2205066
33436 2205066 1741380 -452546 -4029232 -6073767 -4731207 -970421 2772119 4408627
33428 4408627 3302897 770906 -892880 -674807 236561 130710 -1320092 -3114444 -3961450
33419 -3961450 -2938202 -205688 2366062 2330388 -742089 -4393552 -5609930 -3659316
33411 -3659316 -436518 1437563 758487 -1321604 -2317687 -854217 2012320 4264225
33403 4264225 4998451 4272195 2044964 -1102420 -3145374 -2706486 -1436893 -1885336 -3345481
33394 -3345481 -2731575 326693 2660975 2719463 2958771 5145432 6534497 3701395 -2085535
33385 -2085535 -6538657 -7885930 -7508881 -6117468 -2938325 1170356 3127411 1440876
33377A440876k857485l69137K816750L195230L38117k853764k948867L10444L095515
33368B167679J722635k301735l859000j254675J488292Q52307j096455p30404
33360c011356J003521O62418j211185o14942L015173N268316L398641K05899r92699
33351G723786j460979l685210n816322m040336O79836L033217J015938j184540
33343c734610L17076L432020L753936J201140n90901j54791L02607p63717j766410
33334A996350q96822Q76135J168362o73672k760205k453467J001180M918451N096549
33325H272861Q18004l223084k469354J115571J807862j260926l023537q57492
33317A179905J301624j23624k322679j215149J411772J222827q87084k63339L410357
$$ plain form
33377 1440876 -1416609 -1785746 1031004 4226234 4564351 1710587 -1238280 -927836 2167679
33368 2167679 3890314 1588579 -2270421 -3525096 -2036804 -1184497 -2280952 -3011356
33360 -3011356 -2007835 -1345417 -2556602 -3171544 -156371 5111945 8510586 8716485 7723786
33351 7723786 6262807 2577597 -3238725 -7279061 -6599225 -3566008 -2550070 -3734610
33343 -3734610 -3417534 14486 3768422 4969562 4378661 4223870 4526477 3762760 1996350
33334 1996350 1099528 1975663 3144025 2470353 -289852 -2743319 -1742139 3176312 8272861
33325 8272861 9090865 5867781 3398427 4513998 6321860 5060934 2037397 1179905
33317 1179905 2481529 2357905 35226 -1179923 231849 1454676 567592 304253 3714610
33308C714610N316460K967371p17276k627358l093913l019955j691698O37216
33300A485457J571350J48396j245671n18496J024254J064526m02196j819958k226780
33291i19118j275117Q89728K529091J375455j735838k708700M28750M178517L913826
33282F676594j15427l491902l188595k37776K353027K427121n1706k967092l618756
33273b214512j409409J464852K631629J954642P16132l45076j176555j637885
33265a6182j625433j325746q33221k52038j51171o75929m87845J499741L537348
33256c30476K753805l60602k165436j204894m2672n77697j037700L58970J977587
33247f29115J566202j37963j118144j088099n70034N69818J565996O28120j394040
$$ plain form
33308 3714610 9031070 11998441 11281165 8653807 5559894 2539939 848241 1485457
33300 1485457 3056807 3205203 1959532 1441036 2465290 3529816 3127620 1307662 -919118
33291 -919118 -2194235 -1304507 1224584 2600039 864201 -1844499 -1415749 2762768 6676594
33282 6676594 6561167 3069265 -119330 -357106 1995921 4423042 4371336 1404244 -2214512
33273 -2214512 -3623921 -2159069 472560 2427202 3143334 2798258 1621703 -16182
33265 -16182 -1641615 -2967361 -3800582 -4052620 -4203791 -4879720 -5367565 -3867824 -330476
33256 -330476 2423329 2062727 -102709 -1307603 -1350275 -1927972 -2965672 -2606702 -629115
33247 -629115 937087 799124 -319020 -1407119 -1977153 -1407335 158661 786781 -607259
33238f07259p32624L063266M639563N50760m522136m375807n82595R11094l87191
33229b042929k08672J696050J320447j242134j119196K392839L697016J54744
33221D648165l356029k450550K83175P39844j73154K7368M8039k058704l964204
33212f256050k414007R86517K203274J164800J085054K618446L162943J633349
33204D184326P8267K29327J231971J203831o43747l266218m196463j856286J666010
33195a368982K278420l95417j870607N45382L345933K325476p73210j493967N1103
33186B644131L15893r70440r19315L40250n10123l430625l930826j55610L810782
33177b805883L931343J404376m90000j039605r47130K27187K411239L234923R67784
$$ plain form
33238 -607259 -1339883 1723383 6362946 6913706 2391570 -1984237 -2566832 -1655738 -2042929
33229 -2042929 -2251601 -555551 764896 -477238 -1596434 796405 4493421 4648165
33221 4648165 1292136 -1158414 -875239 -135395 -308549 -281181 -233142 -2291846 -6256050
33212 -6256050 -8670057 -7683540 -5480266 -4315466 -3230412 -611966 2550977 4184326
33204 4184326 4262593 4491920 5723891 6927722 6283975 3017757 -1178706 -3034992 -1368982
33195 -1368982 909438 514021 -1356586 -811204 2534729 4860205 4086995 2593028 2644131
33186 2644131 2960024 1989584 1070269 1410519 900396 -2530229 -6461055 -6616665 -2805883
33177 -2805883 1125460 2529836 2039836 1000231 53101 280288 2691527 5926450 6894234
33168F894234k336505l225395j220321J231324K048800J049995o78278j516173
33160B247681n74035Q21050N02914j006663q61278J173816J529094j296646l374141
33151h38208j386223J321635l26388m460972m543447L40464L834748K097087p78906
33142d740210J49163L287629M190760K772333K038748J989207n8050l749735n119252
33133G60593k440958J164792K337733J662610J504143K023674J542435m59579
33125H095443k727886m023092m007864k739441o08944J313458J922781J215983
33117a559562K60831R8463R75275K278018K840814J832942j47841j407467j131208
33108D040265l93016n41727j358100j740685j444126r15162o9206J276736K217370
$$ plain form
33168 6894234 4557729 1332334 112013 1343337 3392137 4442132 3763854 2247681
33160 2247681 1673646 2494696 2997610 1990947 1129669 2303485 3832579 2535933 -838208
33151 -838208 -2224431 -902796 -1229184 -5690156 -10233603 -9893139 -6058391 -3961304 -4740210
33142 -4740210 -4591047 -1303418 2887342 5659675 7698423 9687630 9629580 5879845 760593
33133 760593 -1680365 -515573 1822160 3484770 4988913 7012587 8555022 8095443
33125 8095443 5367557 1344465 -2663399 -5402840 -6011784 -4698326 -2775545 -1559562
33117 -1559562 -1298731 -1200268 -224993 2053025 4893839 6726781 6578940 5171473 4040265
33108 4040265 3647249 3105522 1747422 6737 -1437389 -2352551 -2421757 -1145021 1072349
33099A072349J695179L98143n1967L31643J91758l10018M55748J981756J048452
33090F813043l366456p116244n615959n7013M027747L655995J011791n67335l49773
33081a564204M96940Q79123R3806j961256l923959l767926j296135J411735K658332
$$ plain form
33099 1072349 2767528 3165671 3113704 3445347 3637105 3327087 3782835 5764591 6813043
33090 6813043 3446587 -3669657 -9285616 -9342629 -5314882 -1658887 -647096 -1214431 -1564204
33081 -1564204 -1067264 -188141 -94335 -2055591 -5979550 -9747476 -11043611 -9631876 -6973544
$$ [...]
##END NTUPLES=NMR SPECTRUM
##END=
