##TITLE=31Pdec_PR192_5Na
 D2O, 24 sc
 20.10.2020
##JCAMPDX= 6.0         $$ Bruker NMR JCAMP-DX V2.0
##DATA TYPE= NMR SPECTRUM
##DATA CLASS= NTUPLES
##ORIGIN= UXNMR, Bruker Analytische Messtechnik GmbH
##OWNER= root
$$ XWIN-NMR		Version 3.5
$$ Tue Oct 20 11:11:20 2020 Russian Standard Time (UT+4h)  she@DPX200
##.OBSERVE FREQUENCY= 81.013821
##.OBSERVE NUCLEUS= ^31P
##.ACQUISITION MODE= SIMULTANEOUS
##.ACQUISITION SCHEME= undefined
##.AVERAGES= 24
##.DIGITISER RES= 17
##SPECTROMETER/DATA SYSTEM= spect
##.PULSE SEQUENCE= zgpg30
##.SOLVENT NAME= D2O
##.SHIFT REFERENCE= (INTERNAL, D2O, 0, 182.463)
##AUDIT TRAIL= $$ (NUMBER, WHEN, WHO, WHERE, WHAT)
$$ ##TITLE= Audit trail, XWIN-NMR		Version 3.5
$$ ##JCAMPDX= 5.01
$$ ##ORIGIN= Bruker BioSpin GmbH
$$ ##OWNER= she
$$ F:/spectra/data/she/nmr/P31/1/pdata/1/auditp.txt
$$ ##AUDIT TRAIL=  $$ (NUMBER, WHEN, WHO, WHERE, WHAT)
(   1,<2020-10-20 11:10:27.07 +0400>,<she>,<DPX200>,
      <created by zg, POWCHK disabled, PULCHK disabled
       configuration hash MD5:
       00 E9 B6 7A A2 85 ED C7 34 08 36 98 17 FE 4E 26
       data hash MD5: 32K
       A5 60 76 B9 7E D5 59 CF 7B 77 3D 24 B5 CD 4C C9>)
(   2,<2020-10-20 11:10:29.39 +0400>,<she>,<DPX200>,
      <Start of raw data processing
       efp BC_mod = 2 LB = 1 FT_mod = 6 PKNL = 1 PHC0 = -2751.636 PHC1 = 71.60141 SI = 64K 
       data hash MD5: 64K
       EB 72 09 88 F8 56 34 F2 FF 1C 2D 04 69 E8 77 43>)
(   3,<2020-10-20 11:10:45.18 +0400>,<she>,<DPX200>,
      <pk PHC0 = -13.17144 PHC1 = 0 
       data hash MD5: 64K
       22 62 16 74 D3 EF DF 31 04 63 34 91 EA DC 71 7D>)
(   4,<2020-10-20 11:10:48.54 +0400>,<she>,<DPX200>,
      <abs ABSG = 5 
       data hash MD5: 64K
       FF 40 83 14 37 45 D1 78 87 2E 9A 30 0A 2E A1 16>)
$$ ##END=
$$ 
$$ hash MD5
$$ 65 2D 7E 85 BA 66 7D 15 A3 E6 73 91 6F A4 37 C1
##$RELAX= 
##$RELAX= 
##$RELAX= 
##$RELAX= 
##$RELAX= 
##$RELAX= 
##$RELAX= 
##$RELAX= 
$$ Bruker specific parameters
$$ --------------------------
##$DU= <F:/spectra>
##$EXPNO= 1
##$NAME= <P31>
##$PROCNO= 1
##$TYPE= <nmr>
##$USER= <she>
##$AMP= (0..31)
100 100 100 100 100 100 100 100 100 100 100 100 100 100 100 100 100 100 
100 100 100 100 100 100 100 100 100 100 100 100 100 100 
##$AQSEQ= 0
##$AQ_mod= 1
##$AUNM= <au_zg>
##$AUTOPOS= <>
##$BF1= 81.014009
##$BF2= 200.13
##$BF3= 200.13
##$BF4= 200.13
##$BF5= 200.13
##$BF6= 200.13
##$BF7= 200.13
##$BF8= 200.13
##$BYTORDA= 1
##$CFDGTYP= 0
##$CFRGTYP= 5
##$CHEMSTR= <none>
##$CNST= (0..31)
1 1 145 1 1 1 1 1 1 1 1 1 1 1 1 1 1 1 1 1 1 1 1 1 1 1 1 1 1 1 1 1 
##$CPDPRG= <waltz16>
##$CPDPRG1= <>
##$CPDPRG2= <waltz16>
##$CPDPRG3= <>
##$CPDPRG4= <mlev>
##$CPDPRG5= <mlev>
##$CPDPRG6= <mlev>
##$CPDPRG7= <mlev>
##$CPDPRG8= <mlev>
##$CPDPRGB= <>
##$CPDPRGT= <>
##$D= (0..31)
0 1 0 0 0 0 0 0 0 0 0 0.03 2e-05 3e-06 0 0 0 0 0 0 0 0 0 0 0 0 0 0 0 0 
0 0 
##$DATE= 1603177826
##$DBL= (0..7)
120 120 120 11 120 120 24 19 
##$DBP= (0..7)
150 150 150 150 150 150 150 150 
##$DBP07= 0
##$DBPNAM0= <>
##$DBPNAM1= <>
##$DBPNAM2= <>
$$ [...]
##$SUBNAM3= <"">
##$SUBNAM4= <"">
##$SUBNAM5= <"">
##$SUBNAM6= <"">
##$SUBNAM7= <"">
##$SUBNAM8= <"">
##$SUBNAM9= <"">
##$SW= 369.568048894756
##$SWIBOX= (0..15)
0 1 3 0 0 0 0 0 0 0 0 0 0 0 0 0 
##$SW_h= 29940.119760479
##$TD= 32768
##$TD0= 1
##$TE= 0
##$TE2= 300
##$TE3= 300
##$TEG= 300
##$TL= (0..7)
0 120 53 12 22 120 120 120 
##$TP= (0..7)
150 150 150 150 150 150 150 150 
##$TP07= 0
##$TPNAME0= <>
##$TPNAME1= <>
##$TPNAME2= <>
##$TPNAME3= <>
##$TPNAME4= <>
##$TPNAME5= <>
##$TPNAME6= <>
##$TPNAME7= <>
##$TPOAL= (0..7)
0.5 0.5 0.5 0.5 0.5 0.5 0.5 0.5 
##$TPOFFS= (0..7)
0 0 0 0 0 0 0 0 
##$TUNHIN= 0
##$TUNHOUT= 0
##$TUNXOUT= 0
##$USERA1= <user>
##$USERA2= <user>
##$USERA3= <user>
##$USERA4= <user>
##$USERA5= <user>
##$V9= 5
##$VALIST= <valist>
##$VCLIST= <CCCCCCCCCCCCCCC>
##$VD= 0
##$VDLIST= <DDDDDDDDDDDDDDD>
##$VPLIST= <PPPPPPPPPPPPPPP>
##$VTLIST= <TTTTTTTTTTTTTTT>
##$WBST= 1024
##$WBSW= 4
##$XGAIN= (0..3)
0 0 0 0 
##$XL= 0
##$YL= 0
##$YMAX_a= 11971
##$YMIN_a= -5586
##$ZGOPTNS= <>
##$ZL1= 120
##$ZL2= 120
##$ZL3= 120
##$ZL4= 120
##$ABSF1= 182.463
##$ABSF2= -187.1042
##$ABSG= 5
##$ABSL= 3
##$ALPHA= 0
##$AQORDER= 0
##$ASSFAC= 0
##$ASSFACI= 0
##$ASSFACX= 0
##$ASSWID= 0
##$AUNMP= <proc_1d>
##$AZFE= 0.1
##$AZFW= 0.5
##$BCFW= 0
##$BC_mod= 2
##$BYTORDP= 0
##$COROFFS= 0
##$CY= -3
##$DATMOD= 1
##$DC= 0
##$DFILT= <>
##$DTYPP= 0
##$F1P= 0
##$F2P= 0
##$FCOR= 1
##$FTSIZE= 65536
##$FT_mod= 6
##$GAMMA= 0
##$GB= 0
##$INTBC= 1
##$INTSCL= 5.30512e-09
##$ISEN= 30
##$LB= 1
##$LEV0= 0
##$LPBIN= 0
##$MAXI= 10000
##$MC2= 0
##$MEAN= 0
##$ME_mod= 0
##$MI= 50
##$NCOEF= 0
##$NC_proc= -7
##$NLEV= 6
##$NOISF1= 182.463
##$NOISF2= 159.3651
##$NSP= 0
##$NTH_PI= 0
##$NZP= 0
##$OFFSET= 182.463
##$PC= 4
##$PHC0= -2764.807
##$PHC1= 71.60141
##$PH_mod= 1
##$PKNL= yes
##$PPARMOD= 0
##$PSCAL= 0
##$PSIGN= 0
##$REVERSE= no
##$SF= 81.0140089999434
##$SI= 65536
##$SIGF1= 159.3651
##$SIGF2= -187.1042
##$SINO= 113.3802
##$SIOLD= 16384
##$SREGLST= <1H.CDCl3>
##$SSB= 0
##$STSI= 65536
##$STSR= 0
##$SW_p= 29940.119760479
##$SYMM= 0
##$S_DEV= 0
##$TDeff= 32768
##$TDoff= 0
##$TI= <>
##$TILT= no
##$TM1= 0
##$TM2= 0
##$TOPLEV= 0
##$USERP1= <user>
##$USERP2= <user>
##$USERP3= <user>
##$USERP4= <user>
##$USERP5= <user>
##$WDW= 1
##$XDIM= 65536
##$YMAX_p= 438282295
##$YMIN_p= -26258794
$$ End of Bruker specific parameters
$$ ---------------------------------
##NTUPLES= NMR SPECTRUM
##VAR_NAME=  FREQUENCY,     SPECTRUM/REAL,   SPECTRUM/IMAG
##SYMBOL=    X,             R,               I
##VAR_TYPE=  INDEPENDENT,   DEPENDENT,       DEPENDENT
##VAR_FORM=  AFFN,          ASDF,            ASDF
##VAR_DIM=   65536,         65536,           65536
##UNITS=     HZ,            ARBITRARY UNITS, ARBITRARY UNITS
##FACTOR=    0.456856943014862, 1,           1
##FIRST=     14782.0589164792, 0,            0
##LAST=      -15158.0608439998, 0,           0
##MIN=       -15158.0608439998, -26258794,   0
##MAX=       14782.0589164792, 438282295,    0
$$ Real data points
##PAGE= N=1
##DATA TABLE= (X++(R..R)), XYDATA
$$ [...]
40591 -1817757 -1540084 -1474384 -1783520 -1255137 -97429 60828 -972898 -1620275 -1298184
40582 -1298184 -1151265 -1709710 -2158627 -2368863 -3303598 -4790680 -5194054 -4096561 -3106622
40573 -3106622 -3096005 -2827749 -1434140 -118335 6744 -130234 672980 1821459 2270579
40564 2270579 2531455 3555860 4646117 4196890 1923206 -956442 -3173256 -4034168 -3405416
40555 -3405416 -2102978 -1414746 -1184057 584913 4899803 9543932 11258800 9509670
40547 9509670 6532109 4241095 2900018 2565107 3742315 6016230 7592870 7166724
40539 7166724 5349572 3460342 1676160 -571995 -2736105 -3012585 -648503 2437314
40531 2437314 3468924 2175227 1153303 2402217 4663973 5283347 3823232 2297581
40523 2297581 2157586 2640460 2212068 300716 -2565624 -5123435 -5830842 -4322196 -2471061
40514 -2471061 -2503672 -3952276 -4180808 -2109618 595951 2450572 3871113 5010444 4423945
40505 4423945 1759852 -246215 1165812 4889202 7273859 6610152 4487520 3330392
40497 3330392 4211485 6505222 8221374 7309295 3993924 1076142 633805 1436939 1082618
40488 1082618 -531379 -1689044 -1633733 -728234 1159683 4057248 6414122 6685436 5810930
40479 5810930 5604624 5277812 2533238 -2041302 -4862980 -4119419 -1750276 -7135 1083368
40470 1083368 1811071 1104059 -1754920 -5811636 -9894911 -13214960 -13792389 -9389061 -1751890
40461 -1751890 3022402 979520 -4916958 -8966044 -9608661 -9233765 -8989088 -7581861 -4719059
40452 -4719059 -2206323 -1141868 -617294 250877 1092300 1494549 1573303 1050155 -417723
40443 -417723 -1814037 -1684627 -804468 -1696818 -4715244 -6797731 -5465507 -2287664 -717105
40434 -717105 -1750828 -3466059 -3985340 -3028413 -779465 2987078 7993906 12464421 13744054
40425 13744054 10270979 3413004 -2726414 -4441239 -2067156 335317 -291273 -2624999
40417 -2624999 -3545688 -2936499 -3576388 -6347445 -8204987 -6184456 -1514629 2069379 2833199
40408 2833199 1751634 -444272 -4136384 -8325574 -9963729 -7538798 -3784637 -2826584
40400 -2826584 -5371274 -8582468 -10228867 -10730728 -10859708 -9778902 -6797991 -3570891
40392 -3570891 -2633449 -4158932 -5678778 -5035874 -2459251 350058 2021086 2071144 770148
40383 770148 -844334 -1576670 -1493363 -2151719 -4478582 -6884728 -6804234 -4156134 -1843855
40374 -1843855 -2165907 -4005027 -4716853 -3740717 -2612964 -1950466 -620584 1751762 3569239
40365 3569239 3594748 2739292 2114276 888436 -1953467 -4873886 -5273309 -3403888 -2391735
40356 -2391735 -4008443 -6472660 -7158525 -5837446 -4428112 -4795529 -7343648 -10488103
40348 -10488103 -11147587 -7429465 -1527715 1755913 338429 -2889876 -4049410 -2552888
40340 -2552888 -68468 2509948 4677598 4674803 1341398 -3124399 -5287518 -5164664 -5811148
40331 -5811148 -8001317 -8533995 -5058687 148562 3128096 3029045 1972398 1577154 1809338
40322 1809338 2483200 3727310 5031427 5515156 5306655 5358994 5755812 5433964 3938697
40313 3938697 2411629 2278304 3605105 5187599 5752228 4746439 2504665 120096
40305 120096 -1196442 -1071043 -88160 1238836 3107714 5515401 7214541 6629687 3946303
40296 3946303 1356069 703471 1543771 2155803 1879543 1547016 1932677 2805690 3468436
40287 3468436 3298735 1862863 -335079 -1275488 685348 3813102 3887803 -456893 -5065191
40278 -5065191 -5206229 -1958026 -618651 -3028507 -5055549 -2996293 745865 1089228
40270 1089228 -2573806 -5924894 -5810839 -3619506 -2148827 -1926878 -1942394 -1843778 -1586098
40261 -1586098 -423526 1635044 2347968 -340915 -4597524 -5907626 -2694384 1345019
40253 1345019 1737430 -1538878 -4809723 -5389963 -3651845 -1186022 1004164 2462368
40245 2462368 3186320 3969966 5598521 7437982 7922374 6561253 4319332 1998399 -365215
40236 -365215 -2370014 -3115079 -2625334 -1916878 -1189073 440868 2819939 4149119 3443952
40227 3443952 2075379 1928575 3457430 6157011 8982415 9567198 5715578 -797514
40219 -797514 -4742248 -3966311 -2557849 -4550272 -7420664 -6089576 -1201533 1775308
40211 1775308 793616 -824082 -800436 -854242 -2052749 -2296794 -516165 1065371 1266710
40202 1266710 2387507 5452975 6966632 3999632 -731722 -2770043 -2186835 -1803029
40194 -1803029 -1436514 1328179 5835547 8540756 8342546 7679363 8067871 8181485 6922735
40185 6922735 5199619 3871066 2584902 1266798 360766 -732295 -2900083 -4708348
40177 -4708348 -3389818 842585 4197268 4001398 1493254 -1081460 -3504678 -6187251
40169 -6187251 -8076873 -7961009 -6395925 -4757232 -3554988 -2819716 -2808102 -3272588 -3398462
40160 -3398462 -3269392 -3670388 -3677902 -901042 4314981 7485385 5320884 531524 -1685691
40151 -1685691 -599426 20260 -1755641 -3402596 -2504094 -757338 -1463058 -4787214 -7574068
40142 -7574068 -7294046 -4637644 -2073327 -759996 452004 2868826 5380828 5166278
40134 5166278 1369260 -3147013 -4912346 -3871055 -2772345 -3134197 -3786864 -3467891 -2741482
40125 -2741482 -2467892 -2026763 -385719 2023917 3709147 3842540 2731426 1218286 499739
40116 499739 1767505 4728240 6890011 5806103 2182150 -466842 376240 3743527
40108 3743527 6824686 7941099 7163687 5101943 2491744 589314 480294 1652162
40100 1652162 2234724 1116563 -834785 -1988919 -1749625 -855381 -608510 -2102098 -5229491
40091 -5229491 -7828944 -6938796 -2206986 2575872 2847406 -1881739 -7699425 -10613859
40083 -10613859 -9881279 -7206786 -4485577 -2899689 -2597449 -2280419 -399063 2289290
40075 2289290 2811220 -2148 -3035030 -2529404 682713 2171587 81027 -2427223
40067 -2427223 -1861864 850787 2167700 931178 -693777 -667025 757379 2446895 4052459
40058 4052459 5552410 6553248 6925821 7091792 6863837 5123347 1793362 -942250 -1117565
40049 -1117565 -112684 -1190166 -4711091 -6994384 -5057199 -772983 1452465 230872
40041 230872 -1499240 -585597 2596175 5042887 4731564 2610779 1275190 1988327 3169111
40032 3169111 2253636 -859165 -3167543 -2089227 1311049 3827172 4094055 3417801 3006920
40023 3006920 2407219 1092398 -206539 -724033 -1014568 -2165574 -4446838 -7296244 -9755050
40014 -9755050 -10490476 -8573116 -4969969 -2207200 -1763210 -2788229 -4045906 -5649016
40006 -5649016 -7617090 -8161525 -5508338 -932510 2036787 1621940 -503316 -1797087
39998 -1797087 -1732767 -1473984 -1753428 -2105510 -1937886 -1567197 -1875169 -3184488 -4946774
39989 -4946774 -6655353 -8339550 -9470536 -8310924 -4145545 85504 -126294 -5162143
39981 -5162143 -9918127 -9819113 -6188611 -3326759 -2058770 426924 5036829 8912632
39973 8912632 9846842 9252320 9122923 8655638 6096617 2212031 -434255 -771149 240883
39964 240883 1743297 3576910 4871937 4136247 1485333 -651413 -173387 1988576 2857084
39955 2857084 993433 -1798791 -2739859 -1381956 267854 800197 1246504 3019454 5046200
39946 5046200 4616244 1013933 -3225149 -5103629 -3980122 -1134030 2117309 4898457
39938 4898457 6450871 6654132 6429515 6579514 6541861 5207646 2684915 362884 -537306
39929 -537306 336690 2808759 6062553 8302278 7801659 4700375 965572 -1665805 -2952216
39920 -2952216 -3297135 -2736119 -1235894 936125 3682988 6980564 9690605 9657426 6220189
39911 6220189 1811067 -402282 44386 1319087 2528336 4308999 6092257 5468259
39903 5468259 1698971 -2186280 -2863208 -1017882 -18635 -1087611 -2159676 -1388706 502435
39894 502435 1799531 1843193 880578 -580664 -1660062 -1693529 -1396623 -2049149 -3180564
39885 -3180564 -2810083 -637998 887116 -188470 -2616759 -3734551 -2582188 -81337
39877 -81337 2446751 3662594 2574682 -39833 -1892936 -2099520 -2197285 -2961679 -2462743
39868 -2462743 609231 3965146 4894841 4417592 4917244 5476242 3708273 968234 883993
39859 883993 3035864 3309640 1192453 1268519 5494534 9127611 7575925 3091473 695000
39850 695000 680441 -416115 -3505559 -6046280 -6423318 -5335763 -3362805 -683721 974696
39841 974696 -559403 -4515566 -7577955 -8013463 -7137555 -6561401 -6354610 -6270278 -6527729
39832 -6527729 -6744825 -5900129 -3903967 -1772419 -130347 890555 423221 -2379758 -6112031
39823 -6112031 -7728886 -6026598 -2804288 -172871 1344746 1517901 -425353 -3928674
39815 -3928674 -6198616 -4985069 -1399586 1424730 1885433 1076802 992435 2549281 5035444
39806 5035444 6743059 6313025 3875273 812558 -1396082 -1695326 439228 4101648
39798 4101648 6671913 6367165 5060723 6257637 9736783 10857350 6669461 296745
39790 296745 -2997028 -2208021 -390547 430153 767870 665038 -1072938 -3785810 -4262105
39781 -4262105 -854336 3911767 6621861 7065606 7122711 7186941 6201416 4337279 2906391
39772 2906391 1780161 -389895 -2937012 -2932885 458085 3715737 3186176 13611 -1604517
39763 -1604517 -246902 1304073 445292 -1963781 -3466976 -3208996 -2208293 -1816621 -2796084
39754 -2796084 -4663066 -5165410 -1899234 4409029 9604057 10483545 8297195 6370339
39746 6370339 5572882 4399417 2752354 2740986 5156485 7534810 7157785 4627271 2930810
39737 2930810 3520497 4733280 4315972 2502415 1592766 2535253 3220417 1384682 -1612220
39728 -1612220 -2145664 299225 1764976 -712699 -4774960 -6372567 -5696488 -6028645 -7828405
39719 -7828405 -8110554 -5887298 -4111784 -4839289 -6017550 -5216761 -3648833 -3808368 -5158141
39710 -5158141 -4942565 -2065332 2242244 6605814 10062256 11240939 9330948 5586948
39702 5586948 2094999 -522142 -2656130 -3949544 -4002736 -3932650 -4822610 -5340136 -3661260
39693 -3661260 -1235877 -1240599 -3141945 -2688573 1418839 4735154 3453061 290974 460965
39684 460965 4026300 6470653 5826716 4776893 5379240 5968973 4906295 3935004 5312267
39675 5312267 7887927 8685274 7033004 4792925 3427941 2958167 3051897 3112950 1965614
39666 1965614 -509983 -2135969 -1056022 1147210 1651209 1131740 2861621 6884646
39658 6884646 8989043 6856537 3545145 2574763 2839547 1464692 -1041618 -2306501
39650 -2306501 -2845702 -5003661 -8015438 -8580051 -6632567 -6340380 -9962072 -14137413 -14368394
39641 -14368394 -10772628 -7086868 -5446496 -4499233 -2387380 166004 537256 -2244784
39633 -2244784 -5372775 -4968148 -1217518 1118496 -1157107 -4945936 -4813902 -187436
39625 -187436 4676609 6864393 6936536 5212150 678679 -5204499 -8013495 -5928737 -2389363
39616 -2389363 -956755 -763556 428101 1840492 1593965 550620 792406 1903346 1921883
39607 1921883 766285 -74638 -151120 108148 894075 1991871 1778645 -207648 -1375512
39598 -1375512 298409 2359004 1029565 -2853654 -4730107 -2631607 835503 2628107
39590 2628107 2151511 12215 -3005272 -5332762 -5511048 -4018871 -2435846 -1352578
39582 -1352578 -968774 -2273387 -4902399 -5595920 -2472967 771845 -517607 -4367995
39574 -4367995 -4567262 -124706 3734162 4446940 5256296 7602035 7291832 2066976 -2946440
39565 -2946440 -2374944 1354511 2484361 850555 563215 2324547 3130152 2388832 2513046
39556 2513046 3572348 2719674 -313758 -1886204 -109449 2033101 1276245 -1047068
39548 -1047068 -986492 2729885 7204817 8546705 5585114 753663 -2444962 -2966737 -2671785
39539 -2671785 -3018402 -2891270 -1031482 971322 346162 -3031474 -6609884 -8349362 -7966034
39530 -7966034 -5799826 -2767478 -836365 -1047567 -1464525 339759 3119850 3252942 248563
39521 248563 -2293377 -2045991 -1170166 -2581403 -5468458 -6543578 -4219127 213519 4503204
39512 4503204 7041203 7261924 5722846 3661446 2053391 1297153 1399234 1531878 13572
39503 13572 -3622399 -6857629 -6433942 -2299952 2695169 6783737 10251006 12405382 11204605
39494 11204605 7263497 4807008 6267731 8656401 7995514 4967003 2961272 2470695
39486 2470695 1274095 -819475 -1519619 -427412 -19763 -1294084 -1800805 269750 2788338
39477 2788338 2823004 1216372 1288194 3674660 5135623 3030153 -945747 -2785201 -1102442
39468 -1102442 1358253 1255368 -1429714 -3809209 -3779114 -1998676 -165305 1153737 2059052
39459 2059052 1894909 -95641 -3001007 -4663062 -4195710 -2998686 -2764391 -3273957 -2862383
39450 -2862383 -738130 1804146 2683483 1376600 -397223 -657120 467383 1096922 242564
39441 242564 -1070502 -1604637 -1359929 -388419 2164975 6174624 9106056 8838904 7035402
39432 7035402 6862160 7698501 5553509 -526463 -6061682 -7109886 -5484489 -5031951 -5185192
39423 -5185192 -2315522 3492273 7399446 6204916 2214673 -599041 -1300501 -1090473
39415 -1090473 -420356 461125 36398 -2398199 -4238300 -2348421 1811707 2992526 -1056470
39406 -1056470 -6283136 -7388738 -4112491 -373078 1425001 2524015 4487367 6424322
39398 6424322 6697762 5785563 5751284 7209481 8112764 6000376 1034043 -3609726 -4562006
39389 -4562006 -1539716 2425979 4290549 4113580 4191418 5516703 6583734 6054592 4901774
39380 4901774 4617687 4658841 3640686 2267066 2531001 3903240 3031493 -1594540 -6927764
39371 -6927764 -9100264 -8176405 -7021353 -6655717 -5352518 -2068755 1628971 3459428
39363 3459428 2597690 -150576 -2741063 -2608981 934673 4827330 4977014 1396380 -1564718
39354 -1564718 -777242 2323823 4982082 6875855 8594852 8830450 6027428 1524929
39346 1524929 -1683114 -2578565 -2256479 -1352594 202538 1565436 1709647 1466184 2509999
39337 2509999 4619565 6133467 6614432 6765104 6519692 5961819 7056501 10728288 12915070
39328 12915070 8359000 -1090568 -7032954 -5176259 -600848 363243 -1224806 -544908
39320 -544908 2575145 4228610 3276213 2174842 1660376 -299059 -3717719 -5114770 -2300955
39311 -2300955 2394872 5179775 4986829 3492713 2589123 2773444 3050196 2128871 425624
39302 425624 185052 2333037 4340264 3325094 348898 -1019958 131165 1311024
39294 1311024 979503 523085 1309136 2673289 3845684 5361854 7375572 8710731 8754503
39285 8754503 8448872 8427905 7938826 6439717 4494160 2419765 -1810 -1884879 -1618156
39276 -1618156 251796 930620 -664586 -2216894 -1612604 145588 1176419 1484329 1652462
39267 1652462 1079818 -342310 -886217 420870 1865558 2079834 2809229 5614786 7736357
39258 7736357 5113623 -1290176 -6022096 -6086263 -4006027 -3404915 -4551653 -5420726 -4823016
39249 -4823016 -3019466 -629103 1847786 4020046 5610084 6175283 5242560 3362683
39241 3362683 2100489 1796491 461612 -3335963 -7505560 -8638480 -6588274 -4431189
39233 -4431189 -4103940 -4460322 -3582213 -699533 4028743 9116211 11356205 8912672 4979721
39224 4979721 4871998 8687570 10603278 7003067 1465855 -828907 -26757 629788 948847
39215 948847 2999388 5658554 4971220 245814 -4334948 -5225268 -3353729 -1309811 212625
39206 212625 1454338 1652566 267707 -1485504 -2266123 -2511662 -3084948 -3413047 -2870852
39197 -2870852 -2696566 -4144192 -5608964 -4360601 -958068 950721 -161932 -1404001
39189 -1404001 283256 3785560 5553660 4118967 980302 -1848040 -3218681 -2632546
39181 -2632546 -662706 823712 606832 -161985 184572 986426 348588 -1568520 -2869120
39172 -2869120 -3162296 -3586569 -3642401 -1440593 2147710 3237193 546371 -1995792 -566837
39163 -566837 3421970 6039334 6039881 4479674 1638404 -2180372 -4690457 -4130726 -2308352
39154 -2308352 -1703155 -1248683 1027610 2975086 1077611 -2671368 -2462156 2384497 5914690
39145 5914690 4337993 825847 -549309 -288499 42986 1650175 4807983 5646110 1419117
39136 1419117 -4120159 -5355132 -2367627 800729 3230082 7168041 12129953 14284867
39128 14284867 11921895 7259825 2520069 -2006186 -5709111 -7172476 -6545671 -5372618
39120 -5372618 -3882757 -1472589 387182 -599726 -3341322 -4297564 -2966401 -2305848 -3142428
39111 -3142428 -2871612 -1066394 -1350902 -5126198 -8024291 -6091697 -1725729 376413
39103 376413 -29758 -119242 683189 1266432 2433326 5003156 5911842 1604521 -5193683
39094 -5193683 -7543978 -3744435 331004 -238341 -3276160 -4293849 -3322735 -3432913 -5015024
39085 -5015024 -5388696 -3287167 -713005 -180060 -1960468 -4324999 -5417192 -4689707 -2981537
39076 -2981537 -1259331 473979 2460562 3908681 3743269 2342567 881910 -798288
39068 -798288 -3460317 -5569849 -3999994 1388828 6586622 8268912 7179245 5121704
39060 5121704 1814679 -2471673 -4194469 -693574 4578753 5479551 1305060 -2763258
39052 -2763258 -3366471 -2692613 -3522085 -4832387 -4514222 -3184723 -2666958 -2874360 -2583985
39043 -2583985 -1715104 -931500 -447008 -730327 -2604702 -5132711 -5626857 -3735509 -3006749
39034 -3006749 -5535430 -7418832 -3590216 4049045 7892730 4326861 -1891503 -4229827
39026 -4229827 -2064643 107925 -1195613 -5168629 -8325390 -7910129 -4398325 -1203935
39018 -1203935 -1050233 -2755492 -3231321 -2358908 -3127842 -6351086 -8434617 -6254380 -1666990
39009 -1666990 1204981 1181716 32138 -938552 -1431179 -631427 1679658 3264799 1910209
39000 1910209 -590603 -319109 2734354 4058173 977078 -3748995 -6297710 -6655244
38992 -6655244 -6791823 -6621517 -4943685 -2850940 -2828222 -4854044 -6207770 -5172522 -2532309
38983 -2532309 604669 3815898 5697111 4003461 -988585 -5335685 -5621794 -3029602
38975 -3029602 -1374309 -2123585 -3518264 -4048512 -4232780 -4489423 -3580489 -658603 2507993
38966 2507993 3121125 753502 -2238515 -3637231 -3445481 -2817168 -2158596 -1173127 -84074
38957 -84074 392372 341650 897022 2602868 4153568 3687190 1266946 -873505 -992764
38948 -992764 17544 12546 -1297330 -1855724 -216343 2085512 2140706 -691506 -3785278
38939 -3785278 -4131496 -1525912 1526694 2562554 1204488 -1177507 -2854048 -2522027
38931 -2522027 310144 4678389 8154160 8576210 6124887 2991076 774299 -960172
38923 -960172 -3232809 -5912646 -8261046 -10132544 -11326992 -10582746 -6980901 -2081269
38915 -2081269 1139096 1633711 1023564 937160 1452569 2462447 4402316 6721809 7703582
38906 7703582 7108667 7117950 9112100 11356684 11704324 10718064 9810787 8145361 4514695
38897 4514695 997541 935912 3560457 4529230 2393593 657110 1855688 3175412 713036
38888 713036 -4303305 -6754882 -4113236 1032880 4772313 6108528 6999813 9372507
38880 9372507 12646641 14126999 12062291 8113206 5806652 6482649 8050553 7967519 5876155
38871 5876155 2902301 267674 -610732 1214717 4138719 4688668 2044868 -151448
38863 -151448 1290963 4325195 4634648 1887391 -413450 -585123 -461880 -1115748 -595657
38854 -595657 2509146 6025806 6839956 5006550 3352302 3773832 5258928 5166494 1809718
38845 1809718 -3676402 -7770442 -7756757 -4682577 -2017268 -1318559 -965932 317732 889762
38836 889762 -1318169 -5370721 -8399755 -9125513 -8305727 -6424664 -3392119 -592268 -706236
38827 -706236 -4388850 -8864267 -11117317 -11071871 -10125609 -8025954 -3763301 912508 2011662
38818 2011662 -1490164 -5389549 -5171501 -1551584 1132361 792223 -890430 -2079813
38810 -2079813 -2638752 -2198153 176046 3257570 3808249 1233524 -843806 139809 1851818
38801 1851818 1516831 1206017 4211004 8116085 7100523 1065019 -3124850 -1042284
38793 -1042284 3564137 5004912 3304106 1896997 996586 -1822618 -5700554 -6057084
38785 -6057084 -872793 6045831 9507375 8390902 5311922 2653193 716307 -1036883
38777 -1036883 -2698700 -4104145 -5323405 -6447539 -7171202 -6924612 -5410244 -2922192
38769 -2922192 -268469 1474862 1474460 75500 -808445 726314 4016406 5778465 3644273
38760 3644273 -882615 -4184773 -4708183 -3901301 -3319651 -2759730 -1726736 -906685 -974111
38751 -974111 -1102657 -80048 1546676 1711535 -565996 -3529070 -4206152 -1624695 1971632
38742 1971632 3694235 3407654 3258361 3830411 3013386 -51150 -2290252 -657213 2804336
38733 2804336 3282663 -26061 -3108943 -3231108 -2032268 -1576709 -1069786 570803 2018370
38724 2018370 1816296 967022 968648 1371436 1420427 1908914 3026185 2623694 -528689 -3754004
38714 -3754004 -3919977 -2207353 -1949797 -3051468 -2492907 184941 1907493 780647 -1794351
38705 -1794351 -4163144 -6121550 -6862827 -4755658 -576813 2142838 1774030 908294 2090550
38696 2090550 3782047 3094728 583046 -667822 260945 1249198 838468 240011 977571
38687 977571 2416447 2857824 2172694 2099502 3927052 6675174 8083182 7168797 5142823
38678 5142823 3627453 2778640 1831680 745005 97111 -317426 -1379663 -2977640 -3718530
38669 -3718530 -2787011 -1150902 -447119 -1403606 -3635943 -6110693 -7398702 -6377963 -3387076
38660 -3387076 -189407 1723356 2498391 3394992 5220234 7274096 7547408 4536968 -241264
38651 -241264 -2323721 1216227 7420490 9900529 6403205 1545397 449832 2113299
38643 2113299 2012999 -424748 -1293164 608337 649850 -4906609 -12312492 -14521241 -10556622
38634 -10556622 -6250802 -5497926 -5412378 -2202299 2208303 3203660 632366 -1538637 -1747855
38625 -1747855 -2406794 -4625330 -5824745 -4224671 -2031136 -1891832 -3074913 -3589161 -3581591
38616 -3581591 -3965041 -3835333 -2187172 -523458 -805076 -2153433 -2492860 -2214120 -3110791
38607 -3110791 -4684369 -4768011 -3192864 -1668763 -540497 1134604 2761341 2893679 2461760
38598 2461760 3676935 5748685 5572173 3030312 1539237 2485885 3281646 2309774 1648491
38589 1648491 2878804 4076530 3448294 2451917 2599002 2474019 960193 291421 2374013
38580 2374013 4726847 3863993 565786 -2020039 -3549347 -5627970 -7449245 -6918763
38572 -6918763 -5267723 -5733420 -7626748 -6449636 -888977 4556175 5596670 3264915
38564 3264915 1060585 99598 -422369 -333861 981980 2316991 1578820 -1101779 -3029151
38555 -3029151 -1985384 1406516 4533333 5334034 3790757 1269632 -1154780 -3280509
38547 -3280509 -4746757 -4454311 -1987696 930188 1758049 128057 -1385053 99263
38539 99263 4681494 9300177 10349833 7087481 2666599 1221520 3691156 7241706
38531 7241706 8764344 7472515 3889946 -1245323 -5692874 -5921510 -1299741 3636387
38523 3636387 4171114 1555099 929439 3910725 7019138 7500775 6723088 6751389 7213886
38514 7213886 7341377 7979580 9305117 9119565 6067678 2693255 2526778 5236842 7189546
38505 7189546 6190800 3471124 1353760 967757 2136634 3686508 3645878 635221 -4375006
38496 -4375006 -8419344 -8982334 -5988748 -1794105 535926 -294296 -2537051 -3361330 -2348818
38487 -2348818 -1680248 -2371826 -2508858 -812315 260952 -2152267 -6259398 -7427732 -4788087
38478 -4788087 -2284915 -2358244 -2328601 806776 5033562 5985212 3293996 931981 1689249
38469 1689249 4283119 6154366 6461915 5481728 3255485 193106 -2374844 -3480075
38461 -3480075 -3497561 -3148268 -2596816 -2186335 -2698510 -3893979 -4137053 -2676493 -938107
38452 -938107 -96277 1134541 4215040 7559177 8253578 6318511 4387211 3409948 1905071
38443 1905071 -135073 -111160 2964263 6193395 6853517 6248206 7043395 8735802 8592191
38434 8592191 5935246 2839648 1149157 991836 1765803 2628610 2405901 725131 -1159680
38425 -1159680 -1983862 -2052899 -1925912 -978839 917196 1976297 1201888 904662 3495368
38416 3495368 7085891 7769585 5320283 2791166 1150691 -1257579 -4052027 -4637077
38408 -4637077 -3581330 -4998075 -9525103 -11859808 -8452794 -3420334 -2786086 -6044087
38400 -6044087 -7792277 -5516967 -1421701 1996125 3960880 3828641 1442357 -1103664
38392 -1103664 -1344721 133468 1152107 2212808 5679031 10706517 12913319 10196449
38384 10196449 5663601 3301188 3304210 3279675 1983335 195061 -683859 323124 2833446
38375 2833446 4359879 2073204 -3567024 -8301894 -8387396 -4424921 -46438 2040428
38367 2040428 1779197 785644 859565 2633788 4667184 4568579 1822242 -1284617 -2271646
38358 -2271646 -1065048 818920 2569603 4263695 5471421 5178189 3131224 382742
38350 382742 -1623751 -2178029 -1735428 -1404118 -1599299 -1315531 367561 2218796 1923968
38341 1923968 -385652 -1651113 -53989 2277017 2475807 1065601 422792 449669 -1071620
38332 -1071620 -4135181 -5744966 -4178116 -1420819 -357475 -1627748 -4146628 -6599414
38324 -6599414 -7383378 -5290484 -1660489 200664 -713463 -1561746 -172700 1337750 180964
38315 180964 -2017812 -1388421 2112026 4667748 4233894 2332700 174428 -2835951 -5786766
38306 -5786766 -5642694 -1952717 1301189 947578 -1298581 -2532872 -3358930 -5531522 -7440851
38297 -7440851 -6090067 -2288506 63604 -672809 -2684431 -4388494 -5825838 -6568957
38289 -6568957 -5760404 -4438397 -4494348 -5098684 -3711659 -1006718 -616352 -2779025 -2751240
38280 -2751240 1834424 5988561 3606493 -3857673 -9102673 -8067989 -3437726 369591
38272 369591 1848643 1538236 -69924 -2053243 -2562080 -758359 1510055 1445534 -1331686
38263 -1331686 -4097481 -4078043 -1642163 403139 689610 1053943 3345374 5876820 5488802
38254 5488802 2721437 1843827 4838218 8217506 7696798 3871801 1037428 1906479 5662843
38245 5662843 9879608 11966218 9754273 3349615 -3783830 -7664058 -7595958 -5664132
38237 -5664132 -3380391 -1072414 216066 -732015 -2643889 -2480387 278699 2417809
38229 2417809 1209304 -2150744 -4700609 -5559543 -5849840 -5975422 -5087643 -3113045 -1632474
38220 -1632474 -2156778 -4290641 -6108736 -6065521 -4255172 -1993909 -538593 -249144 -550854
38211 -550854 -327631 1278835 3787591 5311095 4414743 1928353 -88580 -1032656 -2022222
38202 -2022222 -3497792 -4486336 -4813417 -5853428 -7759221 -8015227 -4777321 -100375 2502465
38193 2502465 2626880 2595771 3233708 2892392 907582 -544677 880967 4677125 8088483
38184 8088483 8946885 7393273 5258952 3918265 2707871 104013 -3381813 -4959553
38176 -4959553 -3175519 -228992 847513 -71838 -1107540 -1640693 -2401411 -3353102 -3948840
38167 -3948840 -4700654 -6014593 -6276300 -3887151 -585346 350222 -1042592 -1521952 351230
38158 351230 2559541 3297789 2999641 2106143 199507 -1657780 -1137799 1321102 1922816
38149 1922816 -1131566 -4556974 -4415796 -1148794 2089465 3871871 4769469 5002600 4467780
38140 4467780 3967352 4154006 4123958 2908621 1412775 1102292 1672831 1753968 1189903
38131 1189903 1025866 1739161 2674858 2719013 874340 -2792039 -6170278 -6578230 -4045149
38122 -4045149 -1456996 -549569 114107 1844714 2947629 1354709 -1802166 -3793541
38114 -3793541 -4064702 -3932016 -3780444 -3255740 -3313910 -5162965 -7438602 -7130615 -3593587
38105 -3593587 498051 2589991 2978707 3724414 6026410 8885570 9734079 6900850 2164737
38096 2164737 -256409 1510277 4469402 4686609 2464340 1314425 2645741 4224685
38088 4224685 3904868 2324094 1214633 973221 857370 394709 -170071 -213273 712403
38079 712403 2175085 2942488 2360105 1200721 500454 282558 259656 842990 2253078
38070 2253078 3437995 3151532 1423075 -1092169 -4146854 -7002405 -7898524 -6365913
38062 -6365913 -4934564 -6156023 -8532586 -7920651 -3036019 2577045 4479247 1768038
38054 1768038 -2578165 -4611491 -2797632 504783 1381597 -1020270 -3340364 -2562087
38046 -2562087 61917 1582228 1914671 2864661 4038768 3455334 1749075 1939267 4665963
38037 4665963 7176356 7778171 7900121 8553732 8035298 5018716 1281156 -838061 -1764197
38028 -1764197 -3315195 -5347673 -5837283 -3703551 -89074 2871600 3725774 2520853
38020 2520853 452118 -1512394 -3380639 -4936584 -4815873 -2517452 -584247 -2162408
38012 -2162408 -6198639 -7703472 -3755530 2846268 7011442 6738112 4080542 2274143
38004 2274143 2901097 4792823 5171543 2916097 585210 1490955 4917435 6636672 4512689
37995 4512689 1007814 -602884 191483 2422205 5610013 8622503 9113509 6547599
37987 6547599 4046267 4782437 7661227 8780112 6459329 2918831 1310653 2463913
37979 2463913 4351031 4082638 979295 -2112929 -1738773 1768166 4541162 4146031 1982580
37970 1982580 11701 -2035487 -4502208 -5645069 -4215339 -2174543 -2062023 -3139898
37962 -3139898 -2883330 -1080875 331692 549865 174529 -1010156 -3475455 -5520743 -4625111
37953 -4625111 -1556633 -138187 -2045369 -4484847 -4314468 -2096609 -210372 1205122
37945 1205122 3836575 7319211 8411181 5003356 -584479 -3824583 -2958781 -220305
37937 -220305 1854541 3284543 4729691 4769175 1694319 -2766787 -4496716 -2138455 1355139
37928 1355139 3001478 3030683 2703722 1583816 -897629 -3108497 -2974174 -1070546 250167
37919 250167 287071 608052 2342723 4346261 4390469 1703828 -1632691 -2130691 1221833
37910 1221833 4811662 3990951 -1048001 -5271732 -5209224 -2693884 -1143751 -1062973 -1163451
37901 -1163451 -1247722 -1406079 -455493 2122069 4316413 4138836 2471247 1068522 -397027
37892 -397027 -2624878 -3948726 -2537168 102453 1093818 516486 552679 1430131 1603799
37883 1603799 1066730 1023972 1090824 416639 769519 4350208 8824671 9003261 4063074
37874 4063074 -1043281 -2431893 -1653716 -1720041 -2382153 -1694098 181107 1092502 -242205
37865 -242205 -2718656 -3589574 -959651 3301525 4363452 433532 -3619667 -2233421
37857 -2233421 2533480 3477446 -1294629 -5995998 -6140280 -3944747 -2512226 -566870
37849 -566870 3082864 4929197 1906334 -2312184 -1830426 2568709 4468096 1059113
37841 1059113 -3565325 -4668626 -2409589 -225100 -570112 -3141999 -5438873 -4849480
37833 -4849480 -1722846 213654 -1618347 -4698084 -4600706 -1336252 828487 -162412 -1492804
37824 -1492804 -319337 1979995 2325468 293791 -2274867 -4313476 -5772494 -5924015
37816 -5924015 -4056027 -1718006 -1872944 -5095295 -8306247 -8226907 -4833625 -469195 3099950
37807 3099950 5255685 5369571 3400494 1374991 1784534 3977508 4440878 1592920 -2036913
37798 -2036913 -3773819 -4436127 -5815280 -6810713 -5205128 -1878813 125622 82828 -82100
37789 -82100 424491 387664 -507448 -1041688 -1038025 -1654175 -2800944 -3126261 -2775180 -3169051
37779 -3169051 -3924642 -3319473 -1927764 -1917204 -2360144 233496 5646288 9091477 8516377
37770 8516377 7800899 9894272 11694072 9660499 6184098 5558846 6947148 6497332 4057258
37761 4057258 2569712 2364412 1166053 -960680 -1372263 539945 2385966 2403896 830371
37752 830371 -1922738 -5306403 -7404746 -6749798 -4798872 -3939321 -4272431 -5165323 -7770883
37743 -7770883 -11994567 -13272919 -7834512 172250 2912424 -157622 -2014688 706469
37735 706469 3212125 1395663 -1588180 -1422187 288838 -148201 -1744574 -1072179 1478229
37726 1478229 2694545 2112241 1913952 2135608 395511 -3412895 -5847393 -4367444 -652044
37717 -652044 1607219 850427 -1154588 -1571612 385893 2532063 2311615 197101 -734931
37708 -734931 1146332 3994385 5144266 4138063 2212890 525630 79052 1668218
37700 1668218 4327205 5279431 3108173 -215566 -2009595 -2261777 -2538129 -2805980 -1742552
37691 -1742552 300438 1037255 -642686 -2902973 -2958570 -173402 3032797 3085216 -1514437
37682 -1514437 -8309437 -12657654 -11866631 -7180718 -1632334 2907815 6031459 7606175
37674 7606175 7656605 6798050 5707127 4523803 3399233 2956253 3459360 4143182 4079569
37665 4079569 3210898 2056012 1024529 347735 -145570 -1429091 -4284308 -7474794 -8301929
37656 -8301929 -5834597 -2415664 -961934 -1662347 -2274570 -997475 1707088 3651503
37648 3651503 2929637 -73515 -2792892 -3379376 -2837991 -2901585 -2865556 -1084139 1158759
37639 1158759 826237 -1756328 -2957935 -1797720 -1400873 -2798215 -2084077 3084014 8462364
37630 8462364 8870939 5398352 2401793 405961 -2663394 -5478868 -4602467 -846081
37622 -846081 1472867 1532133 2729564 5918813 7286855 4284521 -959604 -5535507 -8783074
37613 -8783074 -10138973 -8388875 -4826367 -3051438 -3787881 -3842863 -1834758 -441575 -875360
37604 -875360 -162432 2913605 4130028 382558 -4401063 -4952939 -2650837 -2197289 -3322105
37595 -3322105 -2239822 475298 422674 -2587480 -3757932 -1346092 794690 269650 -321100
37586 -321100 569192 -454750 -5800937 -11660734 -13046225 -10521266 -7503396 -4061490
37578 -4061490 1302081 5844234 4692176 -1310640 -5304184 -3139361 1990808 5155959
37570 5155959 5760237 5619170 4596596 1750334 -1202475 -1288382 1385286 3631329 3538708
37561 3538708 2419208 2071171 2197864 1348437 -1005964 -4102762 -6605028 -7226082 -5656313
37552 -5656313 -3325020 -2215744 -2415942 -1921141 457889 3145125 3839698 2651565 1838555
37543 1838555 2731838 4166363 4065404 1775649 -1188181 -2114877 891593 6918854 12330502
37534 12330502 13849941 11772635 9353089 8956843 9794609 9691419 7945103 5664659
37526 5664659 4018310 3064190 2110902 682643 -788046 -1115887 331448 2360189 2754128
37517 2754128 754341 -2052280 -3807237 -4302797 -3976319 -2268085 1204746 4469801
37509 4469801 4523836 1287677 -1698535 -1460910 1079999 3024409 3176740 2276272 917080
37500 917080 -583357 -954711 897367 3457926 3690891 1208568 -862050 -234009 1525419
37491 1525419 2037646 2131744 4154404 7376047 8222735 5286553 1449925 142812 1506422
37482 1506422 3307768 3946908 3314527 2037184 1224772 1966731 3841750 4804940 3739986
37473 3739986 2240193 2555540 4610380 6554684 7538127 8098106 8126954 6510410 3187981
37464 3187981 -78754 -1722971 -2044287 -2277796 -2945477 -3684768 -3891644 -3030422 -1066624
37455 -1066624 928920 1361626 -127075 -2060272 -2797124 -2332491 -2027339 -2981590 -4966211
37446 -4966211 -6547652 -6190499 -3885035 -1725286 -1932576 -4084544 -5430966 -4433998 -2734760
37437 -2734760 -2718096 -4277201 -5263956 -4362171 -2176711 -12718 1121678 769340 -323981
37428 -323981 -188657 2214044 5059770 5578669 3857750 2820100 4137760 6293019 7497701
37419 7497701 8285197 9590449 10151345 8157945 4461078 1722015 719242 -272038 -2408640
37410 -2408640 -4717896 -5984907 -6252413 -5760074 -4125119 -1537564 593656 1188141 728610
37401 728610 361778 865566 2809537 6043381 8422345 7188508 2877383 -340794 17938
37392 17938 1360746 332359 -1935374 -2511588 -2610842 -5772778 -10559000 -10875991 -5194935
37383 -5194935 -19185 -833541 -4091545 -2910114 2400499 5199549 2641045 -921372
37375 -921372 -1248412 376338 1181370 2036935 5156879 9302167 10932692 9052916 5834775
37366 5834775 2923721 80013 -2344401 -2557886 -349575 1152497 -1123728 -5867380
37358 -5867380 -8458861 -6385283 -1907828 1172822 1867789 1921291 2477871 2750184 2047128
37349 2047128 1298094 1489722 1608913 -422436 -4807951 -8902141 -9635004 -6577241 -2300922
37340 -2300922 188692 135305 -863641 -991982 181952 2114451 4117289 5122690 3859809
37331 3859809 742512 -1279582 202964 3440228 4319352 1965581 -118917 616700
37323 616700 2203214 1784774 171428 -108907 583379 -155962 -2211822 -2899258 -1519192
37314 -1519192 -394709 -508249 455057 3833223 6628699 5311404 1371531 -189254
37306 -189254 2233042 4391418 1837593 -3914237 -6879096 -3746122 2372375 5832376
37298 5832376 4514487 715644 -2743916 -4958715 -5620082 -4048239 -935511 961027
37290 961027 -155349 -2643335 -3835966 -3726973 -3997794 -4368934 -2882785 214891 1902506
37281 1902506 684900 -965661 -63093 2647350 3738317 1650962 -1438936 -2349029
37273 -2349029 -453070 1957418 2571501 1705264 1516898 2878543 4187924 3619253 1267535
37264 1267535 -1636309 -4200648 -5527405 -4551505 -1841530 -45345 -633865 -1718481
37256 -1718481 -1294021 -851432 -2729507 -5430049 -5422100 -2771149 -813911 -575134 -41521
37247 -41521 823454 -528628 -3549377 -3569053 918689 4619963 2687187 -2164581 -3907743
37238 -3907743 -1686851 391025 25970 -1272026 -2150997 -3215081 -4668243 -5434232 -5242921
37229 -5242921 -5268346 -6095227 -6611766 -5342378 -2155129 1122516 1626519 -1687974 -5793671
37220 -5793671 -6342789 -3400918 -1589623 -3187675 -4699090 -2853836 -231340 -820366
37212 -820366 -3065977 -2532273 415829 1280486 -911918 -2353232 -1290815 -636552 -2236772
37203 -2236772 -3420037 -1664134 1126772 1660248 -292501 -2829019 -4822849 -5675796
37195 -5675796 -4407886 -1357327 890726 412639 -1502771 -2385140 -1737279 -498154 1115345
37186 1115345 3160442 4407108 3366539 521061 -2095196 -3308487 -3501709 -3203353
37178 -3203353 -2382321 -1289405 -855519 -1614626 -2646656 -2260580 -32623 2164950 1946069
37169 1946069 -599448 -2615045 -1743605 1246651 3905262 5126362 5531573 5716153 5563352
37160 5563352 4803175 3156920 665733 -1228366 -383846 2858038 5039992 4251905 3397751
37151 3397751 5702274 8730316 7160098 934694 -3953277 -3475990 -184007 1559836
37143 1559836 1171593 573840 352011 -208773 -921536 -631682 1328165 4396186 6695482
37134 6695482 5984967 2307122 -978339 -1128666 -78537 -1365989 -3944660 -3531491 -8581
37125 -8581 1775187 -350082 -2795516 -2706073 -2089068 -2595955 -1624549 2252427 4782738
37116 4782738 2084562 -2482039 -2932119 567995 2927448 2059818 234214 -1006045
37108 -1006045 -2050532 -2384606 -1558244 -2117538 -6459706 -11364157 -11060376 -5793833 -1928996
37099 -1928996 -2866090 -5221406 -5371934 -4455835 -4435877 -3855992 -898487 2600801 3574575
37090 3574575 2076216 486319 44358 497184 1723863 3458638 4397915 3511100 1673221
37081 1673221 699053 1326418 2968072 4622919 5327044 4628823 3271561 2578877 2815704
37072 2815704 3091652 2877919 2209863 400708 -3430521 -7918226 -9503444 -6163957 160913
37063 160913 5783032 8651336 8705300 6403029 2489255 -1477062 -3897370 -4628582 -5087089
37054 -5087089 -6700349 -9355625 -11402489 -11364582 -9578464 -7502688 -5486021 -2672425
37046 -2672425 398140 1193977 -1197150 -3766370 -3287086 -880341 -70330 -1357003 -1978402
37037 -1978402 -578199 1341454 2694376 4071899 5134100 4094589 993966 -1354638
37029 -1354638 -1006620 915392 2699404 4229935 5563530 5822844 4906787 4164036 4200389
37020 4200389 4162220 4099995 5422364 7787441 8387917 6074490 3548495 3427849 4560393
37011 4560393 4479327 3321006 2843539 3282119 3476967 2702385 560083 -3177304 -6824213
37002 -6824213 -7059411 -3191406 951283 1847362 851901 1154359 2411024 1973284 -191703
36993 -191703 -1732114 -2051904 -2250289 -1515893 2130520 7181073 8897861 5562501 1143800
36984 1143800 67264 2011781 3736022 3851730 3561252 3916025 4429936 4163891 2973610
36975 2973610 1679078 1401246 2422335 3585918 3419304 1977883 884752 1298870 2423976
36966 2423976 2361793 216121 -2757656 -4130923 -2737866 -89939 1287230 887788 533607
36957 533607 1532892 3058022 3979483 4658398 5731737 6494125 5896893 4154194 2157913
36948 2157913 285211 -1222547 -1931848 -2248300 -3282140 -4665813 -4381363 -2059674 -294350
36939 -294350 -995994 -2741857 -3693402 -4469418 -5565911 -4847703 -1079087 2731144 3581085
36930 3581085 3463182 5223803 5996286 1215778 -6153645 -7967692 -3129931 74312
36922 74312 -3718291 -9286319 -9365123 -4861807 -1437347 -494876 555346 1931757 1323212
36913 1323212 -1028680 -2134773 -1045624 48099 -390101 -1458917 -1941442 -1613641 -293611
36904 -293611 2331270 5805207 9158363 11524889 11497136 7503914 741346 -3990921 -3121283
36895 -3121283 1048599 3229247 1877093 243266 1215295 4074270 6469279 6962822
36887 6962822 5212576 1889648 -1048358 -1807669 -836991 35313 400077 1374275 3029478
36878 3029478 3853111 3132628 2026289 1788877 2419338 3255278 3412252 1728918 -1834105
36869 -1834105 -4694099 -3750780 481962 3948809 4079500 2764252 3163648 5316906 6520719
36860 6520719 5002047 1710482 -1006095 -1391797 668025 3650559 5536012 5455837 4198025
36851 4198025 3085765 2710901 2707383 2310132 1256916 511611 1546339 4203199 6073870
36842 6073870 5270683 3162843 2739201 4691364 6995315 8116585 8355672 7778463 5308146
36833 5308146 942738 -3100561 -4785724 -4421037 -3470590 -2737365 -2730520 -4072376 -6011392
36824 -6011392 -6007855 -2664847 1841094 4001970 3096357 1601626 1948400 4134254 6143541
36815 6143541 5679212 2081959 -2389886 -3936238 -1135398 3148886 4938690 3307942
36807 3307942 19960 -3610232 -7004864 -8234846 -4990164 1480640 6088999 5305174
36799 5305174 1247110 -1196780 -35453 2751358 4779320 5650100 5770127 4850496 2649594
36790 2649594 154392 -1209508 -1313802 -1340341 -1954031 -2280545 -1230594 683876 1699759
36781 1699759 950560 -472259 -819862 530700 2767916 4411314 4092917 1469589 -1965353
36772 -1965353 -3726449 -2843490 -925730 118108 596449 1948295 3843783 4323705 2873854
36763 2873854 1358641 1193108 1349891 369257 -1067141 -1202785 -51102 572872 -237525
36754 -237525 -1190959 -526380 2002551 5295688 8290333 10569528 11898983 11750458 9635485
36745 9635485 6040419 2747990 1531900 2257195 2899141 1913170 -34063 -1309813 -1547326
36736 -1547326 -1594552 -1810830 -1876768 -2157468 -3505963 -5153108 -4475136 -249075 4821853
36727 4821853 6499218 3783816 -73246 -1534004 -483718 666512 508313 -73379
36719 -73379 87427 627693 649378 558684 1496691 3099683 3428253 1774786 126808 545618
36709 545618 2115154 2259592 608729 -444394 865809 3643841 6067492 7198878
36701 7198878 6419216 3260627 -850776 -2641424 -614986 2823069 4610200 4837948
36693 4837948 5297190 5937264 5562818 4776589 4987527 5261025 3621132 1030874 212508
36684 212508 546266 -1416220 -5573765 -7247580 -4482819 -1670261 -2808535 -5347565
36676 -5347565 -4670330 -1192974 1478450 2570424 3428720 3202516 697741 -1161072 1388562
36667 1388562 6097982 7237667 4696270 4006623 6704741 7754879 4643410 2014369
36659 2014369 3661277 6231731 5573035 3791302 4419557 5261891 2528169 -1325867 -745923
36650 -745923 4056393 7993953 9387714 10697083 11847874 9882425 5566239 3504005
36642 3504005 4475095 4128008 1017849 -616233 1240113 2109180 -1430253 -5556463 -5357053
36633 -5357053 -2525420 -1605444 -2305429 -1380887 457929 -364957 -3530548 -4823690 -2696792
36624 -2696792 -15012 886963 619348 -26524 -1225572 -2014219 -719061 1924492 3423323
36615 3423323 3654365 4850518 7094410 7715932 6062752 4865448 5354066 4937125 1924766
36606 1924766 -1026613 -1027425 425974 189770 -1315705 -1049020 1691750 4344643 4662903
36597 4662903 2838020 348167 -1426945 -1716095 -939141 -438505 -712850 -800864 -244641
36588 -244641 -187438 -1341294 -2595873 -3163452 -4156191 -6043209 -6609139 -4115336 -696639
36579 -696639 540093 318835 1515451 3843433 4426721 3263333 3499501 5644848 6130257
36570 6130257 3280514 496516 986061 2937794 3059779 1972106 2388924 3973442 4023542
36561 4023542 2375408 1756208 3120368 3974547 2307294 -294178 -856361 1076459 3061603
36552 3061603 2799069 767997 -347348 1062802 3174241 2658512 -991232 -4662309
36544 -4662309 -5649181 -4352521 -1843834 2409071 7697201 9540496 4423273 -3832053
36536 -3832053 -7153492 -3181411 2273409 3924362 3483276 4804124 6830113 5769778
36528 5769778 1843016 -905153 -717774 167257 -75653 -601640 -741973 -1634920 -3623756
36519 -3623756 -4864439 -4313290 -3905241 -5776437 -8875922 -10265501 -8747305 -5584295
36511 -5584295 -2574220 -951170 -1249066 -2550584 -2610883 -460612 1761089 1427370 -714285
36502 -714285 -1533870 -151537 980849 58453 -1613503 -2231433 -2136770 -2124116 -1240253
36493 -1240253 1342437 3793130 3777441 2273003 2140926 3086391 1501767 -3684520 -8201357
36484 -8201357 -7587049 -2938491 891123 1286126 -491152 -2493289 -3910145 -4013012 -2385509
36475 -2385509 -812364 -2118412 -5820572 -7375660 -3732199 2172543 4858280 3160651
36467 3160651 991543 1499447 3243239 3128825 1033566 -281559 1050117 4059961
36459 4059961 6760216 8509779 9857773 10706095 9733796 6079402 1055948 -2686160
36451 -2686160 -3913119 -4084059 -5417256 -8142070 -10286627 -9973693 -7355452 -4340239
36443 -4340239 -2792285 -2888096 -3033822 -1734720 373387 1229112 474736 470624 2885123
36434 2885123 5612841 5333864 2446728 651033 1508265 2524864 1685458 676324 1329644
36425 1329644 1566262 -1718112 -7189559 -10228773 -9281882 -7561572 -7836527 -8734712 -7640164
36416 -7640164 -4703911 -2091955 -1046966 -1563773 -3500092 -5928677 -6470719 -3666802
36408 -3666802 328442 1719281 -15729 -1326200 471260 3454751 3977717 1911350
36400 1911350 538127 1396904 1978958 -152972 -3211166 -3674352 -1757690 -1206455 -3562623
36391 -3562623 -5988058 -6006506 -5134928 -5403653 -5107663 -1605223 3409720 5564111 4146553
36382 4146553 2732790 3336728 3991461 3030411 1806310 1455478 471866 -2265418 -4930198
36373 -4930198 -5510709 -4668794 -3779385 -2715560 -1730911 -2636154 -5427670 -6655388 -4313958
36364 -4313958 -1500610 -1551292 -2502511 -986847 1096506 -331270 -3453358 -2298900 3499166
36355 3499166 7405986 5742863 2424246 1605173 1498610 -959630 -4216008 -5134420 -4307440
36346 -4307440 -4185058 -4707063 -4597374 -4424448 -4627020 -3056875 1398132 5075099 4108586
36337 4108586 1065118 1880709 6860253 9952229 7420955 2348514 -906033 -2387511
36329 -2387511 -4276822 -6164014 -5613774 -1978518 2664727 5795715 6358811 4985932
36321 4985932 3219730 2072398 1032420 -816329 -2728722 -2621319 175148 3691844
36313 3691844 5449928 4910252 3317010 2002305 1498488 1696434 2116821 2092106 1099799
36304 1099799 -754327 -2382858 -2218009 124675 2819214 3681545 3159077 3835835 6441502
36295 6441502 8330455 7057735 3485664 -180735 -3325721 -5793764 -5971459 -2967012
36287 -2967012 717314 1786752 411493 -1070833 -2375190 -4459475 -5520457 -2486712
36279 -2486712 3241232 6181654 4123927 927585 332155 1008604 126620 -1795532 -2685779
36270 -2685779 -2802308 -3571542 -4470350 -4092751 -2901691 -2195565 -1570615 -59505 1204745
36261 1204745 146450 -2869728 -5044514 -4393941 -1511258 1383136 1939964 -695571
36253 -695571 -4318410 -5031046 -1881713 1369644 1263942 -243906 1208490 5273057 6635026
36244 6635026 2369198 -3887058 -6747871 -5658909 -4527550 -6015281 -8376699 -8084496
36236 -8084496 -4239459 461847 2917075 2937482 2726713 3576721 4518930 4510816 4265199
36227 4265199 4760727 5248113 4376856 2643250 2105392 3754613 6274902 7378897 5738657
36218 5738657 1949959 -1871458 -3948717 -4563952 -4976991 -4587184 -1228991 4691384 8679062
36209 8679062 6978674 1416795 -2921973 -3696262 -2529980 -1301559 -283051 167685
36201 167685 -992644 -3661542 -6146431 -7124892 -6588341 -4820857 -2146588 288742 1258784
36192 1258784 1086459 971310 944771 336011 -161068 686857 1856734 860615 -2206822
36183 -2206822 -4155712 -3156704 -1172258 -736596 -1625567 -2091019 -1250317 1163623 5153076
36174 5153076 8765302 8337191 2934235 -3101151 -4764429 -2468967 -752664 -1667234
36166 -1667234 -2656485 -1251622 1250899 2211151 1519435 1125593 1947006 3200246 4248418
36157 4248418 5118406 5050673 2585134 -1730938 -4260232 -2006162 2979122 5226327 2540793
36148 2540793 -992423 -189605 4546579 7842022 6113807 1642498 -448040 2114923
36140 2114923 6664504 8576119 6025495 1736523 -494882 -692960 -2304730 -6462121
36132 -6462121 -9427155 -7856136 -4050466 -2578049 -3492529 -3185620 -1053755 -284290 -1592143
36123 -1592143 -1426423 1637730 3457699 447838 -4521150 -6108294 -3823232 -1514286
36115 -1514286 -1250253 -1528608 -769452 780561 2385368 3364729 2581139 -216628 -2877706
36106 -2877706 -2971571 -1057331 433894 1100902 2721538 5578844 7414167 6695822 4666690
36097 4666690 3240585 2648533 2124858 1542846 1378425 1854813 2768347 3733135 4481310
36088 4481310 5235314 6308029 6886862 5352528 1868454 -766405 -640035 264442 -941792
36079 -941792 -3185885 -2806707 640315 3655600 4264684 4297600 4923576 3968006 292901
36070 292901 -2599859 -1039557 3002721 4608481 3116352 2384608 4162018 5554775
36062 5554775 4088450 1464050 329038 328031 -146808 -524235 762253 3045550 4286730
36053 4286730 4488786 5448715 7271977 7913829 6593045 5013622 4264955 2972105 -1070
36044 -1070 -3122111 -4337249 -3964283 -3356492 -2113839 864645 4464494 6293329 6328813
36035 6328813 6877566 8517449 8754705 5844815 1758140 -365965 -413252 -1176818 -4396169
36026 -4396169 -8145676 -8538054 -3973084 2403367 5246136 2678587 -1549028 -2739982
36018 -2739982 -791563 1033144 1592264 2730075 4865652 5680388 4392646 3747802 5732693
36009 5732693 8358501 9115148 8846935 9232464 8792183 5125578 -162568 -2598958 -846044
36000 -846044 1505463 638401 -3248628 -6988047 -8153072 -7157961 -6386554 -7250401 -8088874
35991 -8088874 -6210373 -2237244 -12798 -909787 -1108123 2878358 8537599 10803454
35983 10803454 9255379 7574699 6860610 4431230 -297894 -3543085 -2697414 -501447
35975 -501447 -1026399 -3784296 -4545108 -1028016 4384560 7587358 7172192 5388792 4823777
35966 4823777 4908709 3149413 -273408 -1785125 321023 2788627 2288262 771340 2019359
35957 2019359 4821776 4552971 789406 -1991661 -1795881 -1965714 -5043379 -8408096 -8472702
35948 -8472702 -5641245 -2603561 -529385 896234 2160549 4396095 8638470 13168182
35940 13168182 14384109 11676530 8283379 5994122 2976538 -1101200 -2387488 1134447
35932 1134447 4947311 4015994 687592 1456441 7432419 13117807 14237007 12154212
35924 12154212 10047447 8703629 7524643 7016633 8534276 12376684 16663181 18069361
35916 18069361 14858139 9856421 8449110 12084468 15943309 15284732 11847568 10770802
35908 10770802 12903703 14138930 11824930 7981682 5709805 5628487 6862280 9066279
35900 9066279 12092853 15056804 16930009 17755976 18935473 22054418 26771150 30327516
35892 30327516 30888120 31018287 35000517 42603932 49512405 54879561 63305719 76839235
35884 76839235 90884616 102642629 118013847 143774611 178171315 217693977 268036050
35877 268036050 334889770 403042831 438282295 417870714 352749683 274577332 207396290
35870 207396290 157309800 121798255 97752809 80977196 66602324 53336029 43941176
35863 43941176 40047031 38730129 35205917 27771436 19645085 15844709 17453071 19570878
35855 19570878 17072049 11675630 9559101 11906160 13004318 9506475 5941618 7212916
35847 7212916 10539242 10141114 6369478 4250929 5214388 6303646 6403325 7215242 8213924
35838 8213924 6426285 2119132 -386024 889607 2601618 1227557 -2332159 -4987280
35830 -4987280 -5290510 -3544137 -793297 991594 316434 -1183800 -201176 3209165 5227273
35821 5227273 4197466 3364928 5444061 7859236 6726684 3173580 1887080 4487195
35813 4487195 7794575 8404675 6123665 2736789 -261589 -2210390 -3169209 -3674570 -3783189
35804 -3783189 -2837594 -1225509 -1258512 -4290194 -7667166 -7126185 -2364623 2252872 3232588
35795 3232588 1887306 1530570 2818688 3811145 3366799 2293103 1527000 1083594 926161
35786 926161 1318960 1894325 1600364 207577 -968803 -466985 1720947 4297988 5795976
35777 5795976 5258634 2725426 -127595 -511416 3024804 8532761 11932793 10765789
35769 10765789 6361488 2178936 414084 441898 229132 -1208319 -2972813 -3779682 -3750079
35760 -3750079 -4098452 -5201928 -5950578 -5365381 -3893160 -2394307 -805108 1060254 2173291
35751 2173291 1401268 -264180 -383353 1559795 2996712 1474014 -1961382 -3763829
35743 -3763829 -2000058 1447632 2962378 1065980 -2083001 -3098447 -995057 2064731
35735 2064731 3495763 2762460 838256 -1425317 -3314260 -3833857 -2882858 -2070443 -2656806
35726 -2656806 -3365091 -2220648 5801 634183 -746474 -1591862 -386581 1237450 1299567
35717 1299567 76486 -1293646 -2775549 -4650953 -6462117 -7937372 -9344614 -9920119
35709 -9920119 -7905515 -3514404 -3771 -146382 -3031307 -5659976 -6265632 -5024955
35701 -5024955 -3252066 -2873772 -4638612 -6006534 -3587884 1249444 2870933 -611118
35693 -611118 -4093140 -3416689 -1976275 -4475080 -8141652 -6968369 -2307348 -1412612 -5691392
35684 -5691392 -8232545 -4694630 454083 1655276 161784 120231 1534451 1873080 1446356
35675 1446356 2485583 4707852 5733379 4786885 2938441 792328 -1415129 -2565803
35667 -2565803 -1964240 -850828 -495315 44260 2267397 5590747 8177207 8939118 7102764
35658 7102764 1982939 -4527237 -7646525 -5048784 -638692 400646 -1438632 -1947465
35650 -1947465 -598112 -939793 -3655147 -4378179 -90472 6263796 9721923 8998490 6276757
35641 6276757 3776469 2592925 3009062 3900765 3143058 191181 -2928732 -4348015 -4518184
35632 -4518184 -4387788 -3302909 -700553 1568047 1036965 -1845436 -4094996 -3843784 -1754781
35623 -1754781 1040880 4352286 7737387 9603381 8688579 5797061 3202602 2483525
35615 2483525 3313638 4189378 3987259 2746636 1110946 -598045 -2355921 -3733701 -4037854
35606 -4037854 -3378518 -2816676 -2968487 -3143488 -2449087 -1073217 255398 1394664 2408391
35597 2408391 2640439 1411052 -602325 -1905525 -2051698 -1813361 -1608614 -1173421 -879646
35588 -879646 -1661990 -3065369 -3107158 -1126333 835751 901512 84734 272690 821625
35579 821625 -256634 -2385277 -2693493 -442535 1689142 1578725 107358 -1767053 -5437222
35570 -5437222 -11487030 -16265291 -15255971 -9357483 -4485684 -4398130 -6573625 -6251234 -2410957
35561 -2410957 1804578 3288613 1902352 -401456 -2084125 -3242552 -4669690 -6224860
35553 -6224860 -6845003 -6339361 -6087615 -7033151 -7961724 -7190186 -5175174 -3628008 -2625101
35544 -2625101 -937624 834699 239415 -2987151 -5368295 -3938575 -307349 1520603
35536 1520603 275263 -1730801 -2476387 -2889850 -4981368 -8443259 -10254000 -7995795
35528 -7995795 -3128579 92670 -531646 -2595535 -2681254 -1190403 -1145103 -2876669 -3294126
35519 -3294126 -1045860 996130 109906 -2290638 -3328408 -2983222 -3070687 -3664450 -3405789
35510 -3405789 -2281692 -1432244 -976053 -440787 -535035 -1986562 -3386305 -2943817 -1876350
35501 -1876350 -3041871 -6213571 -7782602 -5778284 -2410116 -572405 -231266 305060
35493 305060 1438431 2285398 2461200 2310125 1856607 699515 -986997 -1896588 -538934
35484 -538934 2701454 4716524 2484525 -2580330 -5068491 -2071143 2633699 3400254
35476 3400254 99927 -2649406 -2579419 -1988732 -2832265 -3871588 -3919526 -4148127 -5323726
35467 -5323726 -5903893 -4907499 -3857891 -3737289 -2746749 344741 3008730 2061758 -1708367
35458 -1708367 -4772346 -5366254 -4248834 -2357478 -439645 108419 -1182168 -2310988
35450 -2310988 -1497190 -396099 -1565112 -3546404 -2220273 2785021 6755917 6067771
35442 6067771 2548358 97287 -347640 -358688 -567877 -231459 628817 906249 221253
35433 221253 -494116 -521196 -447124 -1183487 -2313992 -2182409 -184602 1409902 -554843
35424 -554843 -5482067 -8022491 -3940000 3771786 7515197 4200219 -1164386 -2232134
35416 -2232134 1178126 4660928 5906682 6230006 6412892 5084540 2059737 -43437
35408 -43437 648243 2441382 2927367 2887855 4816282 8545179 11083405 10723442 8942669
35399 8942669 7922192 8290901 9759303 11773391 12699669 10548522 5842203 1916907
35391 1916907 960076 1579976 1821155 2313880 4019261 4970719 2706832 -1225465 -2928424
35382 -2928424 -1932523 -1595721 -3557695 -5597598 -5871256 -5590879 -5966597 -5812570 -4185895
35373 -4185895 -2574377 -2329769 -2400243 -1697257 -1286090 -2006570 -2312399 -925438 631284
35364 631284 730264 585629 1693691 2707649 2191259 2176455 4885235 7686861 6052321
35355 6052321 748121 -2685363 -1717960 333834 -148779 -2780268 -5387377 -6864634
35347 -6864634 -6625809 -4443699 -2029163 -1922756 -3945951 -5533633 -5911290 -6461821 -6591259
35338 -6591259 -3708364 1285711 3159853 -456525 -5125316 -5883509 -3860922 -3231008
35330 -3231008 -4815613 -6572926 -7760677 -8481944 -7122114 -2429616 3165281 6051144
35322 6051144 6091897 5435768 4295382 1791715 -499544 -345757 659824 -929923 -4293330
35313 -4293330 -4948909 -1695501 1824387 3149862 3665026 3968570 1736568 -3341066 -7152477
35304 -7152477 -7028159 -6143036 -8256835 -11338498 -10882099 -7222273 -4654185 -4437884 -3589401
35295 -3589401 -618267 2142934 2955763 3396531 4822791 5437936 3453391 802690 608474
35286 608474 2135805 1488296 -2559280 -6214254 -5331546 -578556 3643562 4342621 2269920
35277 2269920 -271327 -1841382 -1786763 257815 3596965 6400516 7533659 7513676 6761065
35268 6761065 4392102 314994 -3009672 -3351871 -2307825 -3242250 -6060843 -7336236
35260 -7336236 -5938332 -4903994 -6356450 -8021296 -7091279 -4671125 -3496732 -3501108 -2873454
35251 -2873454 -1763104 -1335739 -327783 3485915 8708707 11185826 9892439 8125983
35243 8125983 7748496 6104670 891463 -5103068 -7285228 -5427510 -3410480 -3654721
35235 -3654721 -4685000 -4204294 -2207738 -387629 89176 -533441 -1322862 -1875473 -2721988
35226 -2721988 -4018850 -4049906 -684491 4978253 8451687 7111634 3877093 3176139 4643131
35217 4643131 4174696 648203 -2453053 -2779947 -2316646 -2834095 -2005878 2428230 7337526
35208 7337526 7487156 3032393 -705546 -930227 -432773 -1857807 -3107774 -1002989 3543876
35199 3543876 7098590 8395423 8325106 6834387 3469909 310199 450244 3090651 3701389
35190 3701389 358043 -3254510 -3120548 -421945 933507 294844 394721 2324127 3843584
35181 3843584 3111965 1247264 122802 -207246 -608899 -1113172 -1452429 -2004318 -2782175
35172 -2782175 -2665505 -1253579 -510500 -2583890 -6430449 -8720685 -8201036 -6977201 -6663434
35163 -6663434 -5403650 -727537 5677239 8597561 5329205 -634011 -3348041 -1129477
35155 -1129477 2095539 2234970 13085 -842119 799244 2097690 758976 -1477233
35147 -1477233 -1439381 1007785 3233960 3684900 3100668 2266159 1134477 441985 1502666
35138 1502666 3486131 3530634 1061262 -567562 1049220 3148437 1496026 -3276388
35130 -3276388 -6572140 -6338893 -4912112 -4202434 -2890043 226662 3206968 3310999 404870
35121 404870 -3511595 -6415363 -6678173 -3472429 1569923 4851243 4618642 2801687 1853694
35112 1853694 1827468 2035869 2998489 4465054 4107896 1198568 -757231 1332017 4931606
35103 4931606 5587056 4116891 4883118 7718731 7659635 3452495 128064 733450 1181802
35094 1181802 -2828242 -8309040 -9210070 -5200784 -1369144 -813148 -1983365 -2557425 -1978400
35085 -1978400 -378101 1734986 2825407 2027564 939326 1075067 575719 -3108016 -7967428
35076 -7967428 -8995089 -5271886 -1410742 -833800 -1491939 -210192 2150803 2740830 1577234
35067 1577234 1118254 1997312 2098430 6023 -2638684 -2929148 -8333 3859059 5376894
35058 5376894 3320550 -615079 -4138573 -6668668 -8485931 -8752271 -6444521 -2932726
35050 -2932726 -1240451 -2259200 -3791302 -4008859 -3671248 -3810031 -3382616 -1053238 2149552
35041 2149552 3905390 3575119 2494968 1758728 1072947 -254512 -1986336 -2635901 -541938
35032 -541938 3972481 7664672 7085035 2586680 -1899530 -3521485 -3107306 -2490942 -1619419
35023 -1619419 94897 1617407 1724987 1260948 1746650 2681083 2375462 840007 -238632
35014 -238632 -84949 413046 360770 -237525 -980698 -1182709 51305 2570056 4648974
35005 4648974 5108197 5115918 6199833 7373554 6433548 3588490 1375728 989176 1057998
34996 1057998 466085 144650 1146846 2640001 2930923 1539419 -454281 -1493891 -780114
34987 -780114 899959 1709024 897386 -85467 337006 1523078 2027905 2556656 5000897
34978 5000897 8620345 10036263 7919578 5135183 4631031 5260235 3948033 859058
34970 859058 -250641 2798740 7020582 7282488 2461849 -2883289 -3741707 -528223 1919082
34961 1919082 879133 -1200606 -1110030 329043 245988 -1403708 -2172428 -1539234 -1599584
34952 -1599584 -3102761 -3880075 -2255473 332561 1419987 626128 -466084 -488153 424463
34943 424463 857638 -531539 -3274123 -5148928 -4837991 -3548727 -2674104 -1266004 1951419
34934 1951419 5300367 5772329 3302807 585153 -830402 -1283445 -486991 2243434 5420171
34925 5420171 6544658 5860266 5587461 5747885 4655526 3282073 4562994 8095135 10201505
34916 10201505 9706182 8797580 7895213 5356290 2939706 5075753 11252982 15923023
34908 15923023 17802486 21745633 28938625 33829606 34547549 37078007 43936667 48760779
34900 48760779 49151635 54134323 69624133 88376654 107518920 143113392 205500716
34893 205500716 266413531 277220342 225172415 150485484 99264186 78073833 65815340
34886 65815340 51523664 41138159 37172653 32691532 24853953 19320960 19114332 19648966
34878 19648966 16923906 12591742 9093398 6190235 3793932 3081060 3853905 4884270
34870 4884270 6653413 9615306 10761712 6907230 753107 -1597056 899137 3365181
34862 3365181 2800209 1446879 1439038 1206448 -805160 -2915261 -2993543 -1459399 407975
34853 407975 2543083 4630953 4847522 2248303 -807665 -522680 4136986 9894668 12078613
34844 12078613 9287697 4876368 2824506 2635620 697297 -3312788 -5279856 -3540068
34836 -3540068 -2502506 -5788662 -9536806 -7631385 -1186189 2786146 1002214 -3246840
34828 -3246840 -6385427 -8168806 -8590189 -6436034 -2376046 599899 1148652 659908 -55150
34819 -55150 -1397406 -2089115 -153238 2505262 1416696 -3087533 -4901588 -1024183 3332237
34810 3332237 2061803 -3127743 -5446775 -2174699 2732189 4105285 858176 -3573612
34802 -3573612 -4514736 -674213 3885303 4176834 911495 -304300 2918747 6401027
34794 6401027 6021239 3606673 3155712 4715828 5787734 5994169 6194752 5098976 1181577
34785 1181577 -3345702 -4792156 -3539040 -3256666 -4818403 -5027411 -1940025 2079282
34777 2079282 3763675 2822818 1348839 1191647 2535344 3595340 1823378 -2730140
34769 -2730140 -5659809 -2475425 5143449 10239568 8734311 4099250 2309465 4392472
34761 4392472 6324290 4980809 1475785 -1337798 -2324902 -2120478 -1374996 -536032 -675663
34752 -675663 -2629627 -4957294 -4504549 -246788 4625194 6119620 4206729 2321836
34744 2321836 2667998 4326957 5932738 7441766 8492053 7739820 5404973 4274431
34736 4274431 6213093 9234254 9894640 7383649 3636680 654685 -681840 -416316
34728 -416316 154935 -881777 -3504392 -5161771 -4394765 -3425790 -4933447 -7735910 -8412797
34719 -8412797 -6238155 -3581946 -1896926 -325921 1519737 2172089 560130 -2235701
34711 -2235701 -4248602 -4423713 -2961493 -1062242 -231882 -658474 -712462 626325 1744992
34702 1744992 779898 -834279 27029 3113122 4346092 1300121 -3412198 -5656496
34694 -5656496 -4796955 -3553886 -4026082 -5515182 -6011976 -4753815 -3059698 -2782536 -4035854
34685 -4035854 -4964749 -4117964 -2268197 -1164038 -1424350 -2762728 -5229985 -8557767 -10989438
34676 -10989438 -10657312 -7842753 -4299020 -888583 2263382 3900312 2407258 -1373353
34668 -1373353 -4252745 -4123411 -1721397 1094222 3112578 3824687 3551029 3616053 4688630
34659 4688630 5169401 3313303 706157 957658 4607910 8056346 8341456 6398195 4507922
34650 4507922 3107913 1743925 943669 1019726 453071 -2397382 -6546553 -8889412 -7340363
34641 -7340363 -2782507 1784003 3745610 3029801 1810264 1661944 1744631 806924 -240016
34632 -240016 223194 1443992 1290117 -229215 -1352385 -2107847 -4036977 -6299414 -5923258
34623 -5923258 -2727266 -55200 685416 2073606 5239522 6584006 3100620 -2434178
34615 -2434178 -5259857 -5038812 -4742994 -5224146 -4879672 -3534454 -2908538 -3614379 -4609250
34606 -4609250 -5266185 -5592976 -4976791 -2921424 -399507 1382549 2586560 3481463 3244824
34597 3244824 2021021 2117813 4581598 6750313 6331529 5628957 7729009 10519135 9544086
34588 9544086 5744078 4616290 7251338 7861482 2227080 -6021587 -10370412 -9309039
34580 -9309039 -6338169 -4500367 -3863730 -3235641 -1991459 -449555 484165 395062 211603
34571 211603 930765 1565302 -31736 -4069814 -8075538 -9450728 -7549376 -3722460 -1031866
34562 -1031866 -2958504 -9608024 -15690322 -15546970 -10209873 -6020653 -6065664 -7117505 -6031254
34553 -6031254 -4508977 -5030973 -6075589 -4855897 -1989903 4144 669192 752094 -548751
34544 -548751 -3715026 -5717854 -2804548 3799610 8560718 8293681 5100399 2225261
34536 2225261 88542 -2237079 -4140806 -4290874 -3261520 -3248627 -5013332 -6538645 -5636167
34527 -5636167 -3192026 -2314539 -4008767 -5554724 -4589667 -2984591 -3952006 -6440850 -6154616
34518 -6154616 -2208197 1318796 1615086 814178 1373659 1894653 824520 693345 4183442
34509 4183442 8407782 8053890 3053607 -1637303 -3447574 -4656458 -7096923 -8929393
34501 -8929393 -8128638 -5642876 -3395773 -1822993 -790420 -579154 -699961 84307 1424846
34492 1424846 1198177 -1245350 -3705512 -4148165 -3167420 -2333391 -1964471 -1667842 -1340031
34483 -1340031 -640749 755356 1639293 210520 -2552054 -3114014 -471337 1746158 423115
34474 423115 -2383992 -2792301 -927959 104451 -287782 329781 2712510 4557498 4595108
34465 4595108 4696449 6277355 7219829 4707066 -268177 -3544642 -2636065 747485 3037819
34456 3037819 2231582 -1335857 -6109326 -9955819 -10611467 -7509688 -3460722 -2573487 -5384699
34447 -5384699 -7799050 -6610981 -4276597 -5287694 -9050055 -10501204 -7962545 -5700737
34439 -5700737 -6827041 -8119892 -5450163 -927605 37134 -3086806 -5617363 -4936139
34431 -4936139 -3406840 -3561551 -4629571 -5140766 -5360763 -5368282 -3731269 -226844 2417313
34422 2417313 1683036 -1417181 -3956518 -4607303 -3936662 -2631763 -1242355 -672046 -1262369
34413 -1262369 -2091615 -2410165 -2830832 -3840884 -4249962 -2768555 -366927 686394 -146713
34404 -146713 -1100618 -577424 913107 1451599 -212988 -3227108 -5081879 -3985142 -969427
34395 -969427 1064367 522808 -1544527 -3171701 -3147821 -1067165 2277211 4316222 3013592
34386 3013592 425796 982917 4867097 6505941 2126782 -4491319 -7353883 -6489193
34378 -6489193 -6265788 -7446179 -6466961 -2386988 841471 263836 -2202433 -3336366 -2547049
34369 -2547049 -838438 857078 908549 -2196408 -6687997 -8242144 -5443477 -1483166
34361 -1483166 979591 2997847 5474442 6262543 4260478 2730227 4565396 7126144
34353 7126144 6071946 2057404 -911470 -1981121 -3403254 -5123526 -4672665 -2376383
34345 -2376383 -1579264 -2893049 -2972950 -476950 1231687 -364702 -2572462 -1854597 188700
34336 188700 -1099991 -6504721 -11332039 -10957409 -5949863 -993433 355696 -946343
34328 -946343 -1426905 95230 1154165 -272417 -2263708 -1665078 1129204 3063402 3335492
34319 3335492 3951505 5409480 5655923 4206283 3530112 4722911 5336369 3681716 1934341
34310 1934341 2134808 2136956 -861716 -5023094 -6155314 -3965223 -1910409 -1331573 128979
34301 128979 3767674 7201075 7865906 6308264 4384339 2450259 260156 -955947
34293 -955947 376517 3338376 4654275 2244639 -2160326 -4642359 -3261993 -53232
34285 -53232 1529874 617016 -681568 -688757 -266552 -780496 -1605462 -1184972 453310 1902699
34275 1902699 2469752 2467947 1916113 668700 -329223 362076 2568964 4293880 3855872
34266 3855872 1221607 -2747795 -7081316 -10491301 -11600832 -10040248 -6867565 -3727847
34258 -3727847 -1855655 -1497582 -1685720 -990570 855847 2642192 3549970 4231945 4940186
34249 4940186 3982790 73540 -4621356 -6180168 -3530761 742619 4034939 5807451
34241 5807451 5959611 3906151 341336 -2320530 -2702292 -2093194 -2147745 -2479967 -1852417
34232 -1852417 -457931 420457 213575 -555582 -990427 -146790 2526892 6362086 9806162
34223 9806162 11893958 12413043 10780837 6759778 2651084 2182879 5860598 9755688
34215 9755688 10618556 9734203 9354533 7965431 2963248 -3485804 -5947164 -3296713 -487251
34206 -487251 -1356268 -3427080 -2314175 1546820 3841184 2610073 192533 -979312
34198 -979312 -1604660 -3426889 -5837223 -6382957 -4215006 -1510705 -932953 -2481677 -3773222
34189 -3773222 -3193478 -1617299 -620994 -203450 574434 1467081 1136137 -792903 -3282074
34180 -3282074 -5599556 -7881024 -9522013 -8764098 -5079452 -739643 1415771 1081160
34172 1081160 174759 169303 1092319 2533776 3914287 3919504 1471898 -2384440 -5125918
34163 -5125918 -5818869 -6072370 -7164927 -7777755 -5998850 -2479731 223026 1058628 1420132
34154 1420132 2463218 3150396 1895494 -816159 -2599006 -1787827 852019 3141653
34146 3141653 3810721 3560024 3878686 5100141 6033147 5560623 4055558 2841617 2734270
34137 2734270 3616400 4903944 5664549 4803281 2221334 -526412 -1975733 -2943186 -5408801
34128 -5408801 -9098482 -11036434 -9271957 -5401038 -2280971 -772668 -210764 -643079
34120 -643079 -2403373 -4119427 -3515679 -490051 2379562 2914295 1539527 -110293 -1447612
34111 -1447612 -2847609 -4191747 -4718224 -4293128 -3973823 -4774163 -6104205 -6222928 -4688004
34102 -4688004 -3492911 -4445486 -5923166 -4426037 178409 3424312 1791513 -2600991
34094 -2600991 -4954927 -3713867 -1011875 1277604 2806757 2985009 1387523 -302408
34086 -302408 -46673 963148 -39231 -2231220 -1955822 725668 1165166 -2222559 -4406746
34077 -4406746 -1292966 3396981 3283166 -1816945 -7120392 -10494131 -13276689 -14961503
34069 -14961503 -13174982 -9037439 -6794707 -7053629 -5720437 -1332376 1915498 1206198
34061 1206198 100063 2428700 5330512 3619452 -1497280 -3831227 -1438427 1185945
34053 1185945 729773 -275595 1489104 4443341 4635630 1682896 -906144 -426994 2328825
34044 2328825 4678511 4659814 2318479 -396303 -1392848 -882637 -1075589 -2424082 -1882335
34035 -1882335 2789611 8238427 8435123 2551183 -3467516 -4464955 -2157886 -1476768 -3405888
34026 -3405888 -4765487 -3913421 -3073782 -4582005 -7473251 -8913075 -7583421 -4865529
34018 -4865529 -3427593 -4710214 -7064888 -6925584 -2964014 1820823 3853962 3693850
34010 3693850 4380548 5955922 5320785 1809969 -1071337 -852438 668580 1427459 2714159
34001 2714159 5846416 8378672 7437050 4659522 3842959 5230605 6232062 6645472 8553613
33992 8553613 11248742 10964544 6598431 1696951 -605167 -1112657 -1569752 -1604460 -788565
33983 -788565 -857781 -3359187 -7018978 -9477909 -9920020 -8465762 -5258513 -2031612 -1939550
33974 -1939550 -5078137 -6512444 -2295964 4165746 5776073 1054679 -4416856 -6060795
33966 -6060795 -5468917 -5989841 -7115517 -6315121 -3986351 -2928854 -3705024 -3927006 -2589112
33957 -2589112 -2159729 -4656885 -7510155 -5923682 767047 7403693 8797096 5681028
33949 5681028 3067113 3522168 4701795 3984302 2635772 3159327 4447050 2934554 -1620201
33940 -1620201 -4735030 -2683179 2975349 7760247 9203077 7729396 4518557 1010510
33932 1010510 -550963 1024938 3584078 3748719 1532403 262983 1377140 2219715
33924 2219715 513339 -1718579 -1223205 1302612 2040349 -672205 -4448244 -5996652
33916 -5996652 -4111112 132266 4163605 5288230 3265243 1019987 770950 529887
33908 529887 -2604077 -6731284 -6968655 -3020922 -173338 -1415235 -3292041 -2000652
33900 -2000652 819458 1761619 1225762 1133550 219490 -3546610 -7895439 -8555847 -5503234
33891 -5503234 -2388471 -573492 1754807 5034777 7479409 8767169 10229201 11174022
33883 11174022 9377227 5664114 3600612 3832810 3085633 -116018 -3055984 -3583705
33875 -3583705 -3066014 -2869116 -1951860 -2039 781280 -830366 -3205773 -5096709 -7001413
33866 -7001413 -7808883 -4773279 916906 3631818 1495786 -101625 2791428 5783572
33858 5783572 3328634 -1899983 -3430977 -1221774 -203758 -1023400 60751 3128054
33850 3128054 4156564 2746647 2892335 5001826 4268065 -932759 -5506862 -5276756 -2396583
33841 -2396583 -105797 2352676 5733714 6778482 3095303 -1595750 -2113152 734769
33833 734769 1971397 -106583 -2777475 -3973176 -4166353 -3626124 -1733178 724723 1758401
33824 1758401 1045105 -25634 -1242949 -3668829 -6426465 -6418610 -2660847 1398662 1757476
33815 1757476 -1374997 -4539135 -5756517 -6074201 -6502631 -5914316 -3453265 -1389298 -2989896
33806 -2989896 -7587600 -10307516 -7884685 -2788696 202764 -1165 -478846 1071714
33798 1071714 3974544 6503766 7652131 6891442 4483189 2308219 2293573 3806567 4646049
33789 4646049 4489537 4790709 5316816 4088136 1439595 613903 2752138 4477403 2508165
33780 2508165 -2052144 -6087098 -8351587 -8609267 -5777690 -241111 4056725 3434746
33772 3434746 -656357 -3555082 -3221464 -1469875 -503087 -1077338 -3190626 -5778232 -6578701
33763 -6578701 -4974295 -3742428 -4952252 -5721031 -2205392 3275405 4293748 -251134
33755 -251134 -4144472 -2933815 80646 -186897 -3028102 -4356457 -3568004 -3257561 -3606612
33746 -3606612 -1819128 2656616 6232765 5799848 2681172 455916 424495 824970 -75551
33737 -75551 -1524910 -1361967 935506 3136545 2812474 535645 -645147 1076957 4451993
33728 4451993 7357895 9087407 9620648 8479815 5963203 4120328 4457053 5541476
33720 5541476 4938902 2794863 1164261 289090 -1572255 -4355726 -5335312 -3316709 -904647
33711 -904647 -502078 -320350 2717832 7394498 8867090 4988409 -914558 -4381904 -4575244
33702 -4575244 -3442928 -2204751 -755959 411741 -57143 -2434868 -5023578 -5762934
33694 -5762934 -4126396 -1154931 1859340 4269653 5801260 5919504 4121410 1088030
33686 1088030 -1191903 -1421141 -818949 -1712643 -4263835 -6031268 -5233524 -2963319 -1379550
33677 -1379550 -1200053 -2083051 -3900042 -5945052 -6208817 -3600142 -128347 1274139 568817
33668 568817 44402 388143 -83629 -2202612 -4604826 -6164914 -7298779 -8054636 -7396037
33659 -7396037 -5531497 -4506068 -4877188 -4082420 -222848 4372702 5799785 3525225
33651 3525225 219256 -2417013 -4880959 -7097579 -7221550 -4226608 48788 2701028
33643 2701028 2820547 1820999 1113151 399596 -1352836 -3781387 -5043302 -4300112 -3204484
33634 -3204484 -3739906 -5468811 -6609380 -7008777 -7564331 -7128895 -3391780 2443564 5412115
33625 5412115 3055637 -1082694 -2498856 -1458886 -945039 -1506787 -1671037 -1622436 -2746547
33616 -2746547 -4633450 -5929495 -7068881 -8742757 -8993169 -5985193 -2693935 -3866478
33608 -3866478 -8230763 -8925948 -3022602 4103009 6002372 2692137 -1447925 -3517065
33600 -3517065 -2853643 667826 5315420 6734293 2446090 -3934846 -6303494 -3314267
33592 -3314267 771388 2012729 800952 -99693 886395 3132426 4856428 4756906 3376739
33583 3376739 2551947 2803418 2277548 -422821 -3493790 -4046665 -2346538 -1567220 -3158656
33574 -3158656 -4681964 -3164287 952239 4365636 4528880 1681021 -2205871 -5371638
33566 -5371638 -6921515 -6278864 -2979936 2473891 8043468 11433358 12139553 11457072 10324170
33557 10324170 8295711 5252927 2891571 3088359 5204251 6422834 5061226 2644736
33549 2644736 2122877 4343835 6853487 6446875 2684107 -1718183 -4097219 -4466943 -4180104
33540 -4180104 -3132881 -214869 3702531 5508865 3526356 -118380 -2009363 -1359586
33532 -1359586 -302344 -941540 -3212154 -5482327 -6510005 -6563909 -6580965 -6378440 -4678985
33523 -4678985 -1604160 219649 -1130471 -3550161 -3334006 -438669 1756728 2009868
33515 2009868 2836520 5475073 7080770 5298883 2426144 2007904 3791026 5262348
33507 5262348 6034796 7086462 7307887 4833889 995378 -925749 -530016 -192566 -381409
33498 -381409 794803 2914623 2496000 -1397611 -4577808 -3313243 267564 1191714 -1780356
33489 -1780356 -5407486 -6711478 -5745361 -3883482 -1726530 644066 2679682 3473420
33481 3473420 2584043 573567 -1209195 -1593276 -483846 1355984 3219757 4637017
33473 4637017 4919091 3555365 1297063 -37692 664796 2674783 4216438 3940533 1643029
33464 1643029 -1781872 -4944677 -6988399 -7980725 -7934781 -6041534 -1876001 3038746 6218473
33455 6218473 6807532 6008789 4929487 3424266 1442435 52654 136748 880862 546111
33446 546111 -1520542 -4236701 -6053205 -6565675 -6796834 -7810508 -9168122 -9324567 -7699477
33437 -7699477 -5536517 -4321246 -4342080 -5334066 -7111995 -8522033 -7439125 -3650539 -394665
33428 -394665 -758994 -3532875 -5070625 -4333638 -3191995 -2494238 -1473005 -989900 -3198389
33419 -3198389 -6885138 -7258707 -2638219 2127327 1975148 -1267874 -1687320 2350730 6359165
33410 6359165 5983039 1932450 -1933409 -3194307 -2527324 -1972520 -2431573 -2749202 -1307363
33401 -1307363 1516708 3338567 2617728 494509 -921070 -1071906 -887813 -1142758 -1887315
33392 -1887315 -2864632 -3734246 -4436306 -5537199 -7155154 -7590655 -4977110 -747207 997044
33383 997044 -1204561 -3895957 -3427199 -572183 1682958 2514960 2604927 1307870 -1923511
33374 -1923511 -4698285 -4080492 -1122630 582413 289939 226459 720230 -365507 -2851736
33365 -2851736 -3452025 -1195941 631439 126363 339439 4160119 8900156 9705890 6250681
33356 6250681 2369395 396760 -625112 -1836018 -2887115 -3228904 -2577321 -431934
33348 -431934 2646408 4057149 2123028 -678740 -565658 1844964 2213414 -932552 -4079405
33339 -4079405 -4153273 -2239311 -190006 2643921 6551172 8663228 6653771 2856903
33331 2856903 859388 -57587 -2704653 -5663075 -4491425 733052 4516672 4035785
33323 4035785 3104147 5512632 8898607 8950141 6258428 4601790 4675674 4075649 2253703
33314 2253703 1042781 715923 -284927 -1632818 -1138342 983549 1685180 -108229 -1823747
33305 -1823747 -1608268 -898998 -1041585 -817116 430754 429217 -2278532 -4688561 -2820047
33296 -2820047 2559798 6715793 6629526 3484893 355005 -311138 2234644 6204432 8207452
33287 8207452 6936132 4870306 4359771 3714158 154492 -4735482 -6318458 -3293620
33279 -3293620 943057 3438914 4407396 4268128 2083786 -1428120 -3081157 -1872052
33271 -1872052 -1359353 -4484438 -8550452 -8784881 -5160397 -1973560 -1547606 -2139623 -2026635
33262 -2026635 -1889361 -2213204 -1674897 179865 1359041 628008 22125 1588993 3492228
33253 3492228 2672660 325533 729840 4364706 6369791 3675754 49751 958380 5929876
33244 5929876 9685942 9272707 6033145 1336409 -4940416 -11015456 -12890778 -9683142
33236 -9683142 -5894006 -5712472 -7598621 -7316724 -4321137 -1976402 -2467275 -4356826 -5008028
33227 -5008028 -3508020 -1357595 -1277169 -4396707 -7858087 -7171780 -2344064 898981 -1603215
33218 -1603215 -6490295 -7600994 -4533506 -2196156 -3003390 -4347339 -3964471 -3237044 -3933255
33209 -3933255 -5314786 -5956749 -5586006 -4011279 -971872 2064495 2880433 2191382 3128615
33200 3128615 5846743 6258418 2257332 -2135755 -1807406 2704798 6627799 7361451 6282146
33191 6282146 5220410 4398399 3886482 4486557 6322623 7922259 7505917 4914109 2100376
33182 2100376 1472966 3228009 4750402 3717109 1201581 -35465 269331 60072 -735447
33173 -735447 531604 4537678 7762533 6997416 3669080 1559970 2145909 4067547 5327978
33164 5327978 4216316 78875 -4895227 -6714385 -4414635 -1662856 -1434300 -1761467
33156 -1761467 318211 3266547 3440124 1043727 -808343 -1909377 -4967870 -9712841
33148 -9712841 -11769663 -8784614 -3746306 -276616 2072392 5261346 8065709 7369760
33140 7369760 3395448 472616 1688844 4763544 5048008 1947848 58104 2990113
33132 2990113 8150651 10054991 7631539 4897197 4499464 4521622 2934802 1357269 1939377
33123 1939377 3639263 4452492 4699298 5112262 4218623 1009978 -2084491 -2527595 -1845432
33114 -1845432 -2644629 -3731554 -2754825 -1652318 -3933991 -7664322 -7166289 -1733897 3241861
33105 3241861 4569699 4758912 5619129 4282641 -1241879 -7210551 -8598859 -5319421
33097 -5319421 -855318 2668913 5117454 6296032 6223449 6117770 6987016 8278507 9093106
33088 9093106 9269640 8533291 6537606 4392992 3881164 4642409 4755471 4399950 5588230
33079 5588230 7707765 7373706 4036983 1632537 2790304 5359254 6672994 7107871
33071 7107871 7138798 5410273 2662862 2867596 6706436 8489463 4054206 -2530880 -5231058
33062 -5231058 -4891592 -5806355 -7083195 -4684940 85535 1778467 -166384 -810412 1558243
33053 1558243 2979607 1260698 -596475 -426263 -657667 -3444552 -6781900 -8159297
33045 -8159297 -8124742 -7823673 -6679722 -4768497 -3881304 -3942327 -2009325 2545252 5373746
33036 5373746 2849728 -2411645 -5039271 -3728629 -1379769 -131069 530969 1593172
33028 1593172 3091684 4502064 4912166 3469394 772506 -1280809 -1896222 -2048410 -2016370
33019 -2016370 -655911 1534136 1438995 -2233238 -5954731 -5748350 -2726760 -1077950 -1858437
33010 -1858437 -2315145 -848407 952283 1719488 2636255 4960924 7319130 7286383 4904156
33001 4904156 3110166 4275685 6868579 6568466 1462661 -4645827 -5898326 -1342716
32993 -1342716 3915915 5135366 3067377 1330008 1252598 1814746 2780633 4707010 6656126
32984 6656126 6953128 6121745 6399339 8077241 8716989 6622544 3163210 951431 1240565
32975 1240565 3634822 6807977 8762894 7726139 3868559 -400197 -2429494 -1363498
32967 -1363498 1715870 4949002 6918464 7357296 6860610 5831618 4212473 2445564
32959 2445564 1573491 1589701 927012 -1155028 -2931462 -2699558 -1762203 -2660452 -5178010
32950 -5178010 -6669591 -6015978 -4516097 -2917592 -656490 1483938 1355367 -598644
32942 -598644 -652466 2832412 6304721 6072466 3878342 3829829 5610379 5162857 1616783
32933 1616783 -1089385 -430306 1015996 113243 -2042147 -2705038 -2231509 -2770273 -3860095
32924 -3860095 -3252399 -1608574 -2295975 -5732972 -7673066 -4984051 -118652 2666693
32916 2666693 3102274 3759901 4845847 4015134 1000115 -1378879 -1527652 -1102877 -1477948
32907 -1477948 -1220742 984212 3448035 3960281 3285928 3554620 4518650 4188986 2340798
32898 2340798 543925 -896157 -3113763 -5684618 -6387964 -4811368 -3630173 -4909696
32890 -4909696 -7130924 -7520795 -5835653 -4003701 -2911164 -1459509 1204697 3969423
32882 3969423 4968470 4145961 3907853 6437999 10271261 10964943 6537299 958321 -304015
32873 -304015 2324790 3026205 -775851 -4164485 -1771975 3969053 5695874 950582
32865 950582 -5067526 -6642888 -3525683 1256289 5921720 9969070 12220780 11756017
32857 11756017 9740973 7977380 6258768 3261996 -425034 -2481964 -2195192 -1484281
32849 -1484281 -1984548 -3003500 -3400415 -3799957 -5270013 -6780240 -5906895 -2035136 2597845
32840 2597845 5349981 5595832 4394529 2832292 1470549 802431 1254274 2619310 4008611
32831 4008611 4671965 4804006 5345357 6808457 8376565 8611689 7302287 6085689 6577005
32822 6577005 8155424 8435878 5953190 1625896 -2496532 -5076701 -5879540 -5329811 -4321450
32813 -4321450 -3796794 -3837986 -3621343 -2814932 -2502724 -3976532 -6829358 -8909375 -8302661
32804 -8302661 -5273229 -2349961 -2222470 -4867361 -6916863 -4997709 108443 3904425
32796 3904425 3220651 -582583 -4067865 -5528790 -5045407 -2758873 457889 1855848
32788 1855848 -656982 -5015992 -6748572 -4440294 -851406 1793726 4506453 8085355
32780 8085355 9948760 7268718 1775705 -1570524 -565633 1855701 1591251 -1911175
32772 -1911175 -5478027 -5660730 -1838116 3363340 6253613 5147532 1668391 -1120126
32764 -1120126 -1853158 -1801901 -2720896 -4399843 -4938972 -3350710 -1122181 -479429 -1338487
32755 -1338487 -1095109 2026509 6369617 8594000 7419521 4476005 1909740 573132
32747 573132 374297 780674 754760 -327500 -1404414 -870074 735683 983967 -895803
32738 -895803 -2715059 -2661345 -1963374 -2585159 -3930978 -3891177 -1981966 636110 3228298
32729 3228298 5218218 4671887 3025 -6616893 -10302487 -8889814 -5263250 -3208745
32721 -3208745 -2936058 -2322826 -998193 -799932 -2446936 -3877210 -2732765 572624 3252911
32712 3252911 3282068 1287402 -781691 -2086578 -3321482 -5055686 -6623080 -6933126 -5690769
32703 -5690769 -3413696 -824525 1286251 2103637 1368384 -158476 -1097385 -342175 2052591
32694 2052591 4233465 3351543 -1426985 -6641395 -7252845 -2551149 2452457 2865651 -573739
32685 -573739 -3579433 -4155572 -3693667 -3289050 -2227398 -364322 889197 1002471 1551854
32676 1551854 3640390 5614676 4845110 1039630 -3323447 -5534742 -5016944 -3434747
32668 -3434747 -2805244 -3444210 -3969948 -3385605 -2174375 -640588 2380453 7280326 11076783
32659 11076783 9711804 3250096 -3417581 -5815456 -4162319 -1768928 -853315 -1055138
32651 -1055138 -1067825 -637039 -965861 -3039556 -5433423 -5092399 -1467753 1831613 1828552
32642 1828552 929356 3310858 7670740 8426380 4448874 1207039 2186955 3292637 -603160
32633 -603160 -7563664 -11496868 -10442213 -7457149 -5115878 -3642960 -3408796 -4827860
32625 -4827860 -6013142 -4382566 -693201 1737043 1643824 488231 -1038602 -3503332
32617 -3503332 -5738380 -5264767 -2381919 -272118 -152909 194183 1991640 3210391 2461424
32608 2461424 1748857 2958144 4274030 2683906 -1870372 -7088253 -11288910 -13613077
32600 -13613077 -12982958 -9447815 -5563677 -4073161 -4675580 -4874418 -3522823 -1927806
32592 -1927806 -1806337 -3469978 -5791914 -7115165 -6577440 -4963461 -3547580 -2185340
32584 -2185340 -162554 1098261 -1079471 -6019761 -8953854 -6943415 -2927910 -1317068
32576 -1317068 -2081668 -2523176 -2660932 -4525066 -7273475 -7750889 -5936769 -5327258 -7063966
32567 -7063966 -7952947 -5915258 -3520762 -3832724 -6049631 -7923014 -9554681 -11573464
32559 -11573464 -11959204 -8612905 -3802094 -2061337 -3986185 -5833929 -5507074 -5066887
32551 -5066887 -6108158 -6443842 -4054645 -1548335 -2984702 -7431088 -9570453 -7124127
32543 -7124127 -4200126 -5507485 -9761471 -11500986 -8232042 -2828701 1144705 3594886
32535 3594886 6051640 7793823 6246441 861053 -5308421 -8382695 -7060447 -3085560
32527 -3085560 649593 2032758 714816 -1874606 -3669070 -3784562 -3322116 -4061658 -6314590
32518 -6314590 -8357679 -8164063 -5521445 -2182347 2006 696445 752821 877546 1178044
32509 1178044 1579803 1800253 1062216 -1106916 -3659673 -4783074 -4319945 -4217415 -5738935
32500 -5738935 -7425875 -7137266 -5197503 -3836503 -4002925 -4672509 -5324599 -6902524 -9374635
32491 -9374635 -10252163 -7473668 -2997303 -1374186 -4208637 -7496738 -5785647 1357669
32483 1357669 8301881 9305222 4677281 -49883 -688205 1506531 2826314 2461271
32475 2461271 3028109 6391903 11042853 14058971 14092442 11578513 7235866 1691398 -3820295
32466 -3820295 -7516970 -8056993 -5229731 -63032 5227352 7923425 6644353 2874589
32458 2874589 -127843 -575736 175211 -90452 -1019301 13563 3917133 7894050 8764289
32449 8764289 6986946 5294826 4092952 1128616 -3877063 -7460805 -7081957 -5024046
32441 -5024046 -5037995 -6845365 -7025218 -4394105 -1234670 682489 2112912 3791576 4717680
32432 4717680 4172899 3290219 3327781 3970466 4332470 4186680 3428885 1850153 155986
32423 155986 -362642 186509 298421 -500280 -1285688 -2244196 -4781187 -8066965 -8656646
32414 -8656646 -5586075 -2808470 -3714948 -5936617 -5241672 -2512895 -2447706 -6245500 -10076345
32405 -10076345 -10947547 -9926359 -8671099 -6630912 -3480068 -1365837 -2465715 -5918643
32397 -5918643 -8750185 -8696509 -5369414 -206751 3921817 4638109 2428279 -182898 -2032859
32388 -2032859 -4009764 -6147125 -6683938 -5065032 -3346149 -3070303 -2977266 -1557381 204116
32379 204116 626450 47149 -353135 -784944 -1739618 -2197138 -1231185 67270 651060
32370 651060 1854287 4721554 6489636 3495460 -2974200 -7611076 -8020586 -6934709
32362 -6934709 -6800259 -6131581 -3107561 549310 1980042 1317087 817520 1300888 1741860
32353 1741860 1368663 183205 -1654199 -3140988 -2273742 1245658 4091853 2757991
32345 2757991 -1340583 -2936404 417586 5232618 6783914 4827220 2808301 2753007
32337 2753007 3340428 2968825 2498664 3693474 6054844 6961153 5107837 2399620 1541063
32328 1541063 2709648 3950175 4275994 4498101 4847416 3946133 1297660 -982244 -706021
32319 -706021 1316981 2747115 3330486 4600358 6320605 6101628 3283584 638602 711501
32310 711501 2395976 2949298 1931052 1006488 712944 -228253 -2367919 -4264539 -4356838
32301 -4356838 -2876281 -1364897 -1095512 -2259663 -4031841 -5275297 -5702594 -6111831 -6790100
32292 -6790100 -6355177 -3670814 -539093 -339462 -3490839 -6398866 -6092969 -3962063 -3053739
32283 -3053739 -3266354 -1850803 1892855 5182273 5499820 3609546 1904878 1352832 1155908
32274 1155908 320401 -1408888 -3309329 -3672455 -1073410 3529583 7002042 7238918 5106715
32265 5106715 2352728 -757482 -4016149 -5150047 -2056676 3261726 6010700 4341756
32257 4341756 1141179 -670185 -1768385 -3764377 -5572011 -5039622 -2562721 -356995
32249 -356995 871312 1936891 2676229 2296474 1827881 3121139 5193728 4798274 1553428
32240 1553428 -617517 1153429 4608108 5919075 5131185 5246624 7161103 8404503
32232 8404503 6687244 2542676 -1573695 -3334624 -1994709 868384 2514607 2036245
32224 2036245 1292030 1767777 2206218 1265648 553534 1971243 3578172 1997707 -1798592
32215 -1798592 -3456693 -2015994 -1036882 -2055225 -1886292 1341266 4074827 2559223
32207 2559223 -1529853 -4287347 -5174376 -5445885 -4020244 216118 4115075 3659826 677345
32198 677345 871623 5330858 9201943 9391445 8423565 9093746 10012857 8923726 6660967
32189 6660967 5025139 3574830 1143422 -1732496 -4112442 -6191329 -7577838 -6509449
32181 -6509449 -3105285 -986601 -2865183 -6475286 -7771632 -6415064 -4907268 -3716768
32173 -3716768 -1009094 3099269 5475844 3833998 -620941 -4880760 -6716729 -5472597
32165 -5472597 -2097649 1248440 2903162 3140173 3110258 3054867 2774343 2855854 3713600
32156 3713600 4312203 3763612 3211371 3810781 3793622 504402 -5056840 -8970536 -9829648
32147 -9829648 -10075685 -11182588 -11029093 -7809243 -3546207 -1251128 -729882 152712 1547140
32138 1547140 1766343 655051 118301 1110273 2183586 1669996 -115061 -1609894 -2091200
32129 -2091200 -2259431 -3027045 -4219938 -4590565 -3134427 -449150 1339605 316396 -3282908
32120 -3282908 -6908270 -7998687 -6866404 -6611832 -9031223 -11178478 -8229797 -270964
32112 -270964 6407680 6622454 2684068 752809 2436491 3584822 1001732 -3331845
32104 -3331845 -5489078 -4149413 -899860 1725006 1690267 -899310 -2961297 -1465821
32096 -1465821 2180322 3343630 428647 -2959047 -3156701 -667289 2219498 4707706
32088 4707706 6171945 4743853 357946 -3121166 -2156277 1616102 3766495 2881651
32080 2881651 1059107 -62417 -592621 -599057 -93186 -263753 -1987968 -3662037 -3088089
32071 -3088089 -830789 905591 1845808 3139059 4135112 3077017 663559 -542629
32063 -542629 -281641 -743292 -2254150 -2281643 434582 3787291 5239432 4232961 1151880
32054 1151880 -3209509 -6527853 -6407991 -3918176 -2791894 -4303867 -6050832 -6594368
32046 -6594368 -7521558 -9347141 -9310770 -5813335 -1771567 -653593 -1819959 -2587776 -2384906
32037 -2384906 -1908961 -607526 1676623 2637278 646830 -1716348 -1023172 1377166 1046746
32028 1046746 -2781529 -6031678 -5569516 -2738165 -463066 311256 371562 602549 1489922
32019 1489922 2806641 3422261 2525271 743965 -1055434 -3045221 -4887803 -4478426 -897728
32010 -897728 2668064 2376596 -566116 -1446878 770498 1955424 -633334 -4393086 -5786601
32001 -5786601 -5140870 -4615865 -4303560 -3207324 -2009263 -1956092 -2336290 -1672034 -466461
31992 -466461 -399894 -1464552 -2050914 -1470370 -538696 25167 174542 -106695 -473003 375925
31982 375925 3337380 7072180 8949704 7842442 4901327 1798650 -601190 -2073757
31974 -2073757 -2916667 -4043117 -5988853 -7700164 -7401881 -4875840 -1926754 -351438
31966 -351438 -241505 -441538 135797 1840514 4075697 5383924 4468898 1719195 -628484
31957 -628484 -399717 2335686 5110291 5272564 2664490 124315 794915 4581042 7788364
31948 7788364 6884330 2294677 -2189629 -3524470 -2101736 -319547 573461 1458151 3371920
31939 3371920 5392443 5333754 2726345 206027 842813 4402497 7724240 9001401 9819879
31930 9819879 11812968 13100058 10422557 4202527 -1089789 -2074884 85474 2184213
31922 2184213 2990251 3371773 3935141 4516601 5299596 6445006 6815853 5082385 2408184
31913 2408184 2051460 5349184 9725357 11919415 11691960 10700789 9202642 6445683 3597982
31904 3597982 3092276 4572919 4517356 1226904 -2484879 -3470804 -2620585 -2463622 -2569272
31895 -2569272 -841105 1825933 2094478 -779020 -4146729 -6472852 -8780262 -10733254
31887 -10733254 -9491712 -4656039 -670209 -1169771 -3717602 -3632937 -838826 1075527
31879 1075527 1157993 1978332 4355499 5438328 3124040 -842982 -3543078 -4118177 -3059407
31870 -3059407 -597200 2614547 5007905 5848380 6124993 6532667 6114374 4244186 2384201
31861 2384201 2165960 2991685 3339976 3278694 3548428 3121182 438175 -3033908 -3450765
31852 -3450765 165386 3727710 2855167 -1808306 -5953817 -6991570 -5719698 -3388995
31844 -3388995 -121261 3220807 4404312 2688283 339153 -531971 -901077 -2366451
31836 -2366451 -3416417 -1420721 2361215 3595431 1327117 -34330 3056834 8097305
31828 8097305 10098426 8161430 5612998 4837214 4836364 3609037 704734 -2688173 -4828185
31819 -4828185 -4841609 -3959431 -4402586 -6066698 -5955552 -2556848 1059256 942019 -2440263
31810 -2440263 -5392424 -6185121 -5827434 -4668735 -2081564 622268 840108 -1163375 -2201740
31801 -2201740 -1041564 18547 -589459 -1277447 -595518 215699 -194393 -866636 -605937
31792 -605937 -148222 -465166 -981587 -992824 -772724 -66557 2082100 4846107 5837020
31783 5837020 5106609 5499402 7286377 6533479 1654576 -2552169 -1502963 2024893 2239318
31774 2239318 -872045 -2617387 -1752510 -1567306 -3137846 -3264121 -220023 3113163 3445980
31765 3445980 916755 -2495179 -5341618 -6525631 -5552506 -3769466 -2989672 -2826646 -2032009
31756 -2032009 -1803926 -3985149 -6445496 -5132908 -1175732 -445851 -4341135 -6662268
31748 -6662268 -2878248 2623113 3063645 -953190 -3537908 -2688113 -1525319 -1471919 -67760
31739 -67760 3579940 5959443 3884678 -947249 -4263963 -4243555 -2353328 -319079 1722421
31730 1722421 3903450 4909255 2994044 -1139800 -3959492 -3065433 -598421 -473802
31722 -473802 -2735703 -3784765 -2560022 -2574103 -5887050 -8865238 -7396614 -3472237 -2181427
31713 -2181427 -3808064 -3807426 -385944 2768234 2489716 698397 758198 2400605 3067213
31704 3067213 2361848 2186271 3108420 3184770 814499 -2874389 -5312533 -5435908 -4587127
31695 -4587127 -4607026 -5690038 -6562263 -6378632 -5531211 -4484291 -2886907 -451434 2158071
31686 2158071 4041050 4844242 4123639 1096651 -3652011 -7164360 -6601999 -2497930 1958449
31677 1958449 4639037 5895039 6378550 5465268 2777137 -16543 -309676 2593553 6438406
31668 6438406 8164981 7052008 5325662 5214382 5941042 4913158 1833913 -215907
31660 -215907 1350294 5250673 8057609 8016832 5940791 3675273 3098812 5187721 8313686
31651 8313686 8871416 5650959 2236685 2647430 5812528 7219160 5116835 1827510
31643 1827510 -652401 -2735978 -4637198 -5273064 -4865450 -5521147 -7717049 -8849411 -7005145
31634 -7005145 -4000892 -2863046 -3986162 -5502262 -6155895 -6318131 -7072747 -9216323 -12144059
31625 -12144059 -13318665 -10463461 -4814149 -257372 1476362 2563413 5086082 7829482
31617 7829482 8689021 7829198 6246034 3349330 -1185755 -4622559 -3479932 1518079
31609 1518079 5367599 4140546 -1046962 -5557375 -5661790 -1584013 2996945 4613593
31601 4613593 3401037 1988436 1081854 -1655823 -7249167 -12335892 -12728056 -8577407
31593 -8577407 -3745450 -1189598 -1113227 -2382302 -3176884 -1249185 3565346 7630451 7152965
31584 7152965 3215715 312472 249035 958536 1434085 3514496 7132286 7892770 2737396
31575 2737396 -4529057 -7187750 -3987175 -24765 467238 -1384287 -2675954 -3428753
31567 -3428753 -5288329 -7551737 -7631984 -5118631 -2541103 -1472585 -362772 2390805
31559 2390805 5417545 6606825 6705128 7764089 8871533 6937078 2034577 -1521275
31551 -1521275 -770320 2175137 3763207 3596366 3076361 1989529 -344385 -2064022 -404057
31542 -404057 3985492 7134272 6191100 1706264 -4132935 -9275265 -12014749 -11757527 -9904477
31533 -9904477 -8365440 -7278008 -5652872 -3689063 -2574946 -2517572 -2929814 -3950792 -5649863
31524 -5649863 -6523019 -5370280 -3957766 -4769264 -6578657 -5815596 -2436015 -555523 -2321687
31515 -2321687 -4943619 -5492687 -5226263 -6742283 -9430664 -10371800 -8195891 -4098889 -339196
31506 -339196 994142 -551839 -2336387 -673624 4284189 7917597 6941921 3388648
31498 3388648 828087 -748029 -3441866 -6957655 -8985596 -8974054 -8399504 -7849610 -6597728
31489 -6597728 -4758524 -3401687 -2662964 -1807420 -902688 -550480 -424932 48858 256565
31480 256565 -290138 -86324 2266234 4655372 3296287 -1759472 -5916047 -5641513 -2143299
31471 -2143299 1611399 4845493 8032017 10116625 9432655 6801249 5303365 6410199
31463 6410199 7840803 6288542 1644013 -2651938 -3614065 -1997808 -745401 -1047240
31455 -1047240 -1590972 -1426667 -1351420 -1799307 -1605049 -342515 20405 -2154684 -5175642
31446 -5175642 -5978729 -4151906 -1789358 -130005 1205240 2078925 1615579 327317 95935
31437 95935 1424211 2533347 1717778 -953024 -4504750 -7872457 -9538275 -8317207 -5329644
31428 -5329644 -3622482 -4825246 -7197102 -7690369 -5139907 -1061303 1804718 1505931
31420 1505931 -1565695 -4808885 -5831532 -4776731 -3614638 -3565418 -4210431 -4635810 -4261776
31411 -4261776 -3045531 -1969502 -2389985 -3538111 -2180051 2980270 8086187 8520381
31403 8520381 5455542 4066122 5566291 5708225 2133265 -1547019 -1386222 1087848
31395 1087848 1840959 298372 -912165 -283722 1454976 3214149 4078804 3169034 1048466
31386 1048466 -65 1052835 2264147 1782332 712428 712910 774790 -781546 -2780688
31377 -2780688 -2811518 -1175458 -72667 223898 1177320 2652263 3088195 2701041 3199415
31368 3199415 4233443 3404942 413029 -1723678 -506035 3270196 7214184 9626911
31360 9626911 9592521 7086843 3715485 1362327 -311742 -2853778 -5284346 -4308499 627013
31351 627013 5309365 5774521 3337976 2414861 4575818 6985760 6410585 3066117 94060
31342 94060 -106158 1502525 2087574 1010870 929030 3626814 6435369 5449115 1425978
31333 1425978 -884398 592043 2755066 2418352 489053 -638041 -870468 -1368710 -2071193
31324 -2071193 -2577477 -3541732 -4931343 -4716617 -1674081 2062006 3573218 2788949 1238784
31315 1238784 -1079291 -4609935 -7329500 -6391434 -2393643 989234 1690910 1036901 891307
31306 891307 1550101 2574509 3295738 2369782 -686600 -3311775 -1956862 3005061 6966976
31297 6966976 6633201 3564739 1172433 580880 970281 1827194 2830828 3049526 2320498
31288 2320498 2361652 4507696 7082922 7102589 4382002 1978141 2086787 3017565 1285433
31279 1285433 -3869750 -9049198 -10071060 -6413004 -1761590 -93999 -1873971 -4479505
31271 -4479505 -5432661 -4095759 -851984 3657653 8227055 11317133 12139533 10943502
31263 10943502 8404755 5550703 3701193 3045096 1797963 -1321706 -4192740 -3426409
31255 -3426409 442333 2846191 1220548 -1779507 -2694812 -2017841 -2075587 -2539219 -1293131
31246 -1293131 1433329 2957231 1911861 -207056 -1075677 614916 4687291 9059115
31238 9059115 10743106 9277730 7978545 9351136 10723316 7909484 2269159 -311194
31230 -311194 2142951 4764985 3020153 -1124328 -2816011 -1081713 1162693 1923138
31222 1923138 1783423 1679790 1724871 1991478 2496036 2528536 1392985 -460349 -2074582
31213 -2074582 -3210658 -4060301 -4601910 -5203474 -6826376 -9493490 -11577020 -11743970 -10502870
31204 -10502870 -8767626 -6459941 -4024144 -3487812 -5702809 -7948687 -6990498 -3571355
31196 -3571355 -1033670 -275491 538568 1462930 -50362 -4279111 -7090875 -5032261 -186173
$$ [...]
##END NTUPLES=NMR SPECTRUM
##END=
