##TITLE=31Pdec_PR192_5ACN
 D2O, 24 sc
 22.10.2020
##JCAMPDX= 6.0         $$ Bruker NMR JCAMP-DX V2.0
##DATA TYPE= NMR SPECTRUM
##DATA CLASS= NTUPLES
##ORIGIN= UXNMR, Bruker Analytische Messtechnik GmbH
##OWNER= root
$$ XWIN-NMR		Version 3.5
$$ Thu Oct 22 11:57:48 2020 Russian Standard Time (UT+4h)  she@DPX200
##.OBSERVE FREQUENCY= 81.013821
##.OBSERVE NUCLEUS= ^31P
##.ACQUISITION MODE= SIMULTANEOUS
##.ACQUISITION SCHEME= undefined
##.AVERAGES= 24
##.DIGITISER RES= 17
##SPECTROMETER/DATA SYSTEM= spect
##.PULSE SEQUENCE= zgpg30
##.SOLVENT NAME= CDCl3
##.SHIFT REFERENCE= (INTERNAL, CDCl3, 0, 182.463)
##AUDIT TRAIL= $$ (NUMBER, WHEN, WHO, WHERE, WHAT)
$$ ##TITLE= Audit trail, XWIN-NMR		Version 3.5
$$ ##JCAMPDX= 5.01
$$ ##ORIGIN= Bruker BioSpin GmbH
$$ ##OWNER= she
$$ F:/spectra/data/she/nmr/P31/1/pdata/1/auditp.txt
$$ ##AUDIT TRAIL=  $$ (NUMBER, WHEN, WHO, WHERE, WHAT)
(   1,<2020-10-22 11:55:46.20 +0400>,<she>,<DPX200>,
      <created by zg, POWCHK disabled, PULCHK disabled
       configuration hash MD5:
       00 E9 B6 7A A2 85 ED C7 34 08 36 98 17 FE 4E 26
       data hash MD5: 32K
       3C B6 87 21 0A 06 50 E4 CA 54 EF 48 EE 62 06 00>)
(   2,<2020-10-22 11:55:48.75 +0400>,<she>,<DPX200>,
      <Start of raw data processing
       efp BC_mod = 2 LB = 1 FT_mod = 6 PKNL = 1 PHC0 = -2372.461 PHC1 = 72.20061 SI = 64K 
       data hash MD5: 64K
       8F 6F 44 75 53 78 64 69 42 34 9B 67 BB 32 21 C0>)
(   3,<2020-10-22 11:56:04.78 +0400>,<she>,<DPX200>,
      <pk PHC0 = 30.20758 PHC1 = -123 
       data hash MD5: 64K
       7A 17 97 11 34 44 EF 1C D5 52 57 46 EE 92 EE 55>)
(   4,<2020-10-22 11:56:17.65 +0400>,<she>,<DPX200>,
      <abs ABSG = 5 
       data hash MD5: 64K
       BC F3 D2 AB 99 A7 E5 A4 2F F4 D9 13 23 EA 1C 66>)
$$ ##END=
$$ 
$$ hash MD5
$$ E3 1B 1D 3B E5 E7 63 CA 71 F7 AB C3 BF 99 AF 97
##$RELAX= 
##$RELAX= 
##$RELAX= 
##$RELAX= 
##$RELAX= 
##$RELAX= 
##$RELAX= 
##$RELAX= 
$$ Bruker specific parameters
$$ --------------------------
##$DU= <F:/spectra>
##$EXPNO= 1
##$NAME= <P31>
##$PROCNO= 1
##$TYPE= <nmr>
##$USER= <she>
##$AMP= (0..31)
100 100 100 100 100 100 100 100 100 100 100 100 100 100 100 100 100 100 
100 100 100 100 100 100 100 100 100 100 100 100 100 100 
##$AQSEQ= 0
##$AQ_mod= 1
##$AUNM= <au_zg>
##$AUTOPOS= <>
##$BF1= 81.014009
##$BF2= 200.13
##$BF3= 200.13
##$BF4= 200.13
##$BF5= 200.13
##$BF6= 200.13
##$BF7= 200.13
##$BF8= 200.13
##$BYTORDA= 1
##$CFDGTYP= 0
##$CFRGTYP= 5
##$CHEMSTR= <none>
##$CNST= (0..31)
1 1 145 1 1 1 1 1 1 1 1 1 1 1 1 1 1 1 1 1 1 1 1 1 1 1 1 1 1 1 1 1 
##$CPDPRG= <waltz16>
##$CPDPRG1= <>
##$CPDPRG2= <waltz16>
##$CPDPRG3= <>
##$CPDPRG4= <mlev>
##$CPDPRG5= <mlev>
##$CPDPRG6= <mlev>
##$CPDPRG7= <mlev>
##$CPDPRG8= <mlev>
##$CPDPRGB= <>
##$CPDPRGT= <>
##$D= (0..31)
0 1 0 0 0 0 0 0 0 0 0 0.03 2e-05 3e-06 0 0 0 0 0 0 0 0 0 0 0 0 0 0 0 0 
0 0 
##$DATE= 1603353345
##$DBL= (0..7)
120 120 120 11 120 120 24 19 
##$DBP= (0..7)
150 150 150 150 150 150 150 150 
##$DBP07= 0
##$DBPNAM0= <>
##$DBPNAM1= <>
##$DBPNAM2= <>
$$ [...]
##$SUBNAM3= <"">
##$SUBNAM4= <"">
##$SUBNAM5= <"">
##$SUBNAM6= <"">
##$SUBNAM7= <"">
##$SUBNAM8= <"">
##$SUBNAM9= <"">
##$SW= 369.568048894756
##$SWIBOX= (0..15)
0 1 3 0 0 0 0 0 0 0 0 0 0 0 0 0 
##$SW_h= 29940.119760479
##$TD= 32768
##$TD0= 1
##$TE= 0
##$TE2= 300
##$TE3= 300
##$TEG= 300
##$TL= (0..7)
0 120 53 12 22 120 120 120 
##$TP= (0..7)
150 150 150 150 150 150 150 150 
##$TP07= 0
##$TPNAME0= <>
##$TPNAME1= <>
##$TPNAME2= <>
##$TPNAME3= <>
##$TPNAME4= <>
##$TPNAME5= <>
##$TPNAME6= <>
##$TPNAME7= <>
##$TPOAL= (0..7)
0.5 0.5 0.5 0.5 0.5 0.5 0.5 0.5 
##$TPOFFS= (0..7)
0 0 0 0 0 0 0 0 
##$TUNHIN= 0
##$TUNHOUT= 0
##$TUNXOUT= 0
##$USERA1= <user>
##$USERA2= <user>
##$USERA3= <user>
##$USERA4= <user>
##$USERA5= <user>
##$V9= 5
##$VALIST= <valist>
##$VCLIST= <CCCCCCCCCCCCCCC>
##$VD= 0
##$VDLIST= <DDDDDDDDDDDDDDD>
##$VPLIST= <PPPPPPPPPPPPPPP>
##$VTLIST= <TTTTTTTTTTTTTTT>
##$WBST= 1024
##$WBSW= 4
##$XGAIN= (0..3)
0 0 0 0 
##$XL= 0
##$YL= 0
##$YMAX_a= 6670
##$YMIN_a= -11485
##$ZGOPTNS= <>
##$ZL1= 120
##$ZL2= 120
##$ZL3= 120
##$ZL4= 120
##$ABSF1= 182.463
##$ABSF2= -187.1042
##$ABSG= 5
##$ABSL= 3
##$ALPHA= 0
##$AQORDER= 0
##$ASSFAC= 0
##$ASSFACI= 0
##$ASSFACX= 0
##$ASSWID= 0
##$AUNMP= <proc_1d>
##$AZFE= 0.1
##$AZFW= 0.5
##$BCFW= 0
##$BC_mod= 2
##$BYTORDP= 0
##$COROFFS= 0
##$CY= -3
##$DATMOD= 1
##$DC= 0
##$DFILT= <>
##$DTYPP= 0
##$F1P= 0
##$F2P= 0
##$FCOR= 1
##$FTSIZE= 65536
##$FT_mod= 6
##$GAMMA= 0
##$GB= 0
##$INTBC= 1
##$INTSCL= 5.30512e-09
##$ISEN= 30
##$LB= 1
##$LEV0= 0
##$LPBIN= 0
##$MAXI= 10000
##$MC2= 0
##$MEAN= 0
##$ME_mod= 0
##$MI= 50
##$NCOEF= 0
##$NC_proc= -7
##$NLEV= 6
##$NOISF1= 182.463
##$NOISF2= 159.3651
##$NSP= 0
##$NTH_PI= 0
##$NZP= 0
##$OFFSET= 182.463
##$PC= 4
##$PHC0= -2342.253
##$PHC1= -50.79939
##$PH_mod= 1
##$PKNL= yes
##$PPARMOD= 0
##$PSCAL= 0
##$PSIGN= 0
##$REVERSE= no
##$SF= 81.014009
##$SI= 65536
##$SIGF1= 159.3651
##$SIGF2= -187.1042
##$SINO= 113.3802
##$SIOLD= 16384
##$SREGLST= <1H.CDCl3>
##$SSB= 0
##$STSI= 65536
##$STSR= 0
##$SW_p= 29940.119760479
##$SYMM= 0
##$S_DEV= 0
##$TDeff= 32768
##$TDoff= 0
##$TI= <>
##$TILT= no
##$TM1= 0
##$TM2= 0
##$TOPLEV= 0
##$USERP1= <user>
##$USERP2= <user>
##$USERP3= <user>
##$USERP4= <user>
##$USERP5= <user>
##$WDW= 1
##$XDIM= 65536
##$YMAX_p= 558333805
##$YMIN_p= -62627573
$$ End of Bruker specific parameters
$$ ---------------------------------
##NTUPLES= NMR SPECTRUM
##VAR_NAME=  FREQUENCY,     SPECTRUM/REAL,   SPECTRUM/IMAG
##SYMBOL=    X,             R,               I
##VAR_TYPE=  INDEPENDENT,   DEPENDENT,       DEPENDENT
##VAR_FORM=  AFFN,          ASDF,            ASDF
##VAR_DIM=   65536,         65536,           65536
##UNITS=     HZ,            ARBITRARY UNITS, ARBITRARY UNITS
##FACTOR=    0.456856943014862, 1,           1
##FIRST=     14782.0589164895, 0,            0
##LAST=      -15158.0608439895, 0,           0
##MIN=       -15158.0608439895, -62627573,   0
##MAX=       14782.0589164895, 558333805,    0
$$ Real data points
##PAGE= N=1
##DATA TABLE= (X++(R..R)), XYDATA
$$ [...]
40599 -5389094 -3342944 -230694 1420055 -460583 -4705440 -6635731 -2910977 3633829
40591 3633829 6840279 4848394 1471634 -195218 -1074922 -1745146 55780 4379463
40583 4379463 6131599 1843211 -3979229 -4537591 -444654 1923972 388472 -891591
40575 -891591 712802 2344120 1186521 -1044670 -1463391 -54922 1792411 3465460
40567 3465460 3832355 1050477 -4047824 -7334741 -6527909 -4195265 -3247621 -2472332 275671
40558 275671 3190534 2954376 423344 -502807 800201 711056 -2693613 -6399677 -6735283
40549 -6735283 -4294313 -2598164 -3253187 -4319074 -3215777 -69705 2270486 1500065
40541 1500065 -1190260 -2266966 -284645 1999624 1042232 -2844922 -5798307 -5006455
40533 -5006455 -1583857 1087223 671284 -2450330 -5723475 -6541605 -4597020 -2005134
40525 -2005134 -605008 20461 870590 1184902 -132140 -1469541 300641 5105189 8656044
40516 8656044 7474714 3204039 477948 1719150 5421603 8626430 9628360 8708691
40508 8708691 7418501 7008903 6965310 5627375 2806389 770003 1523407 4017988 5579959
40499 5579959 5495090 5305218 5720179 5461421 3868386 2567045 2956477 3446306 1302078
40490 1302078 -3246163 -6808029 -6947111 -4691330 -2381901 -812627 311695 628158
40482 628158 -246538 -1107702 -357075 1199329 871675 -1899170 -3952342 -2273981 1776598
40473 1776598 3894032 2045590 -1438273 -3171305 -2617259 -1839842 -2199279 -2539764 -922926
40464 -922926 2506548 5151712 4656371 1520072 -1420851 -1866707 89782 2616445 3736795
40455 3736795 2418186 -645778 -2943985 -2110550 1200665 3527306 2804888 1304124
40447 1304124 2689518 6756811 9269962 7364825 3058448 228693 -244943 -377670
40439 -377670 -963070 -177783 2956896 5897279 5381932 1961528 -581863 -251317 1208474
40430 1208474 2066258 3564457 7098794 10659733 11145176 9044599 7511274 7333595 6463604
40421 6463604 4594085 4135239 5631658 6295238 4862609 3760892 3880872 1628257 -4730367
40412 -4730367 -9717766 -7312529 -511011 2163108 -1255458 -4255917 -2489435 507924
40404 507924 580583 -158696 2267535 6780752 9195975 8227933 5465693 1630593 -2997548
40395 -2997548 -6000001 -4859189 -991542 1780146 2396633 2964615 4360976 4986704 4293930
40386 4293930 4195853 5768018 7180081 6442063 4327708 3031114 3165562 3447716 2644373
40377 2644373 896528 -443700 93379 2527312 4816322 4790889 2948923 2149106 3975002
40368 3975002 6577900 7043059 4959885 2448563 1195417 844497 344591 -425504 -982069
40359 -982069 -1245707 -1284473 -628222 922373 1996920 786692 -2018701 -3170611 -1069027
40350 -1069027 1530421 1167373 -1064214 -869431 2783943 5912938 5256519 2564219 1076911
40341 1076911 436491 -1791168 -5099819 -6114921 -3625320 -634217 -554438 -3171070 -5234906
40332 -5234906 -4037244 77059 4091317 5122461 3301829 1453118 1444327 1908601 635846
40323 635846 -1987570 -3693771 -3700118 -3312183 -3421640 -3394954 -2648554 -1691635 -1242859 -1482588
40313 -1482588 -2302216 -3339328 -4002354 -4396060 -5503517 -7152373 -6873801 -2901655 2368563
40304 2368563 4432148 2095615 -1562387 -3717121 -4660045 -5526081 -5659314 -3562401 960469
40295 960469 6328508 9736164 8487105 2864537 -2455559 -2518508 1977352 5508958 4904220
40286 4904220 2571606 1753577 2211054 2471970 2911913 3922071 3853069 1766392 -127454
40277 -127454 178995 931607 -272458 -1959981 -1304029 550348 284671 -1356850 -236171
40268 -236171 3871891 5706565 2146002 -2746042 -3154138 805208 3877093 2585413
40260 2585413 -1312336 -3589854 -1767960 3117017 7546878 8450326 5849675 2311860
40252 2311860 -307674 -2419316 -4663640 -6052281 -5409046 -3436531 -1851210 -1227744
40244 -1227744 -1075722 -1372221 -2431775 -3512937 -3110997 -893770 1753037 3410542 3971175
40235 3971175 3945440 3214009 1172592 -2040243 -4940021 -5603613 -3329732 618414 4129476
40226 4129476 6087738 6779284 6594908 5261352 2930975 1147846 1368048 2579003 1832298
40217 1832298 -2049801 -6179195 -6204547 -1114028 5476958 9003387 8210193 5575160 4358084
40208 4358084 5805394 8601844 10231554 9143716 6233834 3917263 3229970 2534404
40200 2534404 37174 -3284109 -4985928 -4881252 -5062906 -5931280 -5027872 -1356062 1681419
40191 1681419 380429 -3724903 -5620326 -3722674 -1795989 -3288156 -6698045 -8328325
40183 -8328325 -7517719 -6611640 -6572515 -5303410 -1030942 4447132 7409534 6513605 3927340
40174 3927340 1971370 197759 -2977718 -6868309 -8883000 -8246207 -7088632 -7058783 -7026573
40165 -7026573 -5639369 -4198528 -4771281 -6759333 -7806387 -7280417 -6314613 -5006187 -2500072
40156 -2500072 169338 384789 -2199529 -4793419 -5382506 -4946519 -4690108 -3826248 -1896158
40147 -1896158 -800152 -2100299 -4097610 -4142436 -2603346 -2033169 -3237810 -4574598 -4604919
40138 -4604919 -3205286 -508540 2953127 5262577 4561808 1580557 -1254618 -3130603
40130 -3130603 -5030009 -6654268 -5985713 -2726878 487715 1728189 2286082 3758568
40122 3758568 4791669 3305679 542798 -161777 1661600 2774547 923302 -2059000
40114 -2059000 -3088634 -1964730 -952945 -1236249 -1684452 -1163221 -568568 -1828411 -5465037
40105 -5465037 -9769206 -12310868 -12002544 -9742455 -7299849 -5752600 -5002396 -4579690 -4547775
40096 -4547775 -5352625 -6798544 -7454075 -5563105 -999378 3821967 5817120 4545158
40088 4545158 2946884 3791336 5924303 5699920 2267266 -652899 440255 3940339
40080 3940339 5213258 2763436 -221967 -665433 552853 688118 -827592 -2225763
40072 -2225763 -2343612 -1935468 -2128519 -2867749 -3293817 -3078248 -2932095 -3647701 -4699857
40063 -4699857 -4443294 -2335661 -261156 -366093 -2067093 -2940896 -2311603 -1726774 -1823052
40054 -1823052 -1548689 -1209313 -2966486 -6535253 -7718797 -4158018 193397 -1247 -4018654
40045 -4018654 -6533884 -5167575 -2372716 -573339 173824 -181762 -1953434 -3216764
40037 -3216764 -1328112 2323424 3343307 1039536 -470284 701001 1031841 -2021410
40029 -2021410 -5231699 -4818006 -2484684 -2042497 -3111582 -2668075 -596887 742669 949507
40020 949507 1502173 2474564 3050313 4037462 6165937 7260147 5146330 2161761 2350473
40011 2350473 4992488 5634761 3241172 1354156 1769925 2120802 1041451 994677 3763624
40002 3763624 6969409 7517415 5549342 2894098 373625 -1340527 -915875 1336309
39994 1336309 2652229 1521893 194909 1377003 4272538 6045984 5635792 4022652
39986 4022652 1996455 -348672 -2754036 -4929844 -6802250 -7798287 -7111241 -5326911
39978 -5326911 -4061098 -3216921 -782529 3404584 5961929 3854307 -1703771 -6846252
39970 -6846252 -9003538 -7974644 -4977901 -2149042 -1155406 -949692 1045916 4359207
39962 4359207 4942914 1031587 -3728758 -5674638 -6352494 -8667370 -10727632 -8408354
39954 -8408354 -2555225 1328386 353896 -2969016 -5269703 -5863049 -5510528 -5055553 -5647596
39945 -5647596 -7375225 -7746198 -4632823 -425566 352920 -2480162 -4577206 -3586732 -1674713
39936 -1674713 -796158 93452 1568844 1766699 150877 -493684 1588282 4032396 4234679
39927 4234679 3213384 2760777 1803451 -969761 -3454226 -3027726 -1302594 -1986431 -5061716
39918 -5061716 -6952155 -6037335 -4378149 -3825039 -3651509 -2740271 -1604490 -1372404 -2398673
39909 -2398673 -4248648 -5759385 -5345764 -2750156 -85422 458931 -634691 -1450078 -1672120
39900 -1672120 -2131067 -2255279 -905457 716156 314260 -1217902 -329381 3490512 6068744
39891 6068744 4291565 372015 -1826583 -1963403 -1949044 -1804329 -275756 1653384 1537315
39882 1537315 -312985 -605826 2220143 5635407 6500755 4952394 3487917 3603880 4760503
39873 4760503 5740328 5567327 3521661 -302941 -4208960 -5655002 -3524889 484473
39865 484473 3176093 2865341 1073805 798436 2807729 4290714 2201137 -2304952 -4422382
39856 -4422382 -1537392 2881927 3042071 -1984485 -6904388 -6567894 -1829302 2279479
39848 2279479 2848477 1508058 962227 1380393 1101747 -529627 -2343436 -2853234 -1686865
39839 -1686865 267380 1616787 1663268 1196970 1588712 2736150 2731990 311687 -3209943
39830 -3209943 -5595531 -6593039 -7561893 -8424300 -7083820 -2751228 1843244 3278125 1835588
39821 1835588 1311570 4159359 8128986 8651888 4118081 -2078502 -4931470 -2825366
39813 -2825366 1166054 2767601 773772 -2323650 -3445132 -2020847 -65552 203020
39805 203020 -1414624 -2895170 -1891257 1735164 5190805 5267174 2007583 -905895 -362612
39796 -362612 2078829 1735813 -3314479 -9354965 -11081274 -7577771 -2787203 -474557
39788 -474557 -571441 -865913 -357056 518850 1726345 3639863 5451433 5429334 3153847
39779 3153847 117914 -2250286 -3749987 -4206552 -2965168 -714454 -45245 -2271473
39771 -2271473 -4895077 -4583797 -2059996 -1309435 -3723967 -5907338 -4616042 -1451403
39763 -1451403 -390964 -2124678 -3504315 -2254910 289847 1712844 1793118 2108264 3537442
39754 3537442 5355188 6235884 5270749 2496758 -674480 -1972159 -361678 2290492
39746 2290492 2608399 -805553 -5756125 -8553551 -7321715 -3255794 575356 1343806
39738 1343806 -1672104 -6372484 -9305587 -8667911 -5802132 -3332117 -2336543 -2148428 -2351743
39729 -2351743 -3506512 -5738238 -7949624 -9063353 -9125995 -8547937 -7060668 -4216404 -412976
39720 -412976 3279361 6015814 7481972 7728328 7130628 6159445 4924369 3332470 1665221
39711 1665221 254767 -1280023 -3236654 -4276567 -2508214 1325397 3896298 3767333
39703 3767333 3557375 5608290 7678149 6069568 1683478 -790863 482544 2310586
39695 2310586 1587750 -712212 -1918184 -1232911 627717 2998433 4804607 4579295 2620219
39686 2620219 1330467 1874567 2444749 1560479 916284 2573268 5160488 5752753 4356844
39677 4356844 3593757 4573105 5912802 6510403 6453207 5175956 1609846 -3225153 -6314649
39668 -6314649 -6284173 -4877808 -3930734 -2951498 -951200 1211131 2029236 1671265 1392706
39659 1392706 1382441 875897 176872 1003707 4344660 8780807 11475385 10616943 6764277
39650 6764277 2163877 -870857 -1156348 888628 3385704 4198411 2935336 1476367
39642 1476367 1559892 2423524 2424536 2306459 3990981 5954320 3731590 -2977929 -7538076
39633 -7538076 -4439082 2641584 5519793 2536115 -458430 385969 2382424 2486919
39625 2486919 2248041 3598544 4298635 1618240 -2452035 -3773182 -1977997 -49295
39617 -49295 789146 2075624 4412691 6090812 5875763 4826394 4662305 5743358 7079183
39608 7079183 7528369 6926479 6284368 6344276 6146393 4592281 3301688 5142937 9137114
39599 9137114 10252817 6305771 1658804 979401 2507664 1768047 -527124 372718 5183069
39590 5183069 9063338 8541598 5254615 1917975 -1071413 -3670020 -4806443 -4734957 -5432576
39581 -5432576 -6976364 -6676194 -3506643 -298651 351183 -586321 -1202216 -1588035 -2079057
39572 -2079057 -1716839 -962713 -2760686 -7747708 -11291347 -9039335 -3122732 1098037
39564 1098037 2393588 3303923 4101606 2552550 -529260 -1006649 2048238 4326615 2836085
39555 2836085 317573 391100 1882058 1558103 -105460 -159963 1032193 -323335 -5329533
39546 -5329533 -9831903 -9557641 -5301629 -1097914 966091 1858640 2568580 2500821 1018202
39537 1018202 -1365219 -3750713 -5220211 -4236842 100238 5314820 6619420 2750024
39529 2750024 -1458802 -1189194 1496561 814502 -3681759 -6121589 -3147041 1210023
39521 1210023 1827704 -541669 -1992056 -1802983 -1924754 -2388653 -1666323 -452869 -896337
39512 -896337 -2556098 -3000813 -2166631 -2232337 -3151122 -2484170 -367408 -352136 -3594179
39503 -3594179 -6023133 -3857537 898268 3241351 1516687 -1588909 -3055836 -2243096
39495 -2243096 -421825 628583 156172 -379356 1323443 5049404 7677301 7243123 5530078
39486 5530078 5101469 5677353 5454475 4322762 3436871 2939422 2513223 2997609 4892437
39477 4892437 6335951 5440509 3808471 4467402 6631674 6066342 1142301 -4818947 -8174479
39468 -8174479 -8655899 -7040562 -2631855 4150401 9175584 8232215 2532121 -2302514
39460 -2302514 -2670481 -194725 1410289 432136 -2247814 -4625223 -4734326 -1799685 2647442
39451 2647442 5557269 5113757 2317104 -534642 -2298294 -3447865 -4675666 -5653834
39443 -5653834 -5040001 -1656840 3808644 8318620 8790175 5446914 1891282 1037032 1967360
39434 1967360 1990765 764157 398590 1815466 3332282 3451479 2914349 2745868 2124506
39425 2124506 90803 -1953967 -1839354 -136012 486299 -438673 -162148 2895451 6084894
39416 6084894 5887625 2842544 573544 413835 -205978 -3272701 -6560562 -6471609 -3211501
39407 -3211501 -698291 -1410987 -3628055 -4518655 -3792523 -2582509 -487683 3450291 7434336
39398 7434336 7889874 4606033 1946077 3068643 5359359 4307777 259838 -2098888
39390 -2098888 -533756 1949281 1852115 -230073 -1374756 -609029 539608 666301 -103455
39381 -103455 -940995 -1293420 -1075774 -552901 -40584 335247 294748 -766376 -2640633
39372 -2640633 -3399564 -1262615 2479029 4222118 2383341 -692515 -1992070 -1339153
39364 -1339153 -548288 -694639 -1668190 -3106637 -4200704 -3674219 -1559438 -62613 -1090917
39355 -1090917 -3766122 -5894021 -6854444 -7196225 -6405255 -3547496 191018 2097101 1403036
39346 1403036 113403 -125493 -27971 -684366 -1290333 -276956 2128464 3766311 2874479
39337 2874479 -118779 -3170743 -4684276 -4872687 -5105220 -6178322 -7644164 -8578109 -8165919
39328 -8165919 -5703081 -1358722 2877285 4667072 4311610 4428093 5835976 6104320 3761532
39319 3761532 1396010 1928645 3906360 3867713 1892122 907523 1267851 329061 -2383568
39310 -2383568 -3900700 -2865018 -1982455 -3559414 -5844398 -6061874 -4479554 -3097036
39302 -3097036 -2366258 -1558612 -776690 -412881 124406 1243825 1899322 1175490 -24440
39293 -24440 -437554 -356446 -582969 -839972 -834584 -1445726 -3026675 -3956801 -2952530 -1518931
39283 -1518931 -1806526 -3126894 -3124622 -1651734 -784707 -1232229 -1321794 142347 2134169
39274 2134169 3006678 2293154 670496 -605351 -367924 1039600 1456664 -424143 -2737518
39265 -2737518 -2856579 -1557108 -2079423 -4954726 -6727729 -4841579 -1232790 493731
39257 493731 -519118 -2510361 -4037267 -4826732 -4733385 -3810684 -2978402 -3010072 -3117256
39248 -3117256 -1977942 -2341 933946 206635 -540017 243479 1720874 1784599 -70510
39239 -70510 -2148327 -2892188 -2819605 -3566427 -5617192 -7717543 -8287558 -6807895 -4068856
39230 -4068856 -1711228 -1140181 -1917314 -1587747 1466474 5103684 5284747 1426911 -2201869
39221 -2201869 -1800834 1155817 2491732 1196063 -113368 -6734 -285407 -2384763 -4387231
39212 -4387231 -3491430 -122750 2279309 1278335 -1995912 -4371882 -3983079 -1856551
39204 -1856551 -433005 -749001 -1341122 -119092 2980076 5695143 5751610 3072561 -357075
39195 -357075 -2565409 -3412502 -4270452 -5874823 -7061622 -6385996 -4476018 -3297433 -3106675
39186 -3106675 -2073695 396284 2059226 1013277 -1300293 -2223421 -1581978 -993854 -608485
39177 -608485 757712 2730621 3462948 2823612 2919491 4707606 6245703 5358683 2446722
39168 2446722 -408934 -2026398 -2942568 -4311314 -6397533 -7811613 -6678306 -3350326
39160 -3350326 -1000753 -1908755 -3996167 -3275314 715327 4490228 5589870 5130229 4800200
39151 4800200 4184835 2473876 589383 -52899 582455 1737543 2953441 3675481 3323584
39142 3323584 2661157 3432217 5622942 6760187 5097802 1991890 13827 144148 1730038
39133 1730038 3543789 3949708 1948441 -796345 -1025272 1667330 3663918 2312174
39125 2312174 -270282 -720648 429507 267912 -1291549 -1410924 843547 2924362 2787330
39116 2787330 1840746 2483676 4222364 3959007 116015 -4554515 -5324935 -1050446 3690064
39107 3690064 3522670 -1253108 -5290568 -5138227 -2776424 -1645536 -2261809 -3321487 -4346486
39098 -4346486 -5151742 -4999818 -4303099 -4864063 -6443410 -5804545 -1686481 2088533 1649239
39089 1649239 -1309110 -2479629 -1188372 226174 1135413 2303365 2542281 406991
39081 406991 -1983462 -1585752 191675 -183681 -1702496 -345146 3145547 3678632 776508
39072 776508 142622 4009781 6589527 2867418 -3683142 -6637639 -5357237 -3559606
39064 -3559606 -2976643 -3333554 -5525739 -9600527 -11770189 -8656952 -3218053 -1530690
39056 -1530690 -4394874 -6850144 -5876800 -3907603 -3904307 -5083369 -5210412 -4109780 -2949611
39047 -2949611 -1981741 -760985 441197 773009 -13925 -1134802 -1415422 -373195 1216567
39038 1216567 2191276 2441378 2633432 2504264 918856 -1963164 -4295638 -4986928 -4677285
39029 -4677285 -3630880 -1153652 1716018 1964187 -786353 -2371043 185873 3649930
39021 3649930 3071085 -750416 -2750302 -1405931 -269778 -1749680 -3937727 -4511921
39013 -4511921 -3805307 -2653512 -643472 1885585 3049869 2369951 2084884 3914359 6642765
39004 6642765 8343205 8881636 8763365 7607267 5415352 3457679 2213450 249438
38996 249438 -3054932 -5455123 -4685528 -1949496 -213158 -15931 488521 1786791 2007813
38987 2007813 134829 -2091128 -2768721 -2870203 -4914618 -8959373 -11617889 -9820951
38979 -9820951 -4536801 435478 2758914 2988221 2008645 -323801 -2975630 -3008407 428573
38970 428573 3496773 2384888 -815489 -950433 2200647 3568789 1017836 -1207067
38962 -1207067 484034 3094359 1752481 -2949294 -6387284 -6408971 -4341281 -1249556
38954 -1249556 2403108 4329537 2303792 -1441350 -2065435 843484 2198575 -1165501
38946 -1165501 -5871634 -7081185 -4902396 -2762536 -1907019 -1018896 165187 473038 49049
38937 49049 197506 385871 -1425391 -4701982 -5586470 -1881274 3496221 6098551 5360196
38928 5360196 4173544 4243547 4563173 4221983 3979630 4322884 4127578 2460884 178547
38919 178547 -1530547 -2959532 -4861528 -6540643 -6503650 -4611198 -2261498 -572464 570902
38910 570902 1688091 2679415 2630410 460448 -3531173 -6528645 -5150874 249514 4694603
38901 4694603 3941565 -240827 -2424894 -488249 2532900 3537742 3155585 3233221 3187423
38892 3187423 1104548 -2790507 -5809436 -5675109 -2613330 1070951 2737045 1234085
38884 1234085 -2166660 -4748381 -4542788 -1473514 3159325 7324937 8731525 6291202
38876 6291202 1605152 -2147798 -3198933 -2240263 -780450 75524 -489360 -2214009 -2717342
38867 -2717342 348587 5554251 8660633 8202153 7223660 7966995 8013411 4458421 -590825
38858 -590825 -2296777 311689 3368146 3357301 406888 -3347622 -5831783 -5232863 -842822
38849 -842822 5256298 9081110 8378851 4575152 814765 -1023859 -1125459 -422200 852758
38840 852758 3001984 5149541 4844920 1259738 -1834324 491159 7196929 11266674
38832 11266674 8722983 3862261 2428203 3371795 2055611 -1358795 -2752809 -1841616
38824 -1841616 -2623450 -5839626 -7270432 -5126326 -3487056 -5736125 -9188025 -9391918
38816 -9391918 -6295471 -3163655 -2126007 -3272751 -5597641 -6745490 -4557159 -791882
38808 -791882 -191944 -3745004 -6455095 -4551750 -1135692 -928594 -2834317 -2447533 406164
38799 406164 1720873 -239290 -3132906 -4645511 -4362771 -1986308 2421124 6553255
38791 6553255 7752198 6608620 5426868 3796449 -348361 -5590770 -7467338 -4751699
38783 -4751699 -1278758 -449751 -1598725 -2969978 -4573677 -6320198 -6475006 -3953911
38775 -3953911 108438 4248567 7720019 9102597 7203738 4291634 4584244 7972075
38767 7972075 9362357 6397798 3243932 3406575 3504139 -704990 -5773858 -4612425 2499532
38758 2499532 7619296 6124785 1994623 678578 2031656 2930136 2666139 2382037 1927599
38749 1927599 565584 -877073 -1332967 -1772605 -3729230 -6409199 -7467592 -6097545
38741 -6097545 -3434597 -406250 2841166 5558458 6394235 5165596 3227372 1649942
38733 1649942 133681 -1832565 -3691323 -4337981 -3493090 -2202043 -2147390 -4280655 -7569097
38724 -7569097 -9314817 -7690949 -4135013 -2224787 -3692076 -6485882 -7546523 -6574394
38716 -6574394 -5736767 -6139633 -6345138 -4742450 -1822160 819190 2493129 3202749 2483512
38707 2483512 252654 -1667602 -951351 2018380 4177494 3669772 1997258 1332808 1397935
38698 1397935 585870 -1053422 -1844515 -921477 1012972 2983488 4334854 4440106 3328842
38689 3328842 2267657 2244783 2359731 1358460 45743 -83115 -5304 -1906224 -4668259
38680 -4668259 -4256880 113022 3732577 2690115 -529968 -823766 2385542 5357376
38672 5357376 5970059 5583020 5441926 4981778 4084771 3781124 3983672 3350769 2117936
38663 2117936 2229220 3749005 4116721 2352407 1064933 2282002 3888939 2726091
38655 2726091 -786439 -3756617 -4937666 -5040544 -4310109 -2746752 -1812806 -2842210 -4236535
38646 -4236535 -3330171 -873651 -381847 -2627970 -4128883 -2291227 880892 1885655
38638 1885655 70988 -2989685 -6250769 -9014053 -9736669 -7737596 -5201575 -4892854
38630 -4892854 -6180496 -5677712 -1916461 2725906 5169698 4848891 3126154 1126665
38622 1126665 -808198 -2604983 -4441039 -6531439 -8060947 -7036302 -2404634 3817702
38614 3817702 7638366 6811955 3109764 585259 1728523 5423417 8412622 8439030 5987704
38605 5987704 3328427 2165523 2196472 1764743 -191091 -2900398 -4540653 -4098056 -2069097
38596 -2069097 572426 3195968 4881730 4180258 962123 -2084672 -1757034 1601051
38588 1601051 4152091 3378058 1070321 360324 1502093 2469110 2489501 2633163 3373495
38579 3373495 3928758 4124888 4748221 5637621 5498734 4301152 3773916 4389699 3851750
38570 3851750 305484 -4460739 -7035335 -6594891 -5056005 -3770709 -2345709 -483701
38562 -483701 1327214 3147979 5388085 6860818 5431163 1544720 -1262496 -883804
38554 -883804 525878 194460 -990435 -697494 114625 -1478529 -4944170 -6468378 -5130749
38545 -5130749 -4525799 -6363474 -6706500 -2121492 3582457 3529934 -2586793 -7821856 -7139105
38536 -7139105 -3028862 -763153 -1669920 -3241398 -3345627 -1861992 416032 2348985
38528 2348985 2646029 1040785 -1147317 -2425454 -2345778 -879959 1975842 5100521 6309066
38519 6309066 4809199 2358901 817773 -18238 -813835 -661295 1298475 3533939 3833207
38510 3833207 2698864 2691033 4568820 6159787 5218455 1877086 -1719955 -3019876 -847369
38501 -847369 2962588 4466957 1894321 -1810735 -2770877 -1501015 -1682885 -4296906 -6444281
38492 -6444281 -6200891 -4979528 -3996309 -1964399 1672022 4225882 3257209 615202 244577
38483 244577 3141992 6865712 9078809 9222814 7372708 3965685 753387 -91729 1470416
38474 1470416 2832528 1317576 -3183703 -8082790 -10197410 -8425238 -4878223 -2870037
38466 -2870037 -3286120 -3649432 -1346321 3134741 7004038 8334246 7422661 5685438 4232243
38457 4232243 3164695 1671724 -666364 -2515325 -2037158 17310 326310 -2646524
38449 -2646524 -6128566 -6666221 -4611795 -2679435 -1492623 358631 2510197 2561750 107936
38440 107936 -2045126 -1916936 -1142077 -2104202 -4141355 -4527348 -2244244 879615 2378724
38431 2378724 1400081 -858459 -2119516 -873605 1984559 3756818 2804290 327255
38423 327255 -1368096 -1752467 -2157386 -3271893 -3940692 -3021383 -1486042 -1557727 -3863090
38414 -3863090 -6414271 -6801441 -4735676 -1955152 -299162 -554857 -2389019 -4208474
38406 -4208474 -3727864 -351563 3302598 4205383 3142633 3661257 6433921 7859252 5790718
38397 5790718 3308886 3819525 5093217 2343362 -4133450 -8963613 -9317393 -8154531
38389 -8154531 -8808611 -10270470 -9903662 -7795098 -5849135 -4580108 -3265062 -1924552
38381 -1924552 -927493 390150 2647463 4661905 4746570 3355741 2491669 2491105 1356424
38372 1356424 -1975662 -5189369 -4918061 -1218007 1804652 754301 -2534585 -2988734
38364 -2988734 1076907 5527488 5957088 3518103 2496657 3487599 2889885 -616728 -3221987
38355 -3221987 -1521992 2310374 3708260 1938670 -4090 -572203 -1401020 -3785136
38347 -3785136 -6205232 -6380432 -4093528 -944649 1648420 3250713 3845314 3463931 2430214
38338 2430214 1402410 849345 700348 893496 2040221 4651775 7504956 8036500 5290363
38329 5290363 1357777 -1363626 -3093566 -5042721 -6225516 -4772492 -1797152 -537816
38321 -537816 -1386999 -1288753 957728 2349580 389340 -3056717 -4855228 -4747401 -3914918
38312 -3914918 -2104188 827660 2773574 2098291 746393 1332197 2714559 2022012 -224164
38303 -224164 -905679 529639 1654424 1564447 1900611 3172106 3815192 3513613 3957988
38294 3957988 5522702 6524871 6613796 7449880 8955995 8544234 5680763 3611428 4323709
38285 4323709 5151572 3206278 233278 -349684 1011616 1232606 -34561 -126609 1978460
38276 1978460 4312737 5490982 6484836 7963868 8429603 6352906 2554099 -705439
38268 -705439 -1968306 -1239761 509162 1816102 1694143 855334 1157428 3134883 4871562
38259 4871562 4236964 1697768 -187136 27279 1039630 744450 -1085720 -2939022 -3913501
38250 -3913501 -4600776 -5312528 -4827320 -2209337 889594 1590852 -379217 -1978002 -837127
38241 -837127 1499164 1770747 -547921 -2922088 -3663280 -4020809 -5557626 -7228879 -6828568
38232 -6828568 -4518996 -2893614 -3433282 -4748506 -5014608 -4452516 -4168900 -4034496 -3559256
38223 -3559256 -3827583 -6215263 -9496881 -10627487 -8638875 -5548991 -3054988 -755853
38215 -755853 1647077 3061429 3256180 3922735 5804902 7104830 6624631 6043473 6748042
38206 6748042 6904240 4655055 1967475 1762105 3064909 2880796 1283315 291577 -992342
38197 -992342 -4983200 -9793753 -10328888 -5846080 -1145324 977156 3045951 6673514
38189 6673514 8533082 5977835 2101951 1095823 2112179 1974579 1009995 1622523 3211501
38180 3211501 3198897 1955412 2344760 4742214 6246386 4923924 1880994 -884891 -2175660
38171 -2175660 -1319172 1418374 4208518 5323348 5075013 4580832 3620479 1611768 -417134
38162 -417134 -973213 -233593 856931 2211179 3264309 1923749 -2376221 -6372205 -6905989
38153 -6905989 -5436189 -5086334 -5099387 -2752629 637681 1077520 -1066955 -1135570 1940769
38144 1940769 3509350 779240 -2821656 -3631508 -3242716 -4357107 -5252460 -2897286 1194537
38135 1194537 2923449 1881548 1272123 2216625 2308380 267268 -1418999 144524 4326227
38126 4326227 7710511 7806677 5275242 2933834 2827182 4174490 4522902 2890517 700533
38117 700533 -740692 -2078467 -4007621 -4990589 -2945263 1286840 4240128 3929657 2090641
38108 2090641 1639850 3100619 4641657 5031198 5069260 5689463 5898376 3981627 380244
38099 380244 -2270702 -2299142 -637185 1275923 3347526 5325543 5399124 2500753 -1282358
38090 -1282358 -2963109 -2372637 -1260020 215992 3038519 5985844 6230086 3565128
38082 3565128 894884 -16524 -285136 -816166 -636790 653541 1695059 1823990 2068748
38073 2068748 2713006 2684817 2321455 3554277 6109554 6964603 5221146 3961320 5215302
38064 5215302 6754179 6427541 5943809 7085085 7677086 5265561 1883148 951414 1889219
38055 1889219 2056945 1685610 2200713 1859918 -1502062 -4872417 -3140842 2693723 6346807
38046 6346807 5590868 4753781 6633993 7970737 5675460 2369830 1944172 3410256 3182116
38037 3182116 833529 -1281747 -2356926 -3380618 -4019662 -2626302 722656 3754552
38029 3754552 4782159 4099341 2540523 502902 -1062630 -261786 3768631 8796924
38021 8796924 10663700 7351718 1467720 -2444624 -2968224 -2569039 -2961347 -2229032 1573129
38012 1573129 6175348 7555377 5504172 3382955 2789786 2039333 258407 -603809 863174
38003 863174 3017011 3565204 2360014 523397 -1319857 -2825210 -3635856 -4108699 -4722036
37994 -4722036 -4528283 -2331455 551064 1554464 1158035 2397805 5315212 6057429 3314948
37985 3314948 1288453 3205018 5863701 4754356 1413301 739360 3038162 4071937
37977 4071937 2278562 744415 1555012 2803104 2537910 1901328 2479682 3341788 2682182
37968 2682182 609280 -1211719 -1442063 240198 3021374 4970013 4529930 2340354
37960 2340354 186219 -1755214 -4577581 -7515007 -7886371 -5114882 -2194125 -1586949
37952 -1586949 -1973616 -1047276 584016 897092 260896 605453 1592711 1135116 -43149
37943 -43149 1918111 8036187 13186246 11727676 4822741 -1051520 -2256481 -1234088
37935 -1234088 -1245233 -1606797 -283112 1687126 1765299 576479 1342093 4583826 6661190
37926 6661190 4684540 433081 -2099732 -1354079 1016137 2678413 2521727 896884
37918 896884 -856070 -1596983 -1646747 -2172281 -3195248 -3488052 -2692701 -1908196 -1653628
37909 -1653628 -999510 587198 2353152 3907448 5684181 6997290 6182931 3846085
37901 3846085 3061750 4635243 5353215 3361213 1835245 3778324 6366154 5180260
37893 5180260 1724191 1225403 4173906 5907907 4571598 3612242 5227339 6755754
37885 6755754 5607660 3087269 964437 -1445132 -4052536 -3836690 775674 6485272
37877 6485272 9217728 8851697 6959646 3132457 -2517566 -5994045 -3491961 2421945
37869 2421945 5323566 3266843 468389 570682 2255447 2571436 1218148 -307481
37861 -307481 -1667612 -3834773 -7022173 -9584434 -9109293 -4890890 508192 3226341
37853 3226341 2298315 452234 -154488 -727023 -2519687 -3430566 -1336294 1103362 -627586
37844 -627586 -5890510 -9355569 -8634256 -6907508 -7047058 -7715166 -7195871 -6854962 -7986544
37835 -7986544 -8627809 -6637747 -3280932 -778736 1141101 3090587 3074765 -298738 -3693561
37826 -3693561 -2750427 1120453 2406928 -264423 -2420616 -1016717 1355936 1385793 -39513
37817 -39513 -519908 -333395 -739331 -741315 875887 2091680 -334 -4326791 -6964539
37808 -6964539 -6815102 -6550513 -7567316 -7609686 -4779876 -937570 899063 445162 -586635
37799 -586635 -1466969 -2525821 -3426215 -3638124 -3972223 -5382495 -6466221 -4453612 855811
37790 855811 6033208 7725723 6090830 3797784 2842836 3277093 4091188 4252435 3392385
37781 3392385 2290765 2199429 3090817 3397633 2400366 1929136 4122605 7932096 9756130
37772 9756130 7860037 4397267 2196984 1140056 -813435 -4125473 -7148905 -8685361
37764 -8685361 -9009676 -8082551 -4884838 255583 4335956 4609545 2100326 219843 110334
37755 110334 -433667 -2863133 -5003053 -4123634 -1510455 -1338174 -4786584 -7636150 -5275042
37746 -5275042 1171369 5851107 5248956 1992223 455708 649028 -731949 -3973078
37738 -3973078 -4990536 -1727843 1681900 378508 -4055581 -6151349 -4932773 -4586725
37730 -4586725 -6695631 -7590993 -5389416 -3968651 -6171291 -8067234 -5317767 -1267234
37722 -1267234 -1956433 -5599878 -4935640 429594 2466504 -2588889 -7989054 -6991178 -2802250
37713 -2802250 -2247555 -4689000 -4265638 -177975 2550014 1667196 364673 787505 791056
37704 791056 -994019 -1654920 1644319 6883097 9481510 7687801 3783258 1084983
37696 1084983 988113 2055950 1428824 -1891783 -5136926 -4626497 -524950 3103768 3205515
37687 3205515 751672 -1529182 -2400252 -2406236 -2718924 -4449299 -7557750 -9876334 -8784245
37678 -8784245 -4401194 318619 2902129 3180442 1924438 -109804 -1567509 -1343012
37670 -1343012 -483484 -840136 -1551045 137547 3906130 5677530 3288960 -500431 -2463548
37661 -2463548 -3023151 -3711456 -3884210 -2782970 -1819480 -1716906 -334443 3231945 5392674
37652 5392674 3038205 -895318 -1504674 699210 1666196 1193921 2499834 5329672 5771807
37643 5771807 3092175 660912 -586863 -3294617 -6908654 -6439573 -788358 3925532
37635 3925532 3258505 1151652 3042137 7056694 7657526 4465540 1489500 -15291
37627 -15291 -1953497 -4055732 -3868921 -1634720 -109595 358162 1872806 4161704 4510115
37618 4510115 2965962 2835003 4933376 5942591 4203974 2914035 5108964 8907688
37610 8907688 10525873 9498094 8247629 8303168 9265768 10152470 9915196 7872769 5062210
37601 5062210 3784684 4586561 5294134 4249572 2632065 2107681 2128181 1378561 149059
37592 149059 -694704 -1477474 -2357019 -1740993 1562578 5763382 7968900 7671994 6225142
37583 6225142 4135276 1561860 343934 2108272 4672959 3919525 -206334 -2986406
37575 -2986406 -1546438 897432 -357711 -4780386 -7157232 -4019724 2662854 7986697
37567 7986697 8665593 5121442 479683 -2082383 -1781013 -454562 -182815 -923522 -1046007
37558 -1046007 83541 1086022 517500 -997523 -1475980 -135876 1775319 2871549
37550 2871549 3250117 3565847 3569023 2865923 2389869 3298038 4589640 3925950 1288276
37541 1288276 -347903 829087 2520860 1279123 -2880659 -6709797 -7787410 -6603802
37533 -6603802 -5065863 -4450292 -4568469 -3896766 -1080778 2894826 5217657 4958897 4506678
37524 4506678 5611512 6157094 3664090 120496 -516437 1408149 1827869 -377543 -1948680
37515 -1948680 -1187849 -504492 -1256726 -780246 2476927 4991330 3261528 -304523 -1031134
37506 -1031134 770214 1003890 -1031671 -1750099 394270 2412302 1778167 -40544 -907689
37497 -907689 -1692949 -4139180 -7057986 -7237800 -3496103 1902162 5689892 6525993 5680329
37488 5680329 5278385 5717463 5033256 1492694 -3614770 -6991230 -6856192 -3988256 361211
37479 361211 5270107 8564012 7352499 1969067 -2719778 -2379014 1582134 4204962
37471 4204962 3465608 1759479 1186103 695034 -918194 -2093393 -905471 1480963 2502034
37462 2502034 2339343 3374892 5684618 6293212 3808898 818446 -80561 -31236 -1227107
37453 -1227107 -2627047 -1676678 873146 1496732 -965300 -4091527 -5985100 -7097170
37445 -7097170 -7300122 -4897160 -138609 3655914 4532851 4341858 4468923 2564584 -3069785
37436 -3069785 -8734687 -9341584 -5513551 -2367966 -2235767 -2939624 -2775463 -2574197 -2488797
37427 -2488797 -1278908 77358 -1690369 -6735430 -10294715 -8711663 -4341218 -1904878
37419 -1904878 -2338799 -2948779 -1889119 214714 2010943 2512792 1248150 -860216 -1644091
37410 -1644091 -410612 460468 -1514563 -5149217 -6756270 -4761227 -1416884 70807
37402 70807 -1185776 -3390839 -4015244 -2124573 658732 1758779 516410 -1170784 -1323837
37393 -1323837 34755 1662167 2592770 2142475 -74921 -3046880 -4670887 -4363514 -3912751
37384 -3912751 -4383814 -3925050 -711819 3417073 4971369 3725795 2797594 3833263 4837667
37375 4837667 3533423 681706 -1173453 -906927 383120 1029554 463133 -417026 -268719
37366 -268719 965507 1552579 -130889 -3405677 -5834348 -5832392 -3979458 -2048042 -1681117
37357 -1681117 -3639286 -7009511 -9184183 -7998456 -4218628 -845476 285572 105036
37349 105036 278225 954468 1351832 1492563 2073156 2933557 2801234 830179 -2258312
37340 -2258312 -4979242 -6656617 -7657079 -8235812 -8045705 -7207134 -6927037 -7935406 -8804211
37331 -8804211 -7279097 -3353626 277489 1035681 -1410160 -5699734 -9779602 -11266011
37323 -11266011 -9009276 -5032443 -2813438 -2745245 -1644217 2045732 5400950 5470737 3840183
37314 3840183 3753174 4902643 4677147 3041680 2278180 2758213 2888558 2726016 3535294
37305 3535294 3912062 892340 -4358465 -6502721 -3288524 1234147 2832653 2546134
37297 2546134 3246422 4192967 2663277 -1213061 -4853876 -7134795 -8744628 -9577351 -8708695
37288 -8708695 -6504057 -4329089 -2602912 -1208976 -1072651 -2922298 -4978163 -4423316
37280 -4423316 -1196303 1889526 2883842 2382031 1260856 -838609 -3674704 -4924902
37272 -4924902 -2375362 2818697 6327746 4568443 -1684457 -7818696 -9751334 -7576227
37264 -7576227 -4379975 -2089246 -224822 1197272 212073 -3888363 -7860285 -7625524
37256 -7625524 -3319818 1003412 2184051 338921 -2999161 -6491563 -8555658 -7810883
37248 -7810883 -4860764 -1966153 -337981 724893 1692806 1774672 828427 407521 1591609
37239 1591609 3143561 3196660 1830285 747335 1090905 2565303 4012388 3935957 1241493
37230 1241493 -3405696 -7463342 -8812166 -7850246 -6446413 -5314869 -3590549 -821722
37222 -821722 1907777 3293418 3473460 3737775 4748218 5521845 4493003 1542579 -1560891
37213 -1560891 -3199432 -3825808 -4836904 -5922486 -5258061 -2683952 -650704 -639381 -417749
37204 -417749 2892895 8095290 11049013 10348470 8891339 9019966 9062654 6646170 3156731
37195 3156731 2096435 4067573 6168512 6138087 4629043 3199317 2370914 2238849 2877740
37186 2877740 3300401 1958293 -695948 -2030491 -867766 611727 243053 -756775 -152669
37177 -152669 1040523 -328393 -4587605 -8288018 -8514605 -5704628 -1686841 2564684
37169 2564684 6046447 6745965 3513807 -1855321 -5768087 -5880694 -2657575 1366770
37161 1366770 3468860 2680964 361266 -1591267 -2889547 -4311549 -5451236 -4776373
37153 -4776373 -2158666 421597 1337085 976403 331430 -492891 -1486497 -1848375 -875695
37144 -875695 1248668 4032937 6765124 7769298 5490137 1122221 -1714637 -1020583
37136 -1020583 1470028 3103269 3349067 2959168 2120204 889806 -253559 -1513290 -3563919
37127 -3563919 -5305739 -4403330 -1350166 130581 -1351924 -2432387 -867309 24614
37119 24614 -3099605 -7074573 -6578138 -2607364 -578092 -1293919 -336264 3520303 5822003
37110 5822003 3797537 416259 -1121801 -1912773 -3703496 -5061548 -4156615 -1924230
37102 -1924230 129100 2081319 3370136 2050991 -1120341 -1587769 2749587 7461401
37094 7461401 7349482 3414027 301405 -542998 -919336 -1156929 -18346 1666623 1520239
37085 1520239 -555655 -2539284 -3739760 -4696504 -4286038 -769438 4235050 6466381
37077 6466381 4315117 456467 -2180688 -3124692 -2659145 -692122 1521266 1388620 -1570221
37068 -1570221 -4255822 -3591676 -268122 2395955 2359213 626495 -251208 1155771 3601460
37059 3601460 4251135 1772371 -2092131 -4649341 -5067310 -4127075 -2492304 -889743 -805143
37050 -805143 -2852809 -5334883 -6580478 -7620072 -9900697 -11564255 -9637494 -5432825
37042 -5432825 -3557964 -4974321 -5272036 -1472714 3274094 4302346 1796148 -364558
37034 -364558 -159029 1051764 1493148 987093 283871 -40230 -101654 -642776 -1794190
37025 -1794190 -1980948 335121 3767091 5140141 3984555 3194788 4278797 5052784 3780752
37016 3780752 2472677 3475710 5441831 5763347 4916249 5105690 6257116 6740969 6781054
37007 6781054 7674794 8622631 7920332 6639433 7379826 9542306 9588941 6373772 2763401
36998 2763401 1343392 1730543 2783273 4102120 4321112 1356370 -3952832 -7442823
36990 -7442823 -6870091 -5060514 -5748050 -8483094 -9972744 -8754216 -6184450 -3895887
36982 -3895887 -2289284 -893008 1089117 3778933 5450338 3868422 -360312 -3755738
36974 -3755738 -4441808 -4385055 -5633693 -6971375 -6675798 -6066895 -7098545 -8373276 -7276534
36965 -7276534 -4866067 -4702273 -7205746 -8925936 -7654287 -5004796 -3529648 -4166401
36957 -4166401 -6711921 -9785705 -10189293 -5770171 499815 2875270 231545 -2513533
36949 -2513533 -1681228 370743 -80613 -2314335 -3106084 -1735053 148925 1619404 2507761
36940 2507761 2176409 1010565 1277698 3767508 5670000 4846593 3828918 5647628 7867963
36931 7867963 5817474 620890 -1580983 1329040 4600849 4136471 1887183 1473281
36923 1473281 2637387 3014641 2245038 1271916 -103662 -2147001 -3568858 -3598995 -4034885
36914 -4034885 -6621136 -9703497 -10102302 -7480768 -4455698 -2832864 -1903229 -487867
36906 -487867 1013904 1138314 -590200 -2279682 -950540 3640522 7150584 5075971
36898 5075971 -947344 -4383430 -2140292 1861213 3110492 2564756 3228106 4210740 2630997
36889 2630997 -680280 -2037077 -526404 1351251 2068265 2208568 1765164 346446 -237026
36880 -237026 2049229 4734658 2732087 -4077881 -9704594 -10186436 -8521212 -8994245 -10604562
36871 -10604562 -9684095 -6186646 -3399645 -2904554 -3371859 -3638854 -3907787 -4096911 -3635358
36862 -3635358 -3102952 -3922202 -5882563 -6581252 -4159384 201990 3205847 2740436 -2305
36853 -2305 -1924234 -1554134 -517787 -953820 -2509390 -3315559 -3059074 -2920455 -2825278 -1344325
36843 -1344325 1381208 3223777 3313230 3196178 3813038 3934106 2974653 2772431 4655492
36834 4655492 6931910 7374513 6347438 5446437 4866912 4286936 4566608 6055860 6627575
36825 6627575 4017348 -746019 -4395217 -5001868 -2764966 1233995 4895217 5426143
36817 5426143 2569597 208236 1961003 6424654 9620770 10543102 10630007 9197416 4213280
36808 4213280 -2497729 -5694797 -3504067 250808 1796181 1673045 1660333 1285771 -91239
36799 -91239 -794899 637375 2461506 1866512 -1257659 -4624940 -6287734 -5624731 -3292658
36790 -3292658 -1551687 -2587566 -5070013 -4941583 -1508255 417283 -2509625 -6231674
36782 -6231674 -4956668 -556917 -290097 -5327978 -8036716 -3045957 4467338 5902300
36774 5902300 1085777 -2348788 -129381 3547925 3075336 -850264 -3290527 -2194040
36766 -2194040 -122556 300976 -329459 88395 2252328 5078420 6952951 6819088 5192362
36757 5192362 4411840 6348940 9380016 9607726 6135131 2875742 3235252 5223110 4763421
36748 4763421 2100856 957790 2011216 1796814 -1077811 -3050583 -1085126 2561827
36740 2561827 3911761 2853344 1982448 1941056 1386929 335482 75504 318083 -428803
36731 -428803 -1873079 -2252372 -1543402 -1389234 -1654981 -230681 2923093 4614536 2850888
36722 2850888 -98821 -979462 121735 855312 453306 21560 -220321 -1474807 -3955948
36713 -3955948 -5856208 -5473547 -3372875 -1802844 -2374876 -4558085 -6232766 -5745912 -3537445
36704 -3537445 -1422078 -188013 1261176 3812805 6175605 6303504 4357096 2706489
36696 2706489 2801881 3475823 3020645 1773419 1549079 3131020 5366405 6423338 5097323
36687 5097323 1396815 -2884837 -4474557 -1317538 4433125 7707750 5907164 1763615
36679 1763615 -433015 -79649 294853 -247000 63101 1831567 2641858 648590 -2300432
36670 -2300432 -3263763 -2261786 -1338219 -756830 1059190 4148085 6369117 6558425 5935316
36661 5935316 5648298 5184682 4331749 4525523 6420271 7734019 5816758 1644161 -945886
36652 -945886 96626 3059129 5324245 6253038 6366107 5317117 2382279 -1587952 -4359558
36643 -4359558 -4812827 -4198049 -4267111 -4859434 -4298504 -1993265 457033 1239168 641883
36634 641883 557523 1976717 3840723 4417768 3128710 893900 -747536 -794581 333690
36625 333690 1062599 495753 -190386 647207 2152225 1488786 -1815724 -4091645 -2116335
36616 -2116335 1942024 2985944 -47309 -2825805 -1862707 945583 1695111 -202362
36608 -202362 -2551041 -4281303 -5688474 -5852411 -3433282 -100786 417615 -2205028 -3658609
36599 -3658609 -1140508 2146225 1505317 -2332752 -4435449 -2927527 -1086496 -1645547
36591 -1645547 -2646032 -955277 2546531 4000670 1915958 -802985 -309033 4039524
36583 4039524 9157004 10974454 7657133 963688 -5172453 -7747225 -6760040 -4456303
36575 -4456303 -2811059 -1848455 -217471 2725355 5517724 5739977 2852193 -857031
36567 -857031 -2981371 -3869892 -5381802 -7444528 -8072984 -6881234 -5959302 -6246931 -5597372
36558 -5597372 -2384157 1062715 1295453 -1202607 -2666671 -1310502 809758 1383417
36550 1383417 836430 995520 2560524 4624320 5412238 3295218 -1377699 -5347233 -5293684
36541 -5293684 -2034864 237048 -376014 -987384 1419217 5117502 5864253 2738595 -822016
36532 -822016 -1488837 641479 3314419 4812816 4766014 3555281 1789053 15246 -1350633
36523 -1350633 -1782690 -756667 1482119 3778401 5228667 5879537 5773209 4414838 2279043
36514 2279043 1612327 3822391 6783311 7066720 4715225 3173626 3888523 3817938 123517
36505 123517 -4882839 -6232008 -2826713 1230425 1920332 -318360 -2086960 -1081554
36497 -1081554 2266488 5777586 6996201 4691880 179538 -3381359 -4060176 -3046734
36489 -3046734 -2448984 -1917347 775247 5830968 10131241 10749002 8182218 4795684 1482204
36480 1482204 -2070620 -4663022 -4062317 -883027 631195 -2326074 -6838227 -7500268
36472 -7500268 -3348320 1095757 2103740 1413254 2961601 6880436 9404272 8221458
36464 8221458 5158072 2865753 1268358 -929435 -2826394 -2036439 1338585 3850928
36456 3850928 2811363 -275519 -1689742 -61298 2392971 2903209 1202032 -656449
36448 -656449 -756215 782595 2130633 1830703 419101 -443494 -337343 -472056 -1239737
36439 -1239737 -907081 1669220 4167087 3187561 -534708 -2136230 979159 5176714
36431 5176714 5165352 911763 -2721739 -2575805 -464996 585071 540561 1087327 2047142
36422 2047142 1558215 -557314 -1802422 -55020 3689749 6494609 6665950 4934917
36414 4934917 2953945 1649291 1073518 906044 572182 -526998 -2156801 -2817181 -904925
36405 -904925 3509461 8467783 11773514 12499400 10973030 8126407 5324046 4058173
36397 4058173 4729553 5763181 4867317 1547481 -2238300 -4348550 -4799106 -5140188 -5915128
36388 -5915128 -5876012 -3986647 -1139714 980032 2078112 3094925 4052049 3486526 633487
36379 633487 -2874930 -4489747 -3492737 -1497316 -540509 -1362429 -3220389 -4604096 -4338190
36370 -4338190 -2722669 -1401895 -1424323 -1785857 -807816 1371266 2877097 2644298 1707273
36361 1707273 1773505 3453381 5878620 7054093 4949614 -95766 -4207036 -3438925 1163636
36352 1163636 4434649 3913369 2892990 4776349 7440818 6586065 2512492 -717702
36344 -717702 -1812500 -3111675 -4758540 -3264663 2090676 6076392 4262820 -334981
36336 -334981 -1509871 1442525 3885702 3629200 3502128 5500039 6996050 5065565 1365140
36327 1365140 -162904 1359249 3295350 3384153 1825034 -5445 -996980 -594670 912474
36318 912474 2409395 3133669 3387896 3326985 2127029 -266699 -1718329 -288705 2640538
36309 2640538 3921625 2957744 1959814 2004329 1809678 985035 1254062 2989715 3620613
36300 3620613 1734419 19189 1155987 3041878 1762849 -2156767 -4569068 -4116723
36292 -4116723 -3435638 -3629464 -2166336 1955868 5022669 3556925 -354315 -1957765
36284 -1957765 -190083 2168040 3457717 4681523 6247409 6521923 4519351 1597762
36276 1597762 -629442 -2184504 -3391191 -3418783 -1846837 -535616 -1876377 -5347025
36268 -5347025 -7628185 -6631831 -3944408 -2351956 -2234353 -2040117 -1570377 -2439525 -4910981
36259 -4910981 -6668074 -6130808 -5009082 -5484469 -6432207 -5171981 -2039268 -76253 -388619
36250 -388619 -1087671 -1200068 -2122090 -4031109 -4316415 -1630545 1409901 1997696 1108032
36241 1108032 1047966 1362093 386585 -857747 134313 3124169 5274974 5040108 3229881
36232 3229881 913984 -1014276 -1038629 1196680 3094711 2365640 1252120 3588858 8101491
36223 8101491 9319228 5805154 2677244 4137693 7839888 9318834 8321063 7451962
36215 7451962 7332589 6650783 5247530 3941225 2500126 538510 -689947 40497 1590260
36206 1590260 2373851 3426880 6457555 9549154 8433670 2628901 -2827497 -3293101
36198 -3293101 -47928 1916520 377213 -1933971 -1556542 1148518 2958664 2510722
36190 2510722 1973973 3248724 4564710 3170145 182508 -576497 1336575 1731123 -1929178
36181 -1929178 -6255283 -6495527 -3028868 -365049 -1117784 -3829399 -5925221 -6171323 -4640943
36172 -4640943 -2584784 -2109957 -4004922 -6149057 -5837002 -3214580 -632318 742705
36164 742705 1537454 1863103 782173 -1736484 -4226358 -5348058 -4734446 -2465761 712535
36155 712535 2954722 2849300 1276544 227982 155085 128402 64932 735385 1786561
36146 1786561 1797452 323559 -1809815 -4010022 -6019768 -7036975 -6645583 -5999416 -6023529
36137 -6023529 -5392171 -2884511 -616951 -1386504 -3439882 -2186470 2576133 5715414
36129 5715414 4340056 1838235 2026361 3307675 1963985 -1794199 -4827590 -6168628
36121 -6168628 -7417498 -8961626 -9047402 -6590732 -2749166 304928 954285 -823264 -2872967
36112 -2872967 -2460301 329421 2195027 983568 -1299832 -1709986 -804355 -1291693 -3400574
36103 -3400574 -4416798 -2531770 1196948 4707024 6827138 7260560 6304641 4830211
36095 4830211 3604235 2805052 2731396 3958343 5801265 5902621 2861611 -1656302 -4786167
36086 -4786167 -5417413 -4088973 -1485999 1238153 2203163 1042602 145413 1448652 3276119
36077 3276119 2823744 515017 -982102 -1042096 -1154248 -1299669 279370 3544316 6017651
36068 6017651 6200589 5087526 3984133 3269490 3404332 4537846 5048950 3277565 738896
36059 738896 492340 2211409 2543087 904186 684703 3165660 4570806 1949664 -1629744
36050 -1629744 -1367295 2325277 4969301 4533776 3056151 2413910 1928516 476192 -1573919
36041 -1573919 -3161392 -3651578 -2784776 -715229 1644720 3104846 3132290 2065634 800440
36032 800440 297307 526786 7716 -2157904 -3958663 -2533516 1066441 2227658 -724771
36023 -724771 -3586005 -2283668 1132833 2023770 429326 395258 2951978 4407404 2289998
36014 2289998 -872897 -1274361 1371546 4363484 5450010 4317432 2071734 546332
36006 546332 1255239 4054897 7191261 8863768 8298942 5742461 2459230 322004 50121
35997 50121 154324 -998532 -2555238 -2341171 -254653 1596377 2077464 2097419 2242135
35988 2242135 1703761 316391 -514475 5739 798958 970339 1360526 2635981 3328430
35979 3328430 1500302 -2450134 -6082188 -7533628 -6808730 -4927732 -2784763 -764684
35971 -764684 957604 1751083 599890 -2375045 -5052605 -5518766 -4836370 -5557414 -7428531
35962 -7428531 -7241816 -3886597 -772927 -1261973 -3880641 -4602323 -2380756 339099 1731447
35953 1731447 2289613 2526170 1765807 19905 -1003920 67328 2457485 4407967 5286177
35944 5286177 5682593 6048497 6203472 6114734 6385184 7466471 8599297 8305937 6405682
35935 6405682 4829559 5361485 7020152 7269983 5836768 5340163 7396255 10018587 10256453
35926 10256453 7884540 4918214 2826528 2030478 2988836 5603757 8152578 8843507
35918 8843507 8115982 7669097 7716795 7102294 5641859 4234473 2993210 1556340 984406
35909 984406 2650660 5125939 5236110 3057086 2687681 6294536 10257826 9983936 6592032
35900 6592032 5474901 8832107 12799219 12584198 8156336 3736408 3082589 6465468
35892 6465468 11503153 15762525 18583977 21167623 25235683 31334350 38179967 43896146
35884 43896146 48297618 53781154 63318330 77661069 95535719 116691303 143294242
35877 143294242 177997024 223027035 282235287 359435282 448437024 525307450 558333805
35870 558333805 531801534 459425981 372433357 295913734 237393909 193060073 158183772
35863 158183772 130946727 111043687 97697863 88475199 79841411 70016066 60705785
35856 60705785 54199115 49474799 43725456 37240474 33379689 33114892 33018713 30227192
35848 30227192 26373944 24327138 23520209 21480766 18422020 17054705 18233528 19598368
35840 19598368 18858182 16321827 13671760 11801751 10353998 8295119 4800952 524499
35832 524499 -2333797 -2489600 -1543641 -1619678 -1536455 1858611 8089448 11986253 10071271
35823 10071271 5450214 3684437 5578562 7238033 6333463 4709476 4485259 4908227
35815 4908227 4456814 3578324 3512484 3983409 3789848 2752078 1811791 1947470 3671018
35806 3671018 6407668 7839503 5757008 1572250 -317732 1640896 3498796 1507630
35798 1507630 -2164686 -3272817 -2891422 -5594354 -10777036 -11895901 -5999758 1431570
35790 1431570 4172664 3267436 3597500 6226011 8773239 10688918 12975912 14109989
35782 14109989 11439654 6385023 3526933 4200144 5398267 5691665 7550147 11991437
35774 11991437 15186362 13419432 8615062 5815864 6828152 9018054 9357674 7487173
35766 7487173 5380876 5424526 8108462 10788890 10084077 6313074 3525669 3805829 4106939
35757 4106939 1231576 -2353818 -1470534 3914582 7869990 6175562 1360339 -1528023
35749 -1528023 -1471124 -1298268 -2419074 -2757182 -417647 2805115 3459819 1387370 469636
35740 469636 3507449 8142985 10021068 8961408 8830300 11049225 11899979 8248655 2892360
35731 2892360 1055459 3448351 6232654 6771083 5803592 4339941 2221168 351095
35723 351095 846289 3565458 5243795 3668459 489308 -1620710 -2428622 -2987736 -2995956
35714 -2995956 -1587380 408296 1149321 213286 -1165014 -1717125 -812033 1603674 4329535
35705 4329535 5005987 2469146 -1512256 -4228270 -5147555 -5614230 -6118193 -5706935 -3947197
35696 -3947197 -1778678 -251686 308466 -112911 -1207407 -1962017 -1587272 -840051 -1170401
35687 -1170401 -2589206 -3712956 -3854793 -3511693 -2710736 -733762 1930762 3122790 1569111
35678 1569111 -1294688 -3029359 -2800459 -1629882 -1121933 -2530759 -5736608 -8342059
35670 -8342059 -7365913 -3097196 296180 -233768 -2304800 -1000087 4705408 10796829
35662 10796829 13233678 11750976 8549349 5640040 4235176 4662060 5724008 5657870
35654 5657870 4636599 4774415 6751208 8288489 7427032 5583966 5334647 6439435 6484644
35645 6484644 4822468 3270951 2738673 1613518 -1416089 -4620824 -4873887 -1580876
35637 -1580876 2123256 2429270 -1048036 -4613397 -4532126 -1470885 562485 8541 64107
35628 64107 3363660 6731392 4843287 -1851560 -7061591 -6873862 -3885600 -1773259 5193
35619 5193 3245714 6251715 6103795 3756282 2865860 4448299 6305213 7138743 7478415
35610 7478415 6633610 2792702 -2848853 -5709942 -3457679 654563 2031418 136775
35602 136775 -2358517 -3895157 -5014148 -6106578 -6575207 -6054476 -4859195 -3325623 -1739122
35593 -1739122 -473256 726328 2834107 5749674 7227784 5157638 474845 -3734175
35585 -3734175 -5782550 -6512199 -7065562 -7371716 -7224892 -7070221 -6703002 -4573337 105747
35576 105747 5215118 7312196 5507955 2532441 1393761 1930944 1677180 -302789 -1751102
35567 -1751102 152394 5260041 10206713 11427448 8160443 2915585 -767399 -1671389
35559 -1671389 -2313679 -5955993 -11596526 -13586038 -8014692 1751382 8463752 9349487
35551 9349487 7999992 7770613 7189067 3974942 308972 364996 3958038 6422734 4982497
35542 4982497 2193445 2034232 4724876 6860380 5582326 1444935 -2397804 -3150402
35534 -3150402 -739151 2399375 3799353 2975296 965073 -1154690 -2551311 -2427901
35526 -2427901 -929076 259646 -297185 -1663841 -1701463 -125840 1360525 1956794 2622009
35517 2622009 3476906 2710944 -320569 -2742677 -1299197 2885538 5184039 3432544
35509 3432544 822066 1463851 4433995 4431135 -1343211 -8727748 -10570512 -4719662 3526106
35500 3526106 7309103 5095424 669583 -2369619 -3908961 -5139918 -5416549 -3009183
35492 -3009183 1701488 5531972 5670834 2815905 200956 -428433 -672905 -2536575 -4841971
35483 -4841971 -4633075 -1887386 -100487 -1180973 -2574594 -1701487 -703901 -3129089 -7375459
35474 -7375459 -8067456 -4094180 -541005 -986178 -2256105 119148 4729098 6691262
35466 6691262 5152787 3889526 5080812 6750949 6809295 5814473 4534378 2107568 -1422515
35457 -1422515 -3341633 -1471112 2456324 4922922 5054524 4705438 4855885 4380782 2511082
35448 2511082 371268 -708142 -970390 -1465615 -2441994 -3233721 -3104175 -1710633 571746
35439 571746 2319395 1878261 -749077 -3473317 -4393864 -4005836 -4267291 -5873725 -7472938
35430 -7472938 -7465736 -5696657 -3386325 -2108223 -2627887 -3915619 -3606955 -526536 3507306
35421 3507306 5701151 5815047 5843729 6172928 4599021 343440 -3298919 -2552096 1825831
35412 1825831 5279097 4654071 985573 -2340584 -2622748 368614 4041152 4975257 2736395
35403 2736395 799770 1919486 3817114 2136636 -3085964 -7121824 -6743471 -3560976
35395 -3560976 -707068 604065 261488 -1762553 -3975852 -3690237 -687832 1815146
35387 1815146 1667175 700126 1054372 1381336 -254508 -2014389 -668676 2910315 4581734
35378 4581734 2996827 1226709 1942161 4137177 5558938 5784062 5646319 5532025 5469360
35369 5469360 5613321 5739708 5202188 3873464 2280087 741784 -580553 -932552 358353
35360 358353 2439405 3547808 3133780 2067610 886389 -540432 -1637295 -1346997 -166512
35351 -166512 -176514 -2263268 -4683506 -5175202 -3511694 -1455522 -953790 -2425522 -3988982
35342 -3988982 -2877220 1036230 3934325 2442337 -1352413 -2335443 149795 997110
35334 997110 -3184840 -8939437 -10782443 -8204586 -4706248 -2104904 349314 2325536
35326 2325536 2048845 -24595 -640154 1795897 4626048 4491400 1906228 450844 2009829
35317 2009829 4463956 4450050 1439952 -1776355 -2502467 -1043077 367293 614746 326887
35308 326887 -63513 -914017 -1740252 -1026649 1385475 3510179 4022574 4108081 4992090
35299 4992090 5424433 3829144 1627473 1764615 4454497 6889867 7155304 6231080 5871408
35290 5871408 6345322 6585757 5111883 897299 -4970853 -8647754 -6681465 -241933
35282 -241933 5597164 7250443 5641602 3599197 2339780 1418494 422697 -469320 -649771
35273 -649771 639810 3031022 4111325 1756011 -2382103 -4125629 -2252505 -135506
35265 -135506 -715781 -2622651 -3172892 -2471376 -1846932 -607218 2205767 4467025 3227611
35256 3227611 -379208 -2201782 -902065 814145 950574 533321 457376 -322393 -2052358
35247 -2052358 -2928272 -2330274 -2259959 -3540446 -3647056 -968972 1554144 372563 -3221341
35238 -3221341 -5176591 -4597626 -3673055 -2796391 -138737 3947971 6311335 5576383 3728176
35229 3728176 2231436 234904 -2048624 -1999222 1099088 3628140 2292168 -1285482
35221 -1285482 -3366896 -3231102 -2519279 -1486901 606706 2642662 2629180 894372 -680249
35212 -680249 -1863665 -3509124 -4687913 -3919407 -2721200 -3978419 -6661814 -6271477 -1399053
35203 -1399053 4017023 6243805 5846334 4723730 2989450 1117697 1466465 4475087
35195 4475087 6349848 4096336 470505 140100 2816560 4320420 3252667 2215064
35187 2215064 2646934 2708665 1067621 -782055 -1300901 -1257371 -1857320 -2572356 -2194315
35178 -2194315 -646843 1182616 2282664 1770338 -382633 -2556169 -2751607 -883944
35170 -883944 1446641 3282907 4704390 5111050 3422575 409699 -1404394 -970503 104825
35161 104825 393300 645767 1900635 3507611 4394091 4681830 4578878 3091216 -400408
35152 -400408 -4105877 -5079348 -2514111 1084111 2220656 21752 -2270397 -292708
35144 -292708 5928137 10803703 9690166 5223639 3626683 5397132 4620504 -1469832
35136 -1469832 -7703873 -8675269 -6320309 -5405230 -5537604 -3470836 -688913 -1890353 -6492890
35127 -6492890 -8264186 -4554872 -136754 300490 -1487925 -1357903 899398 2852960
35119 2852960 4074710 5640519 6725490 5318949 1754257 -1220189 -1763858 -551338
35111 -551338 535138 -60306 -2602623 -5338427 -5683954 -3409111 -1401883 -1840420 -3183366
35102 -3183366 -2909268 -1562395 -1326614 -1845058 -927728 928893 484412 -2974340 -5699566
35093 -5699566 -4568772 -1477665 -405860 -1921010 -3122942 -2166752 -457178 -381356 -2628401
35084 -2628401 -6033985 -8839947 -9784946 -8837897 -7171425 -5873940 -4636024 -2281906
35076 -2281906 1371834 4820689 6293268 5569173 4232953 4186010 5731337 6971136 5446053
35067 5446053 760814 -4628341 -7552979 -6823622 -3685793 -365526 1240459 308892
35059 308892 -2176154 -3750591 -2855917 -815507 -75085 -590878 86111 2669670 4487821
35050 4487821 3591190 2354946 4146747 7557914 7555318 2732538 -2117152 -2389850 237393
35041 237393 834560 -1582596 -3370015 -2210483 -104391 511569 578593 2298939 5113590
35032 5113590 6262674 4690599 2290618 1269889 1893584 3066548 3809689 3719761 2963319
35023 2963319 2279225 2289617 2579537 2235176 1462667 1645359 3287993 4815119 4138272
35014 4138272 840914 -3647287 -7247740 -8125520 -5648059 -1656817 222877 -1772527
35006 -1772527 -5069104 -5663901 -3231650 -1253542 -1851729 -2929010 -1677748 1153444
34998 1153444 2583438 1786192 801232 1149781 1932719 1781980 1043744 1107371 2483160
34989 2483160 4330006 5423700 5149464 3908610 2770083 2375151 2216900 1522178 650104
34980 650104 684957 1603378 2015005 1197175 278315 541169 1431100 1438945 506730 209690
34970 209690 1433165 3046689 3469257 2770896 2408992 3247322 4748116 6193928 7797828
34961 7797828 9973605 12023045 12444118 10563193 7196134 3620904 570884 -1630855
34953 -1630855 -2761903 -2939515 -2537309 -1533895 335972 2483043 3527616 3048674 2228345
34944 2228345 2035069 1986763 1681359 2022128 3294042 3505194 1046419 -1948693 -1809364
34935 -1809364 1241994 2795770 -10910 -5031737 -8276727 -8187160 -5613030 -1805703
34927 -1805703 1834415 3612032 3003074 1548311 1118673 1888295 2674921 2553549 1765724
34918 1765724 1728789 3878545 7431270 9195872 7547017 5478424 6861248 10779565
34910 10779565 13405229 14489465 16938310 20554924 22756746 25799072 35047106 48066773
34902 48066773 55140598 55105970 60117614 77763167 100928588 127359435 175360326 257050159
34894 257050159 340787104 367992645 316544053 227695781 158635726 125482379 107218480
34887 107218480 88328968 73266582 65185052 55602939 40169487 27434967 24619501
34880 24619501 26432907 24733913 19936589 16274076 13487926 10038165 8547031 11245814
34872 11245814 14307080 12904438 8721034 6836546 7657520 7271398 4228778 1191593
34864 1191593 567405 2183449 4602204 5874447 4157458 343800 -1399778 1360971
34856 1360971 5399620 6190936 4573753 5002638 8114508 9742340 7746316 5271275
34848 5271275 5392705 6266087 4595337 1621117 1995457 6967271 11837681 11609619 7336965
34839 7336965 4539202 5658345 6861696 3818904 -1675087 -4003503 -1734015 594904
34831 594904 -603660 -3104203 -3001147 -463681 1646415 2517892 3233959 3418550 1829694
34822 1829694 -307498 -234823 1935984 3078589 1893994 831585 2110247 4472188
34814 4472188 5328796 4076173 1855868 -265203 -1471178 -1019187 683491 1946332
34806 1946332 2006074 2368633 4708010 8277841 10657889 10473761 8285516 5328093 2575504
34797 2575504 933172 1361669 4358702 9282366 14118732 16419171 15396141 12982291
34789 12982291 11737813 11775331 11164234 9416774 8507271 9527321 10359081 8433975 4436152
34780 4436152 1246256 -2985 -795921 -2519131 -4786441 -6483600 -6841779 -5378411
34772 -5378411 -2337811 606002 1631572 1108502 1159548 2464771 3182685 1887384 -90621
34763 -90621 -643439 83547 341659 -414088 -1317392 -2306526 -4375892 -7215832 -8555649
34754 -8555649 -6931527 -3787530 -1704081 -1647151 -3185848 -6190358 -10300893 -13315404
34746 -13315404 -12603948 -8611518 -4826862 -3356244 -2549791 -383622 1943489 2183055
34738 2183055 1242331 1976638 4242786 4690334 2154696 -179788 264988 1344062 -312798
34729 -312798 -3893461 -5729153 -4741763 -3136354 -2158591 -719779 1367464 2210204 1167547
34720 1167547 512030 2009631 4094967 4348338 2868829 1154577 -577802 -2465407
34712 -2465407 -2794070 224953 4831921 6711550 4037739 -634378 -3996788 -5505907
34704 -5505907 -6485233 -7418208 -7382173 -5487865 -2234136 275731 -171899 -3183786 -5035343
34695 -5035343 -2351141 3553914 7818820 7643649 4787132 2232114 818019 138216
34687 138216 327687 1241613 1699973 1327530 1596092 3375900 5167597 5699573 6382595
34678 6382595 8531191 9782537 6792899 898650 -2554730 -975665 2499139 3673811
34670 3673811 2215302 681729 904672 2771344 4901432 5306793 2859199 -948873
34662 -948873 -3300544 -3880476 -5259682 -8180897 -8987299 -4332363 3169720 7132950 4877160
34653 4877160 5982 -2670814 -2259178 -979583 -450252 -492792 -514256 -201638 1047868
34644 1047868 3838826 7326216 9106727 7637808 4341189 2097691 1719694 1401668
34636 1401668 67329 -648884 825522 2960154 3194868 1985877 1862666 2791472 1910069
34627 1910069 -1310430 -3009872 -66877 5185569 7847152 6488471 3916468 2955638
34619 2955638 3841107 5445834 7078374 8745848 10562095 11955917 11491204 8550997
34611 8550997 5228507 4506339 5923707 5626381 2054485 -1383245 -1559827 -464867 -1393540
34602 -1393540 -3036816 -1957190 800988 936478 -1739505 -2738769 -518196 780920
34594 780920 -1660391 -4413819 -3102615 1073469 3777678 3840795 3363936 3306473 2707858
34585 2707858 1453032 523493 -202301 -1644616 -3187967 -3168697 -1709226 -721665 -905737
34576 -905737 -1041653 -717920 -1360982 -3364783 -4231013 -1548016 3208725 6004247 5276002
34567 5276002 3589778 3502600 3629533 737140 -5169688 -10306502 -11747805 -10152942 -7283273
34558 -7283273 -3789486 -1132754 -2388607 -7682585 -11255045 -7719739 -184124 2924623
34550 2924623 -812018 -4989198 -4164729 -1026377 -883947 -3618497 -5199627 -4060236
34542 -4060236 -1788209 338624 1615229 527762 -3015608 -5490188 -3605826 756072
34534 756072 3161453 3074964 3653277 5894166 7469916 7318046 6798168 5601132 1135677
34525 1135677 -6260930 -11557203 -11101073 -7598548 -6391822 -8812801 -11669685 -11827445
34517 -11827445 -9004873 -4934722 -1649753 -156660 412522 1861574 4426835 6019010
34509 6019010 4694510 1131345 -1925924 -2051171 1084588 5254628 7072794 5320708
34501 5320708 2871145 3524353 6934703 9007947 7699480 5525090 5019085 4608111 1441489
34492 1441489 -3689667 -7148031 -7235893 -5606313 -4198497 -2995414 -1087907 1613216
34484 1613216 4185127 5409742 4637603 2514075 638929 70159 577483 1614814 3139831
34475 3139831 4969691 6326867 6709355 6284857 4915673 2138017 -1098220 -2305864
34467 -2305864 -510269 1900329 2048257 225717 -1105504 -977366 -336660 716157 3527761
34458 3527761 8107837 11698841 11386678 7311946 2400185 -663067 -1488805 -1188402 -365778
34449 -365778 1244926 3142785 3461179 1379149 -770675 -22920 2735665 3454952 720221
34440 720221 -2035394 -1626571 392939 661902 -1056363 -2863789 -4563470 -6831424 -7938220
34431 -7938220 -5455448 -823691 1866226 1810873 2098731 3735319 3551634 -94885 -3748665
34422 -3748665 -3991869 -2842436 -4343400 -8044827 -9869820 -8206470 -5142703 -2042858
34414 -2042858 2111256 7269283 10656748 10154991 7009610 3746907 1398913 188964
34406 188964 810787 2907703 3942902 2199406 -52400 792420 4213838 5853224 3681960
34397 3681960 625142 -366955 -596542 -2276769 -3613906 -1257184 3546852 5671310
34389 5671310 3241767 25577 -325827 1405229 3108781 4949841 7166520 7582030
34381 7582030 4861535 1774878 1318241 1510187 -1586174 -6912701 -9353975 -7426530
34373 -7426530 -5134934 -5352084 -6007363 -4560141 -2092278 -587851 312993 1151749 364557
34364 364557 -2704384 -4944633 -3000884 1924922 5730510 6481265 5122419 2729589
34356 2729589 187588 -675121 908153 2249397 261587 -3558662 -4836991 -2964966
34348 -2964966 -2098445 -4665133 -7642604 -7120877 -3612892 -647527 -203213 -1569692 -3088761
34339 -3088761 -3216187 -1276195 1256428 1607532 -779213 -3168122 -3366225 -2600017 -2621875
34330 -2621875 -2187754 601818 4075082 4734255 2570839 954402 1172127 837155 -1381605
34321 -1381605 -3071015 -1984961 205061 367115 -1893572 -4627608 -6411935 -6718918
34313 -6718918 -5023829 -1861910 541074 1049352 1760610 4747529 7889734 7311965 3485167
34304 3485167 1197576 2971410 6054191 7198533 7110247 7994672 9306036 8793948 6401213
34295 6401213 4404688 4058766 4175788 3165212 1137495 -310959 105113 1729588 2218849
34286 2218849 164013 -2774842 -3741443 -2504477 -1331146 -989340 126595 1889970
34278 1889970 1026306 -3653899 -7632690 -5942862 -142700 3827375 3549081 1829222
34270 1829222 1087595 481787 -703841 -819805 1267489 3857363 4712752 3756475 2271287
34261 2271287 1167105 1003740 2062332 3570963 4349069 4591637 5230176 5384390 2896129
34252 2896129 -1920849 -5539681 -5369963 -2592370 166111 1911217 2938838 3436810
34244 3436810 3670058 3929991 3543779 1767513 -16349 368136 1779390 280475 -4917829
34235 -4917829 -9554657 -10438192 -9998593 -11835296 -14778187 -14982880 -11753723 -7659335 -4475806
34226 -4475806 -2465066 -2281577 -4091410 -5804440 -5436112 -4253579 -4432173 -4799383 -2534256
34217 -2534256 1788205 4720583 5065587 4636599 4136621 2378001 -29198 -321518 1928936
34208 1928936 3427927 1619674 -2313571 -5956054 -8286380 -8734715 -6617463 -3055345
34200 -3055345 -926310 -1351435 -2318984 -1912032 -569093 954739 3169279 5743871 6306857
34191 6306857 3436966 -948019 -4026838 -5351757 -6168668 -7093182 -7977469 -8550039 -7879282
34182 -7879282 -4976678 -1296633 -527994 -3982568 -8044743 -8385668 -5202053 -2089331
34174 -2089331 -1145828 -1651900 -2520982 -3374740 -3566688 -2480928 -817105 191108 710045
34165 710045 1858501 3538793 4323957 3436619 1393817 -1229583 -4204252 -6715615 -7442681
34156 -7442681 -6069390 -3888723 -2535307 -2586020 -3474169 -4294484 -4534875 -4195452 -3338411
34147 -3338411 -1959242 -746738 -1277034 -4175593 -7424378 -8210323 -6547853 -5211599
34139 -5211599 -5808592 -7149803 -8169079 -9748318 -12034450 -12515447 -9363066 -4986593
34131 -4986593 -3375309 -4783840 -5820919 -4499287 -2557224 -2394649 -3827432 -4755790
34123 -4755790 -3853783 -1856464 -616176 -1069475 -2094253 -1904864 -637527 -379171 -2187393
34114 -2187393 -4525886 -5410352 -4501484 -2154761 1538912 5179820 5667106 1800834 -3213534
34105 -3213534 -5354901 -4644473 -3864574 -3725182 -2552625 -267980 707807 -1007482 -3884894
34096 -3884894 -5697726 -5636143 -4054665 -2057468 -1343204 -2524927 -3778969 -3187414 -1947021
34087 -1947021 -2708466 -5095277 -5965406 -4291601 -2465682 -1972745 -1103698 1523212 4144420
34078 4144420 4648789 3914924 4075629 5012555 4707003 2099195 -2052442 -6256592 -8811482
34069 -8811482 -8198066 -4531137 -147275 2480084 3169471 3659439 5245338 7419061 8541500
34060 8541500 7511005 4975352 2722125 1500231 246380 -1544153 -1909659 991683
34052 991683 5115977 6160076 3125603 -456414 -1464305 -676577 -317685 -691613 -805551
34043 -805551 -347778 490103 1597120 2186432 1049088 -1464221 -3380471 -3755328 -3445124
34034 -3445124 -2721253 -777418 1475343 1307748 -1425771 -2908548 -633002 2948748
34026 2948748 4699238 5650079 8107985 10604801 10069719 7355579 6061226 6601376 5850236
34017 5850236 2716926 39602 258785 2547273 5017399 6862776 7507835 6281676
34009 6281676 3879214 2007017 912665 -766398 -3277977 -4867939 -4020160 -908246
34001 -908246 3243743 6344346 5625389 418829 -5514197 -7496808 -5814042 -4861529 -6402924
33992 -6402924 -7642204 -6729589 -5704764 -6034352 -5479560 -2347717 773735 1121857 626477
33983 626477 2559277 5499534 5210911 1472882 -1475852 -1235717 158765 566973 845611
33974 845611 2152778 3245678 2570237 1036208 585384 1100303 580216 -1999566 -5308179
33965 -5308179 -7121526 -6474827 -4365943 -2669516 -2440753 -3350400 -4599856 -5545422 -5100046
33956 -5100046 -1978758 2953516 5659425 2633677 -4388488 -9679498 -9956512 -7416291
33948 -7416291 -5564862 -4517209 -2395287 447079 1428535 -380531 -2730501 -2953762
33940 -2953762 -669925 2656238 5457776 6781002 6430650 5259012 4680080 5215997 5887629
33931 5887629 5460002 3916228 2349972 1742584 2159232 2906382 3296648 3417238 3989714
33922 3989714 5055297 5162408 2840225 -1139817 -4146522 -4637523 -3516204 -2080825
33914 -2080825 -195517 2266385 3558574 1762472 -1951718 -3754967 -1399728 3177278
33906 3177278 6028403 5136666 1714696 -1810195 -4456426 -7147019 -10499784 -12811050
33898 -12811050 -11621354 -7472062 -4168663 -4140528 -5471904 -5366131 -4390111 -4260160 -3330554
33889 -3330554 1117695 6557872 6532079 -235402 -6901176 -7422642 -4207476 -3126109 -4452595
33880 -4452595 -3847159 -539567 928759 -2533537 -8216255 -11102921 -8945756 -3168262
33872 -3168262 2861630 5836075 4897970 2560110 1587095 1225158 -1132747 -4795898 -5580049
33863 -5580049 -1751792 2789027 3211122 -273405 -3168679 -2367254 774980 2768686
33855 2768686 2104947 642304 1100957 3576696 5457608 5129770 4231741 4853309 5994822
33846 5994822 5114438 2273157 70525 -128140 856090 2624907 5644553 8658434 8757136
33837 8757136 5152113 480578 -2551724 -3558331 -2924132 -615631 2458976 4551597
33829 4551597 5676848 7563191 10022555 10344076 7659660 4764772 3813535 3401788 2115686
33820 2115686 1627872 3250900 4341880 1786925 -2988238 -6028844 -6255500 -5487712 -4538856
33811 -4538856 -2812426 -819233 187392 412950 627859 189882 -1228469 -1476799 1019892
33802 1019892 3358825 1329370 -4201960 -8106109 -7887379 -5791181 -4126192 -2606863
33794 -2606863 -712837 1273184 4109862 8541916 11858814 9885554 3603081 -622748
33786 -622748 717017 3966526 4558153 3487957 4322676 7098030 9045768 9262197 9022698
33777 9022698 8740757 7719182 6092751 4518251 2662932 -15255 -2867605 -5067299
33769 -5067299 -6816841 -8073017 -7753799 -5922052 -4737388 -5059693 -4236671 -40375 5117137
33760 5117137 7107231 5565117 2895645 -558989 -5718462 -9803091 -7729065 33145
33752 33145 5721689 3312972 -3923391 -8077654 -6563447 -3904622 -4612798 -7915025 -10179963
33743 -10179963 -9888377 -8523189 -7773290 -7691104 -7647036 -7651414 -7787138 -7146013 -4861480 -2193497
33733 -2193497 -1849001 -4435049 -7158231 -7357794 -5918906 -5398848 -6025857 -5988895 -4962484
33724 -4962484 -4442657 -4546076 -3496979 -1095394 207160 -811593 -1785866 -404622 1677602
33715 1677602 1164104 -2094020 -5422747 -7499943 -9127862 -10094138 -8571670 -4452262
33707 -4452262 -412760 1724757 3225163 5303371 6240239 4401196 2353492 4243114
33699 4243114 9340548 11920179 8592811 2610661 -881295 -1146215 -888208 -1148373 -569495
33690 -569495 1121153 2334576 2493902 2724744 3140726 2306300 397776 48140 2336549
33681 2336549 4428540 3487202 948356 189827 1325683 1395492 -735588 -2615475 -1686643
33672 -1686643 1756235 5591622 8006143 8204152 6738006 5585890 6305063 7754918
33664 7754918 7296045 4504185 1730902 534134 -101132 -969711 -579766 2173605 5192737
33655 5192737 5495264 3252202 1141760 374220 -199999 -1241356 -1662841 -724459 601435
33646 601435 1204886 1379346 1981924 3028471 3685421 2905107 -27520 -4459581 -7763548
33637 -7763548 -7231290 -3121706 1415481 3872475 4399728 3924896 2423460 384805 -65362
33628 -65362 2267807 5255567 5967383 4651231 3685809 3359277 1911777 -138699 723852
33619 723852 5942135 11834686 13599156 10501991 5398385 1061774 -929609 440881
33611 440881 4445086 7658764 6995613 3550894 1221431 1765776 3463651 4389636 4392707
33602 4392707 3610138 1727548 -392924 -627607 1713221 4844917 6986364 7990629
33594 7990629 7696899 4993048 74428 -4372240 -6180101 -6372096 -6928516 -7387714 -5976818
33585 -5976818 -3067782 -957258 -580438 -759864 -731326 -1327053 -3251824 -5785264 -7639237
33576 -7639237 -7958796 -6363655 -3198099 115300 2014244 2157676 1104142 -794735
33568 -794735 -2909891 -3470045 -1261258 1841797 2276413 -590719 -3174795 -2147136 1282340
33559 1282340 3036032 1354450 -1140264 -682223 3019828 5882819 3671333 -2707807
33551 -2707807 -7292156 -5758525 -1013952 284279 -3454002 -6583635 -4082346 1485582
33543 1485582 3627595 640721 -2917753 -3145489 -1571042 -1722890 -3669373 -4439428 -2686872
33534 -2686872 -337820 545294 431227 879940 1900522 2241679 1605023 931760 604707
33525 604707 -17873 -981191 -1278327 -727174 -675617 -1618783 -1610535 1156303 5214895 7307987
33515 7307987 6398112 4114685 1704800 -899626 -2913279 -2505994 125422 1960652
33507 1960652 1117117 -291998 775562 3841624 5856405 5757395 5436143 5952384 5295509
33498 5295509 1464241 -3578980 -5283058 -2243866 1184613 -257040 -5894823 -9557253
33490 -9557253 -7553233 -3580808 -3409186 -6744185 -8023682 -4567699 244882 2569742
33482 2569742 2769460 2752682 2432715 1644858 2514870 6360470 10326172 10821952 8915484
33473 8915484 8556478 10395384 11347939 9956480 8026328 6519406 4008811 569576
33465 569576 -645148 2007204 5428784 5665786 2832260 -219574 -2085546 -2968122 -2430960
33456 -2430960 -289687 1182043 -576513 -4001206 -4432468 -372294 4204413 5270275
33448 5270275 3924051 3863209 5532787 5931046 3832089 1998340 3060619 5518483 5828023
33439 5828023 3310660 864872 983083 2842147 3709168 1917932 -2032086 -6254825
33431 -6254825 -8804115 -9116690 -8638631 -9229008 -10658561 -10788438 -8602151 -5551890 -3003552
33422 -3003552 -3520 4680199 9401226 10735257 7678002 3080094 632773 1470459
33414 1470459 3773987 4865674 3839791 2698739 4136073 7457693 8257505 3968150
33406 3968150 -1757583 -3126235 20380 2031684 -515646 -4207719 -3907668 404126
33398 404126 4312805 4651373 2117440 -664206 -1596384 -329368 1298161 689952 -2274497
33389 -2274497 -4361550 -2814437 1012616 3668756 4227594 4549867 5476647 5527828 3879577
33380 3879577 2234298 2468291 3948500 4513202 3230665 1086241 -429366 -365155 1601660
33371 1601660 4861968 7508078 7457654 4887365 2956167 4653387 8688884 10173830
33363 10173830 6564631 1347305 -424826 880060 373492 -3374334 -5437391 -1665844
33355 -1665844 4936674 8481418 8296718 8403585 10210326 10643843 7894775 4431208 2633664
33346 2633664 1169533 -1853650 -4905651 -5055904 -2329280 587444 2095664 2924768
33338 2924768 4081832 5374188 5895939 4887061 2379546 -364807 -1789432 -1948872
33330 -1948872 -2240084 -2569959 -755183 3657843 6961716 5365508 422783 -2575199
33322 -2575199 -1313145 1395724 2447833 2419735 3436591 5473202 6710996 6293848 5015156
33313 5015156 3853722 2990984 1879922 -349978 -3880305 -7094465 -7546994 -4900287
33305 -4900287 -1860854 -1041031 -1738601 -1196112 1539787 4567788 5759382 4947838 3344872
33296 3344872 2162574 2281574 4020959 6313701 6919055 4598191 881885 -1274462
33288 -1274462 -701187 926218 1568036 1513996 2608564 5095493 6669460 5416721 2700833
33279 2700833 1774457 3777784 6473736 7185939 5761824 4044526 3432709 3802708 4182982
33270 4182982 3700390 2275793 872104 467242 489113 -542852 -2103774 -1074475 4072848
33261 4072848 9720737 10518559 6307376 2777484 4197890 8028856 8763758 5336795
33253 5336795 1926456 1835929 3392392 2979963 293312 -1332109 519351 4099045 5561761
33244 5561761 3493968 293860 -872487 653746 3210325 5059278 5335375 3689873
33236 3689873 712741 -1541437 -1235353 833253 2128552 1899389 1783537 2286369 1177071
33227 1177071 -2843967 -7012237 -7679386 -5374584 -3728391 -3820391 -2811439 1161382 5586713
33218 5586713 6650950 3830547 -270287 -3377924 -5085525 -5701290 -5449764 -4973232 -5333037
33209 -5333037 -6885739 -8558473 -8610775 -6235508 -2610724 -320559 -1200706 -4450046 -7230361
33200 -7230361 -7409607 -5398439 -3126686 -1805377 -1245043 -970465 -1101599 -1811153 -2413002
33191 -2413002 -1679852 724225 3530831 5017459 4658009 3160208 1254278 -563292
33183 -563292 -1284487 12562 2281652 2844710 748526 -1583482 -1468398 520525 1824324
33174 1824324 1472124 360409 -930761 -2188176 -2392678 -1327184 -1524338 -5089852 -8970790
33165 -8970790 -7728772 -1708227 2245560 156340 -3536599 -2939239 824241 2425500
33157 2425500 670429 -1022383 -925866 -712632 -1201990 -1041191 -141202 -428323 -2201916
33148 -2201916 -3078139 -1610324 890885 2995321 4805518 6145057 5968347 4607139
33140 4607139 3821488 3545216 1556292 -2201444 -4074920 -1572845 2862437 5297554
33132 5297554 5271491 4899173 5077406 5263370 5400558 5390029 4006056 958893 -1246705
33123 -1246705 -285561 2198177 2563881 40822 -3148916 -5478774 -6676141 -5502726
33115 -5502726 -981485 4198110 5652593 3415081 2047375 3487969 4151467 1363206
33107 1363206 -1676856 -1023872 1360842 732651 -2811517 -4887113 -4101351 -3618886 -5112605
33098 -5112605 -6095546 -4767994 -3081230 -2604647 -1254919 2617896 6064405 5455108 2404145
33089 2404145 1405117 2814640 2947081 949673 475333 3152704 5108764 2831275 -1073823
33080 -1073823 -1564258 1723205 4757629 5139832 4140577 3241661 2167212 686699 -508204
33071 -508204 -1317207 -2256936 -2561214 -688397 2689680 4696442 4174282 3212420 3537348
33062 3537348 3709287 1649043 -1934898 -4615834 -5373343 -4797437 -3352704 -1363138 121144
33053 121144 296868 -79666 123214 520983 -4727 -1243143 -1894711 -1372026 -9759
33044 -9759 1807299 3263479 2847244 488606 -817518 1941355 7293344 10480800 9563044
33035 9563044 7653965 7970902 9142529 7528183 2728321 -1662634 -2650093 -1312854
33027 -1312854 -1024649 -3194414 -5807110 -6238428 -4562949 -2931570 -1928406 439997
33019 439997 4979289 8526440 7572528 3707340 2029241 3747686 3995121 -1062934 -7957085
33010 -7957085 -10000414 -6062962 -1588514 -976423 -2497183 -2107968 476761 2029716
33002 2029716 775757 -1663395 -3300962 -4250591 -5043855 -4463534 -1241562 2877803 4300961
32993 4300961 2232071 -23202 496559 2524212 2819917 882566 -786311 -391653 1426126
32984 1426126 3291555 4295599 3451039 236045 -3795756 -5984706 -5793393 -5127896 -4856667
32975 -4856667 -3434115 -255725 2095097 1155524 -1625560 -2926105 -2255934 -2003041 -3368614
32966 -3368614 -4975933 -5627027 -5856394 -5943673 -4585359 -1039308 2738536 3768043 1467221
32957 1467221 -1833393 -3796583 -4504363 -5552473 -7398809 -8578213 -7670718 -5083878
32949 -5083878 -2150896 687078 3472215 5136935 4388010 2304407 1697807 3015031
32941 3015031 3317128 933079 -1361694 -427067 2053074 2084728 -22483 191245 4306210
32932 4306210 8390802 8941718 7689456 7855655 8599323 6757516 2476346 -718122 -1206020
32923 -1206020 -1229531 -2872226 -4854721 -4737114 -2417609 183842 1798542 2632470 3108830
32914 3108830 3138131 2518898 1213359 -514773 -1501314 108961 4559504 8554546 7651478
32905 7651478 1589096 -4292977 -4577338 176036 4694898 5678840 4788904 4764825 5404961
32896 5404961 5086762 4151184 4206787 5065925 5033010 4074648 4174170 6019387 7564003 6929094
32886 6929094 4977365 3694372 3374282 2948529 2229291 2174369 3113607 3958395 3327407
32877 3327407 870082 -2360659 -4453344 -4144591 -2437308 -1996362 -3969988 -6135212
32869 -6135212 -5566822 -2629939 -529126 -900848 -1874579 -1207791 560256 1433011 919533
32860 919533 -101307 -1389403 -3089721 -4090014 -3092108 -1342526 -1692534 -4291073 -5904444
32851 -5904444 -4845106 -3774968 -5263269 -7075404 -5380695 -1104001 1032013 -639813
32843 -639813 -3041006 -3824565 -4099247 -4395730 -2456693 2356137 6358027 6577942 5244915
32834 5244915 5565940 6111474 3948451 875155 1150755 4410543 6425151 6243614 6691532
32825 6691532 7729028 5805588 1191010 -633926 2297798 4483996 1727770 -1705787
32817 -1705787 35135 4900408 6561826 4338673 2733479 2847672 1348458 -2104806
32809 -2104806 -3177035 -136675 2749896 1396764 -2845329 -6329371 -7717386 -7169575
32801 -7169575 -4451751 -528364 1845554 1842899 2413967 5747433 9274964 9346481 6973425
32792 6973425 6280618 8212316 9452068 7669692 4640552 3310818 4166620 5608282
32784 5608282 6156507 5129893 2454871 -891790 -2927283 -2283294 328038 2830066
32776 2830066 3772383 3220569 2077494 1321672 1940012 4679708 9046175 12779819 13227754
32767 13227754 9685681 4163398 -245481 -1560809 59107 2526212 3158907 1052001
32759 1052001 -1681056 -2344140 -1434557 -1950672 -4339244 -4924193 -1246027 3687926 5370011
32750 5370011 3798080 1948357 203340 -3002404 -6017755 -5060267 -940672 939527
32742 939527 -1029802 -1840224 1777386 5550305 4486099 969442 587977 3058199 3451996
32733 3451996 876330 -262698 2346731 5709783 6625623 5490019 3780256 1651691
32725 1651691 -482397 -1243272 -604559 -191433 -249823 881548 3400474 5224096 5588673
32716 5588673 6140736 7019191 5456633 563907 -3784740 -3829845 -1127987 246388 -453693
32707 -453693 -973640 -536102 -296157 -216180 895255 2415942 2236666 255799 -1340365
32698 -1340365 -1627513 -1987071 -3009225 -3087215 -1167215 1470347 3447197 5178862 7057264
32689 7057264 7725609 6129139 3876977 3421856 4667900 5355323 4339296 2573207 1054004
32680 1054004 -230031 -1101796 -851365 283362 962731 934717 1761152 4071344 5570209
32671 5570209 3730677 -332425 -2818431 -1902076 574318 2185173 2550957 2252886 1247074
32662 1247074 -342738 -1465434 -1621177 -1864346 -3070402 -4554176 -5717849 -7343441
32654 -7343441 -9369289 -9222407 -5128566 230257 2605937 1977369 1931291 3578376 4131640
32645 4131640 2100201 -350617 -1754172 -3883801 -7367964 -8530939 -4311029 2302376
32637 2302376 5793734 5385568 4670148 5032590 3955793 202243 -3381011 -3720232 -1373419
32628 -1373419 999560 1943141 1534360 50407 -2131606 -4175707 -5446345 -6031799 -6053423
32619 -6053423 -5078523 -2753881 320589 2573937 2249399 -1231205 -6070481 -8907859
32611 -8907859 -7803484 -4024792 -216167 2260151 3219930 2368666 -20898 -2230457
32603 -2230457 -3059826 -3808581 -5965775 -7865990 -6635181 -2941114 -364505 -27735 354067
32594 354067 1437865 530138 -3231301 -5959526 -4343884 -875429 -156429 -2078048 -2588588
32585 -2588588 -229378 2029233 1688302 180547 263569 1976505 2581724 -86605 -4857201
32576 -4857201 -7941422 -6941506 -4068255 -3841918 -7016493 -8930964 -5611408 380674
32568 380674 2777560 -728054 -6271342 -8846986 -7096359 -3135525 71019 736874
32560 736874 -615721 -1607655 -627051 1273911 2200480 2148968 2054812 1142817 -1995923
32551 -1995923 -5940294 -7068111 -4296899 -713102 393599 -987823 -2848491 -3744807
32543 -3744807 -3051369 -524540 3069865 6114096 7697453 7863397 6207023 2194571
32535 2194571 -2714364 -5608645 -5721057 -5263925 -5668453 -5522870 -3809000 -2563351 -3840603
32526 -3840603 -5931368 -5429839 -2071948 1016101 1436728 -111930 -1271642 -361466 2200946
32517 2200946 3736511 1623265 -3092093 -5984610 -4678351 -2043764 -1818116 -3151735
32509 -3151735 -2660044 -223557 1248107 1103998 1693236 3512049 3780547 1135142 -1827789
32500 -1827789 -2449164 -1482669 -790880 -230207 976234 1956909 1680740 1153942 1884332
32491 1884332 3293123 3598932 2308913 183110 -2189823 -4130381 -4336494 -2431925
32483 -2431925 -85311 1137832 1978625 3672370 5113144 4259758 1694359 181823
32475 181823 802706 1970578 2479866 3083516 4315945 4893086 3527127 972282 -860830
32466 -860830 -1006131 32407 1096076 1212366 277734 -831650 -1387024 -1802903 -2551316
32457 -2551316 -2595958 -650584 2088840 2683675 617217 -886938 1008953 5048672 7807764
32448 7807764 7769679 5715596 2598001 -467161 -1057950 2534645 7852799 9743804 6463995
32439 6463995 1959609 492656 1254502 821968 -764004 -102960 3412596 5430169 2476892
32430 2476892 -2842910 -5215681 -3418235 -635384 995157 2424493 4026774 3713879
32422 3713879 498301 -2908522 -3406241 -1447547 597752 2205520 4143595 5559247
32414 5559247 4744313 2278123 578880 539572 1148115 2033577 3486146 4221651 2545931
32405 2545931 26446 306030 3321896 4577705 1933362 -768099 276072 2528172
32397 2528172 796137 -4762701 -8514793 -6708120 -1549056 2167935 1945020 -997655
32389 -997655 -3163862 -1736526 2303792 4644292 2904247 252490 1368964 5872500
32381 5872500 8863626 7609395 4429574 2667225 2888436 3886123 4718439 4569368 2763839
32372 2763839 170667 -960573 577518 3865211 7258297 9319349 8745108 5761060
32364 5761060 3521574 5300642 9863935 12461267 10975434 8009447 6129607 4716331
32356 4716331 3173088 3473331 6639878 9534849 8414161 3869945 -532746 -2888514
32348 -2888514 -3635073 -3317151 -2462870 -2312367 -3002485 -2332813 1066805 4766831 5515688
32339 5515688 3766936 2233774 1370907 -212962 -2001238 -2215343 -1701239 -3053954 -5720261
32330 -5720261 -6004099 -2676807 1191852 3092004 4095489 5362859 5029696 1140435
32322 1140435 -4492931 -7883022 -7273027 -4319760 -1714899 -751870 -669486 18097 1034773
32313 1034773 -63304 -4262540 -8176059 -7591486 -3412313 -580104 -994918 -1517220 91566
32304 91566 1597699 730079 -765392 -377772 1090746 1766239 2137454 2943363 2334793
32295 2334793 -1000505 -4064205 -3180369 46588 842779 -1404371 -2460995 -84414
32287 -84414 2700600 2276583 -1014305 -4428966 -6316130 -6628374 -5971950 -5452621 -6020443
32278 -6020443 -7108175 -7173621 -5996751 -4952534 -4589370 -3498130 -267400 4530021 8722934
32269 8722934 10179794 8351587 5218235 4034309 5637662 6793680 4191906 -641987
32261 -641987 -2925173 -760472 2996769 4968867 4495917 2413012 -298231 -1797197
32253 -1797197 -256338 3301334 5491561 4910914 3448340 2474820 1037381 -681088
32245 -681088 156192 4392172 7924787 6856284 3115157 1195658 1391434 685115 -959313
32236 -959313 -330758 2797964 4164440 1511014 -1442899 -300286 3480861 4601464
32228 4601464 1162864 -3197701 -4358938 -2427002 -554023 -692419 -2020871 -3120400
32220 -3120400 -4102402 -5762008 -7519694 -7690259 -5884490 -3778899 -2908402 -2850878 -2407732
32211 -2407732 -1475354 -653276 37476 719420 682679 -736365 -2810750 -4309573 -5243074
32202 -5243074 -6320391 -7155435 -6645828 -4932380 -3394481 -2740299 -2536281 -2484727 -2609611
32193 -2609611 -2279987 -748797 1265397 2168821 1683771 766643 -446310 -2379151 -3740786
32184 -3740786 -2416461 612018 1343405 -1595511 -4291248 -2978034 374238 1112400
32176 1112400 -1266968 -3165005 -2975515 -2997358 -4721680 -5995047 -4583928 -1752798 -146001
32167 -146001 -74652 -165984 -329511 -1621327 -3698205 -4663301 -3637008 -1839352 -736592
32158 -736592 -323097 341497 1746781 3355925 3769631 1570487 -3009741 -7250975 -7982756
32149 -7982756 -4873891 -748209 1635259 1970475 1329808 435184 6628 1110336 3367605
32140 3367605 4067559 1307134 -2696466 -3916300 -1917530 -254356 -1145444 -2674195
32132 -2674195 -2469270 -1420684 -1756643 -3617017 -5883027 -8581418 -11634552 -12510521 -8487374
32123 -8487374 -1159334 4228605 4475130 1360413 -1261299 -1091155 2058225 6781925
32115 6781925 10384306 10871872 9530836 9555414 11483912 12377954 10428559 7582167 5977762
32106 5977762 4605292 1944406 -592840 -1081582 -1067038 -3267584 -6218154 -5435941 -290077
32097 -290077 4263887 4286820 1953021 1892455 4888321 7872809 8695151 7993980 6732293
32088 6732293 4615418 1720533 -208071 520023 3302807 5915580 7195818 8015475
32080 8015475 9370746 10509211 9887885 7608261 5690914 5555376 6160422 5451675 3195866
32071 3195866 1497579 2442697 5684834 8475909 8051064 4233121 -276524 -2567697
32063 -2567697 -2411715 -1848019 -2086500 -2129129 -803414 1368174 3237896 4544863 5101863
32054 5101863 3875348 689389 -2163803 -2167751 -23096 1174193 44681 -1717675 -2125200
32045 -2125200 -1146397 45137 338950 -1042706 -3862800 -6208235 -6188400 -4481075 -3362403
32036 -3362403 -3080175 -1505231 2031372 5098382 5638226 4824349 4745755 5138735 4464381
32027 4464381 2847189 1764975 1607869 1510968 1203078 1346734 2186794 3142511 3675346
32018 3675346 3705187 3386319 3050590 2956355 2777873 2101942 1563037 2165819 3197165 2643616
32008 2643616 414083 -926503 172919 2003033 2595906 2679286 3456741 3706482 2096813
31999 2096813 680111 2483675 6339287 7587593 3986830 -1907494 -6300854 -7512087
31991 -7512087 -5850019 -2824601 -646028 -138135 777869 4168015 8199934 9167135 6942787
31982 6942787 4808579 3971272 2534119 526979 1063864 4490824 6008754 2362117
31974 2362117 -2819794 -4163743 -2109823 -1089818 -2203222 -2349122 48449 2738844
31966 2738844 3441520 2583201 1516085 648274 193654 696326 1904869 2608780 2270127
31957 2270127 1694407 1692966 2092680 2345851 2214187 1568495 182237 -1976657 -4407851
31948 -4407851 -5972807 -5420578 -2880012 -670768 -1190270 -3814528 -5636036 -5605210 -5645169
31939 -5645169 -6845646 -7318623 -5509788 -2946748 -1440015 -178731 1591419 1697590
31931 1697590 -1355494 -4070008 -1883822 3672330 6511921 4362387 817844 -1199466
31923 -1199466 -2943198 -5535440 -7093684 -6614046 -6655669 -9149826 -11730089 -11366385 -9024053
31914 -9024053 -7430231 -6372657 -3862536 -640704 259135 -1710247 -3421013 -2261045
31906 -2261045 664404 2218044 679995 -2960999 -6082489 -6456243 -4043912 -1082126
31898 -1082126 99811 -596514 -1288307 -637514 316115 -834374 -4878114 -9284494 -10349959
31889 -10349959 -7363011 -3514118 -1944093 -2423002 -3335858 -4947407 -7853469 -9622887
31881 -9622887 -6949478 -1061568 3002464 3244179 2926046 4621122 6025239 4071894
31873 4071894 -66297 -2925886 -3278641 -2138516 -383893 1260575 1887407 2092635 3693126
31864 3693126 5922461 5059641 364260 -3229840 -1908016 1058773 655715 -1777720
31856 -1777720 -1360063 1867096 3683729 3480453 4320428 5453190 2249215 -4872505 -8605195
31847 -8605195 -4985230 583432 1510122 -906661 -1315466 861227 1907710 665559
31839 665559 -511859 -700392 -1537262 -3274189 -3509043 -714214 3478841 6226433 6037338
31830 6037338 3190740 -859501 -4195472 -5561179 -4947788 -2830144 320597 3247456
31822 3247456 4048436 2340195 212051 -184312 1028793 2594730 4197464 5863710
31814 5863710 6547674 5227772 2753486 973407 487614 481765 113382 -1018639 -2841798
31805 -2841798 -4163890 -3313091 -693050 817214 -361356 -1991576 -1352720 607753
31797 607753 1143379 246261 -73714 -194739 -2641853 -7172855 -9826502 -8042621 -3745277
31788 -3745277 -97285 1940880 2325979 237270 -3847141 -6612011 -5385934 -1940532
31780 -1940532 -102887 -402475 64737 2667927 5103110 4943314 2799603 549312 -1575791
31771 -1575791 -4122764 -5933394 -5072203 -2144222 -354292 -1495675 -3765006 -4805469
31763 -4805469 -5242300 -7173812 -10137873 -11161010 -9015408 -6182233 -5660560 -7368444
31755 -7368444 -8657841 -7262293 -3077156 1753399 3967429 1936370 -1978408 -3536594
31747 -3536594 -1941669 -850520 -2637146 -4326013 -2046502 2545676 4136573 1241742
31739 1241742 -2128903 -2548445 -1207335 -789917 -1583883 -2458235 -3143516 -3470256 -2241163
31730 -2241163 990228 4270590 5283614 4158037 2674924 1581869 374824 -867096
31722 -867096 -1125673 166487 2487585 4768134 5767199 4534291 1685053 -158151 1485226
31713 1485226 6161055 10528623 11306722 7992717 3156016 390148 1202931 3315393
31705 3315393 2850860 -1073937 -4930762 -4903383 -1243624 2934701 5946345 8284708 9746877
31696 9746877 8864915 5904325 3730016 4065190 4823412 3108441 -478539 -2624706 -1538692
31687 -1538692 1719338 5510701 8717296 9587493 6320218 4031 -5138502 -6071537
31679 -6071537 -4122769 -2476354 -2083579 -1967425 -2189205 -3844201 -6508011 -8175522 -7875641
31670 -7875641 -6289882 -3813476 -351299 2798526 3568768 2330216 1738062 2331264 1307069
31661 1307069 -2514716 -5561193 -4195699 -187147 1894035 1134654 468770 1290104 1712894
31652 1712894 361723 -1402150 -1726502 -264536 2481657 5566096 7222320 6433746
31644 6433746 4915363 5054061 5997574 4716891 1026375 -1769843 -1723587 -320809 950792
31635 950792 2335497 3010655 749760 -3620528 -5517935 -3052259 -269355 -649619 -1263255
31626 -1263255 2119819 7257436 8243820 4388820 781069 489128 1335116 780291 -618997
31617 -618997 -1632172 -2348670 -2609855 -1695485 -432242 -459725 -748205 1614621 6147790
31608 6147790 8211689 5220419 241748 -2655140 -3510787 -4501661 -5710827 -5881066 -5352779
31599 -5352779 -5204724 -4795024 -2899907 -329929 1065451 1252473 1647991 2546603 2938728
31590 2938728 2311541 834403 -1507232 -4178910 -5439925 -4432389 -2966743 -2972545 -3202661
31581 -3202661 -1285748 1722996 2347215 279688 -843800 673528 1700733 -451314
31573 -451314 -3038938 -1598118 3138751 5833996 3755123 42321 -912174 1377209
31565 1377209 4292940 6034619 6876374 7576640 8359661 9207300 9783035 9110522 6512089
31556 6512089 2983873 533556 -157639 -351908 -1013031 -1086134 834510 3808000 5110129
31547 5110129 3680849 1619634 1405583 2547741 2292481 -524563 -3717263 -4493996 -2997942
31538 -2997942 -1831507 -2278514 -2562570 -621190 2616522 4208233 2979824 731098
31530 731098 -389079 -160932 424653 594519 -198685 -2132373 -3853327 -3073100 152789
31521 152789 2242032 337041 -3250239 -3388720 1334172 6905188 8969463 7301449
31513 7301449 4529521 2522102 1246776 -172165 -2369240 -4935852 -6330958 -5563294
31505 -5563294 -3882474 -3290434 -3543769 -2794105 -1283468 -1502008 -3690447 -4259303 -762351
31496 -762351 3991945 5322326 2418314 -1728084 -4523530 -5232645 -3583060 15595
31488 15595 3391170 4458346 3949129 4115404 5248422 5820749 5459447 5092789 4509891
31479 4509891 2623933 116341 -1026291 -788681 -1142861 -2528124 -3238782 -2823838 -3084669
31470 -3084669 -4838048 -6565335 -7250364 -7711135 -8132053 -7340851 -5656182 -5008498 -4772224
31461 -4772224 -1524692 4603408 7615394 3589028 -2621550 -3557734 459515 2703822
31453 2703822 517821 -1651300 -144964 2620659 2812781 846799 -293158 412803
31445 412803 1598076 1787436 344903 -2333296 -4386357 -3833487 -1215706 820803 1074708
31436 1074708 641982 -267535 -3158412 -7423851 -9126762 -6350713 -2994077 -3707480 -6981430
31427 -6981430 -7344693 -3610665 -619330 -2146837 -5842739 -7037776 -4971098 -2818164
31419 -2818164 -2786025 -3580344 -2850992 -481891 1559272 2084539 2092328 2724254 2921692 825059
31409 825059 -2749877 -4557742 -3577690 -3226347 -6931621 -12892234 -15624312 -12236771 -5178899
31400 -5178899 901219 3088909 1267831 -2521544 -5318578 -5440211 -3962698 -3067885
31392 -3067885 -3163995 -2961517 -1905286 -659065 537541 1789284 1847547 -931175 -5313576
31383 -5313576 -7400482 -5333552 -1756671 -297505 -1458649 -3371978 -4754427 -5318886
31375 -5318886 -4730333 -3158579 -2013144 -2455949 -3793217 -4565006 -4399590 -3666265 -2387907
31366 -2387907 -836832 -138087 -839938 -1864122 -2187198 -2317056 -2627331 -1809302 937772
31357 937772 3634575 4016918 3142505 3534843 4573686 3328321 24211 -1145659 2028883
31348 2028883 6116420 6306213 2256309 -2212039 -3847667 -2742962 -1290148 -1579345
31340 -1579345 -3260891 -3633708 -915965 2627607 2804488 -849949 -3971237 -3026829 402012
31331 402012 2736363 3405072 4187632 5349502 5560706 4930091 5138803 6470197 7113083
31322 7113083 5804967 3292603 830288 -1113959 -2307704 -2411756 -1624467 -520744
31314 -520744 921009 2980966 4880134 5145312 3479653 1076272 -1004638 -2528141
31306 -2528141 -3228314 -2860255 -2334405 -3127508 -4995346 -5765762 -4117954 -1272132 729854
31297 729854 1088311 -75830 -2537626 -5285824 -6244881 -4089770 208190 4424166 6867887
31288 6867887 6620975 3518139 -826068 -3302588 -2387752 -173651 304709 -955598 -1427464
31279 -1427464 43117 1964836 2796966 2732033 2430745 1772199 612692 -611229 -1802653
31270 -1802653 -3579933 -6019789 -7990302 -8352379 -7033352 -4661637 -2249029 -1409603
31262 -1409603 -3212998 -6068477 -6484671 -3277903 380406 741497 -1799400 -3621346
31254 -3621346 -2778185 -890062 -245059 -927829 -1268239 171592 3405454 6761091 7689805
31245 7689805 5007105 580620 -2222551 -1937757 64790 1865120 2772567 2714110 1603520
31236 1603520 135592 -161854 1241916 2873154 3034943 1962351 1385262 2378023 4186544
31227 4186544 4812882 2646696 -1712547 -5203281 -5077638 -2257230 -520345 -1745743
31219 -1745743 -3523854 -2521461 1268346 5033133 6651737 6084123 4221039 2144859
31211 2144859 1069625 1465195 2452538 3086526 3576086 4123481 3561208 773263 -3229580
31202 -3229580 -6278522 -7495805 -7359515 -6341479 -5280975 -5920791 -8657031 -10720267
31194 -10720267 -9407326 -6375762 -5504700 -7042479 -7793415 -7129459 -8087600 -11127865 -11640268
31185 -11640268 -6639541 -63159 2330119 401173 -2031189 -3801719 -6493711 -9159488
31177 -9159488 -8193201 -3094808 1865225 3137652 1903875 1218455 1905370 2975890 3907435
31168 3907435 4566519 4266357 2568283 179407 -1954009 -3397777 -3264058 -43175 6064262
31159 6064262 11728749 13254609 10491924 6632602 4356634 3566216 2917117 2010960 1269626
$$ [...]
##END NTUPLES=NMR SPECTRUM
##END=
