##TITLE=31Pdec_PR192M_ost pu8
 D2O, 24 sc
 23.10.2020
##JCAMPDX= 6.0         $$ Bruker NMR JCAMP-DX V2.0
##DATA TYPE= NMR SPECTRUM
##DATA CLASS= NTUPLES
##ORIGIN= UXNMR, Bruker Analytische Messtechnik GmbH
##OWNER= root
$$ XWIN-NMR		Version 3.5
$$ Fri Oct 23 13:37:41 2020 Russian Standard Time (UT+4h)  she@DPX200
##.OBSERVE FREQUENCY= 81.013821
##.OBSERVE NUCLEUS= ^31P
##.ACQUISITION MODE= SIMULTANEOUS
##.ACQUISITION SCHEME= undefined
##.AVERAGES= 24
##.DIGITISER RES= 17
##SPECTROMETER/DATA SYSTEM= spect
##.PULSE SEQUENCE= zgpg30
##.SOLVENT NAME= CDCl3
##.SHIFT REFERENCE= (INTERNAL, CDCl3, 0, 182.463)
##AUDIT TRAIL= $$ (NUMBER, WHEN, WHO, WHERE, WHAT)
$$ ##TITLE= Audit trail, XWIN-NMR		Version 3.5
$$ ##JCAMPDX= 5.01
$$ ##ORIGIN= Bruker BioSpin GmbH
$$ ##OWNER= she
$$ F:/spectra/data/she/nmr/P31/1/pdata/1/auditp.txt
$$ ##AUDIT TRAIL=  $$ (NUMBER, WHEN, WHO, WHERE, WHAT)
(   1,<2020-10-23 13:36:33.60 +0400>,<she>,<DPX200>,
      <created by zg, POWCHK disabled, PULCHK disabled
       configuration hash MD5:
       00 E9 B6 7A A2 85 ED C7 34 08 36 98 17 FE 4E 26
       data hash MD5: 32K
       7B 9C 59 AB 15 FC 34 83 ED DD 97 F7 2C A1 DB A1>)
(   2,<2020-10-23 13:36:38.75 +0400>,<she>,<DPX200>,
      <Start of raw data processing
       efp BC_mod = 2 LB = 1 FT_mod = 6 PKNL = 1 PHC0 = -2408.955 PHC1 = 73.00069 SI = 64K 
       data hash MD5: 64K
       A1 C5 3F 70 21 FB C5 22 CE 97 5B 00 BC EE 04 DA>)
(   3,<2020-10-23 13:36:52.01 +0400>,<she>,<DPX200>,
      <pk PHC0 = 5.29605 PHC1 = 0 
       data hash MD5: 64K
       B3 87 75 81 8E D9 C1 8A BC C2 FC E7 DE 75 66 5E>)
(   4,<2020-10-23 13:37:07.57 +0400>,<she>,<DPX200>,
      <abs ABSG = 5 
       data hash MD5: 64K
       50 2B 00 01 38 47 A0 F4 89 A3 1B A1 1B 70 7E ED>)
$$ ##END=
$$ 
$$ hash MD5
$$ FA A6 78 3B A6 DC 00 90 A7 EA 3E B0 41 28 F2 9C
##$RELAX= 
##$RELAX= 
##$RELAX= 
##$RELAX= 
##$RELAX= 
##$RELAX= 
##$RELAX= 
##$RELAX= 
$$ Bruker specific parameters
$$ --------------------------
##$DU= <F:/spectra>
##$EXPNO= 1
##$NAME= <P31>
##$PROCNO= 1
##$TYPE= <nmr>
##$USER= <she>
##$AMP= (0..31)
100 100 100 100 100 100 100 100 100 100 100 100 100 100 100 100 100 100 
100 100 100 100 100 100 100 100 100 100 100 100 100 100 
##$AQSEQ= 0
##$AQ_mod= 1
##$AUNM= <au_zg>
##$AUTOPOS= <>
##$BF1= 81.014009
##$BF2= 200.13
##$BF3= 200.13
##$BF4= 200.13
##$BF5= 200.13
##$BF6= 200.13
##$BF7= 200.13
##$BF8= 200.13
##$BYTORDA= 1
##$CFDGTYP= 0
##$CFRGTYP= 5
##$CHEMSTR= <none>
##$CNST= (0..31)
1 1 145 1 1 1 1 1 1 1 1 1 1 1 1 1 1 1 1 1 1 1 1 1 1 1 1 1 1 1 1 1 
##$CPDPRG= <waltz16>
##$CPDPRG1= <>
##$CPDPRG2= <waltz16>
##$CPDPRG3= <>
##$CPDPRG4= <mlev>
##$CPDPRG5= <mlev>
##$CPDPRG6= <mlev>
##$CPDPRG7= <mlev>
##$CPDPRG8= <mlev>
##$CPDPRGB= <>
##$CPDPRGT= <>
##$D= (0..31)
0 1 0 0 0 0 0 0 0 0 0 0.03 2e-05 3e-06 0 0 0 0 0 0 0 0 0 0 0 0 0 0 0 0 
0 0 
##$DATE= 1603445792
##$DBL= (0..7)
120 120 120 11 120 120 24 19 
##$DBP= (0..7)
150 150 150 150 150 150 150 150 
##$DBP07= 0
##$DBPNAM0= <>
##$DBPNAM1= <>
##$DBPNAM2= <>
$$ [...]
##$SUBNAM3= <"">
##$SUBNAM4= <"">
##$SUBNAM5= <"">
##$SUBNAM6= <"">
##$SUBNAM7= <"">
##$SUBNAM8= <"">
##$SUBNAM9= <"">
##$SW= 369.568048894756
##$SWIBOX= (0..15)
0 1 3 0 0 0 0 0 0 0 0 0 0 0 0 0 
##$SW_h= 29940.119760479
##$TD= 32768
##$TD0= 1
##$TE= 0
##$TE2= 300
##$TE3= 300
##$TEG= 300
##$TL= (0..7)
0 120 53 12 22 120 120 120 
##$TP= (0..7)
150 150 150 150 150 150 150 150 
##$TP07= 0
##$TPNAME0= <>
##$TPNAME1= <>
##$TPNAME2= <>
##$TPNAME3= <>
##$TPNAME4= <>
##$TPNAME5= <>
##$TPNAME6= <>
##$TPNAME7= <>
##$TPOAL= (0..7)
0.5 0.5 0.5 0.5 0.5 0.5 0.5 0.5 
##$TPOFFS= (0..7)
0 0 0 0 0 0 0 0 
##$TUNHIN= 0
##$TUNHOUT= 0
##$TUNXOUT= 0
##$USERA1= <user>
##$USERA2= <user>
##$USERA3= <user>
##$USERA4= <user>
##$USERA5= <user>
##$V9= 5
##$VALIST= <valist>
##$VCLIST= <CCCCCCCCCCCCCCC>
##$VD= 0
##$VDLIST= <DDDDDDDDDDDDDDD>
##$VPLIST= <PPPPPPPPPPPPPPP>
##$VTLIST= <TTTTTTTTTTTTTTT>
##$WBST= 1024
##$WBSW= 4
##$XGAIN= (0..3)
0 0 0 0 
##$XL= 0
##$YL= 0
##$YMAX_a= 19328
##$YMIN_a= -24711
##$ZGOPTNS= <>
##$ZL1= 120
##$ZL2= 120
##$ZL3= 120
##$ZL4= 120
##$ABSF1= 182.463
##$ABSF2= -187.1042
##$ABSG= 5
##$ABSL= 3
##$ALPHA= 0
##$AQORDER= 0
##$ASSFAC= 0
##$ASSFACI= 0
##$ASSFACX= 0
##$ASSWID= 0
##$AUNMP= <proc_1d>
##$AZFE= 0.1
##$AZFW= 0.5
##$BCFW= 0
##$BC_mod= 2
##$BYTORDP= 0
##$COROFFS= 0
##$CY= -3
##$DATMOD= 1
##$DC= 0
##$DFILT= <>
##$DTYPP= 0
##$F1P= 0
##$F2P= 0
##$FCOR= 1
##$FTSIZE= 65536
##$FT_mod= 6
##$GAMMA= 0
##$GB= 0
##$INTBC= 1
##$INTSCL= 5.30512e-09
##$ISEN= 30
##$LB= 1
##$LEV0= 0
##$LPBIN= 0
##$MAXI= 10000
##$MC2= 0
##$MEAN= 0
##$ME_mod= 0
##$MI= 50
##$NCOEF= 0
##$NC_proc= -6
##$NLEV= 6
##$NOISF1= 182.463
##$NOISF2= 159.3651
##$NSP= 0
##$NTH_PI= 0
##$NZP= 0
##$OFFSET= 182.463
##$PC= 4
##$PHC0= -2403.659
##$PHC1= 73.00069
##$PH_mod= 1
##$PKNL= yes
##$PPARMOD= 0
##$PSCAL= 0
##$PSIGN= 0
##$REVERSE= no
##$SF= 81.014009
##$SI= 65536
##$SIGF1= 159.3651
##$SIGF2= -187.1042
##$SINO= 113.3802
##$SIOLD= 16384
##$SREGLST= <1H.CDCl3>
##$SSB= 0
##$STSI= 65536
##$STSR= 0
##$SW_p= 29940.119760479
##$SYMM= 0
##$S_DEV= 0
##$TDeff= 32768
##$TDoff= 0
##$TI= <>
##$TILT= no
##$TM1= 0
##$TM2= 0
##$TOPLEV= 0
##$USERP1= <user>
##$USERP2= <user>
##$USERP3= <user>
##$USERP4= <user>
##$USERP5= <user>
##$WDW= 1
##$XDIM= 65536
##$YMAX_p= 402196859
##$YMIN_p= -9560841
$$ End of Bruker specific parameters
$$ ---------------------------------
##NTUPLES= NMR SPECTRUM
##VAR_NAME=  FREQUENCY,     SPECTRUM/REAL,   SPECTRUM/IMAG
##SYMBOL=    X,             R,               I
##VAR_TYPE=  INDEPENDENT,   DEPENDENT,       DEPENDENT
##VAR_FORM=  AFFN,          ASDF,            ASDF
##VAR_DIM=   65536,         65536,           65536
##UNITS=     HZ,            ARBITRARY UNITS, ARBITRARY UNITS
##FACTOR=    0.456856943014862, 1,           1
##FIRST=     14782.0589164895, 0,            0
##LAST=      -15158.0608439895, 0,           0
##MIN=       -15158.0608439895, -9560841,    0
##MAX=       14782.0589164895, 402196859,    0
$$ Real data points
##PAGE= N=1
##DATA TABLE= (X++(R..R)), XYDATA
$$ [...]
$$ plain form
36552 145864 2259132 3101432 1847565 -62517 -1073711 -887969 403006 2522079 4077766
36543 4077766 3586547 1826832 1001578 1272046 710015 -839956 -949900 1248169 3291882
36534 3291882 3435709 3357543 4612811 5375076 3606690 996533 426036 1363169 1182931
36525 1182931 -322992 -1226850 -1271830 -1872986 -2771862 -2079148 316145 2363297 2998977
36516 2998977 2965528 2493067 1049724 -378754 265080 2723342 4158104 3085492 1162054
36507 1162054 278758 286900 518003 1196350 2220121 2667191 2598355 3284584 4616190 4537020
36497 4537020 2323945 137532 -275435 -207586 -1418830 -3012203 -3185101 -2408389 -2288144
36488 -2288144 -2470659 -1367177 713065 1734114 1014489 -130830 -758899 -1169258 -1316672
$$ packed form
36552A45864K113268Q42300j253867j910082j011194J85742J290975K119073J555687
36543D077766m91219j759715q25254K70468n62031j549971j09944K198069K043713
36534C291882J43827p8166J255268P62265j768386k610157n70497R37133j80238
36525A182931j505923r03858m4980o01156q98876O92714K395293K047152O35680
36516B998977l3449m72461j443343j428478O43834K458262J434762j072612j923438
36507A162054q83296Q142K31103O78347J023771M47070o8836O86229J331606p9170
36497D537020k213075k186413m12967O7849j211244j593373j72898P76712J20245
36488b288144j82515J103482K080242J021049p19625j145319o28069m10359j47414
$$ plain form
36479 -1316672 -484880 979219 1474578 445157 -584295 -57967 1662747 3106076 3467595
36470 3467595 2884768 1749102 471370 -579996 -1421903 -2335845 -3155229 -3251740 -2518907
36461 -2518907 -1731504 -1536108 -1683860 -1728193 -1894910 -2586622 -3380248 -3286962 -2028665 -494308
36451 -494308 261204 136759 -108566 148427 799798 1403070 1843055 2303181 2690536 2508673
36441 2508673 1494086 125965 -760520 -784800 -298696 35705 -177123 -778637 -1216191
36432 -1216191 -1105922 -707191 -652163 -1134425 -1650789 -1720415 -1548631 -1652754 -2038748 -2176204
36422 -2176204 -1793723 -1319818 -1312082 -1609700 -1379998 -186981 1172755 1339871 45040
36413 45040 -1353575 -1414923 -390537 141760 -693470 -2068110 -2590716 -1887421 -821742
$$ packed form
36479a316672Q31792J464099M95359j029421j029452N26328J720714J443329L61519
36470C467595n82827j135666j277732j051366q41907r13942q19384r6511P32833
36461b518907P87403J95396j47752m4333j66717o91712p93626R3286J258297J534357
36451d94308P55512j24445k45325K56993O51371O03272M39985M60126L87355j81863
36441B508673j014587j368121q86485k4280M86104L34401k12828o01514m37554
36432a216191J10269L98731N5028m82262n16364o9626J71784j04123l85994j37456
36422b176204L82481M73905P736k97618K29702J193017J359736J67116j294831
36413D5040j398615o1348J024386N32297q35230j374640n22606P03295J065679
$$ plain form
36404 -821742 -549990 -1557906 -3287164 -4508433 -4283256 -2686458 -541913 1315389 2306321
36395 2306321 2131105 1122926 202646 -221420 -900072 -2430014 -3821619 -3657876 -2316497
36386 -2316497 -1405013 -1073643 136805 2380316 3593261 2538271 815511 351540 562926
36377 562926 -126239 -1302147 -1314296 -211529 364501 -9658 67628 1417501 2957030
36368 2957030 3120804 1377271 -1706535 -4675938 -5608356 -3787647 -970831 416342
36360 416342 249070 322323 1244111 1812918 1652820 2002671 3015765 2705543 133742
36351 133742 -2445462 -2688332 -1772303 -2437551 -4469422 -4928076 -2695269 -91017 630044
36342 630044 81334 -80762 73276 -579915 -1886075 -2481227 -1824112 -787078 -303924
$$ packed form
36404h21742K71752j007916j729258j221269K25177J596798K144545J857302R90932
36395B306321j75216j008179r20280m24066o78652j529942j391605J63743J341379
36386b316497R11484L31370J210448K243511J212945j054990j722760m63971K11386
36377E62926o89165j175908j2149J102767N76030l74159P7286J349873J539529
36368B957030J63774j743533l083806k969403r32418J820709K816816J387173
36360D16342j67272P3253R21788N68807j60098L49851J013094l10222k571801
36351A33742k579204k42870R16029o65248k031871m58654K232807K604252P21061
36342F30044n48710j62096J54038o53191j306160n95152O57115J037034M83154
$$ plain form
36333 -303924 -556120 -1482142 -2923358 -4011009 -3540410 -1564535 251160 597401 132746
36324 132746 284289 1100507 1451343 980057 493175 414116 253962 -40548 413102 1901910
36314 1901910 3280427 3542235 3176782 2944969 2333360 611327 -1276763 -1477855 260700
36305 260700 2164449 2546764 1356994 -249925 -904755 165031 2200154 3044056 1476969
36296 1476969 -814032 -1088192 707832 1813848 583680 -1321754 -1539782 -208235
36288 -208235 729296 347027 -523986 -840009 -416189 407947 1306195 2050900 2428434 2188379
36278 2188379 1277278 401678 862343 2985525 5135184 5501586 4553582 4107825 4154712
36269 4154712 2871832 291985 -636840 1781538 4902156 5028225 2351221 180622
$$ packed form
36333c03924k52196r26022j441216j087651M70599J975875J815695L46241m64655
36324A32746J51543Q16218L50836m71286m86882p9059j60154k94510M53650J488808
36314A901910J378517K61808l65453k31813o11609j722033j888090k01092J738555
36305B60700J903749L82315j189770j606919o54830J069786K035123Q43902j567087
36296A476969k291001k74160J796024J106016j230168j905434k18028J331547
36288b08235R37531l82269q71013l16023M23820Q24136Q98248P44705L77534k40055
36278B188379r11101q75600M60665K123182K149659L66402r48004m45757M6887
36269D154712j282880k579847r28825K418378L120618J26069k677004k170599
$$ plain form
36261 180622 120031 611745 149315 -509539 53838 1865657 3877217 5163864 5225449
36252 5225449 4008891 2117504 378196 -969064 -2075955 -2665485 -2320589 -1505210 -1239154
36243 -1239154 -1629723 -1689645 -776648 695253 2088108 3062946 3091079 1651692 -511450
36234 -511450 -1399599 49765 2418248 3401049 2619123 1878093 2593145 3906624 3983648
36225 3983648 2644906 1643236 2076685 2593243 1230544 -1525082 -3037040 -1983403
36217 -1983403 31817 944762 823859 934173 1509659 1940396 2290964 2981834 3424501
36208 3424501 2568197 666426 -849962 -1179852 -679621 170294 1067883 1375056 641027
36199 641027 -451761 -915019 -1042662 -1819863 -2960159 -3100190 -1924343 -501387 543268
$$ packed form
36261A80622o0591M91714m62430o58854N63377J811819K011560J286647O1585
36252E225449j216558j891387j739308j347260j106891n89530L44896Q15379K66056
36243a239154l90569n9922R12997J471901J392855R74838K8133j439387k163142
36234e11450q88149J449364K368483R82801p81926p41030P15052J313479P7024
36225C983648j338742j001670M33449N16558j362699k755626j511958J053637
36217a983403K015220R12945j20903J10314N75486M30737L50568O90870M42667
36208C424501q56304j901771j516388l29890N00231Q49915Q97589L07173p34029
36199F41027j092788m63258j27643p77201j140296j40031J175847J422956J044655
$$ plain form
36190 543268 1508189 2134915 1512469 -68591 -937946 -396103 332565 133314 -629249
36181 -629249 -1482701 -2854003 -4676725 -5549538 -4504881 -2389215 -433522 1286030 2900855
36172 2900855 3629252 2955732 1876245 1663679 2219430 2679410 2698128 2163038 759453
36163 759453 -1121217 -2223742 -2261793 -2571218 -3746796 -4226957 -2838810 -1146899 -1201620
36154 -1201620 -2304127 -2366294 -1419146 -1193177 -1937959 -2351819 -2283307 -2758824 -3385306 -2478414
36144 -2478414 -83459 1727927 2074661 2278576 3040466 3179620 2156250 1352394 1527033
36135 1527033 1313739 -151602 -1243947 -409192 1113441 1296239 591747 839072 1955461
36126 1955461 2267384 1682316 1997194 3827604 5403956 5133102 3739437 2962143 3225652
$$ packed form
36190E43268R64921O26726o22446j581060q69355N41843P28668j99251p62563
36181f29249q53452j371302j822722q72813J044657K115666J955693J719552J614825
36172B900855P28397o73520j079487k12566N55751M59980J8718n35090j403585
36163G59453j880670j102525l8051l09425j175578m80161J388147J691911n4721
36154a201620j102507o2167R47148K25969p44782m13860O8512m75517o26482R06892
36144b478414K394955J811386L46734K03915P61890J39154j023370q03856J74639
36135A527033k13294j465341j092345Q34755J522633J82798p04492K47325J116389
36126A955461L11923n85068L14878J830410J576352k70854j393665p77294K63509
$$ plain form
36117 3225652 3531656 3065121 2120652 1569185 1790716 2188534 1821103 569008 -639122
36108 -639122 -983162 -703276 -539655 -743054 -1173014 -1818989 -2472073 -2368665 -1113328
36099 -1113328 343232 667759 -46805 -465989 11150 556765 387699 -125168 -222697
36090 -222697 276592 1239474 2594671 3892154 4292722 3689369 3146771 3471273 4012254
36081 4012254 3792407 3195926 3320107 4014963 3999162 2979673 2211889 2494877 2916303
36072 2916303 2355633 1136492 237234 -195745 -435552 -133155 917426 1596031 694248
36063 694248 -914653 -1106654 394449 1572803 1229934 661944 1279553 2281156 2146112
36054 2146112 1128867 563416 571445 262639 -263628 79768 1390644 2340088 1951554
$$ packed form
36117C225652L06004m66535r44469n51467K21531L97818l67431j252095j208130
36108f39122l44040K79886J63621k03399m29960o45975o53084J03408J255337
36099a113328J456560L24527p14564m19184M77139N45615j69066n12867r7529
36090b22697M99289R62882J355197J297483M00568o03353n42598L24502N40981
36081D012254k19847n96481J24181O94856j5801j019489p67784K82988M21426
36072B916303n60670j219141q99258m32979k39807L02397J050581O78605r01783
36063F94248j608901j92001J501103J178354l42869n67990O17609J001603j35044
36054B146112j017245n65451Q029l08806n26267L43396J310876R49444l88534
$$ plain form
36045 1951554 690129 -363652 -477944 557254 2225538 3291642 2957476 1881641
36037 1881641 1142688 623242 -305424 -961346 10597 2219984 3628620 3395036 2815584
36028 2815584 2908580 2909150 2008239 838737 113331 -654115 -1769774 -2089362 -616374 1686399
36018 1686399 3111623 3317253 2880844 1774520 -77097 -1526809 -1342072 -242040 -109061
36009 -109061 -1357126 -2656197 -3150122 -3331220 -3611554 -3588650 -3095344 -2657575 -2472286
36000 -2472286 -2051870 -1273157 -708721 -529918 -187757 312628 -42673 -1672931 -3298379
35991 -3298379 -3464841 -2573435 -2295847 -3202585 -4032243 -3472549 -1813031 -384053 90958
35982 90958 1039 17581 471132 1522433 3115613 4407290 4089976 2102455 417453
$$ packed form
36045A951554j261425j053781j14292J035198J668284J066104l34166j075835
36037A881641p38953n19446r28666o55922R71943K209387J408636k33584n79452
36028B815584R2996N70r00911j169502p25406p67446j115659l19588J472988K302773
36018A686399J425224K05630m36409j106324j851617j449712J84737J100032J32979
36009a09061j248065j299071m93925j81098k80334K2904M93306M37769J85289
36000b472286M20416P78713N64436J78803L42161N00385l55301j630258j625448
35991c298379j66462Q91406K77588r06738q29658N59694J659518J428978M75011
35982I0958q9919J6542M53551J051301J593180J291677l17314j987521j685002
$$ plain form
35973 417453 1020252 3389581 5167817 5146958 4144636 2888676 894839 -1809648 -3580320
35964 -3580320 -3107180 -1293869 134081 893114 1630544 2094945 1526374 417926 263566
35955 263566 1592984 3448627 4717516 5017052 4522012 3823900 3610713 3726386 3213547
35946 3213547 2067253 1793408 2982632 3689414 2105304 -337715 -895109 323696 832202
35937 832202 -59181 -540978 189201 829929 933030 1856877 3718715 4369794 2916456
35928 2916456 1533345 1955596 2734735 2151889 1422823 2265613 3280299 2027775 -476363
35919 -476363 -777317 1827222 4298510 4408775 3451943 3484383 4221025 4208701 3639601 4315114
35909 4315114 7163172 10844407 12973343 12433228 10400028 8977960 8866434 8866449 7831399
$$ packed form
35973D17453O02799K369329J778236k0859j002322j255960j993837k704487j770672
35964c580320M73140J813311J427950P59033P37430M64401n68571j108448j54360
35955B63566J329418J855643J268889K99536m95040o98112k13187J15673n12839
35946C213547j146294k73845J189224P06782j584110k443019n57394J218805N08506
35937H32202q91383m81797P30179O40728J03101R23847J861838O51079j453338
35928B916456j383111M22251P79139n82846p29066Q42790J014686j252524k504138
35919d76363l00954K604539K471288J10265r56832L2440P36642j2324n69100O75513
35909D315114K848058L681235K128936n40115k033200j422068j11526J5j035050
$$ plain form
35900 7831399 6270100 5427407 5525867 5733438 5340646 4256090 2906656 2281525 3282500
35891 3282500 5263215 6167515 5113614 3809521 4159702 5577417 6310953 6385975 7061855
35882 7061855 8007041 7560414 5853337 5171375 6545423 8140161 8032206 6784933 6064528
35873 6064528 6171420 6286358 6076379 5695066 4886274 3316220 1440980 140879 -267900
35864 -267900 -114735 110128 -114156 -1074143 -2134738 -1952419 -54949 2279722 3332692
35855 3332692 2671487 1071533 -608971 -1719794 -1621269 -275384 1189902 1513941 933930
35846 933930 940237 2268658 3918964 4491238 3856853 3010484 2671413 2618924 2316889 1695282
35836 1695282 1177382 1191762 1726438 2134613 1422831 -762650 -3213598 -3805006 -1652593
$$ packed form
35900G831399j561299q42693R8460K07571l92792j084556j349434o25131J000975
35891C282500J980715R04300j053901j304093L50181J417715P33536P5022O75880
35882G061855R45186m46627j707077o81962J374048J594738j07955j247273p20405
35873F064528J06892J14938k09979l81313q08792j570054j875240j300101m08779
35864b67900J53165K24863k24284r59987j060595J82319J897470K334671J052970
35855C332692o61205j599954j680504j110823R8525J345885J465286L24039n80011
35846I33930O307J328421J650306N72274o34385q46369l39071n2489l02035o21607
35836A695282n17900J4380N34676M08175p11782k185481k450948n91408K152413
$$ plain form
35827 -1652593 1723237 4006232 4465426 3934064 2952918 1384531 -173512 -353415 952615
35818 952615 2053579 1876491 1485877 2004970 2463273 1413429 -392813 -944369 928
35809 928 792307 510417 -153476 -517039 -559566 58151 1766419 3674847 4176086 3267297
35799 3267297 2534094 2509993 1944128 235489 -1352260 -1763131 -1652557 -1822412 -1821522 -1233002
35789 -1233002 -795595 -982350 -867960 278651 1581372 2083529 2416995 3479709 4614530
35780 4614530 4692951 4030054 3649465 3554450 3295188 3298944 3913308 4054080 2759704 1302346
35770 1302346 1556555 2825472 2756793 1288012 1054616 3359151 6140563 6967552 6090642
35761 6090642 5315177 5474113 6391948 8077940 10446015 12632752 13938000 14950145 16595611
$$ packed form
35827a652593L375830K282995M59194n31362r81146j568387j558043j79903J306030
35818I52615J100964j77088l90614N19093M58303j049844j806242n51556R45297
35809I28P91379k81890o63893l63563m2527O17717J708268J908428N01239r08789
35799C267297p33203k4101n65865j708639j587749m10871J10574j69855Q90N88520
35789a233002M37407j86755J14390J146611J302721N02157L33466J062714J134821
35780D614530P8421o62897l80589r5015k59262L756O14364J40772j294376j457358
35770A302346K54209J268917o8679j468781k33396K304535K781412Q26989q76910
35761F090642p75465J58936R17835J685992K368075K186737J305248J012145J645466
$$ plain form
35752 16595611 18440609 19009536 17650781 15242130 13112541 11905154 11379112 10736409
35744 10736409 9253488 7123144 5526882 5316577 5768785 5308764 3467818 1431662
35736 1431662 489085 649821 1199824 1939915 3067652 4160387 4302662 3432179 2712875
35727 2712875 3098568 4174521 4953578 5130915 4787323 3570514 1398497 -424041 -302505
35718 -302505 1369227 2524156 2347097 2289178 3428587 4458452 3705227 1984039 1681452
35709 1681452 3450323 5414354 5662506 4300575 2856197 2523335 3129592 3278163 1658312
35700 1658312 -1255954 -3223448 -2672370 -651758 542568 207465 -439955 -443678 -257788
35691 -257788 -618545 -1446063 -2197102 -2485039 -2153206 -1451539 -1185853 -1900926 -2871234 -2741080
$$ packed form
35752A6595611J844998N68927j358755k408651k129589j207387n26042o42703
35744A0736409j482921k130344j596262k10305M52208m60021j840946k036156
35736A431662r42577J60736N50003P40091J127737J092735J42275q70483p19304
35727B712875L85693J075953P79057J77337l43592j216809k172017j822538J21536
35718c02505J671732J154929j77059n7919J139409J029865p53225j721188l02587
35709A681452J768871J964031K48152j361931j444378l32862O06257J48571j619851
35700A658312k914266j967494N51078K020612J194326l35103o47420l723J85890
35691b57788l60757q27518p51039k87937L31833P01667K65686p15073r70308J30154
$$ plain form
35681 -2741080 -1283378 278120 851320 630319 476590 803612 1316307 1439059 938831
35672 938831 399686 808871 2274842 3618344 3767666 2928775 1701088 -37951 -2229521
35663 -2229521 -3553825 -2909181 -1418658 -1184064 -2348134 -3202990 -2962177 -2378167 -1662608
35654 -1662608 -122262 1726061 2004519 288289 -1460229 -1691283 -1047829 -391942 807077
35645 807077 2735229 3892200 3218755 1901569 1291422 633810 -1111353 -2662212 -2039497
35636 -2039497 151423 1495794 1306179 1104348 1870409 3034281 4150894 5405612 6197293
35627 6197293 5228063 2582559 127997 -717161 -312883 435241 1234616 1869776 1835300
35618 1835300 1142269 517211 382380 538294 991422 1921300 2656524 2105549 618799
$$ packed form
35681b741080J457702J561498N73200k21001j53729L27022N12695J22752n00228
35672I38831n39145M09185J465971J343502J49322q38891j227687j739039k191570
35663b229521j324304O44644J490523K34594j164070q54856K40813N84010P15559
35654a662608J540346J848323K78458j716230j748518k31054O43454O55887J199019
35645H07077J928152J156971o73445j317186o10147o57612j745163j550859O22715
35636b039497K190920J344371j89615k01831P66061J163872J116613J254718P91681
35627F197293r69230k645504k454562q45158M04278P48124P99375O35160l4476
35618A835300o93031o25058j34831J55914M53128R29878P35224n50975j486750
$$ plain form
35609 618799 -62604 668566 1377397 1105347 1127116 2691588 4408333 3985036 1876119
35600 1876119 890589 2077340 3202961 2147886 -11978 -735952 401313 1639647
35592 1639647 1994466 2337187 3280537 3801946 2957273 1637321 1235264 1402418 726492
35583 726492 -753401 -1452233 -730110 278549 818143 1725638 3441446 4350134 2737035
35574 2737035 -463915 -2526465 -2155724 -448673 1064721 1860683 1929591 1315895 551216
35565 551216 489134 1275431 2201507 2751515 3021609 3002518 2374563 1311003 665038 983129
35555 983129 1967628 3143115 4325449 5160242 5012075 3816791 2431426 1625257 1208134
35546 1208134 643676 94742 286694 1507228 3166711 4320775 4443024 3760051 2924210
$$ packed form
35609F18799o81403P31170P08831k72050K1769J564472J716745m23297k108917
35600A876119r85530J186751J125621j055075k159864p23974J137265J238334
35592A639647L54819L42721R43350N21409q44673j319952m02057J67154o75926
35583G26492j479893o98832P22123J008659N39594R07495J715808R08688j613099
35574B737035l200950k062550L70741J707051J513394P95962O8908o13696p64679
35565E51216o2082P86297R26076N50008K70094j9091o27955j063560o45965L18091
35555I83129R84499J175487J182334Q34793j48167j195284j385365q06169m17123
35546A208134n64458n48934J91952J220534J659483J154064J22249o82973q35841
$$ plain form
35537 2924210 2336689 1919220 1640719 1848795 2608267 3093010 2446935 1175133 816904
35528 816904 2050734 3878974 4986429 5198732 5145628 5090237 4781384 4245141 4070709
35519 4070709 4690421 5619525 5773130 4782298 3779839 4227729 5803914 6318246 4406019
35510 4406019 1554091 391706 1476277 3078590 3896659 4396971 5229215 5913205 5884648
35501 5884648 5607170 5667181 5720301 5425863 5682307 7625357 10662282 12720685 12615303
35492 12615303 11313509 10614065 11255854 12682404 14118248 15250360 15952124 15969983 15306826
35483 15306826 14670310 14935416 16033700 16975614 17367241 18304344 20993821 24813706 27687465
35474 27687465 28445844 28013357 28028670 28975917 30077481 30618946 30961895 32259807 35197942
$$ packed form
35537B924210n87521m17469k78501K08076P59472M84743o46075j271802l58229
35528H16904J233830J828240J107455K12303n3104n5391l08853n36243j74432
35519D070709O19712R29104J53605r90832j002459M47890J576185N14332j912227
35510D406019k851928j162385J084571J602313Q18069N00312Q32244O83990k8557
35501E884648k77478O0011N3120k94438K56444J943050L036925K058403j05382
35492A2615303j301794o99444O41789J426550J435844J132112P01764J7859o63157
35483A5306826o36516K65106J098284R41914L91627R37103K689477L819885K873759
35474B7687465P58379m32487J5313R47247J101564N41465L42949J297912K938135
$$ plain form
35465 35197942 39059546 42428997 44984877 47941652 52234351 57052800 61036636 64185207
35457 64185207 67416040 70873041 74147576 77724542 82445614 87621916 91458081 93452718
35449 93452718 94580426 94986390 93673003 90952463 88767525 87471152 84682493 79060511
35441 79060511 73101828 69951431 69055071 67488805 64414831 61414781 58993939 55739225
35433 55739225 51223246 47113179 44529881 42373461 39368284 36150990 34074039 33096285
35425 33096285 32165415 30995402 30221252 30030128 29680362 28559061 27064381 26022637 25455878
35416 25455878 24461102 22573754 20758506 20233426 20450165 19435361 16597299 14042036
35408 14042036 14187847 16931620 20177763 22360168 23246947 23010275 22059586 21467544 22050002
$$ packed form
35465C5197942L861604L369451K555880K956775M292699M818449L983836L148571
35457F4185207L230833L457001L274535L576966M721072N176302L836165J994637
35449I3452718J127708M05964j313387k720540k184938j296373k788659n621982
35441G9060511n958683l150397q96360j566266l073974l000050k420842l254714
35433E5739225m515979m110067k583298k156420l005177l217294k076951r77754
35425C3096285r30870j170013p74150j91124l49766j121301j494680j041744n66759
35416B5455878r94776j887348j815248n25080K16739j014804k838062k555263
35408A4042036J45811K743773L246143K182405Q86779k36672r50689n92042N82458
$$ plain form
35399 22050002 23117829 23503860 23672636 25249862 28413335 31466848 33430328 35372326
35391 35372326 38318815 41270042 42525726 42077849 41407934 41324167 41158862 40170843 38921412
35382 38921412 38782919 40169824 41592460 40970626 38088522 35109526 33985632 33909003 32385855
35373 32385855 28545189 24105959 21011496 19423819 18446980 17613543 16947043 16434289 16163436
35364 16163436 16366111 16759174 16464239 15163494 13791156 13459779 14075717 14559735 14193454
35355 14193454 13317550 12810045 13098615 13640700 13432166 12140630 10427055 8926423 7565393
35346 7565393 6448690 6494636 8010421 9416475 9008251 7459796 6669689 6520838 5242117
35337 5242117 3068431 2615862 4672915 6536622 6250598 5781180 7503333 9806612 9409036
$$ packed form
35399B2050002J067827L86031J68776J577226L163473L053513J963480J941998
35391C5372326K946489K951227J255684m47877o69915q3767j65305r88019j249431
35382C8921412j38493J386905J422636o21834k882104k978996j123894p6629j523148
35373C2385855l840666m439230l094463j587677r76839q33437o66500n12754k70853
35364A6163436K02675L93063k94935j300745j372338l31377O15938M84018l66281
35355A4193454q75904n07505K88570N42085k08534j291536j713575j500632j361030
35346G565393j116703M5946J515785J406054m08224j548455p90107j48851j278721
35337E242117k173686m52569K057053J863707k86024m69418J722153K303279l97576
$$ plain form
35328 9409036 6646417 5009400 5961300 7538408 8114505 8290963 8421250 7358876 4996437
35319 4996437 3498571 4309687 5863916 5959103 4783728 3842936 3318751 2512528 1909166
35310 1909166 2647315 4332207 5288808 4941554 4337297 4276424 4448563 4599223 5057438
35301 5057438 5642056 5352367 3840767 2202877 1592331 1844568 2165175 2447807 3081533
35292 3081533 3987241 4739257 5336381 5961147 6080763 4737531 2072921 -80998 209631
35283 209631 2774171 5106139 4749156 2006432 -188917 431523 2808427 4200389 4178634
35274 4178634 5177361 8430485 11377433 10951128 8034085 6100069 6096279 5710456 3975556
35265 3975556 3295078 5375996 7992159 8212333 6784473 6449354 7282495 6957971 5118702
$$ packed form
35328I409036k762619j637017R51900J577108N76097J76458J30287j062374k362439
35319D996437j497866Q11116J554229R5187j175375r40792n24185q06223o03362
35310A909166P38149J684892R56601l47254o04257o0873J72139J50660M58215
35301E057438N84618k89689j511600j637890o10546K52237L20607K82632O33726
35292C081533R05708P52016N97124O24766J19616j343232k664610k153919K90629
35283B09631K564540K331968l56983k742724k195349O20440K376904J391962k1755
35274D178634R98727L253124K946948m26305k917043j934016l790l85823j734900
35265C975556o80478K080918K616163K20174j427860l35119Q33141l24524j839269
$$ plain form
35256 5118702 4147512 5178275 6317110 5888075 4982909 5332702 6522646 6893778 5905542
35247 5905542 4259093 2755080 2149761 3034569 4740475 5438630 4421488 3166824 3047270
35238 3047270 3333030 2912768 2639828 4010496 6433036 7922615 7996220 7826121 7861762
35229 7861762 7464582 6855222 7163722 8140917 7928732 5855612 3624585 2846012 3104173
35220 3104173 3506070 4445084 6373507 8195066 8597859 8098432 8091950 8517373 8177219
35211 8177219 6982169 6097352 5925879 5710291 5339352 5711979 6657774 6303180 3772498
35202 3772498 1111128 843058 2522192 3639163 3534954 4181179 6667024 9054766 9012715
35193 9012715 7086079 5711310 5870023 6457057 6558197 6593365 7101542 7906064 8813427
$$ packed form
35256E118702r71190J030763J138835m29035r05166L49793J189944L71132r88236
35247E905542j646449j504013o05319Q84808J705906O98155j017142j254664j19554
35238C047270K85760m20262k72940J370668K422540J489579P3605j70099L5641
35229G861762l97180o09360L08500R77195k12185k073120k231027p78573K58161
35220C104173M01897R39014J928423J821559M02793m99427o482M25423l40154
35211H177219j195050q84817j71473k15588l70939L72627R45795l54594k530682
35202C772498k661370k68070J679134J116971j04209O46225K485845K387742m2051
35193I012715j926636j374769J58713N87034J01140L5168N08177Q04522R07363
$$ plain form
35184 8813427 9851694 10481210 9890500 8549987 8092299 8922763 9325140 8000710 6239352
35175 6239352 6110487 7368632 7831151 6498911 4759655 4439424 5872974 8037990 9594536
35166 9594536 9645393 8318078 6734098 5790688 5157414 4232134 3659737 4607066 6588874
35157 6588874 7514723 6414953 4910938 5190194 7371281 9724038 10938396 11280622 11652435
35148 11652435 12203379 12108125 10595837 8122428 6315198 6466776 8184785 9838031 10196614
35139 10196614 9331836 8235170 8077674 9495285 11854736 13417832 12976637 11146506
35131 11146506 9356636 8054375 7018470 6920773 8768215 11649130 12961415 11710191
35123 11710191 9992606 10115145 11636508 12654258 12805106 13108149 13426789 12181918 8937994
$$ packed form
35184H813427J038267O29516n90710j340513m57688Q30464M02377j324430j761358
35175F239352j28865J258145M62519j332240j739256l20231J433550K165016J556546
35166I594536N0857j327315j583980r43410o33274r25280n72397R47329J981808
35157F588874R25849j099770j504015K79256K181087K352757J214358L42226L71813
35148A1652435N50944r5254j512288k473409j807230J51578J718009J653246L58583
35139A0196614q64778j096666j57496J417611K359451J563096m41195j830131
35131A1146506j789870j302261j035905r7697J847442K880915J312285j251224
35123A1710191j717585J22539J521363J017750J50848L03043L18640j244871l243924
$$ plain form
35114 8937994 5723150 4960207 6840355 9356469 10502838 10006992 9160884 9323150 10617974
35105 10617974 12040605 12725267 12800310 12891445 13221133 13554454 13670083 13405936 12511013
35096 12511013 11032142 9761278 9737734 11163008 13100065 14330651 14362225 13646053 12999770
35087 12999770 12827763 12851039 12615764 12097074 11525424 10841323 9929207 9331190 9891056
35078 9891056 11454395 12783300 13193430 13384402 14016677 14449025 13946661 13356209 14153637
35069 14153637 16142264 17533231 17332990 16308533 15398878 14574668 13797591 13769437 14778654
35060 14778654 15780702 15738826 15251770 15721170 17273810 18634564 18921635 18485141 17929035
35051 17929035 17386495 17026288 17221504 17681286 17334909 15823793 14345615 14093739 14487583
$$ packed form
35114H937994l214844p62943J880148K516114J146369m95846q46108J62266J294824
35105A0617974J422631O84662P5043R1135L29688L33321J15629k64147q94923
35096A2511013j478871j270864k3544J425274J937057J230586L1574p16172o46283
35087A2999770j72007K3276k35275n18690n71650o84101r12116n98017N59866
35078I891056J563339J328905M10130J90972O32275M32348n02364n90452P97428
35069A4153637J988627J390967k00241j024457r09655q24210p77077k8154J009217
35060A4778654J002048m1876m87056M69400J552640J360754K87071m36494n56106
35051A7929035n42540l60207J95216M59782l46377j511116j478178k51876L93844
$$ plain form
35042 14487583 14124344 13083368 12803309 13580615 13761974 12143059 9933779 9289950 10691149
35033 10691149 12789637 14195798 14364217 13372390 12138203 12398781 14917057 17798673
35025 17798673 18212920 16074427 14468243 15825522 19091652 21513975 21927263 21145883
35017 21145883 20198046 19598571 19713110 20374575 20397002 18799615 16499114 15601555 16833192
35008 16833192 18666150 19255017 18365677 17023872 16042639 15508146 15313407 15584129 16515077
34999 16515077 17975634 19389852 20167000 20295993 20177067 19678024 17948165 14840398 12101395
34990 12101395 12076257 15032171 18569396 20059249 19118750 17407153 16650887 17398927 19167363
34981 19167363 20971045 21795799 21266439 20072382 19325122 19330620 19387544 18991710 18703639
$$ packed form
35042A4487583l63239j040976k80059P77306J81359j618915k209280o43829J401199
35033A0691149K098488J406161J68419r91827j234187K60578K518276K881616
35025A7798673M14247k138493j606184J357279L266130K422323M13288p81380
35017B1145883r47837n99475J14539O61465K2427j597387k300501q97559J231637
35008A6833192J832958N88867q89340j341805r81233n34493j94739K70722R30948
34999A6515077J460557J414218P77148J28993j18926m99043j729859l107767k739003
34990A2101395k5138K955914L537225J489853r40499j711597p56266P48040J768436
34981A9167363J803682Q24754n29360j194057p47260N498N6924l95834k88071
$$ plain form
34972 18703639 19233953 19983174 19410684 17094037 14619872 13831219 14755010 16030843 16943192
34963 16943192 17939072 19199808 19961065 19782993 19530213 20233235 21504075 21954918 20998265
34954 20998265 19489759 18579034 18515836 18733342 18674008 18258268 17705032 17160649 16637717
34945 16637717 16252588 16251242 16643866 17105742 17538506 18361531 19697398 20599829 19916208
34936 19916208 17813368 15575200 13935956 12674989 11961618 12741617 15132902 17571580
34928 17571580 18487370 18053430 17435918 17083371 16738104 16489420 16676701 17070420 17132447
34919 17132447 16877771 16644604 16254566 15253970 13850202 12836649 12623502 12894075 13087037
34910 13087037 12785349 11919883 11021842 10893515 11632123 12492584 13062503 13766973 14698817
$$ packed form
34972A8703639N30314P49221n72490k316647k474165p88653R23791J275833R12349
34963A6943192R95880J260736P61257j78072k52780P03022J270840M50843r56653
34954B0998265j508506r10725o3198K17506n9334m15740n53236n44383n22932
34945A6637717l85129j346L92624M61876M32764Q23025J335867R02431o83621
34936A9916208k102840k238168j639244j260967p13371P79999K391285K438678
34928A7571580R15790m33940o17512l52547l45267k48684J87281L93719O2027
34919A7132447k54676k33167l90038j000596j403768j013553k13147K70573J92962
34910A3087037l01688q65466q98041j28327P38608Q60461N69919P04470R31844
$$ plain form
34901 14698817 14995256 14229001 13349501 13110421 12629404 10999983 9429573 9924184 12298783
34892 12298783 14335352 14767020 14392959 14242166 14289744 14161555 13649389 12383044 10340546
34883 10340546 8686679 8668972 9705164 10077338 9442825 8978702 9156345 9387872 9936316
34874 9936316 11810350 14241153 14709917 12511248 10081825 9584508 10327550 10974306 12010379
34865 12010379 13967186 15163486 13802334 11083458 9664239 9818665 9672903 8814445
34857 8814445 8985251 10933718 12958935 13389498 12718163 12321217 12425589 12433012 12367548 12851594
34847 12851594 13890667 14506435 13784543 12024617 10578140 10378902 10838910 10702155 9903703
34838 9903703 9722755 10832846 12176694 12401283 11565192 10644762 10086696 9712871 9406067
$$ packed form
34901A4698817K96439p66255q79500k39080m81017j629421j570410M94611K374599
34892A2298783K036569M31668l74061j50793M7578j28189n12166j266345k042498
34883A0340546j653867j7707J036192L72174o34513m64123J77643K31527N48444
34874I936316J874034K430803M68764k198669k429423m97317P43042O46756J036073
34865A2010379J956807J196300j361152k718876j419219J54426j45762q58458
34857H814445J70806J948467K025217M30563o71335l96946J04372P423o5464M84046
34847A2851594J039073O15768p21892j759926j446477j99238M60008j36755p98452
34838I903703j80948J110091J343848K24589q36091r20430n58066l73825l06804
$$ plain form
34829 9406067 8982823 7971330 6422415 5364394 5528957 6216438 6363019 6044704 5862132
34820 5862132 5628345 5026602 4868572 6066231 7812541 8540303 8419004 8965619 10156211
34811 10156211 10052381 7887153 5579405 5151920 6191416 7054198 7310165 7618267 8102753
34802 8102753 8325110 8380027 8678284 8870739 8228193 7080383 6690893 7400190 7915168
34793 7915168 7064897 5557330 5159069 6415301 8026317 8550969 7967579 7216809 6872430
34784 6872430 6866595 7044698 7237162 7103942 6734484 7104298 8871658 10856332 11012719
34775 11012719 9108932 7134138 6678233 7282484 7923283 8563580 9268081 9268256 8238143
34766 8238143 7293602 7325638 7453755 6607583 5489772 5246208 5301281 4562961 3837396 4667381
$$ packed form
34829I406067m23244j011493j548915j058021J64563O87481J46581l18315j82572
34820E862132k33787o01743j58030J197659J746310P27762j21299N46615J190592
34811A0156211j03830k165228k307748m27485J039496Q62782K55967L08102M84486
34802H102753K22357N4917K98257J92455o42546j147810l89490P09297N14978
34793G915168q50271j507567l98261J256232J611016N24652n83390p50770l44379
34784F872430n835J78103J92464j33220l69458L69814J767360J984674J56387
34775A1012719j903787j974794m55905O04251O40799O40297P04501J75j030113
34766H238143r44541L2036J28117q46172j117811k43564N5073p38320p25565Q29985
$$ plain form
34756 4667381 6371927 6803789 5809526 5288504 5736980 5497127 3960560 2799481 3057566
34747 3057566 3522517 3216145 3159457 4157465 4972116 4490590 3876981 4581142 5686351
34738 5686351 5322633 3640688 2387268 2326272 2899173 3702355 4480554 4294183 2600554
34729 2600554 787891 790135 2314863 3140743 2177359 676431 263584 1141715 2481487
34720 2481487 3462760 3725570 3678298 4339981 6025174 7437706 7101187 5402324 4030550
34711 4030550 3656294 3533479 3269005 3439325 4252945 5032689 5393986 5677811 5867881
34702 5867881 5365145 4299961 3804807 4352335 4930387 4546832 3578157 2963610 2962234 3322790
34692 3322790 3777427 3777515 2750324 1319611 1216362 3105977 5496745 6728775 6955090
$$ packed form
34756D667381J704546M31862r94263n21022M48476k39853j536567j161079K58085
34747C057566M64951l06372n6688R98008Q14651m81526o13609P04161J105209
34738E686351l63718j681945j253420o0996N72901Q03182P78199j86371j693629
34729B600554j812663K244J524728Q25880r63384j500928m12847Q78131J339772
34720B481487R81273K62810m7272O61683J685193J412532l36519j698863j371774
34711D030550l74256j22815k64474J70320Q13620P79744L61297K83825J90070
34702E867881n02736j065184m95154N47528N78052l83555r68675o14547j376L60556
34692C322790M54637Q8j027191j430713j03249J889615K390768J232030K26315
$$ plain form
34683 6955090 7015985 6579086 5091919 3644051 3750561 4661711 4142052 2067520 973143
34674 973143 2335453 4434317 5086697 4642397 4665384 5169910 5175795 5001687 5779318 7105076
34664 7105076 7360902 6388292 5752101 6025359 5919243 4831125 4154559 4779121 5140587
34655 5140587 3530926 944625 -422345 -505796 -909113 -1681760 -1169873 753776 1926459
34646 1926459 1313298 907538 2619658 5008532 5212908 3202642 1878725 3050039 5274175
34637 5274175 6174722 5335961 4032074 3246515 3173271 4079725 6243079 8842861 10053607
34628 10053607 8980553 6920518 5869365 6076038 6032561 4829882 3315816 2476193 1910774
34619 1910774 948585 320095 1241135 3254632 4535577 4357059 3848600 4126727 5043749
$$ packed form
34683F955090O0895m36899j487167j447868J06510R11150n19659k074532j094377
34674I73143J362310K098864O52380m44300K2987N04526N885j74108P77631J325758
34664G105076K55826r72610o36191K73258j06116j088118o76566O24562L61466
34655E140587j609661k586301j366970q3451m03317p72647N11887J923649J172683
34646A926459o13161m05760J712120K388874K04376k010266j323917J171314K224136
34637E274175R00547q38761j303887p85559p3244R06454K163354K599782J210746
34628A0053607j073054k060035j051153K06673m3477j202679j514066q39623n65419
34619A910774r62189o28490R21040K013497J280945j78518n08459K78127R17022
$$ plain form
34610 5043749 6091729 7093373 7443568 6151818 3559454 1723991 1954557 3026502
34602 3026502 3071886 2261718 2119073 2877549 3226983 2458873 1282697 436360 -105548
34593 -105548 -301217 254337 1315010 1798184 1268370 723034 1151859 2008922 2032646 1210479
34583 1210479 896204 1837351 2944922 2611762 816836 -851647 -1209285 -634849 107063
34574 107063 1224804 3146032 5113798 5934627 5922863 6557988 7998258 8544017 7215582
34565 7215582 5334841 4534382 4568047 4415613 4353139 5196139 6221431 5741195 3637695
34556 3637695 1733968 1466424 2404072 3217024 3045308 1790213 49347 -1060476 -833396
34547 -833396 174830 883155 1100380 1409041 1907948 2101608 1936617 1900588 2068456 2006866
$$ packed form
34610E043749J047980J001644L50195j291750k592364j835463K30566J071945
34602C026502M5384q10168j42645P58476L49434p68110j176176q46337n41908
34593a05548j95669N55554J060673M83174n29814n45336M28825Q57063K3724q22167
34583A210479l14275R41147J107571l33160j794926j668483l57638N74436P41912
34574A07063J117741J921228J967766Q20829j1764O35125J440270N45759j328435
34565G215582j880741q00459L3665j52434o2474Q43000J025292m80236k103500
34556C637695j903727k67544R37648Q12952j71716j255095j740866j109823K27080
34547h33396J008226P08325K17225L08661M98907J93660j64991l6029J67868o1590
$$ plain form
34537 2006866 1663159 1469709 1566250 1731652 1976438 2387818 2631820 2491138 2506423 3064202
34527 3064202 3410658 2900311 2616584 3996524 6226248 7036405 6013628 4954302 4747370
34518 4747370 4245590 2799856 1546368 1211269 864023 45585 -36546 1108044 1787575
34509 1787575 840751 -103569 843283 2708837 3361623 2903680 2842093 3022560 2179285
34500 2179285 851892 843905 1935297 1944068 309709 -1039756 -963347 -723581 -1387570 -1891465
34490 -1891465 -1008020 578201 1551215 1833585 1810091 1009543 -902375 -2754215 -2982261
34481 -2982261 -1540476 462167 2372502 4030741 4822303 4124704 2506532 1267009
34473 1267009 827710 585499 242784 173468 386562 217150 -576353 -1223659 -900528 267019
$$ packed form
34537B006866l43707j93450R6541J65402K44786M11380K44002j40682J5285N57779
34527C064202L46456n10347k83727J379940K229724Q10157j022777j059326k06932
34518D747370n01780j445734j253488l35099l47246q18438q2131J144590O79531
34509A787575r46824r44320R46852J865554O52786m57943o1587J80467q43275
34500B179285j327393p987J091392Q771j634359j349465P6409K39766o63989n03895
34490a891465Q83445J586221R73014K82370k3494q00548j911918j851840k28046
34481b982261J441785K002643J910335J658239P91562o97599j618172j239523
34473A267009m39299k42211l42715o9316K13094j69412p93503o47306L23131J167547
$$ plain form
34463 267019 1489379 2136884 2005318 1234229 302678 -248575 -388677 -582774 -978869
34454 -978869 -1010120 -161368 1221331 2327112 2809788 2829569 2422066 1524622 636886 706670
34444 706670 2000753 3586538 4368232 4318470 4271826 4749313 5414161 5509973 4436087 2115433
34434 2115433 -661522 -2381479 -1976965 -33542 1636709 1803595 834925 -136394 -497781
34425 -497781 -361186 -5093 441744 999904 1799429 2801922 3427700 2925930 1438499
34416 1438499 215890 254800 1063764 1386324 935786 714215 1567883 3036932 3892537
34407 3892537 3462251 2198518 1146932 1005648 1567664 2017472 1898254 1733569 2394346
34398 2394346 3797098 4669675 4026715 2655199 2473566 4204793 6316233 6889285 6095271
$$ packed form
34463B67019J222360O47505j31566p71089r31551n51253j40102j94097l96095
34454i78869l1251Q48752J382699J105781M82676J9781m07503q97444q87736O9784
34444G06670J294083J585785P81694m9762m6644M77487O64848R5812j073886k320654
34434B115433k776955j719957M04514J943423J670251J66886r68670r71319l61387
34425d97781J36595L56093M46837N58160P99525J002493O25778n01770j487431
34416A438499j222609L8910Q08964L22560m50538k21571Q53668J469049Q55605
34407C892537m30286j263733j051586j41284N62016M49808j19218j64685O60777
34398B394346J402752Q72577o42960j371516j81633J731227K111440N73052p94014
$$ plain form
34389 6095271 5788446 6683216 7262669 6105255 4033476 2743929 2282610 1580139 944973
34380 944973 1870511 4130053 5221358 3677199 1164139 -34934 -117527 -630419 -1396919
34371 -1396919 -756453 1436209 3103243 2609686 648837 -1030682 -1621622 -1449476 -1097945
34362 -1097945 -934124 -913989 -483578 806327 2378886 2952611 2064243 692341 53296
34353 53296 282698 616596 421500 -291759 -1038723 -1255990 -754127 53420 545490 530899
34343 530899 294742 143821 222774 598932 1114921 1343702 1135366 952314 1169505 1467589
34333 1467589 1625208 2344830 4142171 5833914 5696371 4124340 3382975 4272393 4873990
34324 4873990 3591850 1716017 1414672 2507276 3159475 2954845 3118018 3914948 4010798
$$ packed form
34389F095271l06825Q94770N79453j157414k071779j289547m61319p02471o35166
34380I44973R25538K259542J091305j544159k513060j199073q2593n12892p66500
34371a396919O40466K192662J667034m93557j960849j679519n90940J72146L51531
34362a097945J63821K0135M30411J289905J572559N73725q88368j371902o39045
34353E3296K29402L33898j95096p13259p46964k17267N01863Q07547M92070j4591
34343E30899k36157j50921P8953L76158N15989K28781k08336j83052K17191K98084
34333A467589J57619P19622J797341J691743j37543j572031p41365Q89418O01597
34324D873990j282140j875833l01345J092604O52199k04630J63173P96930R5850
$$ plain form
34315 4010798 2823035 1627578 1512423 1770812 1368033 724309 731186 921717 162681
34306 162681 -1217858 -1509614 25452 2036795 2680856 1530622 -362757 -1525221 -877383
34297 -877383 1628277 4568813 5880186 4855021 2945927 1957824 1861443 1243170 -316188
34288 -316188 -1414691 -719124 1129237 2169651 1390115 -249785 -1120681 -844891 -548733
34279 -548733 -1206215 -2249288 -2420004 -1751655 -1631759 -2569393 -3121842 -2032794 -411392
34270 -411392 -256402 -1432042 -1965260 -1167172 -359363 -157556 702240 2764324 4146154
34261 4146154 3146483 1055966 400086 1413026 2329723 2508519 3010712 4179950 4798150
34252 4798150 4088658 2838325 1932833 1194849 333068 -161964 183396 1017858 1772600
$$ packed form
34315D010798j187763j195457j15155K58389m02779o43724O877J90531p59036
34306A62681j380539k91756J535066K011343O44061j150234j893379j162464O47838
34297h77383K505660K940536J311373j025165j909094r88103r6381o18273j559358
34288c16188j098503O95567J848361J040414p79536j639900q70896K75790K96158
34279e48733o57482j043073j70716O68349J19896r37634n52449J089048J621402
34270d11392J54990j175640n33218P98088Q07809K01807Q59796K062084J381830
34261D146154r99671k090517o55880J012940R16697J78796N02193J169238O18200
34252D798150p09492j250333r05492p37984q61781m95032L45360Q34462P54742
$$ plain form
34243 1772600 2351066 2751484 2725909 2276274 1869624 1765267 1651171 1205781 510431 -231861
34233 -231861 -864960 -1172507 -1173251 -1325177 -1696787 -1341015 347251 2003992 1647468 -319217
34223 -319217 -1301701 -187619 1061769 454861 -1128105 -1488856 -241968 1209673 1914628
34214 1914628 1968719 1442321 283596 -884963 -1129560 -334082 878468 2050894 2881332
34205 2881332 2801768 1634870 316127 -109928 107593 110615 119154 1059014 2635552 3266535
34195 3266535 2202472 436807 -873451 -1674769 -2156222 -1809289 -295937 1489627 2241986
34186 2241986 1834953 1333607 1596151 2497238 3415114 3836574 3415366 2045863 241759
34177 241759 -888615 -534886 897707 2085463 2186684 1741924 1917717 2977412 3862284
$$ packed form
34243A772600N78466M00418k5575m49635m06650j04357j14096m45390o95350p42292
34233b31861o33099l07547p44j51926l71610L55772J688266J656741l56524j966685
34223c19217r82484J114082J249388o06908j582966l60751J246888J451641P04955
34214A914628N4091n26398j158725j168559k44597P95478J212550J172426Q30438
34205B881332p9564j166898j318743m26055K17521L022Q539R39860J576538O30983
34195C266535j064063j765665j310258q01318m81453L46933J513352J785564P52359
34186B241986m07033n01346K62544R01087R17876M21460m21208j369503j804104
34177B41759j130374L53729J432593J187756J01221m44760J75793J059695Q84872
$$ plain form
34168 3862284 3357112 1420566 -709276 -1533386 -437327 1846949 3794511 4316786 3565226
34159 3565226 2495655 1851608 1808448 2261473 2883736 3085616 2621691 2203272 2761075
34150 2761075 4006026 4465017 3159184 625715 -1858860 -3415633 -3855999 -3614565 -3512807
34141 -3512807 -3836650 -3695802 -2287209 -634948 -550938 -1693952 -1571676 737841 2812304
34132 2812304 2260370 225532 -362135 1160012 2983089 3899152 4297775 4312117 3214838
34123 3214838 1078202 -741057 -1420321 -1660375 -2276582 -2896351 -2656617 -1395301 292475
34114 292475 1544354 1577035 287212 -1258218 -1611746 -472251 1073409 1878029 1786344
34105 1786344 1434804 1560907 2390774 3216691 2915219 1457754 330293 617187 1379714
$$ packed form
34168C862284n05172j936546k129842q24110J096059K284276J947562N22275p51560
34159C565226j069571o44047m3160M53025O22263K01880m63925m18419N57803
34150B761075J244951M58991j305833k533469k484575j556773m40366K41434J01758
34141c512807l23843J40848J408593J652261Q4010j143014J22276K309517K074463
34132B812304n51934k034838n87667J522147J823077R16063L98623J4342j097279
34123C214838k136636j819259o79264k40054o16207o19769K39734J261316J687776
34114B92475J251879L2681j289823j545430l53528J139495J545660Q04620r1685
34105A786344l51540J26103Q29867Q25917l01472j457465j127461K86894P62527
$$ plain form
34096 1379714 1163319 451689 927576 2551297 3275984 1975440 -970 -736760 148621
34087 148621 1791036 3161724 3334900 1965344 109893 -600683 -136952 -137354 -1235094
34078 -1235094 -1857404 -700155 1049029 1423647 576390 274592 1020530 1424087 590742
34069 590742 -313147 372249 2364042 3444462 2038815 -693391 -1962416 -623502 1423325
34060 1423325 1687006 148846 -1225072 -1419867 -1216150 -1221469 -869998 117019 824951
34051 824951 465963 -585608 -1684397 -2611910 -2837236 -1571184 588963 1570986 532205
34042 532205 -714922 -299234 993310 1192391 212384 -427595 -215894 -4327 -73491
34033 -73491 241206 919026 951041 37392 -760335 -525824 369285 1025559 1113808 903678
$$ packed form
34096A379714k16395p11630M75887J623721P24687j300544j976410p35790Q85381
34087A48621J642415J370688J73176j369556j855451p10576M63731m02j097740
34078a235094o22310J157249J749184L74618q47257l01798P45938M03557q33345
34069E90742r03889O85396J991793J080420j405647k732206j269025J338914K046827
34060A423325K63681j538160j373918j94795K03717n319L51471R87017P07932
34051H24951l58988j051571j098789r27513k25326J266052K160147R82023j038781
34042E32205j247127M15688J292544J99081r80007o39979K11701K11567o9164
34033g3491L14697O77820L2015r13649p97727K34511Q95109O56274Q8249k10130
$$ plain form
34023 903678 841738 1318842 2369089 3529628 4333581 4711772 4556601 3490698 1746911
34014 1746911 546794 539982 527233 -841033 -2543637 -2157946 565705 2924765 2698005
34005 2698005 820155 -325799 -43152 493059 402091 91563 248500 852965 1315393
33996 1315393 1013372 -298395 -2100892 -3180820 -2669331 -1132338 -117957 -388425 -1080812
33987 -1080812 -1022961 -400461 -309054 -814476 -607498 921554 2333577 1923867 174531
33978 174531 -875702 -340675 873577 1940640 2879474 3254240 2069286 -236615 -1465013
33969 -1465013 -454649 1360179 2384408 3123579 4380936 4968361 3573337 1618507
33961 1618507 1490238 2646295 2476062 834871 499720 2543477 4399031 3869107 2322697
$$ packed form
34023I03678o1940M77104J050247J160539Q03953L78191j55171j065903j743787
34014A746911j200117o812j2749j368266j702604L85691K723651K359060k26760
34005B698005j877850j145954K82647N36211r0968l10528J56937O04465M62428
33996A315393l02021j311767j802497j079928N11489J536993J014381k70468o92387
33987a080812N7851O22500R1407n05422K06978J529052J412023m09710j749336
33978A74531j050233N35027J214252J067063R38834L74766j184954k305901j228398
33969a465013J010364J814828J024229P39171J257357N87425j395024j954830
33961A618507j28269J156057j70233j641191l35151K043757J855554n29924j546410
$$ plain form
33952 2322697 2015343 2495585 2021037 899395 765278 1395835 888537 -1097772 -2583806
33943 -2583806 -2126868 -562371 699795 1480755 2041377 1826861 279960 -1783073 -2828134
33934 -2828134 -2407358 -1339283 -212976 1239083 3067749 4450399 4783286 4685570 4984280
33925 4984280 5193839 4231534 2554456 2148958 3865265 6007713 6517559 5624490 5162565
33916 5162565 5874879 6712032 6602395 5740187 5057324 5287384 6547330 8132610 8921630
33907 8921630 8709033 8702514 9750338 10720126 10127876 8912989 9544137 12178363 13895063
33898 13895063 12683249 10331446 9957103 12069033 14711661 16542074 17958379 19582101
33890 19582101 21365024 23397440 26293968 30289691 34723978 38839546 42670832 46937470
$$ packed form
33952B322697l07354M80242m74548j121642j34117O30557n07298j986309j486034
33943b583806M56938J564497J262166P80960N60622k14516j546901k063033j045061
33934b828134M20776J068075J126307J452059J828666J382650L32887r7716K98710
33925D984280K09559r62305j677078m05498J716307K142448N09846q93069m61925
33916E162565P12314Q37153j09637q62208o82863K30060J259946J585280P89020
33907H921630k12597o519J047824R69788n92250j214887O31148K634226J716700
33898A3895063j211814k351803l74343K111930K642628J830413J416305J623722
33890A9582101J782923K032416K896528L995723M434287M115568L831286M266638
$$ plain form
33882 46937470 52402120 59458583 68051687 77833579 88530262 100312350 113952031 130727606
33874 130727606 151991178 178494536 210154851 246580204 287164461 329577386 368081443
33867 368081443 394528917 402196859 389275485 359447306 319950562 278579213 240682532
33860 240682532 207765430 179000207 153956963 133156425 116371283 102155020 89688244
33853 89688244 79650138 72342757 66251034 59679332 52792368 46698654 41353468 35893457
33845 35893457 30535571 26557393 24467030 23473317 22749657 22055512 21093764 19451418 17452906
33836 17452906 16113446 15867178 15967419 15368785 13744160 11641737 10106159 9937278 10718236
33827 10718236 10873789 9461070 7572141 6974181 7643478 7948851 7296764 7076366 8364433
$$ packed form
33882D6937470N464650P056463Q593104R781892J0696683J1782088J3639681J6775575
33874A30727606K1263572K6503358L1660315L6425353M0584257M2412925L8504057
33867C68081443K6447474P667942j2921374k9828179l9496744m1371349l7896681
33860B40682532l2917102k8765223k5043244k0800538j6785142j4216263j2466776
33853H9688244j0038106p307381o091723o571702o886964o093714n345186n460011
33845C5893457n357886l978178k090363r93713p23660o94145r61748j642346j998512
33836A7452906j339460k46268J00241n98634j624625k102423j535578j68881P80958
33827A0718236J55553j412719j888929n97960O69297L05373o52087k20398J288067
$$ plain form
33818 8364433 9939492 9605378 6867508 3458064 1559495 2053497 4069694 5670972
33810 5670972 5376531 3600601 2282146 2641658 3819910 4359271 4324294 4735844 5258996
33801 5258996 4178465 1221236 -1135033 -454894 2463060 4657597 4730312 3796194 2884522
33792 2884522 1517626 -415969 -1395719 -390449 1230201 1743017 1890139 3411837 5449438
33783 5449438 5091131 1685489 -1934930 -3305407 -3137896 -3184966 -3442599 -3076282 -2372498
33774 -2372498 -1857058 -785230 1426852 3163549 2184125 -1059853 -3593087 -3482447 -1755661
33765 -1755661 -642846 -1133894 -2459990 -3099653 -2198364 -478863 587742 802215 1367869
33756 1367869 2383711 1923114 -827291 -3207167 -2311439 582737 1749083 561152
$$ packed form
33818H364433J575059l34114k737870l409444j898569M94002K016197J601278
33810E670972k94441j775930j318455L59512J178252N39361l4977M11550N23152
33801E258996j080531k957229k356269O80139K917954K194537P2715r34118r11672
33792B884522j366896j933595r79750J005270J620650N12816J47122J521698K037601
33783E449438l58307l405642l620419j370477J67511m7070k57633L66317P03784
33774b372498N15440J071828K212082J736697r79424l243978k533234J10640J726786
33765a755661J112815m91048j326096o39663R01289J719501J066605K14473N65654
33756A367869J015842m60597k750405k379876Q95728K894176J166346j187931
$$ plain form
33748 561152 -1116 1520913 2959741 2544149 1716877 2144363 2687771 1653023 -60498
33739 -60498 -556278 -147199 -458127 -1404542 -1561428 -919707 -883651 -1694493 -1941966 -733286
33729 -733286 1325771 3306571 4563278 4309552 2334356 216668 78980 1817934 3184611
33720 3184611 2961679 2332573 2478017 2609420 1555496 -105259 -924342 -661077 -86902
33711 -86902 610994 1782329 3033559 3450946 3126967 3204670 4164281 5149267 5348804 5029221
33701 5029221 4632520 3778047 2044738 170534 -540750 139619 1163063 1656932 1810036
33692 1810036 2130723 2521811 2495993 1883542 965230 208622 141796 1117732 2800093 4114049
33682 4114049 4133908 2989546 1663409 951525 774459 442993 -450392 -1342004 -1104135
$$ packed form
33748E61152n62268J522029J438828m15592q27272M27486N43408j034748j713521
33739f0498m95780M09079l10928r46415j56886O41721L6056q10842k47473J208680
33729g33286K059057J980800J256707k53726j975196k117688j37688J738954J366677
33720C184611k22932o29106J45444J31403j053924j660755q19083K63265N74175
33711h6902O97896J171335J251230M17387l23979P7703R59611R84986J99537l19583
33701E029221l96701q54473j733309j874204p11284O80369J023444M93869J53104
33692A810036L20687L91088k5818o12451r18312p56608o6826R75936J682361J313956
33682D114049J9859j144362j326137p11884j77066l31466q93385q91612K37869
$$ plain form
33673 -1104135 519405 2195286 2461709 1744432 1835367 3245545 4450494 4350063 3965614
33664 3965614 4482933 4937831 3640526 1106581 -433142 -148636 734799 1368989 2270704
33655 2270704 3445615 3599672 2225448 791339 591071 738700 -269025 -1957977 -2378086
33646 -2378086 -744621 1725407 3441515 3878328 3459723 2843811 2408158 1985050 1133028
33637 1133028 -157477 -1357733 -2123260 -2538174 -2469002 -1537087 -148094 438199 -188433
33628 -188433 -679586 355332 2422022 3896715 4081415 3463128 2507224 1449722 985824
33619 985824 1854304 3636759 4922467 4765338 3322969 1326832 -174318 114546 2592013
33610 2592013 5583533 6594090 5174878 3466585 3339551 4050385 3636976 1819919 213786
$$ packed form
33673a104135J623540J675881K66423p17277R0935J410178J204949j00431l84449
33664C965614N17319M54898j297305k533945j539723K84506Q83435O34190R01715
33655B270704J174911J54057j374224j434109k00268J47629j007725j688952m20109
33646b378086J633465K470028J716108M36813m18605o15912m35653m23108q52022
33637A133028j290505j200256p65527m14914O9172R31915J388993N86293o26632
33628a88433m91153J034918K066690J474693J84700o18287r55904j057502m63898
33619I85824Q68480J782455J285708j57129j442369j996137j501150K88864K477467
33610B592013K991520J010557j419212j708293j27034P10834m13409j817057j606133
$$ plain form
33601 213786 -157997 -189713 -963095 -1681014 -554424 2385280 4668459 4259419 2123054
33592 2123054 822633 1125825 1471427 729601 -205019 -161655 482190 779055 848865 1250358
33582 1250358 1537279 834269 -607300 -1714538 -2151422 -2362382 -2299492 -1398813 141862
33573 141862 1222764 1209539 584923 105161 64060 437704 995713 1207823 730063 8118
33563 8118 -211352 120048 438903 438702 210887 -137830 -260728 564991 2370875 3744554
33553 3744554 3317746 1655151 398652 -96875 -766271 -1764668 -2226193 -2126670 -2397807
33544 -2397807 -2785676 -1693563 937421 2582062 1413083 -886316 -1254474 838761
33536 838761 3250575 4205793 3820067 2930842 2005995 1391864 1489541 2234952 2891997 2587460
$$ packed form
33601B13786l71783l1716p73382p17919J126590K939704K283179m09040k136365
33592B123054j300421L03192L45602p41826r34620M3364O43845K96865O9810M01493
33582A250358K86921p03010j441569j107238m36884k10960O2890R00679J540675
33573A41862J080902j3225o24616m79762m1101L73644N58009K12110m77760p21945
33563H118k19470L31400L18855k01k27815l48717j22898Q25719J805884J373679
33553C744554m26808j662595j256499m95527o69396r98397m61525R9523k71137
33544b397807l87869J092113K630984J644641j168979k299399l68158K093235
33536H38761K411814R55218l85726q89225r24847o14131R7677P45411O57045l04537
$$ plain form
33526 2587460 1033426 -950566 -1616137 204869 3378760 5116282 3960361 1349378
33518 1349378 -412544 -748800 -452499 199952 1472213 2803347 2968188 1662154 -143514
33509 -143514 -1416800 -1723444 -864338 1002758 2793341 3094934 1672546 -269392 -1459459
33500 -1459459 -1633601 -1303073 -1133050 -1534636 -2237043 -2337967 -1410210 -363803 -422943
33491 -422943 -1420595 -2048509 -1770793 -1488991 -2122408 -3398733 -4332999 -4264281 -3298070 -2306126
33481 -2306126 -2359077 -3388047 -3686696 -1883263 763804 1528595 -169187 -1990596 -2061710
33472 -2061710 -1329853 -1426721 -1859568 -1111267 527904 1244727 413893 -822581 -1635583
33463 -1635583 -2440509 -3457766 -3867553 -3008093 -1326098 367605 1622540 1966139 986856
$$ packed form
33526B587460j554034j983992o65571J821006L173891J737522j155921k610983
33518A349378j761922l36256K96301O52451J272261J331134J64841j306034j805668
33509a43514j273286l06644Q59106J867096J790583L01593j422388j941938j190067
33500a459459j74142L30528J70023m01586p02407j00924R27757J046407n9140
33491d22943r97652o27914K77716K81802o33417j276325r34266O8718R66211R91944
33481b306126n2951j028970k98649J803433K647067P64791j697782j821409p1114
33472b061710P31857r6868m32847P48301J639171P16823q30834j236474q13002
33463a635583q04926j017257m09787Q59460J681995J693703J254935L43599r79283
$$ plain form
33454 986856 -537183 -748947 1009316 2861378 2535344 340256 -1224736 -644045 1056256
33445 1056256 2076686 2055502 1953017 2434628 3086931 3073197 2130001 890101 346772
33436 346772 941425 2142512 3024165 3246549 3313361 3844638 4717471 5001941 3870889
33427 3870889 1763807 469041 1455278 4012208 5826101 5822096 5505498 6581738 8174118
33418 8174118 8036573 6190852 5327700 7008009 9261382 9267231 7265395 6203565 7923134
33409 7923134 11159653 13492208 14242415 14944610 17336710 21291030 24915770 26763552
33401 26763552 27469220 28482959 29577240 29054201 26651041 24494083 24149866 24245081 22527417
33392 22527417 19125908 15988180 13945827 12331783 10956102 10264471 9668767 7975059
$$ packed form
33454I86856j524039k11764J758263J852062l26034k195088j564992N80691J700301
33445A056256J020430k1184j02485M81611O52303j3734r43196j239900n43329
33436C46772N94653J201087Q81653K22384O6812N31277Q72833K84470j131052
33427C870889k107082j294766R86237K556930J813893m005l16598J076240J592380
33418H174118j37545j845721q63152J680309K253373N849k001836j061830J719569
33409G923134L236519K332555P50207P02195K392100L954320L624740J847782
33401B6763552P05668J013739J094281n23039k403160k156958l44217R5215j717664
33392B2527417l401509l137728k042353j614044j375681o91631n95704j693708
$$ plain form
33384 7975059 5764547 5176198 6662935 7969517 7280078 5575869 4690006 4616307 4177254
33375 4177254 3138876 2171766 1553892 1231416 1488075 2387229 3173602 3271064 3196174 3470800
33365 3470800 3450882 2469077 1390530 1574038 2768262 3532554 3485300 3628278 4438995
33356 4438995 5082228 4818742 4009508 3268851 2536463 1517456 454931 -5222 495235
33347 495235 1569216 2152787 1278375 -834886 -2746246 -3306194 -2866577 -2472411 -2342807
33338 -2342807 -1969802 -1378490 -1273753 -1913072 -2671014 -2904879 -2671168 -2418019 -2330291 -2057174
33328 -2057174 -1006695 802272 2146968 1616459 -420256 -1823798 -1384217 -477859 -900226
33319 -900226 -2036120 -1860850 -215582 879600 298571 -617513 -203032 1187182 1877965
$$ packed form
33384G975059k210512n88349J486737J306582o89439j704209q85863p3699m39053
33375D177254j038378r67110o17874l22476K56659Q99154P86373R7462p4890K74626
33365C470800j9918r81805j078547J83508J194224P64292m7254J42978Q10717
33356D438995O43233k63486q09234p40657p32388j019007j062525m60153N00457
33347D95235J073981N83571q74412k113261j911360n59948M39617L94166J29604
33338b342807L73005N91312J04737o39319p57942k33865K33711K53149Q7728K73117
33328b057174J050479J808967J344696n30509k036715j403542M39581R06358m22367
33319i00226j135894J75270J645268J095182n81029r16084M14481J390214O90783
$$ plain form
33310 1877965 1122137 -173067 -696562 -289607 -222657 -1700351 -3980455 -4745945 -2966128
33301 -2966128 -463697 450139 -34570 -155842 320094 51478 -1128021 -1781954 -1493054
33292 -1493054 -1620858 -2707155 -3248558 -2142008 -505571 198593 231757 422527 467991
33283 467991 -37209 -146588 1125204 2924372 3644401 3218798 2792943 2719388 2478425
33274 2478425 2169540 2427993 2934497 2470576 626685 -1637942 -3238588 -3859658 -3619633
33265 -3619633 -2718551 -1461270 3082 1786347 3534757 4132299 3067673 1629745
33257 1629745 1560860 2757160 3520897 2986431 1974261 1286040 506842 -895419 -2268616
33248 -2268616 -2388340 -959007 1023746 2234012 2146941 1414269 1141879 1604691 1898255
$$ packed form
33310A877965p55828j295204n23495M06955O6950j477694k280104p65490J779817
33301b966128K502431R13836m84709j21272M75936k68616j179499o53933K88900
33292a493054j27804j086297n41403J106550J636437P04164L3164J90770M5464
33283D67991n05200j09379J271792J799168P20029m25603m25855p3555k40963
33274B478425l08885K58453N06504m63921j843891k264627j600646o21070K40025
33265c619633R01082J257281J464352J783265J748410N97542j064626j437928
33257A629745o8885J196300P63737n34466j012170o88221p79198j402261j373197
33248b268616j19724J429333J982753J210266q7071p32672k72390M62812K93564
$$ plain form
33239 1898255 1249872 358169 719119 2634211 4533416 4474293 1986368 -1587947 -4277811
33230 -4277811 -5039623 -4381757 -3422227 -2418237 -760581 1501930 3053575 2821404 1367069
33221 1367069 84310 -325578 74865 1018716 1748359 1135272 -663718 -1558039 -70992
33212 -70992 2208541 2516555 684099 -1043028 -1599170 -2088949 -3042054 -3280995 -2344190
33203 -2344190 -1655394 -2026823 -2102913 -839492 334158 -293259 -1828973 -2115100 -924351
33194 -924351 149486 221004 -341986 -1212517 -2023917 -1612684 559117 2648553 2389487
33185 2389487 656627 557957 2682180 3981443 2428219 199455 387930 2545541 3828671
33176 3828671 3312476 2630602 2820261 3010073 2487418 1947166 1922537 1598311 216218
$$ packed form
33239A898255o48383q91703L60950J915092J899205n9123k487925l574315k689864
33230d277811p61812O57866R59530J003990J657656K262511J551645k32171j454335
33221A367069j282759m09888M00443R43851P29643o13087j798990q94321J487047
33212g0992K279533L08014j832456j727127n56142m89779r53105k38941R36805
33203b344190O88796l71429p6090J263421J173650o27417j535714k86127J190749
33194i24351J073837P1518n62990q70531q11400M11233K171801K089436k59066
33185B389487j732860r8670K124223J299263j553224k228764J88475K157611J283130
33176C828671n16195o81874J89659J89812n22655n40252k4629l24226j382093
$$ plain form
33167 216218 -1442006 -2026855 -1381552 -431663 136392 188270 -469539 -1995683 -3781054
33158 -3781054 -4613668 -3891649 -2300631 -1080477 -829017 -1151056 -1340362 -1215575 -1115389
33149 -1115389 -1056270 -363308 1262641 2609403 2013159 -151402 -1276392 274720 2787099
33140 2787099 3383866 1933879 1058662 2369854 4543327 5610444 5462684 5086287 4649998
33131 4649998 3696009 2423066 1426872 558062 -774115 -2339437 -3176215 -2926984 -2201707
33122 -2201707 -1536436 -751078 463032 1862350 2799604 2841239 2230062 1809456 2207320
33113 2207320 2973519 3017594 2109041 1226191 1004644 742554 -263551 -1252225 -1008113
33104 -1008113 251541 1274576 1703905 2291822 3330192 4179640 4435876 4379298 4107616
$$ packed form
33167B16218j658224n84849O45303R49889N68055N1878o57809j526144j785371
33158c781054q32614P22019J591018J220154K51460l22039j89306J24787J00186
33149a115389N9119O92962J625949J346762n96244k164561j124990J551112K512379
33140B787099N96767j449987q75217J311192K173473J067117j47760l76397m36289
33131D649998r53989j272943r96194q68810j332177j565322q36778K49231P25277
33122b201707O65271P85358J214110J399318R37254M1635o11177m20606L97864
33113B207320P66199M4075r08553q82850k21547k62090j006105r88674K44112
33104a008113J259654J023035M29329N87917J038370Q49448K56236n6578k71682
$$ plain form
33095 4107616 3295806 1985887 634549 -689039 -2113832 -2997890 -2428215 -868084 12430
33086 12430 -484854 -1292053 -1302445 -608843 360533 1485055 2136948 1279463 -687418 -1634610
33076 -1634610 -455288 1172712 1160032 4478 -237500 845612 1707125 1428195 858189
33067 858189 1028113 1839561 2649641 3039359 2637515 1134946 -1007005 -2485339 -2337617
33058 -2337617 -992086 167623 298559 66283 876955 2911873 4364810 3429186 749539
33049 749539 -1356597 -2099938 -2950491 -4672982 -5621251 -4329683 -2109794 -1204354 -1603579
33040 -1603579 -1756323 -1468546 -1757074 -2391656 -2067870 -922080 -461084 -806093 -408788
33031 -408788 1003349 1598397 446326 -849605 -731022 26830 -22551 -717230 -1153162
$$ packed form
33095D107616q11810j309919j351338j323588j424793q84058N69675J560131Q80514
33086A2430m97284q07199j0392O93602R69376J124522O51893q57485j966881r47192
33076a634610J179322J628000j2680j155554k41978J083112Q61513k78930n70006
33067H58189J69924Q11448Q10080L89718m01844j502569k141951j478334J47722
33058b337617J345531J159709J30936k32276Q10672K034918J452937r35624k679647
33049G49539k106136p43341q50553j722491r48269J291568K219889R05440l99225
33040a603579j52744K87777k88528o34582L23786J145790M60996l45009L97305
33031d08788J412137N95048j152071j295931J18583P57852m9381o94679m35932
$$ plain form
33022 -1153162 -1395942 -1800219 -1854525 -1201211 -647417 -676840 -221206 1349098 2286666 724918
33012 724918 -2051305 -3110014 -2204981 -1923185 -3402205 -4664749 -4049298 -2777489 -2609315
33003 -2609315 -2915742 -2003293 -82661 1108241 1064570 1075817 2111604 3622061 4635004
32994 4635004 4918907 4749356 4330357 3743168 2961271 1858946 657827 142927 726308
32985 726308 1541270 1458157 893858 1334330 2837275 3499540 2187867 406753 152811
32976 152811 998314 1006603 -117755 -793422 -365058 -42875 -547452 -790705 70184 948046
32966 948046 601939 -204739 68452 1302566 2201543 2518667 3016671 3640640 3591791 3049338
32956 3049338 2926544 2894850 1684533 -319474 -961513 366382 1379063 228671 -1622974
$$ packed form
33022a153162k42780m04277n4306O53314N53794k9423M55634J570304R37568j561748
33012G24918k776223j058709R05033K81796j479020j262544O15451J271809J68174
33003b609315l06427R12449J920632J190902m3671J1247J035787J510457J012943
32994D635004K83903j69551m18999n87189p81897j102325j201119n14900N83381
32985G26308Q14962q3113n64299M40472J502945O62265j311673j781114k53942
32976A52811Q45503Q289j124358o75667M28364L22183n04577k43253Q60889Q77862
32966I48046l46107q06678K73191J234114Q98977L17124M98004O23969m8849n42453
32956C049338j22794l1694j210317k004007o42039J327895J012681j150392j851645
$$ plain form
32947 -1622974 -1671480 -184122 362112 -994848 -2581553 -2638223 -1346992 -121327 -89653
32938 -89653 -1412958 -3093815 -3464802 -1856453 299935 1055998 453683 209926 1005421
32929 1005421 1652350 1288120 788693 1154797 1816371 1734132 1298654 1785512 3276024
32920 3276024 4311959 3651908 1544463 -802213 -2324970 -2579637 -1780368 -723409 -339816
32911 -339816 -989334 -2234902 -3361686 -3968272 -3997057 -3432979 -2282201 -859538 250083
32902 250083 840272 1511272 2894898 4345501 4096184 1310203 -2433698 -4474320 -3794670
32893 -3794670 -1744958 -123487 602769 953623 1217332 1262049 1119045 1041058 1020739 703734
32883 703734 -112996 -1063695 -1386106 -641279 581207 909331 -367777 -2147982 -2435927
$$ packed form
32947a622974m8506J487358N46234j356960j586705n6670J291231J225665L1674
32938h9653j323305j680857l70987J608349K156388P56063o02315k43757P95495
32929A005421O46929l64230m99427L66104O61574q2239m35478M86858J490512
32920C276024J035935o60051k107445k346676j522757k54667P99269J056959L83593
32911c39816o49518j245568j126784o06586k8785N64078J150778J422663J109621
32902B50083N90189O71000J383626J450603k49317k785981l743901k040622O79650
32893c794670K049712J621471P26256L50854K63709M4717j43004p7987k0319l17005
32883G03734q16730r50699l22411P44827J222486L28124j277108j780205k87945
$$ plain form
32874 -2435927 -600640 1870943 3162265 3069448 2714225 2881840 3320837 3400511 2796102
32865 2796102 1625115 463808 176674 1180739 2774396 3573558 2747825 676054 -1515856
32856 -1515856 -2811415 -2845573 -1987777 -961169 -252759 20642 -297286 -1404186 -2811512
32847 -2811512 -3284168 -2296181 -1103594 -1320016 -2606222 -3031314 -1903722 -847892 -1377526
32838 -1377526 -2686647 -3036246 -2351747 -1846841 -1584400 -316377 2070891 3812790 3784759
32829 3784759 3225942 3712855 4613771 4168357 2362595 895621 502119 187796 -615104
32820 -615104 -989008 -382610 133028 -387063 -1116922 -956399 -515845 -903467 -1418120 -539700
32810 -539700 1133322 1217970 -853460 -2675840 -2150758 -137369 1293476 1687233 1814375
$$ packed form
32874b435927J835287K471583J291322r2817l55223J67615M38997P9674o04409
32865B796102j170987j161307k87134J004065J593657P99162q25733k071771k191910
32856a515856j295559l4158Q57796J026608P08410K73401l17928j106900j407326
32847b811512m72656R87987J192587k16422j286206m25092J127592J055830n29634
32838a377526j309121l49599O84499N04906K62441J268023K387268J741899k8031
32829C784759n58817M86913R00916m45414j805762j466974l93502l14323q02900
32820f15104l73904O06398N15638n20091p29859J60523M40554l87622n14653Q78420
32810e39700J673022Q4648k071430j822380N25082K013389J430845L93757J27142
$$ plain form
32801 1814375 1652972 565077 -1020909 -1744578 -1135606 -169831 5941 -903137 -2376144
32792 -2376144 -3344314 -2782668 -905753 668049 895411 800253 1670024 2477346 1123757
32783 1123757 -1879256 -3332650 -1662589 812559 1196969 -169603 -903915 -273814 290585
32774 290585 -307828 -1772054 -3585496 -5382627 -6029213 -4115119 -14779 3798661 5182510
32765 5182510 4207790 2281926 557721 -167129 786906 3112753 5082309 5165150 3776525
32756 3776525 2467355 1767927 993320 -32727 -485622 -40905 462743 489086 745190
32747 745190 1699006 2162522 727476 -1908865 -3526382 -3170896 -1934961 -863674 331415
32738 331415 1898668 2904703 2545050 1493188 768915 214239 -555102 -560382 1373623
$$ packed form
32801A814375j61403j087895j585986p23669O08972R65775J75772r09078j473007
32792b376144r68170N61646J876915J573802K27362r5158Q69771Q07322j353589
32783A123757l003013j453394J670061K475148L84410j366572p34312O30101N64399
32774B90585n98413j464226j813442j797131o46586J914094M100340L813440J383849
32765E182510r74720j925864j724205p24850R54035K325847J969556Q2841j388625
32756C776525j309170o99428p74607j026047m52895M44717N03648K6343K56104
32747G45190R53816M63516j435046k636341j617517L55486J235935J071287J195089
32738C31415J567253J006035l59653j051862p24273n54676p69341n280J934005
$$ plain form
32729 1373623 4212235 5348144 3815874 1272925 -468786 -1265177 -1591110 -1419930 -978211
32720 -978211 -1068613 -1621972 -1342902 84694 932119 41071 -922254 201285 2546542
32711 2546542 3390658 2305141 1578850 2364472 2950242 1745541 -157388 -787102 -136771
32702 -136771 305431 -115627 -799029 -1198477 -1273367 -933284 -101846 781717 1138146 1042172
32692 1042172 1034325 1315037 1699273 2165501 2825083 3429774 3454234 2692174 1444837 213017
32682 213017 -512811 -345842 736615 2282232 3733894 4813171 5432233 5468021 4801742
32673 4801742 3436631 1594969 -57086 -543557 394429 1531441 1350059 94488 -451775
32664 -451775 477251 1599994 1753598 1639448 2190236 2482823 1090341 -1191587 -1995164
$$ packed form
32729A373623K838612J135909j532270k542949j741711p96391l25933J71180M41719
32720i78211r0402n53359K79070J427596Q47425q91048r63325J123539K345257
32711B546542Q44116j085517p26291P85622N85770j204701j902929o29714O50331
32702a36771M42202m21058o83402l99448p4890L40083Q31438Q83563L56429r5974
32692A042172p847K80712L84236M66228O59582O04691K4460p62060j247337j231820
32682B13017p25828J66969J082457J545617J451662J079277O19062L5788o66279
32673D801742j365111j841662j652055m86471R37986J137012j81382j255571n46263
32664d51775R29026J122743J53604j14150N50788K92587j392482k281928q03577
$$ plain form
32655 -1995164 -699963 733113 559234 -741610 -1797730 -2220378 -2319531 -2110012 -1574101
32646 -1574101 -1122220 -926554 -456763 493352 940733 -138509 -2138014 -3272855 -2657000
32637 -2657000 -1137221 41569 718417 1631611 3123500 4449924 4473167 2960899 1027775
32628 1027775 94011 435247 998845 678199 -506866 -1606764 -1884609 -1584832 -1621391
32619 -1621391 -2553122 -3886676 -4541618 -4045623 -2974602 -2084240 -1469994 -910935 -500852
32610 -500852 -371326 -271600 -92460 -285478 -952380 -1177647 -443265 -40336 -1352353 -3087219
32600 -3087219 -2449293 601170 2641463 1415358 -1031209 -1550418 -356139 46985 -835107
32591 -835107 -1023982 336201 1518585 929793 -666687 -1495065 -952382 347811 1653523
$$ packed form
32655a995164J295201J433076j73879j300844j056120m22648r9153K09519N35911
32646a574101M51881J95666M69791R50115M47381j079242j999505j134841O15855
32637b657000J519779J178790O76848R13194J491889J326424K3243j512268j933124
32628A027775r33764L41236N63598l20646j185065j099898k77845K99777l6559
32619a621391r31731j333554o54942M95995J071021Q90362O14246N59059M10083
32610e00852J29526R9726J79140j93018o66902k25267P34382M02929j312017j734866
32600c087219O37926L050463K040293j226105k446567n19209J194279M03124q82092
32591h35107j88875J360183J182384n88792j596480q28378N42683J300193J305712
$$ plain form
32582 1653523 2473432 2704560 2902073 3703667 4634546 4345203 2464065 332696 -634844
32573 -634844 -494868 -82821 380970 1152148 1991109 2227683 1611172 508627 -571515
32564 -571515 -1251474 -1355372 -1087865 -860715 -670871 -95451 778759 1058695 294244 -518774
32554 -518774 -45887 1519803 2563425 2016832 466977 -806225 -1170278 -738535 192839
32545 192839 1213735 1644810 1010737 -242726 -1004397 -749415 -210236 -432037 -1432823
32536 -1432823 -2383436 -2974691 -3701481 -4514290 -4231362 -2170893 382378 1537295 1212658
32527 1212658 886438 1167427 1193459 579143 202945 413749 162080 -1003254 -1651639
32518 -1651639 -685910 508832 48810 -1300464 -1222529 410855 1431224 1118857 1396586
$$ packed form
32582A653523Q19909K31128J97513Q01594R30879k89343j881138k131369r67540
32573f34844J39976M12047M63791P71178Q38961K36574o16511j102545j080142
32564e71515o79959j03898K67507K27150J89844N75420Q74210K79936p64451q13018
32554e18774M72887J565690J043622n46593j549855j273202l64053M31743R31374
32545A92839J020896M31075o34073j253463p61671K54982N39179k21801j000786
32536a432823r50613n91255p26790q12809K82928K060469K553271J154917l24637
32527A212658l26220K80989K6032o14316l76198K10804k51669j165334o48385
32518a651639R65729J194742m60022j349274P7935J633384J020369l12367K77729
$$ plain form
32509 1396586 3363574 5082993 4534150 2938079 2962423 4682693 5648268 4647152 3228535
32500 3228535 3158947 4148403 4813203 4578146 3778646 2815133 2072578 2062539 2871786 3863784
32490 3863784 4498818 5015569 5726639 6116266 5400138 3722436 2065715 1120579 922030
32481 922030 1415264 2495247 3441677 3277157 2070789 1102557 1214594 1672652 1304762
32472 1304762 171126 -732428 -999574 -1032844 -925292 -260863 789866 1258342 746340
32463 746340 79613 -65965 -325008 -1461317 -2692024 -2517910 -1077801 -312157 -1415364
32454 -1415364 -3236636 -3847685 -2833143 -1242983 16058 715003 646637 -353111 -1642045
32445 -1642045 -2084705 -1531641 -1172526 -1864113 -2763698 -2375003 -587102 1116912 1386204
$$ packed form
32509A396586J966988J719419n48843j596071K4344J720270R65575j001116j418617
32500C228535o9588R89456O64800k35057p99500r63513p42555j0039Q09247R91998
32490C863784O35034N16751P11070L89627p16128j677702j656721r45136j98549
32481I22030M93234J079983R46430j64520j206368r68232J12037M58058l67890
32472A304762j133636r03554k67146l3270J07552O64429J050729M68476n12002
32463G46340o66727j45578k59043j136309j230707J74114J440109P65644j103207
32454a415364j821272o11049J014542J590160J259041O98945o8366r99748j288934
32445a642045m42660N53064L59115o91587q99585L88695J787901J704014K69292
$$ plain form
32436 1386204 244267 -1398257 -2746908 -3400404 -3265098 -2694559 -2395673 -2719122 -3147433
32427 -3147433 -2816539 -1474680 317400 1820076 2667954 2875654 2621492 2109349 1488767
32418 1488767 848163 292208 -77953 -279679 -327682 35488 1073869 2294131 2471454
32409 2471454 1018996 -1007887 -2014023 -1800962 -1520718 -1648078 -1081429 1119284 3890284
32400 3890284 5030515 3703154 1274396 -388562 -794722 -738296 -811671 -584319 611361
32391 611361 2409639 3452914 2954510 1827595 1653394 2639222 3360777 2709742 1285546
32382 1285546 338715 21448 -503423 -1571789 -2479137 -2385574 -1163513 571673 1742503
32373 1742503 1332235 -625726 -2613558 -2956747 -1720830 -588916 -674353 -1195711 -681798
$$ packed form
32436A386204j141937j642524j348651o53496J35306N70539K98886l23449m28311
32427c147433L30894J341859J792080J502676Q47878K07700k54162n12143o20582
32418A488767o40604n55955l70161k01726m8003L63170J038381J220262J77323
32409B471454j452458k026883j006136K13061K80244j27360N66649K200713K771000
32400C890284J140231j327361k428758j662958m06160N6426p3375K27352J195680
32391F11361J798278J043275m98404j126915j74201R85828P21555o51035j424196
32382A285546r46831l17267n24871j068366r07348R3563J222061J735186J170830
32373A742503m10268j957961j987832l43189J235917J131914q5437n21358N13913
$$ plain form
32364 -681798 1164040 3301961 4573495 4568171 3630938 2508876 1770621 1218514 178908
32355 178908 -1275228 -1890871 -734358 1163358 1605995 -152906 -2388272 -2915548 -1499143
32346 -1499143 345048 1436300 1864213 1931238 1321463 -56067 -1224974 -1173286 -379658
32337 -379658 -214444 -917021 -1431924 -1444957 -2022501 -3414491 -3831269 -2028185 107343
32328 107343 -177199 -2185222 -2423458 75827 1924230 329661 -2550502 -2649021 103176
32319 103176 1834067 375579 -1960719 -1983395 178595 1850759 1531922 375691 346834
32310 346834 1936436 3794262 4204893 2811731 814783 -590169 -1452015 -2204703 -2261104
32301 -2261104 -764140 1466178 2367121 1457980 717212 1733819 3240421 2766036 -25377
$$ packed form
32364f81798J845838K137921J271534n324r37233j122062p38255n52107j039606
32355A78908j454136o15643J156513J897716M42637j758901k235366n27276J416405
32346a499143J844191J091252M27913O7025o09775j377530j168907N1688P93628
32337c79658J65214p02577n14903j3033n77544j391990m16778J803084K135528
32328A07343k84542k008023k38236K499285J848403j594569k880163r8519K752197
32319A03176J730891j458488k336298k2676K161990J672164l18837j156231k8857
32310C46834J589602J857826M10631j393162j996948j404952q61846p52688n6401
32301b261104J496964K230318R00943r09141p40768J016607J506602m74385k791413
$$ plain form
32292 -25377 -2962887 -3959854 -2846700 -843616 722557 1160695 704503 159830 -179361
32283 -179361 -965029 -2565579 -3927821 -3685819 -2156366 -1082172 -1324899 -1888407 -1513631
32274 -1513631 -295370 750147 1021454 742428 502834 770801 1542898 2255766 2296377
32265 2296377 1617789 555647 -755461 -2243739 -3415673 -3766684 -3542023 -3260938 -2649735
32256 -2649735 -1115386 775079 1616973 1227585 1007668 1734742 2397927 2022224 1273704
32247 1273704 1130842 1182343 639629 66963 528459 1685363 2347642 2443137 2775158 3113454
32237 3113454 2329931 538165 -589810 -56178 1288776 2202039 2383228 1937445 833573
32228 833573 -456401 -906845 -234957 649443 1020752 1194694 1474434 1307272 221571
$$ packed form
32292b5377k937510r96967J113154K003084J566173M38138m56192n44673l39191
32283a79361p85668j600550j362242K42002J529453J074194k42727n63508L74776
32274a513631J218261J045517K71307k79026k39594K67967P72097P12868M0611
32265B296377o78588j062142j311108j488278j171934l51011K24661K81085O11203
32256b649735J534349J890465Q41894l89388k19917P27074O63185l75703p48520
32247A273704j42862N1501n42714n72666M61496J156904O62279R5495L32021L38296
32237C113454p83523j791766j127975N33632J344954R13263J81189m45783j103872
32228H33573j289974m50444O71888Q84400L71309J73942K79740j67162j085701
$$ plain form
32219 221571 -1300518 -2551668 -3289651 -3142708 -1556155 768529 1652597 -13298 -2460838
32210 -2460838 -3210532 -2227690 -1306607 -968153 40317 2198958 4118335 4576136 4209373
32201 4209373 4366001 5198702 5664537 4928671 3286424 1941208 1920709 2880436 3248723
32192 3248723 2158033 795993 835301 1886440 1942077 376171 -1130520 -1198850 -747222
32183 -747222 -1342546 -2697959 -3125031 -1909097 -58792 1104426 1210443 764491 444960
32174 444960 457457 275126 -729938 -2165531 -2642833 -1342033 948522 2826791 3756645
32165 3756645 3985460 3607540 2598734 1495883 1180132 1947639 3249142 4209950 4106373
32156 4106373 2785058 1100700 404396 955903 1410193 654148 -522765 -716587 -308774
$$ packed form
32219B21571j522089j251150p37983J46943J586553K324684Q84068j665895k447540
32210b460838p49694R82842R21083L38454J008470K158641J919377M57801l66763
32201D209373J56628Q32701M65835p35866j642247j345216k0499R59727L68287
32192C248723j090690j362040L9308J051139N5637j565906j506691o8330M51628
32183g47222n95324j355413m27072J215934J850305J163218J06017m45952l19531
32174D44960J2497j82331j005064j435593m77302J300800K290555J878269R29854
32165C756645K28815l77920j008806j102851l15751P67507J301503R60808j03577
32156D106373j321315j684358o96304N51507M54290p56045j176913j93822M07813
$$ plain form
32147 -308774 -1050761 -3307305 -5250424 -5187593 -3429707 -1354904 203003 976369 767579
32138 767579 -141355 -790070 -590737 -61646 149785 354701 1127246 2036412 2011216 767796
32128 767796 -883144 -2019863 -2291666 -1805052 -949684 -247044 98957 363187 702708
32119 702708 819053 674682 970736 2137218 3280217 3036246 1220550 -1192244 -3363205
32110 -3363205 -4879075 -5158039 -3921979 -2188989 -1383500 -1310354 -454920 1425562 2656899
32101 2656899 2240915 1403685 1454854 1669677 873907 -105503 460764 2318694 3436569
32092 3436569 2904960 1791484 1033441 266925 -831808 -1632125 -1670136 -1466774 -1555472
32083 -1555472 -1692175 -1594662 -1520059 -1610940 -1631738 -1793311 -2713503 -3989608 -4055701 -2328375
$$ packed form
32147c08774p41987k256544j943119O2831J757886K074803J557907P73366k08790
32138G67579r08934o48715J99333N29091K11431K04916P72545R09166k5196j243420
32128G67796j650940j136719k71803M86614Q55368P02640L46001K64230L39521
32119G02708J16345j44371K96054J166482J142999k43971j815696k412794k170961
32110c363205j515870k78964J236060J732990Q05489P3146Q55434J880482J231337
32101B656899m15984q37230N1169K14823p95770r79410N66267J857930J117875
32092C436569n31609j113476p58043p66516j098733q00317l8011K03362q8698
32083a555472j36703R7513P4603r0881k0798j61573r20192j276105o6093J727326
$$ plain form
32073 -2328375 -392067 -63316 -1249892 -2695034 -3748778 -4206735 -3529994 -1838085 -833426
32064 -833426 -1929645 -3980409 -4692937 -3910726 -3494107 -4118847 -4472750 -3926651 -3597067
32055 -3597067 -3829873 -2905859 139776 3165814 3395267 1156000 -855185 -1389657 -1634598
32046 -1634598 -2508483 -3056095 -2180503 -454140 747196 999163 831966 573357 63050
32037 63050 -707043 -1368068 -1575748 -1162533 73936 2185308 4470423 5539170 4517062
32028 4517062 2111850 16532 -805317 -776825 -570405 -61713 1023411 2073594 2213098
32019 2213098 1726532 1742634 2357045 2179243 283169 -2232649 -3329891 -2168714 367579
32010 367579 2760911 3894581 3484138 2178585 1055388 606669 489656 466054 878181
$$ packed form
32073b328375J936308L28751j186576j445142j053744m57957O76741J691909J004659
32064h33426j096219k050764p12528P82211M16619o24740l53903N46099L29584
32055c597067k32806R24014L045635L026038K29453k239267k011185n34472k44941
32046a634598q73885n47612Q75592J726363J201336K51967j67197k58609n10307
32037F3050p70093o61025k07680M13215J236469K111372K285115J068747j022108
32028D517062k405212k095318q21849K8492K06420N08692J085124J050183J39504
32019B213098m86566J6102O14411j77802j896074k515818j097242J161177K536293
32010C67579K393332J133670m10443j305553j123197m48719j17013k3602M12127
$$ plain form
32001 878181 1673147 1773329 388316 -1576250 -2527370 -2293015 -2018350 -2063200 -1416767
31992 -1416767 379445 2022548 2099018 1132930 839523 1620601 1963925 621478 -1505885
31983 -1505885 -2380926 -1326430 355483 1294986 1640574 2153816 2518603 1726477 -64603
31974 -64603 -1365654 -1348793 -808712 -556063 -53627 1321957 2657040 2597178 1571803
31965 1571803 1349545 2368328 2986758 1821253 -389468 -1946620 -2318387 -2261242 -2356945
31956 -2356945 -2340035 -1829701 -1071325 -688884 -928332 -1400201 -1637055 -1727374 -2089802 -2656513
31946 -2656513 -2784093 -2162690 -1241644 -402903 594775 1719489 1957501 565646 -1412682
31937 -1412682 -2143479 -1409022 -761313 -1167766 -1828162 -1785813 -1483427 -1878592 -2840284 -3341060
$$ packed form
32001H78181P94966J00182j385013j964566r51120K34355K74665m4850O46433
31992a416767J796212J643103P6470r66088k93407P81078L43324j342447k127363
31983a505885q75041J054496J681913R39503L45588N13242L64787p92126j791080
31974f4603j301051J6861N40081K52649N02436J375584J335083n9862j025375
31965A571803k22258J018783O18430j165505k210721j557152l71767N7145r5703
31956b356945J6910N10334P58376L82441k39448m71869k36854r0319l62428n66711
31946b656513j27580O21403R21046Q38741R97678J124714K38012j391855j978328
31937a412682p30797P34457O47709m06453o60396M2349L02386l95165r61692n00776
$$ plain form
31927 -3341060 -2828368 -1707474 -726829 -377408 -656518 -1062322 -1043746 -624264 -234485
31918 -234485 99252 759886 1592086 1802111 1262203 1110144 2317896 4214960 5210397
31909 5210397 4647888 3273313 2151660 1772674 1993959 2209625 1701439 406559 -757263
31900 -757263 -859480 -137329 361246 261737 334367 1288744 2640302 3217190 2598421 1613655
31890 1613655 1310845 1739583 2100955 1964012 1741055 1767027 1631598 1045842 699652 1189830
31880 1189830 1524402 172453 -2319379 -3389232 -1806015 499572 1033591 -20216
31872 -20216 -574231 169977 969388 723971 -158628 -783473 -922514 -796684 -649757 -884865
31862 -884865 -1840992 -3117617 -3814460 -3717512 -3567540 -3870063 -4147292 -3762917 -2851209 -1970095
$$ packed form
31927c341060N12692J120894R80645L49421k79110m05804J8576M19482L89779
31918b34485L33737O60634Q32200K10025n39908j52059J207752J897064R95437
31909E210397n62509j374575j121653l78986K21285K15666n08186j294880j163822
31900g57263j02217P22151M98575r9509P2630R54377J351558N76888o18769r84766
31890A613655l02810M28738L61372j36943k22957K5972j35429n85756l46190M90178
31880A189830L34572j351949k491832j069853J583217K305587N34019j053807
31872b0216n54015P44208P99411k45417q82599o24845j39041J25830J46927k35108
31862h84865r56127j276625o96843R6948J49972l02523k77229L84375R11708Q81114
$$ plain form
31852 -1970095 -1381218 -1119792 -1189195 -1123067 30212 2448595 4692950 5172587 4312530
31843 4312530 4058396 4995851 5309214 3478099 880237 193535 1689872 2887757 2090248
31834 2090248 496834 -60117 101389 -473758 -1584653 -1498170 340098 2428760 3284434
31825 3284434 2989003 2292391 1484226 798100 866632 1912367 3052200 3040648 1446754
31816 1446754 -1017333 -2884947 -2864283 -1262394 -259260 -1504878 -3567221 -3454428 -861332
31807 -861332 1178401 659785 -574347 102389 2151523 3126261 2524693 1941201 2052548
31798 2052548 1913812 1226830 1138187 2331926 3934878 4778272 4525272 3300112 1406635
31789 1406635 -294572 -826214 -294443 112773 -499454 -1943453 -3382269 -3916051 -3102053
$$ packed form
31852a970095N88877K61426o9403O6128J153279K418383K244355M79637q60057
31843D312530k54134R37455L13363j831115k597862o86702J496337J197885p97509
31834B090248j593414n56951J61506n75147j110895Q6483J838268K088662Q55674
31825C284434k95431o96612q08165o86126O8532J045735J139833j1552j593894
31816A446754k464087j867614K0664J601889J003134j245618k062343J12793K593096
31807h61332K039733n18616j234132O76736K049134R74738o01568n83492J11347
31798B052548j38736o86982q8643J193739J602952Q43394k53000j225160j893477
31789A406635j701207n31642N31771M07216o12227j443999j438816n33782Q13998
$$ plain form
31780 -3102053 -1596620 -701963 -512165 480577 2735424 3924382 1872121 -1710110 -2968695
31771 -2968695 -1007373 1417224 2256435 2308423 2501502 2102783 935069 686408 2206473
31762 2206473 3654746 3278540 2205074 2391986 3356989 3267767 2205121 1924449 2829058
31753 2829058 3343948 2316008 392203 -1090289 -1368723 -474717 767328 1152859 446242
31744 446242 -23738 935883 2546574 3012590 1927660 595642 208460 765273 1591724
31735 1591724 1941811 1280662 -112733 -1042990 -740689 10361 -52275 -889120 -1458354
31726 -1458354 -1405718 -1297781 -1386760 -1358275 -1348573 -2085461 -3659566 -4871825 -4225196 -1448933
31716 -1448933 1896747 3406100 2066747 -327394 -914541 790008 2411468 2148037
$$ packed form
31780c102053J505433Q94657J89798R92742K254847J188958k052261l582231j258585
31771b968695J961322K424597Q39211N1988J93079l98719j167714k48661J520065
31762B206473J448273l76206j073466J86912R65003q9222j062646k80672R04609
31753B829058N14890j027940j923805j482492k78434Q94006J242045L85531p06617
31744D46242m69980R59621J610691M66016j084930j332018l87182N56813Q26451
31735A591724L50087o61149j393395r30257L02301P51050o2636q36845n69234
31726a458354N2636J07937q8979K8485R702p36888j574105j212259O46629K776263
31716a448933L345680J509353j339353k394141n87147J704549J621460k63431
$$ plain form
31708 2148037 975181 364793 -231990 -1699023 -2749760 -1735343 110653 129514 -1618900
31699 -1618900 -2709124 -2660172 -3499245 -5466754 -5671248 -2597653 1039048 2120341 1439645
31690 1439645 1692384 2964494 3096477 1598553 352960 487124 912264 400532 -665559
31681 -665559 -1203531 -793278 395257 1970971 3058828 2549359 365023 -1923339 -2378361
31672 -2378361 -582320 2042979 3804322 4358929 4527465 4686597 4129581 2522651 1198149
31663 1198149 1757097 3639840 4558147 3541098 2005373 1238108 518379 -1029857 -2173291
31654 -2173291 -1022516 1939081 4146742 4157893 2969083 2034859 1497593 859641 178222
31645 178222 -129979 99259 936737 2494413 4365588 5482079 5152033 3957602 3128520
$$ packed form
31708B148037j172856o10388n96783j467033j050737J014417J845996J8861j748414
31699a618900j090224M8952q39073j967509k04494L073595L636701J081293o80696
31690A439645K52739J272110J31983j497924j245593J34164M25140n11732j066091
31681f65559n37972M10253J188535J575714J087857n09469k184336k288362m55022
31672b378361J796041K625299J761343N54607J68536J59132n57016j606930j324502
31663A198149N58948J882743R18307j017049j535725p67265p19729j548236j143434
31654b173291J150775K961597K207661J1151j188810r34224n37266o37952o81419
31645A78222l08201K29238Q37478J557676J871175J116491l30046j194431q29082
$$ plain form
31636 3128520 3191218 3621307 3699856 3308740 2809368 2400786 1858875 1002050 256849 397524
31626 397524 1555282 2815584 3200419 2897949 3019144 4055816 5050432 4659935 2866943
31617 2866943 1198774 1058997 2101339 2702651 2087829 1382955 2045465 3710657 4546116
31608 4546116 3734121 2528646 2382917 2989420 3052928 2357486 1929950 2332629 2893527
31599 2893527 2838754 2311991 1853446 1499172 926767 140222 -501111 -818951 -999659 -1231282
31589 -1231282 -1405712 -1273085 -807113 -336470 -257127 -590654 -917770 -856144 -510777 -243940
31579 -243940 -36823 578540 1737889 2653392 2263313 552079 -1188391 -1722691 -1213294
31570 -1213294 -760382 -800022 -616596 461907 2044917 3165340 3259814 2383847 1071996
$$ packed form
31636C128520O2698M30089P8549l91116m99372m08582n41911q56825p45201J40675
31626C97524J157758J260302L84835l02470J21195J036672R94616l90497j792992
31617B866943j668169j39777J042342O01312o14822p04874O62510J665192Q35459
31608D546116q11995j205475j45729O06503O3508o95442m27536M02679N60898
31599B893527n4773n26763m58545l54274n72405p86545o41333l17840j80708k31623
31589a231282j74430J32627M65972M70643P9343l33527l27116O1626L45367K66837
31579b43940K07117O15363J159349R15503l90079j711234j740470n34300N09397
31570a213294M52912l9640J83426J078503J583010J120423R4474q75967j311851
$$ plain form
31561 1071996 335320 983867 2321984 2398490 514425 -1375731 -1095737 641174 1280206
31552 1280206 158440 -909354 -852924 -848143 -1868894 -2911357 -2893464 -2437811 -2268802
31543 -2268802 -1593301 72278 1052666 -181937 -2013483 -1610113 771686 2217275 1757534
31534 1757534 1556020 2869480 3722568 2138519 -556818 -1650807 -807987 98552 63625
31525 63625 -61387 648156 1998641 3261556 3766711 2944311 844037 -1319321 -2052319
31516 -2052319 -1176873 93265 627043 259871 -655832 -1689333 -2207153 -1660569 -348793
31507 -348793 683891 786554 215446 -670820 -1995491 -3634833 -4532066 -3619567 -1339194
31498 -1339194 494754 578068 -579150 -1469016 -1331272 -683437 -291741 -160700 206953
$$ packed form
31561A071996p36676O48547J338117P6506j884065j890156K79994J736911O39032
31552A280206j121766j067794N6430M781j020751j042463J7893M55653J69009
31543b268802O75501J665579R80388j234603j831546M03370K381799J445589m59741
31534A757534k01514J313460Q53088j584049k695337j093989Q42820R06539l4927
31525F3625j25012P09543J350485J262915N05155q22400k100274k163358p32998
31516b052319Q75446J270138N33778l67172r15703j033501n17820N46584J311776
31507c48793J032684J02663n71108q86266j324671j639342q97233R12499K280373
31498a339194J833948Q3314j157218q89866J37744O47835L91696J31041L67653
$$ plain form
31489 206953 842345 1043186 182181 -1444296 -2784242 -3019539 -2255009 -1225238 -516104
31480 -516104 -267657 -528756 -1451098 -2806696 -3610903 -2886290 -963041 558570 568421
31471 568421 -260602 -511610 15287 272215 -160955 -299520 599678 1566452 1151937 -315029
31461 -315029 -947983 127078 1540942 1483055 -159123 -2098965 -3313635 -3552811 -2809762
31452 -2809762 -1414426 -380271 -487478 -1052038 -755031 285331 646407 33332 -145995
31443 -145995 546068 174986 -2615592 -5652052 -5531926 -2280158 658908 1031215 -77
31434 -77 -651201 -1074178 -1913165 -2365153 -1469505 -52923 356993 -263622 -865426 -1253862
31424 -1253862 -1983408 -2786995 -2731009 -1811054 -975755 -569074 -41629 738443 1171267 1144213
$$ packed form
31489B06953O35392K00841q61005j626477j339946k35297P64530J029771P09134
31480e16104K48447k61099r22342j355598q04207P24613J923249J521611R851
31471E68421q29023k51008N26897K56928m33170j38565Q99198R66774m14515j466966
31461c15029o32954J075061J413864n7887j642178j939842j214670k39176P43049
31452b809762J395336J034155j07207n64560K97007J040362L61076o13075j79327
31443a45995O92063l71082k790578l036460J20126L251768K939066L72307j031292
31434g7o51124m22977q38987m51988Q95648J416582M09916o20615o01804l88436
31424a253862p29546q03587N5986R19955Q35299M06681N27445P80072M32824k7054
$$ plain form
31414 1144213 1385673 2210022 2894783 2775409 2167756 1729971 1563598 1454972 1527207 2102977
31404 2102977 3074260 3758143 3443237 2085665 477649 -401375 -198422 846642 2470907
31395 2470907 4192940 4724758 2931554 -159283 -1755442 -676682 1038009 1208949
31387 1208949 726766 1677102 3435116 3376009 1185721 -412834 244115 1574975 1734688
31378 1734688 1421421 2057960 2995902 2575845 938782 -176604 15666 689306 1168123
31369 1168123 1807230 2756418 3002069 1481940 -1172842 -2781044 -1911544 258165 1172084
31360 1172084 135990 -763998 275924 2047361 2214471 963942 522927 1316076 1157613
31351 1157613 -1199343 -4069326 -5417770 -5418132 -5187267 -4758540 -3754381 -2603412 -1670998
$$ packed form
31414A144213K41460Q24349O84761j19374o07653m37785j66373j08626P2235N75770
31404B102977R71283O83883l14906j357572j608016q79024K02953J045064J624265
31395B470907J722033N31818j793204l090837j596159J078760J714691J70940
31387A208949m82183R50336J758014n9107k190288j598555O56949J330860J59713
31378A734688l13267O36539R37942m20057j637063j115386J92270O73640M78817
31369A168123O39107R49188K45651j520129k654782j608202Q69500K169709R13919
31360A172084j036094q99988J039922J771437J67110j250529m41015P93149j58463
31351A157613k356956k869983j348444l62K30865M28727J004159J150969R32414
$$ plain form
31342 -1670998 -469371 1007107 1597496 1001979 950454 2664072 4583132 4544702 2962395
31333 2962395 1737135 1111502 -14580 -1384652 -1531608 -420074 300809 -274880 -1500726
31324 -1500726 -2676171 -3484983 -3128816 -1080972 1268661 1751852 375189 -782762 -714389
31315 -714389 -402320 -366112 312515 1755644 2362562 1339917 273446 770467 2059968
31306 2059968 2401230 1642920 868824 417927 -220888 -1038239 -1331476 -757761 260392
31297 260392 1006570 861177 -378507 -2102722 -3236153 -3374096 -3169488 -3381067 -4083467
31288 -4083467 -4953775 -5623656 -5575936 -4509817 -3062235 -2360731 -2611990 -2922989 -2647847
31279 -2647847 -1959474 -963575 582734 2337694 3318078 3223476 2781415 2447355 1930506
$$ packed form
31342a670998J201627J476478N90389n95517n1525J713618J919060l8430j582307
31333B962395j225260o25633j126082j370072j46956J111534P20883n75689j225846
31324a500726j175445q08812L56167K047844K349633M83191j376663j157951O8373
31315g14389L12069L6208O78627J443129O06918j022645j066471M97021J289501
31306B059968L41262p58310p74096m50897o38815q17351k93237N73715J018153
31297B60392P46178j45393j239684j724215j133431j37943K04608k11579p02400
31288d083467q70308o69881M7720J066119J447582P01504k51259l10999K75142
31279b647847O88373R95899J546309J754960R80384r4602m42061l34060n16849
$$ plain form
31270 1930506 1338908 1421031 2142040 2408303 1829705 1324105 1287464 772185 -570606 -1398519
31260 -1398519 -806791 -24142 -482031 -1545197 -1823330 -1545349 -1798633 -2368022 -2251511
31251 -2251511 -1620035 -1363023 -1220078 -270836 1068578 1419731 646639 -84857 -367238
31242 -367238 -922151 -1860696 -2281058 -1870649 -1447533 -1635569 -2245767 -3033232 -3775040 -3694992
31232 -3694992 -2344026 -992161 -1346956 -2733599 -2571313 -213328 1762287 1157035 -812759
31223 -812759 -1569184 -787996 -166096 -511308 -987200 -983344 -1006604 -1427354 -1623260 -965480
31213 -965480 88886 515647 32199 -621645 -714907 -449623 -566493 -1235207 -1885126 -2214149
31203 -2214149 -2657028 -3437586 -3889184 -3453085 -2725085 -2583745 -2852282 -2954692 -3331551
$$ packed form
31270A930506n91598Q2123P21009K66263n78598n05600l6641n15279j342791q27913
31260a398519N91728P82649m57889j063166k78133K77981k53284n69389J16511
31251b251511O31476K57012J42945R49242J339414L51153p73092p31496k82381
31242c67238n54913r38545m20362M10409M23116j88036o10198p87465p41808Q0048
31232c694992J350966J351865l54795j386643J62286K357985J975615o05252j969794
31223h12759p56425P81188O21900l45212m75892L856k3260m20750j95906O57780
31213i65480J054366M26761m83448o53844r3262K65284j16870o68714o49919l29023
31203b214149m42879p80558m51598M36099P28000J41340k68537j02410l76859
$$ plain form
31194 -3331551 -4673934 -6031496 -5514189 -3129826 -1189802 -1311761 -2561670 -3244595 -2974210
31185 -2974210 -2078013 -560268 1033121 1125125 -801773 -2544960 -1471250 1875467 4123584
31176 4123584 3073430 -2493 -2271624 -2442097 -1527821 -1205063 -1869277 -2259660 -1097958
31167 -1097958 970188 1785615 358555 -1769555 -2566987 -2001726 -1442660 -1419234 -1429793
31158 -1429793 -1470342 -2073435 -2866312 -2710454 -1592777 -956615 -1648006 -2779817 -3241981
$$ packed form
31194c331551j342383j357562N17307K384363J940024j21959j249909o82925K70385
31185b974210Q96197J517745J593389R2004j926898j743187J073710L346717K248117
31176D123584j050154l075923k269131j70473R14276L22758o64214l90383J161702
31167a097958K068146Q15427j427060k128110p97432N65261N59066K3426j0559
31158a429793m0549o03093p92877J55858J117677O36162o91391j131811m62164
$$ [...]
##END NTUPLES=NMR SPECTRUM
##END=
