##TITLE=31Pdec_PR192M_W
 D2O, 24 sc
 27.10.2020
##JCAMPDX= 6.0         $$ Bruker NMR JCAMP-DX V2.0
##DATA TYPE= NMR SPECTRUM
##DATA CLASS= NTUPLES
##ORIGIN= UXNMR, Bruker Analytische Messtechnik GmbH
##OWNER= root
$$ XWIN-NMR		Version 3.5
$$ Tue Oct 27 10:17:45 2020 Russian Standard Time (UT+4h)  she@DPX200
##.OBSERVE FREQUENCY= 81.013821
##.OBSERVE NUCLEUS= ^31P
##.ACQUISITION MODE= SIMULTANEOUS
##.ACQUISITION SCHEME= undefined
##.AVERAGES= 24
##.DIGITISER RES= 17
##SPECTROMETER/DATA SYSTEM= spect
##.PULSE SEQUENCE= zgpg30
##.SOLVENT NAME= DMSO
##.SHIFT REFERENCE= (INTERNAL, DMSO, 0, 182.463)
##AUDIT TRAIL= $$ (NUMBER, WHEN, WHO, WHERE, WHAT)
$$ ##TITLE= Audit trail, XWIN-NMR		Version 3.5
$$ ##JCAMPDX= 5.01
$$ ##ORIGIN= Bruker BioSpin GmbH
$$ ##OWNER= she
$$ F:/spectra/data/she/nmr/P31/1/pdata/1/auditp.txt
$$ ##AUDIT TRAIL=  $$ (NUMBER, WHEN, WHO, WHERE, WHAT)
(   1,<2020-10-27 10:16:10.34 +0400>,<she>,<DPX200>,
      <created by zg, POWCHK disabled, PULCHK disabled
       configuration hash MD5:
       00 E9 B6 7A A2 85 ED C7 34 08 36 98 17 FE 4E 26
       data hash MD5: 32K
       2A 41 5A 25 6C 1E A9 3A B4 41 3F D5 DD 5B 46 D3>)
(   2,<2020-10-27 10:16:12.67 +0400>,<she>,<DPX200>,
      <Start of raw data processing
       efp BC_mod = 2 LB = 1 FT_mod = 6 PKNL = 1 PHC0 = -2366.448 PHC1 = -1.799309 SI = 64K 
       data hash MD5: 64K
       16 79 3C E2 CE DC 17 65 91 51 C7 DC 61 C2 87 E4>)
(   3,<2020-10-27 10:16:28.67 +0400>,<she>,<DPX200>,
      <pk PHC0 = -21.95424 PHC1 = 41.20001 
       data hash MD5: 64K
       00 22 6D 2F 21 9D B5 B3 94 37 DD 73 72 D7 9B 6F>)
(   4,<2020-10-27 10:16:31.95 +0400>,<she>,<DPX200>,
      <abs ABSG = 5 
       data hash MD5: 64K
       3C 69 A8 C6 A6 6B 06 18 0C 3C 87 A6 8B B9 49 D5>)
$$ ##END=
$$ 
$$ hash MD5
$$ 66 B6 A4 37 20 8B 34 8F 09 F4 F5 BB B2 78 E0 DA
##$RELAX= 
##$RELAX= 
##$RELAX= 
##$RELAX= 
##$RELAX= 
##$RELAX= 
##$RELAX= 
##$RELAX= 
$$ Bruker specific parameters
$$ --------------------------
##$DU= <F:/spectra>
##$EXPNO= 1
##$NAME= <P31>
##$PROCNO= 1
##$TYPE= <nmr>
##$USER= <she>
##$AMP= (0..31)
100 100 100 100 100 100 100 100 100 100 100 100 100 100 100 100 100 100 
100 100 100 100 100 100 100 100 100 100 100 100 100 100 
##$AQSEQ= 0
##$AQ_mod= 1
##$AUNM= <au_zg>
##$AUTOPOS= <>
##$BF1= 81.014009
##$BF2= 200.13
##$BF3= 200.13
##$BF4= 200.13
##$BF5= 200.13
##$BF6= 200.13
##$BF7= 200.13
##$BF8= 200.13
##$BYTORDA= 1
##$CFDGTYP= 0
##$CFRGTYP= 5
##$CHEMSTR= <none>
##$CNST= (0..31)
1 1 145 1 1 1 1 1 1 1 1 1 1 1 1 1 1 1 1 1 1 1 1 1 1 1 1 1 1 1 1 1 
##$CPDPRG= <waltz16>
##$CPDPRG1= <>
##$CPDPRG2= <waltz16>
##$CPDPRG3= <>
##$CPDPRG4= <mlev>
##$CPDPRG5= <mlev>
##$CPDPRG6= <mlev>
##$CPDPRG7= <mlev>
##$CPDPRG8= <mlev>
##$CPDPRGB= <>
##$CPDPRGT= <>
##$D= (0..31)
0 1 0 0 0 0 0 0 0 0 0 0.03 2e-05 3e-06 0 0 0 0 0 0 0 0 0 0 0 0 0 0 0 0 
0 0 
##$DATE= 1603779369
##$DBL= (0..7)
120 120 120 11 120 120 24 19 
##$DBP= (0..7)
150 150 150 150 150 150 150 150 
##$DBP07= 0
##$DBPNAM0= <>
##$DBPNAM1= <>
##$DBPNAM2= <>
$$ [...]
##$SUBNAM3= <"">
##$SUBNAM4= <"">
##$SUBNAM5= <"">
##$SUBNAM6= <"">
##$SUBNAM7= <"">
##$SUBNAM8= <"">
##$SUBNAM9= <"">
##$SW= 369.568048894756
##$SWIBOX= (0..15)
0 1 3 0 0 0 0 0 0 0 0 0 0 0 0 0 
##$SW_h= 29940.119760479
##$TD= 32768
##$TD0= 1
##$TE= 0
##$TE2= 300
##$TE3= 300
##$TEG= 300
##$TL= (0..7)
0 120 53 12 22 120 120 120 
##$TP= (0..7)
150 150 150 150 150 150 150 150 
##$TP07= 0
##$TPNAME0= <>
##$TPNAME1= <>
##$TPNAME2= <>
##$TPNAME3= <>
##$TPNAME4= <>
##$TPNAME5= <>
##$TPNAME6= <>
##$TPNAME7= <>
##$TPOAL= (0..7)
0.5 0.5 0.5 0.5 0.5 0.5 0.5 0.5 
##$TPOFFS= (0..7)
0 0 0 0 0 0 0 0 
##$TUNHIN= 0
##$TUNHOUT= 0
##$TUNXOUT= 0
##$USERA1= <user>
##$USERA2= <user>
##$USERA3= <user>
##$USERA4= <user>
##$USERA5= <user>
##$V9= 5
##$VALIST= <valist>
##$VCLIST= <CCCCCCCCCCCCCCC>
##$VD= 0
##$VDLIST= <DDDDDDDDDDDDDDD>
##$VPLIST= <PPPPPPPPPPPPPPP>
##$VTLIST= <TTTTTTTTTTTTTTT>
##$WBST= 1024
##$WBSW= 4
##$XGAIN= (0..3)
0 0 0 0 
##$XL= 0
##$YL= 0
##$YMAX_a= 14097
##$YMIN_a= -18065
##$ZGOPTNS= <>
##$ZL1= 120
##$ZL2= 120
##$ZL3= 120
##$ZL4= 120
##$ABSF1= 182.463
##$ABSF2= -187.1042
##$ABSG= 5
##$ABSL= 3
##$ALPHA= 0
##$AQORDER= 0
##$ASSFAC= 0
##$ASSFACI= 0
##$ASSFACX= 0
##$ASSWID= 0
##$AUNMP= <proc_1d>
##$AZFE= 0.1
##$AZFW= 0.5
##$BCFW= 0
##$BC_mod= 2
##$BYTORDP= 0
##$COROFFS= 0
##$CY= -3
##$DATMOD= 1
##$DC= 0
##$DFILT= <>
##$DTYPP= 0
##$F1P= 0
##$F2P= 0
##$FCOR= 1
##$FTSIZE= 65536
##$FT_mod= 6
##$GAMMA= 0
##$GB= 0
##$INTBC= 1
##$INTSCL= 5.30512e-09
##$ISEN= 30
##$LB= 1
##$LEV0= 0
##$LPBIN= 0
##$MAXI= 10000
##$MC2= 0
##$MEAN= 0
##$ME_mod= 0
##$MI= 50
##$NCOEF= 0
##$NC_proc= -5
##$NLEV= 6
##$NOISF1= 182.463
##$NOISF2= 159.3651
##$NSP= 0
##$NTH_PI= 0
##$NZP= 0
##$OFFSET= 182.463
##$PC= 4
##$PHC0= -2388.402
##$PHC1= 39.4007
##$PH_mod= 1
##$PKNL= yes
##$PPARMOD= 0
##$PSCAL= 0
##$PSIGN= 0
##$REVERSE= no
##$SF= 81.014009
##$SI= 65536
##$SIGF1= 159.3651
##$SIGF2= -187.1042
##$SINO= 113.3802
##$SIOLD= 16384
##$SREGLST= <1H.CDCl3>
##$SSB= 0
##$STSI= 65536
##$STSR= 0
##$SW_p= 29940.119760479
##$SYMM= 0
##$S_DEV= 0
##$TDeff= 32768
##$TDoff= 0
##$TI= <>
##$TILT= no
##$TM1= 0
##$TM2= 0
##$TOPLEV= 0
##$USERP1= <user>
##$USERP2= <user>
##$USERP3= <user>
##$USERP4= <user>
##$USERP5= <user>
##$WDW= 1
##$XDIM= 65536
##$YMAX_p= 411945656
##$YMIN_p= -5472403
$$ End of Bruker specific parameters
$$ ---------------------------------
##NTUPLES= NMR SPECTRUM
##VAR_NAME=  FREQUENCY,     SPECTRUM/REAL,   SPECTRUM/IMAG
##SYMBOL=    X,             R,               I
##VAR_TYPE=  INDEPENDENT,   DEPENDENT,       DEPENDENT
##VAR_FORM=  AFFN,          ASDF,            ASDF
##VAR_DIM=   65536,         65536,           65536
##UNITS=     HZ,            ARBITRARY UNITS, ARBITRARY UNITS
##FACTOR=    0.456856943014862, 1,           1
##FIRST=     14782.0589164895, 0,            0
##LAST=      -15158.0608439895, 0,           0
##MIN=       -15158.0608439895, -5472403,    0
##MAX=       14782.0589164895, 411945656,    0
$$ Real data points
##PAGE= N=1
##DATA TABLE= (X++(R..R)), XYDATA
$$ [...]
39568A203959m30654L84633Q24346M33682j89732m84997n13220m55635l17985
39559D54397j97903j89824k2172N61757J100724Q29312j48230q36215o62368j34959
39549G54519M0713j28724k22750j16393k7219j40539m17460n98072l80548J70611
39539a065862N35260M09370K17731M21279O16725J41353o05528m96525N62615
39530G36418J301987Q90672M1600k56661j68889l92755q56085r42210n55495j35248
39520c36666Q5182J38497n2380m47638n76946j08146N21713O60641L57875J08295
39510C50427m036j97826l15235o0001K59868O6672m77597o25184k13360J40092
39500a076180Q7489k7982L6655K8895j40579j14976J93066L25508J15804R7051
$$ plain form
39568 1203959 773305 1157938 1982284 2415966 2226234 1741237 1228017 772382 454397
39559 454397 256494 66670 44498 606255 1706979 2536291 2388061 1551846 889478 754519
39549 754519 795232 666508 443758 327365 300146 159607 -257853 -855925 -1236473 -1065862
39539 -1065862 -530602 -121232 96499 517778 1134503 1275856 670328 173803 736418
39530 736418 2038405 2929077 2970677 2714016 2545127 2152372 1296287 354077 -201418 -336666
39520 -336666 -251484 -112987 -165367 -613005 -1189951 -1298097 -776384 -115743 242132 350427
39510 350427 346391 148565 -166670 -226671 33197 99869 -377728 -1002912 -1216272 -1076180
39500 -1076180 -988691 -1016673 -980018 -951123 -1091702 -1206678 -1013612 -688104 -572300 -475249
39490d75249N71437R24261N05811l05263o15128k46129K24437M14603M42094L93608
39480A834482J51589k13526m21885m42752n29252p15241p02395l68799K318J67977
39470a237484K47018L81386L92006Q2615l15015l64873n3468J51526k6631k28402
39460i71322N7092P04913J009510N86969j22019m71307m28252l92439m11989j41183
39450e80027M12921P04593M46017P6220P9534K74122K23287l0236j97724m05614
39440A003093r29925j407512j093533k0750Q11469O98205R3807j54126P2386K81735
39430f45151K36121J38595J38556J56322J55293J94769K21536J18164o1166j59118
39420D93921j62604j47146q4674L1782K2148k04264l78084k65748j44022l59014
$$ plain form
39490 -475249 96188 1020449 1526260 1220997 605869 359740 584177 998780 1440874 1834482
39480 1834482 1986071 1772545 1350660 907908 378656 -336585 -1038980 -1407779 -1405461 -1237484
39470 -1237484 -990466 -609080 -217074 -134459 -449474 -814347 -867815 -716289 -742920 -971322
39460 -971322 -914230 -209317 800193 1387162 1265143 793836 365584 -26855 -438844 -580027
39450 -580027 -167106 537487 983504 1059724 1139258 1413380 1636667 1606431 1408707 1003093
39440 1003093 73168 -1334344 -2427877 -2448627 -1637158 -938953 -845146 -999272 -926886 -645151
39430 -645151 -409030 -270435 -131879 24443 179736 374505 596041 714205 653039 493921
39420 493921 331317 184171 99497 131279 153427 -50837 -428921 -694669 -838691 -1197705
39410a197705n71732j46465P04243R83936L70212k14986J5314N11528K96584m90945
39400B59984q70636n32121j14108k5864P7566M57124P41947N88127K76115K40428
39390A098562M43928N84925N63280M16604J25951k10391l22760j73130r4967k64117
39380B167885l98149k93119k40765m82992o51427l16112J96494J78072m02597
39371b42710q43240o92454k13631J82448M24098N67104N58040L81532J13935k43475
39361h353o58539q20487m43448J67528L61351K5621l00899k85545j52968k1062
39351b136801L79090R64248J022181K43886n93230o52013k05648j2866k4404L19888
39341f95669Q25729O94567r3452o36854n21689l33649m47141l43461L13671Q61733
$$ plain form
39410 -1197705 -1769437 -1915902 -1211659 -227723 142489 -72497 -57183 454345 750929 259984
39400 259984 -610652 -1142773 -1256881 -1282745 -1205179 -748055 -6108 582019 858134 1098562
39390 1098562 1542490 2127415 2690695 3107299 3233250 3022859 2700099 2526969 2432002 2167885
39380 2167885 1769736 1476617 1235852 752860 101433 -214679 -18185 159887 -242710
39371 -242710 -1085950 -1778404 -1992035 -1809587 -1385489 -818385 -260345 121187 235122 -8353
39361 -8353 -666892 -1487379 -1930827 -1763299 -1401948 -1376327 -1677226 -1962771 -2115739 -2136801
39351 -2136801 -1757711 -793463 228718 472604 -120626 -772639 -978287 -991153 -1015557 -695669
39341 -695669 130060 824627 731175 94321 -427368 -761017 -1208158 -1551619 -1237948 -376215
39331c76215O54419J39217N8818J81860j87948q48791r20753k80608K56646K48567
39321a074788J73011M56869P91517P35575L16757k66036q91007j177247o23925
39312a559274M94011J077788O08343o0990N476L82409N7799q05685j041441l30789
39302a172353K90285O5359l76869j39851N14107O59947J68052k11625r3206N8987
39292b37167j24790k05496L14485R35497N96090p59640j719443j017461P37678
39283a480247J662149R24555k94693n09580J43807M21286o4236m18190j0543N36919
39273I11227L33893m77791r72831o45315J24816O42492N74884J35117j93009j62692
39263B70791k8147j34424l28260j81211K07912K12565l33260p58228n30786n1987
$$ plain form
39331 -376215 278204 417421 476239 658099 470151 -378640 -1299393 -1580001 -1323355 -1074788
39321 -1074788 -901777 -444908 346609 1082184 1398941 1132905 241898 -935349 -1559274
39312 -1559274 -1065263 12525 620868 559878 565354 947763 1005562 199877 -841564 -1172353
39302 -1172353 -882068 -816709 -1193578 -1333429 -819322 -159375 8677 -202948 -296154 -237167
39292 -237167 -361957 -567453 -252968 682529 1278619 518979 -1200464 -2217925 -1480247
39283 -1480247 181902 1106457 811764 302184 445991 867277 803041 384851 374308 911227
39273 911227 1245120 767329 -205502 -850817 -726001 -83509 491375 626492 433483 270791
39263 270791 242644 108220 -220040 -401251 -193339 19226 -314034 -1072262 -1603048 -1655035
39253a655035K4901k09084j89312K11531O37066Q33927P32452K40091m62857p45290
39243e81610l10599J55070j17353p30114o75688P6798O11781O08021O51741Q70010
39233E58057N49192m25138r90371n02066J75435O5468l96918k95261J48544J45238
39223i67820q0746L04414J061971J055403J17072o23654n06882j75937k56090
39214g2269l90545j81887k9834k58974k89602M19528J251368J201609L46723l60412
39204A635705m83188m17304m60077m12408j50612J06159K17098K72297K63152
39195E70822Q8220r7431m1756Q9579r7333m75726m22345K63446R94253J128218
39185A999947N98438l10434j252590j696306j138652J74544J232834J343776Q09786
$$ plain form
39253 -1655035 -1630134 -1839218 -2028530 -1816999 -1179933 -346006 386446 626537 163680 -581610
39243 -581610 -892209 -737139 -854492 -1584606 -2260294 -2183496 -1571715 -963694 -311953 558057
39233 558057 1107249 682111 -308260 -810326 -634891 -569423 -966341 -1261602 -1113058 -967820
39223 -967820 -1048566 -744152 317819 1373222 1490294 866640 359758 183821 -72269
39214 -72269 -462814 -644701 -674535 -933509 -1223111 -803583 447785 1649394 1996117 1635705
39204 1635705 1152517 735213 275136 -137272 -287884 -181725 35373 307670 570822
39195 570822 659042 561611 519855 609434 512101 36375 -385970 -122524 871729 1999947
39185 1999947 2598385 2287951 1035361 -660945 -1799597 -1625053 -392219 951557 1761343
39176A761343K41495k27208o25932o97541l93389k60520n84135o54612J87651
39167a252848J191761J028043j76398q84156l65520L84071L57941m0314j4715
39158B27865K21077M7689k94249j37310L54377M22518k5283l80839m27473m92962
39148d84590n45079j45916N40259O72319R374n92538m19250J06737K21929j3980
39138f50735r382L31686N43097L44186p7150l93330l78271j6023L37505K18391
39128B49974k10078j57752N88646J030370K93757q60927r14691K06000R72448
39119A197747M46988n31925q04689m54492j89388o2857K24833L82972k2739n31305
39109c44855k98547M72173O93959O2706n00807l43248M549j12160m07617l32900
$$ plain form
39176 1761343 2002838 1775630 1149698 452157 58768 -201752 -785887 -1440499 -1252848
39167 -1252848 -61087 966956 790558 -93598 -459118 -75047 282894 242580 227865
39158 227865 448942 496631 202382 65072 419449 841967 816684 435845 8372 -484590
39148 -484590 -1029669 -1175585 -635326 36993 46367 -546171 -965421 -858684 -636755 -650735
39138 -650735 -660117 -328431 214666 558852 481702 88372 -289899 -305922 31583 249974
39128 249974 39896 -117856 470790 1501160 1794917 933990 19299 225299 1197747
39119 1197747 1644735 1112810 308121 -146371 -335759 -398616 -173783 209189 186450 -344855
39109 -344855 -643402 -171229 522730 585436 84629 -258619 -254070 -366230 -773847 -1106747
39099a106747p4475o7148q3051K92625O89742M49505j29113j01047N53417P45706
39089A169414m7059r16822q65215j92812J50291j0844j09277Q1740K27808J49311
39079c63465K4476q8287k71788k97317J62099P75944P45663R152m66477n5137
39069A74863N23675K60714n80534q67228l42310Q1026r5842j54315N02428J128553
39059F31030O97280l85886p73872j96928K02671k77199q68859o64314K5044L81530
39049a229503L47066K94763R4247m73351q53418l96722M04389N30743R9876J39355
39039a042555P34942Q28825J04527m02598j21506N7223n66896j155190p18225
39030b281453K26037N92413M29028L96276L32592k42389q00048m86996K67214
$$ plain form
39099 -1106747 -1181222 -1248370 -1331421 -1038796 -349054 100451 -28662 -129709 423708 1169414
39089 1169414 1122355 205533 -659682 -852494 -702203 -713047 -822324 -740584 -512776 -363465
39079 -363465 -338989 -427276 -699064 -996381 -834282 -58338 687325 696477 230000 174863
39069 174863 698538 959252 378718 -488510 -830820 -749794 -845636 -999951 -497523 631030
39059 631030 1328310 942424 168552 -28376 174295 -102904 -971763 -1636077 -1611033 -1229503
39049 -1229503 -882437 -587674 -493427 -966778 -1820196 -2216918 -1812529 -1281786 -1181910 -1042555
39039 -1042555 -307613 521212 625739 223141 101635 158858 -408038 -1563228 -2281453
39030 -2281453 -2055416 -1463003 -1033975 -637699 -305107 -547496 -1347544 -1834540 -1567326
39021a567326L42492j58819j69490L41256L44281j95636n9648R87805J443258
39012A308173L50704j132829j450939p32256j05643J00302L63965Q39475J196499
39003G37451J158489N61411n63341j475751j131755K61353J035765K43318r09442
38994h2502q45034R3181M58175P0580j8057M13598L98666l87399r02898l24059
38984a125749P27315J115744O27218m0015k57598m7477Q9907k30496p44337p47429
38974f32917l3744P31739R21279P44313O21457L25854m65870j232942j177550
38965a98381m60493N9688R7126J9527q2868l58536m24171K00866R67688Q28620
38955F49066p5430n27008j50530J42042j04491j55773L60755N96247j5211o50643
$$ plain form
39021 -1567326 -1224834 -1383653 -1553143 -1211887 -867606 -1063242 -1122890 -135085 1308173
39012 1308173 1658877 526048 -924891 -1657147 -1762790 -1662488 -1298523 -459048 737451
39003 737451 1895940 2457351 1894010 418259 -713496 -452143 583622 826940 -82502
38994 -82502 -927536 -834355 -376180 -305600 -323657 89941 488607 101208 -801690 -1125749
38984 -1125749 -398434 717310 1344528 1304513 1046915 999438 1089345 858849 114512 -632917
38974 -632917 -666661 65078 986357 1730670 2352127 2677981 2212111 979169 -198381
38965 -198381 -658874 -599186 -502060 -482533 -565401 -923937 -1348108 -1147242 -179554 649066
38955 649066 573636 46628 -103902 38140 -66351 -222124 138631 734878 719667 69024
38945F9024m65253L0041K9386r8013L88450J091587J070497M27858K3282o6571
38935B500288n24897j347419j641486j020852k00220O5091j39168l15243k31675
38926b855581P0895M56761O76860N44525K28329N4058L8934j5968n1855J72161
38916f80881N47901O30668K50092k75027n89580o28184m50222r2503L18716N55783
38906d13237M76383J13972l49621n90458l24465L01429P15888N75676J74891o7128
38896F13330j99329m32186n88935m08615j23067r3204p2711M12844J034337Q89424
38886A031888n9871o61512j54063O56475N07430m99618j045912m57562M25738
38877b57007N11071p6402l34295J47455P34288P62797L66244K1420j85377l75808
$$ plain form
38945 69024 -396229 -366188 -336802 -434815 -46365 1045222 2115719 2543577 2566859 2500288
38935 2500288 1975391 627972 -1013514 -2034366 -2234586 -2169495 -2308663 -2623906 -2855581
38926 -2855581 -2784686 -2327925 -1651065 -1106540 -878211 -824153 -785219 -801187 -853042 -680881
38916 -680881 -132980 497688 747780 472753 -116827 -745011 -1195233 -1287736 -969020 -413237
38906 -413237 63146 177118 -172503 -762961 -1087426 -785997 -70109 505567 680458 613330
38896 613330 414001 -18185 -607120 -1015735 -1138802 -1232006 -1304717 -891873 142464 1031888
38886 1031888 972017 310505 156442 812917 1320347 820729 -225183 -682745 -257007
38877 -257007 254064 177662 -156633 -9178 725110 1487907 1854151 1875571 1690194 1314386
38867A314386l80024l6759K70711Q1709k88335j61101K78608J27729o72806r69974
38857d35856j14195R18079R06389J19413k85831l1863J73666j7627k17858k01799
38847H12518k25943l73278l84946k48972k38841k74741L5449N77016O66955O9817
38837D15034n42230m75304J10394N27098M03151p9837n26665o60308m56036r2075
38827a376778K51393M87687N10279K48313o8856j03693k8863l61605q75613n14905
38817a832641R23216J890916R89138q76356j590327o92372L41127N12245L60457
38808B5403M42045M03167Q0775M3271L55047J54096p67691j265155o30314J53234
38798a006122K2986m17609k0667R54530J350363Q86058J29886p10895j645747
$$ plain form
38867 1314386 934362 897603 1168314 1250023 961688 800587 1079195 1206924 534118 -435856
38857 -435856 -550051 368028 1274417 1393830 1107999 1076136 1249802 1232175 1014317 812518
38847 812518 586575 213297 -171649 -420621 -659462 -934203 -898754 -321738 345217 415034
38837 415034 -127196 -602500 -492106 34992 438143 358306 -168359 -828667 -1284703 -1376778
38827 -1376778 -1125385 -637698 -127419 120894 52038 -51655 -80518 -442123 -1317736 -1832641
38817 -1832641 -909425 981491 1970629 1094273 -496054 -1188426 -847299 -335054 25403
38808 25403 467448 870615 951390 994661 1349708 1503804 736113 -529042 -1159356 -1006122
38798 -1006122 -983136 -1400745 -1421412 -466882 883481 1769539 1899425 1188530 -457217
38789d57217k018976j150369L85156J336973J408243J181963P93473L87p10735
38780G68898n72884m786j20098p59157o43702L06787O15441k29250p25413J36861
38770a227303R96814K50989j226856j334289K1946Q77327K41617o54017m99634
38761b553406K58800M95245J87684J30628M88866O32546K38791k42230l19455
38752f82531j02579J2554n7791j07280r1360j97409m05547l13965K97242R09641
38742g39025P47491j12640o22468q9212P98166Q33861m7516p09457m57480M4489
38732c53791r7554o30071o24813K6058M58778K02366j32660J23076O28621N64137
38722A64147j13756n85239k97233L34345N10984M2089m68293l71065K14072M80509
$$ plain form
38789 -457217 -2476193 -3626562 -3241406 -1904433 -496190 685773 1479246 1479633 768898
38780 768898 196014 191228 71130 -688027 -1331729 -1024942 -409501 -638751 -1364164 -1227303
38770 -1227303 -230489 20500 -1206356 -2540645 -2518699 -1641372 -1399755 -2053772 -2553406
38761 -2553406 -2294606 -1799361 -1611677 -1481049 -992183 -359637 -120846 -363076 -682531
38752 -682531 -785110 -772556 -830347 -937627 -1028987 -1226396 -1631943 -1945908 -1648666 -739025
38742 -739025 8466 -104174 -726642 -815854 -17688 816173 768657 59200 -398280 -353791
38732 -353791 -451345 -1081416 -1706229 -1680171 -1221393 -1019027 -1151687 -1028611 -399990 164147
38722 164147 50391 -534848 -832081 -497736 13248 55337 -412956 -784021 -569949 -89440
38712h9440l9361p12894n05914N66411J314568R60828J62443r2759N0862j78292
38702A436452o86972o41903M8663N08420K72283j50171l25399m75290o42670l23692
38692i80279N05882R52127M81934j99141k83067n8896j38901k74359M3243M50147
38682D98690L02841q9212K719L24657J9620p75190r88653l09949L71179L95598
38672b47700J12262l5132j75239m10618m62555k90754k47430k79816J57498R91651
38662h87833J229145L50976p47337q84290q4795O91671Q22282L94395k71835q26330
38652b13951q89901m23830P6677J87037J34902L76499Q25191R48881N16216j28507
38642A409214m96624m24621j43943J2182K337P2852K03291j10535j000944j486908
$$ plain form
38712 -89440 -128801 -841695 -1347609 -781198 533370 1494198 1656641 1563882 1614744 1436452
38702 1436452 749480 107577 156240 664660 936943 786772 461373 -13917 -656587 -980279
38692 -980279 -474397 477730 959664 760523 477456 418560 279659 5300 48543 498690
38682 498690 801531 712319 715038 1039695 1059315 284125 -704528 -1014477 -643298 -247700
38672 -247700 -135438 -170570 -345809 -756427 -1218982 -1509736 -1757166 -2036982 -1879484 -887833
38662 -887833 341312 692288 -55049 -939339 -1024134 -332463 489819 884214 612379 -213951
38652 -213951 -1103852 -1527682 -1451005 -1263968 -1129066 -752567 72624 1021505 1537721 1409214
38642 1409214 912590 487969 344026 356208 358545 431397 634688 524153 -476791 -1963699
38632a963699n20296J249559J877676O45274r07937j104400k60446K15435j6417
38623g85251j81087J4490O3238j76239j96709J26654K47331j8307o0383M81053
38613d85210R75641O96105l9602k86494J71743N35717J58412n23785o20432r1013
38603D91082J71212l16843q16850m25367N07918Q39360L36056o1898J87450M37150
38593A349270P7975m22130m19919k11699l44930m68062P0399Q77221Q93804R724
38583A411653p26432n94661l9594J65608j06907m36117m27127k3666M25553M31208
38573G9518j2148k85838k0375K57246o4645o07616n28696J54622O53974O59895
38563B85937N59005M74480R6481m53977n78794k06841O4977J6373N5623K25392
$$ plain form
38632 -1963699 -2483995 -1234436 643240 1288514 380577 -723823 -984269 -768834 -785251
38623 -785251 -966338 -951848 -888610 -1064849 -1261558 -1134904 -887573 -905880 -966263 -485210
38613 -485210 490431 1186536 1146934 860440 1032183 1567900 1726312 1202527 582095 491082
38603 491082 662294 345451 -471399 -896766 -388848 450512 786568 724670 912120 1349270
38593 1349270 1427245 1005115 585196 373497 28567 -439495 -369096 508125 1401929 1411653
38583 1411653 685221 90560 50966 216574 109667 -326450 -753577 -777243 -351690 79518
38573 79518 67370 -218468 -238843 18403 -46242 -653858 -1182554 -1027932 -373958 285937
38563 285937 844942 1319422 1415903 961926 383132 176291 241268 257641 313264 538656
38553E38656j0905o40680q12602k00549L25835N7113m09360j58664O24998J055053
38543C68895Q16432K82585j95335m31712k48711J98307L31733o4151m30447l28118
38533B99478j54422l32545m53971o9642K82635j05962p16292m12313P23525J359874
38523D20365Q02281j68613n87179m73354l21396k07294P1488M56478O76945N77392
38513A247113J79029l33397o15851m78153k18588k82302n89611o18572j62028
38504a872360M27355P43320O33762O1784p82916j246409p45995L24664Q68338
38495a588457M77419o8898J6370M89785O54219M20121K07821J42370l8700l97266
38485C14784o21449m63537k5366M23128O90358P03541M58110O437m86773p07719
$$ plain form
38553 538656 527751 -112929 -925531 -1126080 -800245 -743132 -1152492 -1311156 -686158 368895
38543 368895 1185327 1467912 1272577 840865 592154 790461 1122194 1058043 627596 299478
38533 299478 145056 -187489 -641460 -711102 -428467 -534429 -1250721 -1663034 -939509 420365
38523 420365 1222646 1054033 466854 -6500 -327896 -535190 -463702 -7224 669721 1247113
38513 1247113 1426142 1092745 476894 -1259 -219847 -502149 -1091760 -1710332 -1872360
38504 -1872360 -1445005 -701685 -67923 -6139 -789055 -2035464 -2781459 -2456795 -1588457
38495 -1588457 -1111038 -1179936 -1163566 -673781 -19562 400559 608380 750750 712050 314784
38485 314784 -306665 -770202 -795568 -372440 317918 1021459 1479569 1486006 999233 291514
38475B91514m09155J77346L88826o4726n61856l45589L16967M45196j75165o50891
38465e87533l80638N9531k8089k86072K451N73958N39504j20033m37031L1449
38455f32503M96288J74892m63812l71340N00141J039738M76927n64285q91706
38446b35660k76463M01108M60097J95210R0761l5966m56949o54366k0703Q05977
38436B73046N29026p37622j282434k28960J080350J053797J20600k33820J24166
38427F98149R9396n23522p93523m30415k93963o47664n09720N63505J419476J005379
38417E87098J2139k99971l9273j81063p37511q03459j92460K72881J63480J2270
38407a205869K45019M87738L01529j18792l51592l07455j00995J44012J47474
$$ plain form
38475 291514 -117641 59705 448531 383805 -178051 -523640 -206673 238523 63358 -587533
38465 -587533 -968171 -908640 -936729 -1222801 -1220350 -646392 -106888 -226921 -663952 -632503
38455 -632503 -136215 38677 -425135 -796475 -296334 743404 1220331 656046 -235660
38446 -235660 -512123 -111015 349082 544292 635053 599087 142138 -512228 -532931 273046
38436 273046 802072 64450 -1217984 -1446944 -366594 687203 807803 573983 698149
38427 698149 797545 274023 -519500 -949915 -1243878 -1891542 -2401262 -1837757 -418281 587098
38417 587098 599237 299266 259993 78930 -658581 -1462040 -1654500 -1381619 -1218139 -1205869
38407 -1205869 -960850 -473112 -171583 -290375 -641967 -949422 -1050417 -906405 -758931
38398g58931l50233j024719j090421k77343P49739J205814R98003N10367P5291
38389C7567o0438K34085O03853L63274n42409j203308q76549p110M58582L47295
38379f45158J39901n0908m83812r11654o72775J91957P74424N69292J74705K98443
38369f15585O91126O26068J4081n38223n51945q0472N51089J000911J006152N53276
38359B656478j07985p80240j415020j731424j204090J10621J146182R19576j33020
38350e38922o64169k27144K44931l1887n28093k99710N64078J113124Q66115K79845
38340G78168m4436k9189R5308K09188K99373K96781R3284l61358r73191j415520
38330a051592j272272n14941K86290N47698L77986L27191N17919N36525K25611
$$ plain form
38398 -758931 -1109164 -2133883 -3224304 -3501647 -2751908 -1546094 -548091 -37724 37567
38389 37567 -22871 211214 815067 1178341 635932 -567376 -1443925 -1451035 -992453 -645158
38379 -645158 -505257 -556165 -1039977 -1951631 -2624406 -2432449 -1658025 -1088733 -914028 -615585
38369 -615585 75541 701609 715690 177467 -374478 -454950 96139 1097050 2103202 2656478
38359 2656478 2548493 1768253 353233 -1378191 -2582281 -2471660 -1325478 -405902 -538922
38350 -538922 -1203091 -1430235 -1185304 -1217191 -1745284 -2044994 -1480916 -367792 498323 778168
38340 778168 733732 704543 799851 1009039 1308412 1605193 1698477 1337119 363928 -1051592
38330 -1051592 -2323864 -2838805 -2552515 -2004817 -1626831 -1299640 -781721 -245196 -19585
38321a9585j0591P9037J38002j54066m70032l64952k8682O1755n7552j8025J20097
38310g24594K619k21576j8854N49724P48706K82920k42836k89536r4690q201J60192
38299A43874N53006O82991J75634m34877m73344k40936m23410p40177l37614N69651
38289e25202P35503j64374q40858k77104P13528O99717l05411r93959o11619K87916
38279a281863Q32562P69103L48668q8584k65190j37541j0898j61206l67829j96598
38269e59376K79894M71018M7166o19681q89454m85578L15960Q94906P49780L4539
38259B39174m63326k03212L96383N47211K16967M8511K11289J24130m50815q25129
38249a58817m15704K38986J83020n77910j108870q24122p7473N35707Q52212R39347
$$ plain form
38321 -19585 -30176 48861 186863 32797 -437235 -802187 -830869 -769114 -826666 -844691 -724594
38310 -724594 -721975 -943551 -962405 -412681 336025 618945 376109 86573 -8117 -16318 143874
38299 143874 696880 1379871 1555505 1120628 647284 406348 -17062 -757239 -1094853 -525202
38289 -525202 210301 45927 -794931 -1072035 -358507 341210 35799 -958160 -1569779 -1281863
38279 -1281863 -449301 319802 668470 579886 314696 177155 166257 5051 -362778 -559376
38269 -559376 -279482 191536 238702 -380979 -1270433 -1756011 -1440051 -545145 204635 239174
38259 239174 -224152 -427364 -30981 516230 733197 781708 992997 1117127 666312 -158817
38249 -158817 -574521 -335535 -152515 -730425 -1839295 -2663417 -2740890 -2205183 -1352971 -413624
38239d13624P27866J86565m00889o47076m65899j01143J64432K08020O8267j22338
38229g95819k46110l05679l56061l04153N9177O91209J120680R06032K34891k37352
38219G66815k21239j32332l78901o52980l85452K83305O13092L99934L17117P89170
38209A398529J171591O77814l36126q31309o13326m78954p90739q78440k46204
38200i27164M87134N29374J77394K92586Q34629Q27250j72644j328179j524391
38191h04011o43880M46057Q84403N53796J7974q0717L57260P92522O39090q0583
38181B081911q04369j073962q92681n08041j34693Q8617J55051K60353N53066
38172b74748P80304N19807j34577n10896k27574K17276Q9115n74469j016433p32837
$$ plain form
38239 -413624 314242 500807 99918 -547158 -1013057 -1114200 -949768 -741748 -673481 -795819
38229 -795819 -1041929 -1347608 -1703669 -2007822 -1948645 -1257436 -136756 769276 1004167 766815
38219 766815 545576 413244 34343 -618637 -1004089 -720784 -107692 292242 609359 1398529
38209 1398529 2570120 3247934 2911808 2080499 1467173 988219 197480 -680960 -927164
38200 -927164 -440030 89344 266738 559324 1393953 2221203 2048559 720380 -804011
38191 -804011 -1447891 -1001834 -117431 436365 454339 373622 730882 1523404 2162494 2081911
38181 2081911 1277542 203580 -689101 -1197142 -1331835 -1243218 -1088167 -827814 -274748
38172 -274748 505556 1025363 890786 379890 152316 369592 458707 -115762 -1132195 -1865032
38162a865032N951O06900P52475M71419l2528m37881m47349r2539K48331K90408
38152d99845J52198J03012K03172L57900M86632M12729j11278q90011j106138
38143h91629k63626Q50521R23629j00658q60663m96508K00089J82395k01337J8681
38133f39106O46821O20545j40082n57857j83036J79893m457j41592K06546L80539
38123C68214j42362o06218j55663O58178P38256J68211j79454k41781n78063r29219
38113h99901n13174K98386K14150p91790j100497J38213J606221J680045N43907
38104A175560n12770r30484r37643n56166K49813Q86359P12429Q3629j27218J41767
38094A85276J89285k04997m74985k28855K46497N35214N46308L55617Q9632l2236
$$ plain form
38162 -1865032 -1859081 -1252181 -499706 -28287 -60815 -498696 -946045 -1038584 -790253 -499845
38152 -499845 -347647 -244635 -41463 316437 803069 1215798 1104520 214509 -891629
38143 -891629 -1155255 -304734 618895 518237 -342426 -838934 -638845 -456450 -657787 -639106
38133 -639106 7715 628260 488178 -69679 -252715 -72822 -77279 -218871 -12325 368214
38123 368214 225852 -380366 -536029 122149 860405 1028616 849162 607381 29318 -899901
38113 -899901 -1413075 -1114689 -900539 -1692329 -2792826 -2654613 -1048392 631653 1175560
38104 1175560 662790 -267694 -1205337 -1761503 -1511690 -625331 87098 170727 43509 185276
38094 185276 374561 169564 -305421 -534276 -287779 247435 793743 1149360 1238992 1206756
38084A206756M2935R146l24210o00103m40601j01783j9180m4083J64971L54950
38074B48798J39230r7230K09953N69063L4623j018196j120757N1337J065528Q39920
38064I22269K4359l88180n01894o56583l86002N42358J081427L33306p28276n18142
38054b75358O51098R67436j05883j103763q61054n0255J67753j53753j73618L80512
38044e56885J002592J117221N54575l10918p08240k68333K47382k35219j404078
38035e61903j660259l64892J033032R17135k92127r09126l93226K26536J44078
38026a860752k15339j80457J61636L93298N08907O95014P72468L85003l70208
38017B89570q70614o06254K10080P46984L88217m88456p95723r299J096039J358173
$$ plain form
38084 1206756 1249691 1258837 934627 334524 -106077 -207860 -227040 -271123 -106152 248798
38074 248798 388028 290798 500751 1069814 1104437 86241 -1034516 -983179 82349 922269
38064 922269 946628 558448 56554 -600029 -986031 -443673 637754 971060 242784 -275358
38054 -275358 375740 1343176 1237293 133530 -727524 -777779 -610026 -763779 -937397 -556885
38044 -556885 445707 1562928 2117503 1806585 1098345 830012 1077394 842175 -561903
38035 -561903 -2222162 -2587054 -1554022 -636887 -929014 -1838140 -2231366 -2004830 -1860752
38026 -1860752 -2076091 -2256548 -2094912 -1701614 -1192707 -497693 274775 659778 289570
38017 289570 -581044 -1187298 -977218 -230234 157983 -330473 -1126196 -1135495 -39456 1318717
38007A318717O75555K040o0692O573m15250r95011q83086l805O87380L66695o22745
37996G6371j178542p35996J50185N76927L50854r601j51306k63075m81754m82194
37986b148131n7340L38251K22288k7925L29310J107496J253653L96209n01993
37977I11818m93126O2458K08090j45086k99122m0734P0633k68552n86109m17922
37967i97652o074J67714J22892K28994N52974P47497N10720r1922o91587q39104
37957b95548l21682N18295R29865N19679j98760l54183J72247N58454J26505p26413
37947I28459j029243m85938K19351L86098J20809l0846P5334J00864j70592n47798
37937d33502p35238n91770r5523O01203J064443R14780L45030r1386k64824n22797
$$ plain form
38007 1318717 1994272 1996312 1935620 1942193 1526943 531932 -351154 -354959 332421 699116 76371
37996 76371 -1102171 -1838167 -1687982 -1111055 -760201 -769802 -921108 -1184183 -1665937 -2148131
37986 -2148131 -2205471 -1867220 -1644932 -1672857 -1343547 -236051 1017602 1413811 911818
37977 911818 418692 481150 689240 544154 245032 204298 274931 6379 -579730 -997652
37967 -997652 -1003726 -836012 -713120 -484126 68848 816345 1327065 1235143 543556 -295548
37957 -295548 -617230 -98935 830930 1350609 1151849 797666 969913 1528367 1654872 928459
37947 928459 -100784 -586722 -367371 18727 139536 108690 184024 284888 114296 -433502
37937 -433502 -1168740 -1760510 -1856033 -1254830 -190387 724393 1069423 978037 713213 190416
37927A90416q39287o31495J71727O35157J12391o02567l94951L71941M11874l29518
37917i04312n34941K34822O68212j78186j222707r84940J13656M98596q0589l73154
37907b763543J89059O50281K25044m30747l19397L98313P71897M31319r9246k29893
37897a176913O4939L81254L70521J14007M5050L57303O16457L13158l29953o31710
37887A24113m65414l36063m13049k71698J96354M48204K49938J61501N27282P50304
37877I71472K60411m65702o34869l09603k5236J96873N00727L99685m88101j260057
37867h54400o46861R36714J649674P66599l92967n60762k26378m17016q91680
37858f37077p20333K2251L86412J04925j03526J88044M91727L08752q3460j48970
$$ plain form
37927 190416 -648871 -1280366 -1108639 -473482 -361091 -963658 -1358609 -986668 -574794 -904312
37917 -904312 -1439253 -1204431 -536219 -714405 -1937112 -2922052 -2808396 -2309800 -2390389 -2763543
37907 -2763543 -2574484 -1924203 -1699159 -2129906 -2449303 -2050990 -1279093 -847774 -947020 -1176913
37897 -1176913 -1111974 -730720 -360199 -246192 -201142 156161 772618 1085776 755823 124113
37887 124113 -341301 -677364 -1090413 -1362111 -1165757 -717553 -467615 -306114 221168 971472
37877 971472 1231883 766181 131312 -178291 -203527 -6654 494073 893758 405657 -854400
37867 -854400 -1501261 -564547 1085127 1851726 1458759 897997 671619 254603 -637077
37858 -637077 -1357410 -1335159 -948747 -843822 -947348 -759304 -267577 41175 -42285 -191255
37848a91255Q5322J80633K1209m3379K10292N00781M53671J84839J30985L28665
37838A861763K99429j67464n81796m91368k29091l39671n93791l23761M33491
37829a32259R48490Q99068O11166K20789m24728r35764n81712L60411O34226j00477
37819A499210o06582m3767O29734K84219m89593m91937j6315k16703r33412q95246
37809a280392P1071P11645L71858j50218r9087K18941L28958L25295K67319j05560
37799F59830o22090o42460j77319k7926l97426m53805J92879O92824L37581k85958
37789g23870l33066J2897J38346N4258j2105k75277p16236n46523N84697J549296
37779b67583J108581j96570p72660k37609L14035J40932l06020m27246k45050
$$ plain form
37848 -191255 -105933 74700 95909 52530 262822 763603 1217274 1402113 1533098 1861763
37838 1861763 2161192 1993728 1411932 920564 691473 351802 -241989 -565750 -132259
37829 -132259 816231 1715299 2326465 2547254 2122526 1186762 605050 965461 1599687 1499210
37819 1499210 892628 848861 1478595 1762814 1273221 781284 764969 548266 -385146 -1280392
37809 -1280392 -1209321 -497676 -125818 -276036 -375123 -156182 172776 498071 765390 659830
37799 659830 37740 -604720 -782039 -809965 -1207391 -1661196 -1468317 -775493 -437912 -723870
37789 -723870 -1056936 -1044039 -905693 -851435 -863540 -1138817 -1855053 -2401576 -1816879 -267583
37779 -267583 840998 644428 -128232 -365841 -51806 89126 -216894 -644140 -889190
37770h89190M9244M00639N71166L06155p8088k7826K89615J62101m86599r39263
37760f42046q09960m67583j87654K21392O89194O74592Q9606l42582j13523L41927
37750e46637L92570R5984j19781j47669j32144j21529j35268j95188r1900L73088
37740f28474P67750L69529n97671r13780o3758Q49128O35344k71787n94207j48905
37730e96831J24596j55152k79870K46742Q59170P90377J27362m15693l65313J93983
37720E29371Q45629J103699P03365j04185o90305o68063k79528o0589k28020n10891
37710F40483n37559k88162r5845j76989k95610j21379J54744j3070o20321q78248
37700b231956k65060O16163P99731K99033j586L01691O43103M79283N4826j61258
$$ plain form
37770 -889190 -839946 -439307 131859 438014 359926 332100 621715 783816 297217 -642046
37760 -642046 -1452006 -1919589 -2107243 -1885851 -1196657 -522065 -432459 -775041 -888564 -546637
37750 -546637 -154067 -58083 -177864 -325533 -457677 -579206 -714474 -909662 -1001562 -628474
37740 -628474 139276 508805 -88866 -1002646 -1066404 -217276 418068 146281 -447926 -596831
37730 -596831 -472235 -627387 -907257 -660515 198655 989032 1116394 700701 335388 529371
37720 529371 1375000 2478699 3182064 3077879 2387574 1719511 1439983 1379394 1151374 640483
37710 640483 102924 -185238 -281083 -458072 -753682 -875061 -720317 -733387 -1353708 -2231956
37700 -2231956 -2497016 -1880853 -1081122 -782089 -783675 -481984 161119 640402 695228 533970
37690E33970k21779m16156o49325o09699l01264M4581L72609O71530O59243J40126
37680B23836m70456n92333l77961m35496o18050m4443J263283J785787N01999
37671A236166j246663j233795N33022J664175O75777j017492j253935r9878O34859
37662a07764J87372l74861j08207M62327M01174k21203n97621l00682L90588R20245
37652F51368Q50285J45134o50887q09429k16915M86673O91954M10284p305l07979
37642A243183l45135r5255J55255P2261j56546m5732K85538J66355m00769m47316
37632D31839M41515J150079M87891r62608j536108p50648K13122L07308j39934
37623c57544k65611O5535L12027Q0583n03074r67756q17479L6927R95836J218611
$$ plain form
37690 533970 312191 -103965 -753290 -1362989 -1664253 -1619672 -1247063 -575533 83710 223836
37680 223836 -246620 -838953 -1216914 -1652410 -2270460 -2314903 -1051620 734167 1236166
37671 1236166 -10497 -1244292 -711270 952905 1628682 611190 -642745 -742623 -107764
37662 -107764 79608 -295253 -403460 58867 460041 238838 -358783 -659465 -268877 651368
37652 651368 1501653 1646787 995900 186471 -30444 456229 1148183 1558467 1551162 1243183
37642 1243183 898048 802793 958048 1030309 873763 828031 1113569 1279924 879155 431839
37632 431839 873354 2023433 2511324 1548716 12608 -738040 -524918 -217610 -357544
37623 -357544 -623155 -557620 -245593 -165010 -668084 -1635840 -2453319 -2416392 -1420556 -201945
37613b01945N48582k54408l89729Q9801M61950K55629k62541n16517l20829K2085
37603e67922K49132M38041O16951M52522k00733p17105l86658L95851N05194k30082
37593E55191p22116l65578J9715l21508p33128l26029M11237M59695L3882P1229
37583i17410M53259K93015k77230k56773L23356L41633l83092p05671k09427O3094
37573a275246m01941n44780L63717J286612J084872L44525K41128O46136P13086
37564B458109M44130K97558K2770p05435j179170o33197K61927L55019q7074o920
37554A227717M14257J24369o97494q10120j49925M3737m57844m34691M23788P45057
37544D28851j00020p17543k1361Q75725N67367l14332l68368J36343l4658p38159
$$ plain form
37613 -201945 346637 92229 -297500 -207699 254251 509880 247339 -269178 -590007 -567922
37603 -567922 -318790 119251 736202 1188724 987991 270886 -115772 280079 785273 555191
37593 555191 -166925 -532503 -512788 -834296 -1567424 -1893453 -1482216 -1022521 -988639 -917410
37583 -917410 -464151 -171136 -448366 -705139 -381783 -40150 -423242 -1128913 -1338340 -1275246
37573 -1275246 -1677187 -2221967 -1858250 -571638 513234 857759 1098887 1745023 2458109
37564 2458109 2902239 3199797 3222567 2517132 1337962 704765 966692 1321711 1234637 1227717
37554 1227717 1641974 1766343 1068849 258729 108804 152541 -305303 -739994 -316206 428851
37544 428851 328831 -388712 -410073 465652 1033019 718687 350319 486662 452004 -286155
37534b86155p63046o1064K28175j41853k24058K38115L61446j07732k28222L55929
37524f28465O03721j33376q65861n53852J77963J37568m46923l84405M88194J095854
37514e09582Q11112K06842r409J06602J58660M2325j21552k13237j05211J92794
37504E59344L40161K7937m78736o20815l31840k0840J75367M60117O73634L34883
37494A119212l71717m96837K88781R56442M74301o63184j102766m95847J95335
37485i6280J69144k71186l82032O0164O72638Q81572L10058p98533j482884r33283
37475a870622L86279J052560L96533o35486p38921J01659P89398O58462J79625
37466C19487R9701M23949N27429K8082p35852j099478p98904k02662J69714K00555
$$ plain form
37534 -286155 -1049201 -1110265 -882090 -1023943 -1248001 -1009886 -648440 -756172 -984394 -628465
37524 -628465 -24744 -158120 -1023981 -1577833 -1399870 -1262302 -1709225 -2093630 -1605436 -509582
37514 -509582 301530 508372 498963 605565 764225 806550 684998 471761 366550 559344
37504 559344 899505 927442 448706 -172109 -503949 -524789 -349422 110695 784329 1119212
37494 1119212 747495 250658 539439 1495881 1970182 1306998 204232 -291615 -96280
37485 -96280 72864 -198322 -580354 -520190 152448 1034020 1344078 545545 -937339 -1870622
37475 -1870622 -1484343 -431783 -35250 -670736 -1409657 -1307998 -518600 139862 319487
37466 319487 419188 843137 1370566 1398648 662796 -436682 -1235586 -1438248 -1268534 -1067979
37456a067979J17655N4855k6677l7006K17304N96867O11687Q5889m74929m99108
37446d21442r5775J76352J24148Q1784K81876M82424L62585p111l07436m12707
37436B64698m45981m42421k16054L19821Q65041R78489N71534m3456n60567q59231
37426D31873p96823k79111L00900K39789m65447q21833j71417O79918N41638l11162
37416f51675n05223K90031Q83161N04413o8134M6661M27990K82161j78767l11253
37406G19365k30527l58123m31839q2617K02834q3158k43801N72354J527211J008880
37396B600579o91486j446384l66968R56346R65851K31888K003R6178l51546j045768
37386I50693r52490o8672N95094N78605L52115K35185P863l32002l44198J01921
$$ plain form
37456 -1067979 -950324 -895469 -922146 -959152 -741848 -144981 466706 552595 77666 -421442
37446 -421442 -517217 -340865 -216717 -134933 146943 629367 991952 984841 677405 264698
37436 264698 -181283 -623704 -839758 -519937 345104 1323593 1895127 1851671 1291104 431873
37426 431873 -364950 -644061 -343161 -103372 -568819 -1390652 -1562069 -882151 -340513 -651675
37416 -651675 -1156898 -866867 16294 520707 452573 499234 927224 1209385 1030618 719365
37406 719365 488838 130715 -301124 -383741 -180907 -264065 -507866 64488 1591699 2600579
37396 2600579 1909093 462709 95741 1052087 2017938 2249826 2251829 2348007 1996461 950693
37386 950693 -1797 -70469 524625 1103230 1455345 1690530 1698393 1366391 1022193 1124114
37376A124114N09438M04803j09453n31488m09890K60239Q22479M68002o54469
37367A883775j301705o93991L00373L72786k84670l72954L79658Q11151K77051
37358A371474k95415M6058P23361N61442l69698q83417m30785J97522O5645o60604
37348C25583j016446n08565K82761M42005j35949o35850m23393J34020L12146
37339a223688J58109L16510Q19511Q49671k6954j059090j205321l92595N83207
37330a180640J089801J112571Q77464N04738N0631l93540p03257p56805n43517
37321E7446k37924o615J97548L90387K65034l51959q52741m10480O73862J052179
37311G76737J72883q06315o27736K87198N81196m6288o41376n37580n8259K86192
$$ plain form
37376 1124114 1633552 2038355 1928902 1397414 987524 1247763 2070242 2538244 1883775
37367 1883775 582070 -111921 188452 561238 276568 -96386 283272 1094423 1371474
37358 1371474 1076059 1122117 1845478 2406920 2037222 1153805 723020 920542 986187 325583
37348 325583 -690863 -1199428 -916667 -474662 -610611 -1246461 -1669854 -1535834 -1223688
37339 -1223688 -1065579 -749069 70442 920113 893159 -165931 -1371252 -1763847 -1180640
37330 -1180640 -90839 1021732 1899196 2403934 2454565 2061025 1357768 600963 57446
37321 57446 -180478 -187093 10455 400842 665876 313917 -538824 -949304 -275442 776737
37311 776737 949620 143305 -484431 -197233 383963 337675 -303701 -841281 -899540 -613348
37301f13348L68229J37969m02597p87786m33084M39220R38878P20955L32068K07324
37291I07828J39938j6126J6815K25396P5293n09031p49509k18617L28490R6066
37281B96543m42117l00415M21247P13958K21995l51395m18087k34746k73178n11769
37271h77964o09044l64976J63223P13704R30105O71593J99506j44044l02353l24554
37261E5196p9960M92605J068690J236625R15454K09064p73540j594688j521741
37252G705m81333N08258N65752J17271J3051M5192m91847j176161q59188L39601
37242a411699R43323L21275m27023k97980K28589L24924J31449P3125r4136n78505
37232g86658p62950j45260O31122O86198K44531R0571K36073J44123j74196l00564
$$ plain form
37301 -613348 -245119 -107150 -509747 -1297533 -1730617 -1291397 -352519 368436 700504 907828
37291 907828 1047766 1031640 1048455 1273851 1349144 840113 90604 -128013 200477 296543
37281 296543 -145574 -445989 -24742 689216 911211 559816 141729 -93017 -366195 -877964
37271 -877964 -1487008 -1851984 -1688761 -975057 -44952 626641 826147 682103 379750 55196
37261 55196 -24764 467841 1536531 2773156 3688610 3897674 3124134 1529446 7705
37252 7705 -473628 34630 600382 717653 730704 775896 284049 -892112 -1751300 -1411699
37242 -1411699 -468376 -147101 -574124 -872104 -643515 -318591 -187142 -114017 -208153 -786658
37232 -786658 -1549608 -1694868 -1063746 -377548 -133017 -42446 193627 337750 163554 -137010
37222a37010k82802m14832n00397k64052q4269l12149l18219N69566J537149J131501
37212I24486m24751j251431m06512R05508J208640O08448P1290j24378l19003
37203A192297n15651l93925n90K41623J28257j08180j07470K51209O70977O42561
37193B001108O5505m60517l45442J53292L05181n5906m83262p20118p95727m90688
37183h26574L43723R84027M71818p77202j178872j87909Q73944Q00373J58581
37174F61909Q2675M18527K46735l97820o02776j35276K08083j27045o83342o96307
37164a024637l5916P12645Q30348J46865o83421p87372j13623M96647M80112K50720
37154B72368L47678M91882J31446n25838p71191m32178K9094K72284L01725J00666
$$ plain form
37222 -137010 -419812 -834644 -1335041 -1599093 -1683362 -1995511 -2313730 -1744164 -207015 924486
37212 924486 499735 -751696 -1158208 -252700 955940 1564388 1635678 1511300 1192297
37203 1192297 676646 282721 282131 523754 652011 543831 436361 687570 1358547 2001108
37193 2001108 2066613 1606096 1260654 1413946 1719127 1663221 1179959 459841 -335886 -826574
37183 -826574 -482851 501176 972994 195792 -983080 -1170989 -297045 503328 661909
37174 661909 744584 1163111 1409846 1012026 409250 273974 482057 355012 -328330 -1024637
37164 -1024637 -1060553 -347908 482440 629305 -54116 -841488 -955111 -458464 21648 272368
37154 272368 620046 1111928 1243374 717536 -53655 -485833 -456739 -184455 117270 217936
37144B17936l07951n36483k09642L64918N16123K15955J37572N66029Q56451L44020
37134B164928n97341r08422k14657O03605N06875k83216n56318Q1394M74397l51773
37124I19472j449154j139034M00436J266017O73568J262L67171Q23882J38292
37115B001912j007487j135292l32527J49168J7359q162J34467j66517o70236m09894
37105a427209N32660R25085L30987k76474k09472J9103l2034J02701O70055R44363
37095A579765M32151j77127j37652J45214m5331m35926l15345J43404J55635l50222
37085I94566o30767k95460K07082L48757J66874m444l0954j5148m7684p7894j6138
37074E98790P1467k2363l20561m95116k65606J73640M31917M60021M08724J52335
$$ plain form
37144 217936 -90015 -626498 -836140 -471222 44901 260856 398428 964457 1820908 2164928
37134 2164928 1567587 659165 444508 1048113 1554988 1271772 715454 796848 1271245 919472
37124 919472 -529682 -1668716 -1268280 -2263 671305 672567 1039738 1863620 2001912
37115 2001912 994425 -140867 -473394 -324226 -306867 -315029 -180562 -347079 -1017315 -1427209
37105 -1427209 -894549 30536 361523 85049 -124423 -105320 -137354 -34653 635402 1579765
37095 1579765 2011916 1834789 1697137 1842351 1797020 1361094 1045749 1189153 1344788 994566
37085 994566 363799 68339 275421 624178 791052 786608 755654 740506 692822 614928 598790
37074 598790 670257 647894 327333 -167783 -433389 -259749 172168 632189 1040913 1193248
37064A193248m70905j050975r20132j24225N59857O63280M47328K11150r1031
37055D17595l57253k25975K18609L30513j08007m25856o9645M91683M23449l08235
37045C86878r51837r18396l21292K77762M32528K47082K49751O07329O99430J6530
37035G25765p81378n93064M02855Q45323K05366m70146k97002J39414j7835m34170
37025b74872l29969R9185J26881j61082p6212M10246O30784L32026m3412j56918
37015E56657j40516j55432j50467o8685R1351L17508M25738J62740k65689k57066
37005E16139K27110L81776k25208q30294n97811O7223K19517j58304l93124l77643
36995a170619m75793m99604M305O04439M02199l53453l73115O50782J367599O95210
$$ plain form
37064 1193248 722343 -328632 -1248764 -1372989 -813132 -149852 297476 508626 417595
37055 417595 60342 -165633 52976 383489 275482 -150374 -220019 271664 695113 386878
37045 386878 -564959 -1483355 -1804647 -1526885 -1094357 -847275 -597524 9805 709235 725765
37035 725765 -55613 -648677 -245822 599501 804867 334721 37719 177133 159298 -274872
37025 -274872 -604841 -505656 -378775 -539857 -616069 -205823 424961 756987 713575 556657
37015 556657 416141 260709 110242 41557 132908 450416 876154 1038894 773205 516139
37005 516139 743249 1125025 899817 69523 -528288 -461065 -241548 -399852 -792976 -1170619
36995 -1170619 -1646412 -2146016 -2141711 -1537272 -1135073 -1488526 -1861641 -1210859 156740 851950
36985H51950n96409r95762k40969N93705O03943m5615n78778m77217R9729N45299
36975b40124M71500J26235p668J24451K33322K67695L89309M40880O7609n59771
36965A313438p72515l37672J97943L03453O1726k42257n45316p14841m21364K61824
36955h95581O28802K21371m47838n77019j44346K85300N37036Q74122J142966
36946A624813O94391n44621j563399j368624k56915N69322N04727P3156o5595
36937c32745L751j09887l02997j76380K15998M09817K68356J41248K40459L45695
36927G03315K41528J6031k02255m08964n12121l45365Q003K83717M57597O51321
36917H92807O58221J85917m11843m22247O1780J37436m53242q20717l83738J39088
$$ plain form
36985 851950 255541 -740221 -981190 -387485 216458 170843 -407935 -885152 -785423 -240124
36975 -240124 231376 357611 349943 474394 707716 975411 1364720 1805600 1873209 1313438
36965 1313438 540923 203251 401194 704647 766373 524116 -21200 -736041 -1157405 -895581
36955 -895581 -266779 -45408 -493246 -1070265 -1214611 -929311 -392275 481847 1624813
36946 1624813 2319204 1774583 211184 -1157440 -1414355 -845033 -340306 -267150 -332745
36937 -332745 -328994 -438881 -741878 -918258 -702260 -292443 -24087 117161 357620 703315
36927 703315 944843 960874 758619 349655 -162466 -507831 -499828 -216111 241486 892807
36917 892807 1551028 1736945 1325102 902855 964635 1102071 648829 -171888 -555626 -416538
36907d16538o0646n42826m29992J25170L29254J30740J48022M85090O11061L10318
36897F89653p6837k77216k65717Q698M42855N78593K21177q1027J32095L47304
36887A719578j33121r18555j026771l77610K11769L25510K41741R4245k16854
36878h0068l76522K3894N49813L66076l71093o46585j90096J64266q3180l93473
36868a036968k54413M3935J11391Q0382J18848P3989k8599J68284O58494Q74642
36858H09985N18224R870j66905m0035J39339K40851J54244j63544m53046m28794
36848F20189k67685l32492n38424n43356l49991j09662L32296R58781J099967
36839H69623L71702l82306k31036K46603q6393p99186m77383P03562R88206p2968
$$ plain form
36907 -416538 -477184 -1020010 -1450002 -1324832 -995578 -864838 -716816 -231726 379335 689653
36897 689653 612816 335600 69883 78581 521436 1100029 1321206 1240179 1372274 1719578
36887 1719578 1586457 667902 -358869 -736479 -524710 -199200 42541 136786 -80068
36878 -80068 -456590 -432696 117117 483193 112100 -534485 -724581 -560315 -643495 -1036968
36868 -1036968 -1291381 -1247446 -1136055 -1055673 -936825 -862836 -891435 -723151 -64657 809985
36858 809985 1328209 1338079 1171174 1131139 1270478 1511329 1665573 1502029 1048983 620189
36848 620189 352504 20012 -518412 -1061768 -1411759 -1521421 -1189125 -230344 869623
36839 869623 1241325 859019 627983 874586 788193 -10993 -488376 215186 1203392 1130424
36829A130424p65973K0275J026763P24443l63159p57741k90889J00563P4163R2640
36819I91509L36285M26544R6809m54540p39048l10795O89107J302879P20149n22286
36809B536613j108623o97415j46988p970M5388J75428M0830k55645j26501L10114
36799G65231K51509l08387m40009Q6506M08127J29257j53054j85079l87486n60450
36789c93835M4003J003506R44951o2135l64589M30765P08949k16395q11401j68241
36779A115578K74343n53737j217847l05841R41783P08747l89969o34803j30944
36770a92690j47269o32416n55923R4272N42064P04474Q50718O43660m2914l58028
36760I05948J38127N06380J26596q1787N04692Q26432J23077m98176j71487q742
$$ plain form
36829 1130424 364451 384726 1411489 2135932 1772773 1015032 724143 824706 898869 991509
36819 991509 1327794 1754338 1851147 1396607 657559 346764 1035871 2338750 3058899 2536613
36809 2536613 1427990 730575 583587 575617 621005 796433 837263 581618 455117 765231
36799 765231 1016740 708353 268344 354850 762977 892234 739180 554101 166615 -393835
36789 -393835 -349832 653674 1598625 1536490 1171901 1602666 2311615 2095220 1283819 1115578
36779 1115578 1389921 836184 -381663 -687504 254279 963026 573057 -61746 -192690
36770 -192690 -339959 -972375 -1528298 -1434026 -891962 -187488 663230 1306890 1263976 905948
36760 905948 1044075 1550455 1677051 1595264 2099956 2926388 3049465 2551289 2379802 2371060
36750B371060q20118j165931R2987J353289Q67192j98339J0880O91498K03809
36741C406327n89131K3255J210254J126566L98385Q28663J981118K293672K163244
36732A2842353K574358K212303l75738l172591l148321j121904k77846j026438
36724H506176j334220r58415j151447j261886Q4186J495483Q05489o85839l48189
36715E151338R40350P79700J87725J312854K338469O35336j233508N73523L544617
36706A4230404K800064M38459K014563N720634N346451K519157M281334R306877
36698D6657943R929423P935356J2777813K2876916K7650447L1908269N3809035
36691B13545202Q6230379Q5952872K6217203n6618004r8237759q0759880m3943674
$$ plain form
36750 2371060 1550942 385011 477998 1831287 2698479 2500140 2511020 3202518 3406327
36741 3406327 2817196 2840451 4050705 5177271 5575656 6404319 8385437 10679109 12842353
36732 12842353 15416711 17629014 17253276 14080685 10932364 9810460 9532614 8506176
36724 8506176 7171956 6213541 5062094 3800208 3884394 5379877 6185366 5499527 5151338
36715 5151338 6091688 6871388 7059113 8371967 10710436 11345772 10112264 10685787 14230404
36706 14230404 17030468 17468927 19483490 25204124 30550575 33069732 37351066 46657943
36698 46657943 56587366 64522722 77300535 100177451 127827898 159736167 213545202
36691 213545202 299775581 385728453 411945656 355327652 257089893 176330013 132386339
36684A32386339k5811335k3404541j8085884r443259p114347q945076o551435
36677C3030462j780252j817718n026037m733000j662257j174350k543012j324142
36669A2969694J156112K76105k653468k499961L58363R87306j215923k151535
36661G226693p05454R5936p24466r25986k7569q00r33733q27648K87557M07104
36651C871634m32704k99173P06811N97376o43451j063449l64600k0861j35447
36642B216136L96429J034036L33514r21265p70825K37379k6466j134355o80111
36633F84472J181651J695100K55480o05950L83706J430613J153326N65174M85102
36624G228674J034j204659j697245q26950p3109n13351j059468n61546K11442
$$ plain form
36684 132386339 106575004 83170463 65084579 55641320 48526973 39581897 33030462
36677 33030462 31250210 29432492 24406455 19673455 18011198 16836848 14293836 12969694
36669 12969694 14125806 14401911 11748443 9248482 9606845 10594151 9378228 7226693
36661 7226693 6521239 6617175 5892709 4966723 4939154 4938354 4004621 3176973 3464530 3871634
36651 3871634 3438930 3139757 3846568 4443944 3800493 2737044 2372444 2351583 2216136
36642 2216136 2612565 3646601 3980115 3058850 2288025 2525404 2498938 1364583 684472
36633 684472 1866123 3561223 3816703 3210753 3594459 5025072 6178398 6743572 7228674
36624 7228674 7229708 6025049 4327804 3500854 3427745 2914394 1854926 1293380 1504822
36615A504822Q5246n78342p81372n07865k81963p7427L54679P86918Q50447N43672
36605A898815P4565l00041k82605K5285l3226o57449r44252k31554N75183L00494
36595D25215n15206m63407L96624P37184J94391l05751l12629l05906m30468k85958
36585h65911O0209J99178L19434P19050Q28334J67105l47748K30505Q84138N6855
36575B251149j486439j574545j21422P83785K83405k70033p380K73920J32929
36566B65369L16655Q82246P12368l25144q33372k74990J59527j43985j74144N39544
36556A124074Q49534J72574l22724N3200J12270r49336j795040j098361K08741
36547a645068N69382K41425L20060N73470J42779n24108k95348O64343J158600
$$ plain form
36615 1504822 1590068 1011726 230354 -277511 -559474 -636901 -282222 504696 1355143 1898815
36605 1898815 1973380 1673339 1390734 1416019 1382793 725344 -218908 -450462 124721 425215
36595 425215 -89991 -553398 -156774 580410 774801 469050 156421 -149485 -579953 -865911
36585 -865911 -805702 -606524 -287090 431960 1260294 1427399 1079651 1310156 2194294 2251149
36575 2251149 764710 -809835 -931257 -147472 135933 -134100 -141480 132440 265369
36566 265369 582024 1464270 2176638 1851494 1018122 743132 902659 758674 584530 1124074
36556 1124074 1973608 2146182 1823458 1876658 1988928 1039592 -755448 -1853809 -1645068
36547 -1645068 -1075686 -834261 -514201 59269 202048 -322060 -617408 46935 1205535
36538A205535Q09810K79805M215q8467O6120N07753P43277L20349l93884p57657
36528B696856p62032p06862n01141k9563L00824J39674j31451L123L45016L63416
36518A717860L4212k46620k37669M6581M22715N00501M3422n38552o61865m76563
36508F04022m88039m58769J57874Q36284N29293l59744l05926P47051J067876
36499B329922P985q67296m81249p522n66587j100440k89505J024479J247492N72312
36489A869591J84659L4504o18353j305820r86755J6670N18095L74931K43323L4617
36479C65462o65740j204245o66910L64428O00806J61117J39632M98269K93843
36470a13338l04174k40318K98577N0687r02680r49826M00042J584503J351643
$$ plain form
36538 1205535 2015345 2295150 2299365 2210898 2277018 2784771 3528048 3848397 3454513 2696856
36528 2696856 1934824 1227962 726821 697258 998082 1137756 1006305 1009428 1354444 1717860
36518 1717860 1752072 1505452 1267783 1314364 1737079 2237580 2281002 1742450 1080585 604022
36508 604022 115983 -342786 -184912 651372 1180665 820921 514995 1262046 2329922
36499 2329922 2337907 1470611 989362 981840 415253 -685187 -974692 49787 1297279 1869591
36489 1869591 2054250 2088754 1470401 164581 -822174 -805504 -287409 87522 330845 365462
36479 365462 -300278 -1504523 -2171433 -1807005 -1206199 -1045082 -905450 -407181 -113338
36470 -113338 -417512 -657830 -359253 -308566 -1211246 -2161072 -1761030 -176527 1175116
36461A175116L94078j19278j86066l20277m62595l76292k36492j69737O0222M76378
36451B35057P10156O49178N14802K15130m67158j005107n48126O24790J211863
36442B140585P07802n253j74258j11791k20312k48314n9468q8382m45939n32054
36432I62616j14118J47502j41670l50186P5321N78187L66158l18767n88118j22866
36422D94059O36210J134692J016508J70467j020552j742211j467458m69151N21534
36413g25902R19601N74536j11496l71588J23709P08971N24450k65675p53221o20007
36403C378l29864j11944K29326N11094K99178q2328J33759O74845L95495p44412
36393I78527j310888n92944K70306J98921j69515J57151P20387N41670m0546N2387
$$ plain form
36461 1175116 1569194 1449916 1263850 943573 480978 104686 -131806 -301543 -241321 235057
36451 235057 945213 1594391 2109193 2324323 1857165 852058 303932 928722 2140585
36442 2140585 2848387 2843134 2668876 2557085 2336773 2088459 2028991 1940609 1494670 962616
36432 962616 848498 996000 854330 504144 579465 1157652 1523810 1205043 616925 494059
36422 494059 1130269 2264961 3281469 3451936 2431384 689173 -778285 -1247436 -725902
36413 -725902 193699 768235 656739 285151 408860 1117831 1642281 1376606 623385 3378
36403 3378 -326486 -438430 -209104 301990 601168 518840 652599 1327444 1722939 978527
36393 978527 -332361 -925305 -654999 -456078 -625593 -468442 251945 793615 753069 805456
36383H05456P57565R73595L00997n39444r29220r53832q15937n40143k77867j90747
36373a409577p5722K76120N02385J20654n68528p13389l4662Q30929J103646N69544
36363F01400l77471j031940q75427j05832N29625O33640N02647L91565J02725
36354C70932l06719k18596M78866Q15125J35333o49119l54073N05217M26803o60243
36344E43526j214876m63186M95856M81541r7650j61847L39186N88412K85622m2765
36334G53819k0673J2711l84024r72456j006467j84932Q15996J036545L97967k36337
36324B12149k55624j0635j3504n5552K40695M99158J05919o11087o89112o920
36314e84513M86788J96536l40976m30001j95062j21673k23621j94898J5791K45202
$$ plain form
36383 805456 1563021 2536616 2837613 2298169 1368949 415117 -400820 -940963 -1218830 -1409577
36373 -1409577 -1485299 -1209179 -706794 -586140 -1154668 -1868057 -1902719 -1071790 31856 601400
36363 601400 223929 -808011 -1683438 -1789270 -1259645 -626005 -123358 268207 370932
36354 370932 64213 -154383 324483 1139608 1274941 625822 271749 776966 1203769 543526
36344 543526 -671350 -1134536 -638680 -157139 -254789 -416636 -77450 510962 796584 753819
36334 753819 733146 745857 361833 -610623 -1617090 -1802022 -986026 50519 448486 212149
36324 212149 -43475 -54110 -67614 -123166 117529 616687 722606 111519 -577593 -584513
36314 -584513 -97725 98811 -242165 -672166 -867228 -988901 -1212522 -1407420 -1391629 -1146427
36304a146427M31102N20461L49714m1465k44882K2522M71315O02305L45917N1848
36294A362410k7329K1235j9038k20731m25863l91721j04838J13865J8368j54072
36284A72286l3356K01930L283o23558r52220n26732K25756O97954Q71491R35438
36274I72272O79018p4263q05519q48556m29400l81760q40145r90968k89727P63091
36264b245957J337705J191535N87514j33474n47445k80302L97298O26604J28730
36255A062208k40531K07062P08854J04970j159377j395162j48994J005315O99561
36246H43906l68047o75506o7564M00433K22231j50851l96005o56362q12309m75472
36236b135546J43708L08565p4412k36837K03066O25901M57657M2835m9882R3260
$$ plain form
36304 -1146427 -715325 -194864 154850 113385 -131497 -108975 362340 964645 1310562 1362410
36294 1362410 1335081 1356316 1337278 1116547 690684 298963 194125 307990 326358 172286
36284 172286 138930 340860 344143 -279415 -1231635 -1758367 -1532611 -834657 36834 972272
36274 972272 1651290 1577027 771508 -77048 -506448 -888208 -1728353 -2719321 -3009048 -2245957
36264 -2245957 -908252 283283 870797 737323 189878 -90424 306874 933478 1062208
36255 1062208 821677 1028739 1737593 1842563 683186 -711976 -860970 144345 843906
36246 843906 475859 -199647 -267211 133222 355453 204602 -191403 -847765 -1660074 -2135546
36236 -2135546 -1991838 -1683273 -1757685 -1994522 -1791456 -1165555 -707898 -665063 -714945 -621685
36226f21685J37176J85374M00564M26961q4017p06861p25390j88876J93790J22910
36216h60054K1573K32746M60558K16919m87046j074577r36578m2776R23885J189272
36206c56078P16975J80244L7995M2655j26638k45206r469K79527J10712l57335
36196B73382m36990Q1981O09322N43578l4858o11616q50666p45078l62711K59482
36186a274174R12405J132988O44357j06596k89422J73193L24854m21893j157255
36177f1543p07268L96063N28603m63279r04348M9817J031566O82796k38284l20352
36167f229J69096O7557m65625l46766L40581M97478K0298j40695J09411j45183
36157I9923q90276q85316K23525J145756R44618K98280M2096j12989n25975o18662
$$ plain form
36226 -621685 -484509 -299135 101429 528390 444373 -262488 -987878 -1176754 -982964 -860054
36216 -860054 -838481 -605735 -145177 71742 -415304 -1489881 -2426459 -2469235 -1545350 -356078
36206 -356078 360897 541141 579136 621791 495153 249947 240478 520005 630717 273382
36196 273382 -163608 -81627 527695 1071273 1036415 424799 -425867 -1170945 -1533656 -1274174
36186 -1274174 -361769 771219 1415576 1308980 1019558 1192751 1517605 1095712 -61543
36177 -61543 -768811 -372748 155855 -307424 -1211772 -1161955 -130389 552407 314123 -6229
36167 -6229 162867 230424 -235201 -581967 -241386 256092 276390 135695 245106 99923
36157 99923 -790353 -1675669 -1452144 -306388 638230 936510 978606 865617 339642 -279020
36147b79020J5518N87655K96051l56511m59225r2331J69110L37147N36806K49244
36137A004444p54990j394661n58178R99523J427060L17609q02069o15551M64160
36128H7347J178322R48450J78661l94610l97428j49032k51865o36809m54142N93995
36118G02889J393889P60450p71501j548012j006859j87125j6235k10383j56175
36109a039062J02008K21900J87883J27308J7363j23302j95442k92029m82239l33335
36099a808947N78248J595993J404148j12692j395368j195808j73903K58444p6618
36090i26503k81536K145K65949K29793J92058K22009m7969n87249p42361k20463
36080a894127L63373L71361M9429L9370L83702N94816M89646L62977L80347L46679
$$ plain form
36147 -279020 -263502 324153 620204 263693 -195532 -287863 -118753 218394 755200 1004444
36137 1004444 249454 -1145207 -1703385 -703862 723198 1040807 238738 -376813 87347
36128 87347 1265669 2214119 2392780 1998170 1600742 1451710 1199845 563036 108894 702889
36118 702889 2096778 2857228 2085727 537715 -469144 -656269 -672504 -882887 -1039062
36109 -1039062 -937054 -715154 -527271 -399963 -382600 -505902 -701344 -993373 -1475612 -1808947
36099 -1808947 -1230699 365294 1769442 1656750 261382 -934426 -1108329 -849885 -926503
36090 -926503 -1208039 -1205894 -939945 -710152 -518094 -296085 -344054 -931303 -1673664 -1894127
36080 -1894127 -1530754 -1159393 -1109964 -1070594 -686892 -92076 397570 760547 1140894 1487573
36070A487573J68111O0874J02501j849l91804o34247k79943L48048M46242j73341
36060A132165p81716p07448j71733J64599J27176N1759J00021Q4676n4744j24169
36050a79414j24760l24354o49578n10753L27884J093684Q55234j25221o01061
36041b38339j4020P40707O01624j93401n60340j45924L13901J75982k97636n04896
36031a22342k80677J93444P42462J078344P78406j26367q65447p52944q3668K86539
36021H47750N7815l48010n70311o33434n26099j01843M78171P44439N35292J83414
36011F67184k4769j34860j80736n4216J38711R9699r6265K7454N66914R31504
36001A940620O30510p6814o22387p88436o23748j72119L31514M22031n145m07830
$$ plain form
36070 1487573 1655684 1716558 1819059 1817210 1425406 791159 511216 859264 1305506 1132165
36060 1132165 350449 -356999 -528732 -364133 -236957 -185198 -85177 -501 -55245 -179414
36050 -179414 -304174 -628528 -1278106 -1788859 -1460975 -367291 487943 362722 -238339
36041 -238339 -252359 488348 1089972 896571 336231 190307 504208 680190 382554 -122342
36031 -122342 -403019 -209575 532887 1611231 2389637 2263270 1397823 644879 561211 847750
36021 847750 905565 557555 -12756 -646190 -1172289 -1274132 -795961 -51522 483770 667184
36011 667184 642415 507555 326819 272603 411314 511013 414748 442202 1009116 1940620
36001 1940620 2571130 2494316 1871929 1083493 459745 287626 619140 1041171 1036026 628196
35991F28196k93937J28787L59398K87828R3676j42094l15002k00732Q8346K2554
35981F57020m64775n62688K56942J166696R71259j50830q89265o68331k38314
35972G7714k97015n33905m25251j39757q4821j31192Q6542M22276L63091j64571
35962h26889n98110m34180J65210O22912O49961M52382K40003j04215n87522p04076
35952a124524o4493P58915Q13792J98346m5649L32784L34108m58027q44994J34314
35942C4572J391599J238570j00972r88094q72310o05612n18640l2853O99954O18246
35932H64460l31939p94691j66150M38235J80193j17650L41192P30529R1679p70200
35922D65658m95935N39036Q18074R1554m44358k06158Q5592j05682l10044o1912
$$ plain form
35991 628196 334259 463046 822444 1110272 1203948 1061854 746852 546120 634466 657020
35981 657020 192245 -370443 -113501 1053195 2024454 1873624 984359 316028 77714
35972 77714 -219301 -753206 -1178457 -1318214 -1403035 -1534227 -1447685 -1025409 -662318 -826889
35962 -826889 -1424999 -1859179 -1693969 -1071057 -421096 31286 271289 167074 -420448 -1124524
35952 -1124524 -1189017 -430102 383690 582036 536387 869171 1203279 745252 -99742 34572
35942 34572 1426171 2664741 2563769 1575675 703365 97753 -420887 -453740 246214 864460
35932 864460 532521 -262170 -428320 9915 190108 72458 413650 1144179 1235858 465658
35922 465658 -30277 508759 1326833 1418387 974029 767871 853463 747781 437737 375825
35912C75825L40420M89542M46446L10644n9843n54572o73869k49721K01893J73988
35902H00753j90726m03832k15118K94075Q32855R47857L41284o36268j158661
35893F12219q41484k00636N5422q4651r3274K18712M19455J41324k98026k76711
35883c47650K46820O35690M79053J82153K97328O00976M15516k84810p57900n51855
35873I15321n0891K02726J40022q2986l57948m05178P4359P22774O82705j82998
35863A657906r32112q53540l78941j40536K9366L99770M95519m2366m77543m0048
35853b82525O15227L45007m99324n22605M10166Q82255J49456p92047q23303j36277
35843f53970N21861R29862J056334O20017k48829o77437j39594P09702R32148
$$ plain form
35912 375825 716245 1205787 1652233 1962877 1903034 1348462 674593 424872 626765 800753
35902 800753 610027 206195 -8923 285152 1118007 2065864 2407148 1770880 612219
35893 612219 -229265 -429901 -374479 -459130 -552404 -333692 85763 227087 -70939 -347650
35883 -347650 -100830 534860 1013913 1196066 1493394 2094370 2509886 2225076 1467176 915321
35873 915321 864430 1067156 1207178 1124192 766244 361066 435425 1158199 1840904 1657906
35863 1657906 725794 -127746 -506687 -647223 -617857 -218087 277432 235066 -242477 -282525
35853 -282525 332702 677709 178385 -344220 65946 948201 1097657 305610 -517693 -653970
35843 -653970 -132109 797753 1854087 2474104 2225275 1547838 1408244 2117946 3050094
35834C050094N03318N7635Q615M68872J404220K205703J747418k62121k401759
35825F781995k895546j651304j99116K18680k61819q28772r60139n51101K32698
35816a14424R10755R27320K63146m06396m05131J89033O51568M54316j50146n16676
35806A803365m92318n62999r64189j117565m66831M97178Q25180N29201M49722
35797E00744P11735M91920l46974o68862J31251Q94227L78113p44225r15426p9444
35787C53059M73094K98584K11186M98352L90154k87225m81138L08500R43221L46663
35777C054450p59747r93466m08701j66659n69688p62307k88744K84378M61161
35768a49323M74968N44999L83545j24792m90806l39144L7582K70511M64705O86754
$$ plain form
35834 3050094 3553412 3611047 3619662 4088534 5492754 7698457 9445875 9183754 6781995
35825 6781995 3886449 2235145 2036029 2254709 1992890 1164118 203979 -347122 -114424
35816 -114424 796331 1723651 1986797 1580401 1175270 1364303 2015871 2470187 2320041 1803365
35806 1803365 1311047 748048 -216141 -1333706 -1800537 -1303359 -478179 51022 500744
35797 500744 1212479 1704399 1357425 688563 819814 1714041 2092154 1347929 432503 353059
35787 353059 826153 1124737 1335923 1834275 2224429 1937204 1456066 1764566 2707787 3054450
35777 3054450 2294703 1301237 892536 725877 156189 -606118 -894862 -610484 -149323
35768 -149323 325645 870644 1254189 1129397 638591 299447 337029 607540 1072245 1758999
35758A758999N24218k10244q54056p07043q2143J99163J3251j65281k23800l20578
35748f7514j28282O66270J258347N28885r26305j174462J40513R82084K0264j154869
35738A44931n26111J053975J208982j72690r45068k90784K12535m60730j122313
35729h97273o20498K54012L93798K37316N45562P32801P1147n76967n6792Q55950
35719I39056M68492j017546j650863o49931O35148R33714N72441K87323L965m39488
35709H2311n35909L2113O01256M23228k27703n37890k83305J25745L52096L57378
35699C89320K03232L2407J2535N7546q5223l28709k83332L7442J23711j61824
35689b895k63413J23518M32679J11080m30724m33969M3916L08644J32874l7223
$$ plain form
35758 1758999 2283217 2072973 1218917 511874 429731 628894 642145 476864 253064 -67514
35748 -67514 -195796 470474 1728821 2257706 1331401 156939 297452 1279536 1299800 144931
35738 144931 -381180 672795 1881777 1709087 764019 473235 685770 225040 -897273
35729 -897273 -1517771 -1263759 -869961 -632645 -87083 645718 716865 139898 83106 939056
35719 939056 1407548 390002 -1260861 -1910792 -1275644 -341930 230511 517834 521799 82311
35709 82311 -453598 -421485 179771 602999 375296 -162594 -445899 -320154 31942 389320
35699 389320 592552 624959 637494 695040 609817 281108 -2224 35218 158929 -2895
35689 -2895 -266308 -142790 289889 400969 -29755 -463724 -419808 -111164 21710 -15513
35679a5513R6463K85310K05336j31858m81024n55147j89759L68106N02159l8215
35669D5858o14450m06801M50016R84507O55798k7128k71056P2482N16453N28432
35659A934111k4343p25249q52321j18872Q06972R59638L03610k41505j44870M2518
35649A939689k83944p47136o53117j77172j9854j65583K7030N27194M91702k79284
35639F59525p56992j68149P61530Q69783K37603j74452j49429l22563p77290p57699
35629e78133n6436M18687K7560n56024m15866J89375L39088r2135m03323k53705
35619a380912k80R5065J85483K82716J07681l01336m42486q0892L64380M39463
35609g31118K41995R7329K5821j01520j40508J61903O31326O63179p1424j061116
$$ plain form
35679 -15513 80950 366260 571596 439738 -41286 -596433 -786192 -418086 84073 45858
35669 45858 -568592 -975393 -525377 459130 1114928 1087800 816744 889226 1405679 1934111
35659 1934111 1909768 1184519 332198 213326 1020298 1979936 2283546 2042041 1897171 1939689
35649 1939689 1655745 908609 255492 78320 58466 -107117 -80087 447107 938809 659525
35639 659525 -97467 -265616 495914 1365697 1603300 1428848 1279419 956856 179566 -578133
35629 -578133 -634569 -215882 -188322 -744346 -1160212 -970837 -631749 -723884 -1127207 -1380912
35619 -1380912 -1381192 -1286127 -1100644 -817928 -710247 -1011583 -1454069 -1534961 -1170581 -731118
35609 -731118 -489123 -391794 -365973 -467493 -608001 -446098 185228 848407 776983 -284133
35599b84133j352662o34526K81675M00525j35389k32433N02961J039710M13135
35590a137o94647q02168K37255J022245O00911l36581o41664k40792J11212N1399
35580f93967q3718N5688L56197M46428J55185k38556k65732N9811N7425o72218
35570h23457j333614p55079Q33490J749716R63381n44951j099418l62839O19560
35561g53211R31829N93186R6958j70092q6638J54436J71251j53512m68096m17550
35551a01439r8454J58106J86301j5655l39706m44688k0964O17808P41583K45957
35541I28849j62540j40694k49283p82714r67448k02265O91973N93454j18586j62735
35531e71989N67148Q91016K82613m13809m59385k27039k78499m05742j57246L74280
$$ plain form
35599 -284133 -1636795 -2271321 -1989646 -1589121 -1724510 -1956943 -1453982 -414272 -1137
35590 -1137 -695784 -1497952 -1260697 -238452 362459 25878 -615786 -856578 -745366 -693967
35580 -693967 -777685 -721997 -365800 80628 235813 -2743 -268475 -208664 -151239 -823457
35570 -823457 -2157071 -2912150 -2078660 -328944 634437 89486 -1009932 -1372771 -753211
35561 -753211 178618 771804 868762 698670 612032 766468 937719 784207 316111 -101439
35551 -101439 -199893 -41787 144514 128859 -210847 -655535 -676499 -58691 682892 928849
35541 928849 766309 625615 376332 -406382 -1373830 -1576095 -884122 -290668 -409254 -571989
35531 -571989 -4841 886175 1168788 754979 295594 68555 -209944 -615686 -772932 -398652
35521c98652P82741Q50345N00258k21682q62618q22376j63603L64017L21243M8044
35511C97717m4619k2965l1490K1149R7031m3863k86727j68039K93488M69043J35239
35500H15964j42923l4791j6823l88214n82059j97045J08157k90609o96319q7665
35490a512327J045427J209993J72835o22483j80082P04297Q06656K05870j96656
35481A633530k38163n28934j103445j082131l6413J043914Q49123m48051j248290
35472a158860n34389Q20356J202822K80105p62895q19563k4449P14781P57646
35463D75554J50573n32374o33623p2139M42658K93739j01962O7292N70377L73019
35453A033114n60044r39530j39691P23012N56406l928J53388O16098K22704p52365
$$ plain form
35521 -398652 384089 1234434 1734692 1513010 650392 -171984 -335587 28430 349673 397717
35511 397717 353098 330133 298643 319792 416823 372960 86233 -81806 211682 680725 815964
35500 815964 673041 638250 621427 233213 -348846 -545891 -437734 -728343 -1424662 -1512327
35490 -1512327 -466900 743093 915928 293445 113363 817660 1624316 1830186 1633530
35481 1633530 1395367 866433 -237012 -1319143 -1355556 -311642 537481 89430 -1158860
35472 -1158860 -1693249 -872893 329929 610034 -152861 -972424 -996873 -282092 475554
35463 475554 626127 93753 -539870 -612009 -169351 124388 22426 89718 660095 1033114
35453 1033114 473070 -466460 -606151 116861 673267 669339 822727 1438825 1661529 909164
35443I09164q93060M300N37519o1270p70237m46275N33687J026609O49771j44999
35433A345209q51165j121110p42283J1480M19155J65824k40613k63539n3346M1256
35423a289132J46775N01488Q29809O82850J77423j19263O8092M49709N35190P6388
35413B059329o56112r48861l63068N33753O86724l1419o15716m48636j71601m32411
35403c88018o50166l6942Q16722O75041l19973p44821q3413N35960K02810m06231
35393c99031k51844M37804O83883K60585k65468n81865p68617o36714P2773Q28785
35383f19709O37904m72602j141644l74678J053368J559445P51946k59916m50568
35374F83546l8930J32798k03952o03842o62939m30866j14964K16288N04122N54907
$$ plain form
35443 909164 16104 20404 557923 496653 -273584 -719859 -186172 840437 1490208 1345209
35433 1345209 494044 -627066 -1369349 -1357869 -938714 -772890 -1013503 -1277042 -1330388 -1289132
35423 -1289132 -1142357 -640869 188940 871790 1049213 929950 998042 1447751 1982941 2059329
35413 2059329 1403217 454356 91288 625041 1311765 1280346 664630 215994 44393 -388018
35403 -388018 -1038184 -1075126 -258404 416637 96664 -648157 -731570 -195610 7200 -399031
35393 -399031 -650875 -213071 470812 731397 465929 -115936 -884553 -1521267 -1448494 -619709
35383 -619709 18195 -454407 -1596051 -1970729 -917361 642084 1394030 1134114 683546
35374 683546 644616 777414 573462 -30380 -693319 -1124185 -1239149 -1022861 -518739 36168
35364C6168K60031j43705k51393N3889M60982N86722L55838l3780l79047n39792
35354D05913l52060K12430P39248N88091k88830j008920p01196L07963Q05914
35345G08553K92496l35996p0031P67128R92269K27867o38545p19632k09044Q7233
35335A102298j54895n46409o24625l56318k8949J33512J77092K75552M20254L87179
35325G84691J23421l5311J73668M22215J81669m23667p10926m78250l10429n45454
35315h18373n94659J15863J024235J064075K20663l92201j01321M44828K89496
35306A252606n22713j117570r31862k29095L58468M39200J05486j58930Q1321
35297g23089O33633P26675k0117q73222p74604J68942O69662J5285q34773n60171
$$ plain form
35364 36168 296199 152494 -98899 -45010 415972 1002694 1358532 1324752 945705 405913
35354 405913 53853 266283 1005531 1593622 1304792 295872 -405324 -97361 708553
35345 708553 1001049 665053 595022 1362150 2354419 2582286 1943741 1224109 1015065 1102298
35335 1102298 947403 400994 -223631 -579949 -608898 -475386 -298294 -22742 397512 784691
35325 784691 908112 872801 1046469 1468684 1650353 1226686 515760 37510 -272919 -818373
35315 -818373 -1413032 -1297169 -272934 791141 1011804 619603 518282 963110 1252606
35306 1252606 729893 -387677 -1319539 -1548634 -1190166 -750966 -645480 -804410 -723089
35297 -723089 -89456 637219 617102 -256120 -1030724 -861782 -192120 -176835 -1011608 -1571779
35287a571779N71845J014180J45210q58833p45635J14611M95654J40491j68739
35278h62995o5089j7256k17976j16331N10513Q97225L73753n05911o91398j19443
35268h14908L32002K14703K7511K55988N83145M07796k44638p12014m85435K14348
35258b21502O62083L89036k87006n80366j38976N39088P33186L55935o2634j18731
35248A270113K9574l8593m72220r34452q82909j85765N49722N78919P131l18882
35238c97362j02241q1510p03609j072246k10375J133614J249877m3377j052691
35229a279920o52984K58686M03994k640l7102K13765m781n63616n60448J39460
35219b085586O59088N32240L36059N89111Q82556N87112j75481p52632p73196
$$ plain form
35287 -1571779 -999934 14246 159456 -699377 -1445012 -1330401 -834747 -694256 -862995
35278 -862995 -928084 -945340 -1163316 -1279647 -769134 128091 501844 -4067 -695465 -814908
35268 -814908 -482906 -268203 -240692 15296 598441 1006237 761599 49585 -435850 -221502
35258 -221502 440581 829617 542611 -37755 -176731 362357 1095543 1451478 1388844 1270113
35248 1270113 1299687 1261094 788874 -145578 -1028487 -1214252 -664530 -85611 -78480 -397362
35238 -397362 -499603 -581113 -1284722 -2356968 -2567343 -1433729 -183852 -227229 -1279920
35229 -1279920 -1932904 -1674218 -1270224 -1272864 -1309966 -1096201 -1100982 -1664598 -2225046 -2085586
35219 -2085586 -1426498 -894258 -558199 30912 913468 1500580 1325099 572467 -200729
35210b00729l71354R5430K58106m6670m97715m89989J21509P23107O73981J30230
35200C95906j97867j2618K03443j18813p99869j014343k88204P78798J066144
35191A2577K47220p75782r62168l33324K88520M52194M11612L97653K42397j06508
35181a25609k90468q7828J70727R1855j92497k77555p8479J79990L83365N81465
35171C54966P20041O52402M21122K67274K89183K63018p0500n89108q19834n21696
35161I66868j32451l17678j029613j446015j072578m11080j10345K232L59971
35152c190689O40791K97082k23769P806P49673P87990k8926l97320L11497R79554
35142f6311O10754r4537j17718J50204j22714n46677l05455K04188J02014k65776
$$ plain form
35210 -200729 -572083 -476653 -218547 -265217 -762932 -1252921 -1131412 -408305 265676 395906
35200 395906 198039 185421 388864 270051 -529818 -1544161 -1832365 -1053567 12577
35191 12577 259797 -515985 -1478153 -1811477 -1522957 -1070763 -659151 -261498 -19101 -125609
35181 -125609 -416077 -503905 -333178 -241323 -433820 -711375 -789854 -609864 -226499 354966
35171 354966 1075007 1727409 2148531 2415805 2704988 2968006 2897506 2308398 1488564 966868
35161 966868 834417 516739 -512874 -1958889 -3031467 -3442547 -3552892 -3550660 -3190689
35152 -3190689 -2549898 -2252816 -2476585 -2468779 -1719106 -931116 -960042 -1357362 -1045865 -66311
35142 -66311 544443 449906 332188 482392 359678 -186999 -492454 -288266 -186252 -452028
35132d52028p89N01074J69653o31354n36978M02197P31008J31125j04916M73429
35122F82421O37039j80622p09994p1596O31184K44632m74345k93896L98113M87446
35112A350382P7746k7040L8085l64518q99917p05398Q9809N98521N92019N19723
35102A269412M72721K27293l9426r8362l05199r05475j250725p62539n8952M2192
35092a409060l3802M95134J114377Q09794p461q5318M90318M83976k59677n87470
35082A010811j14298K31092j8978k00064M7415K06893Q8160J21062J64267m27681
35072A108679j247949j033249J48909O76863m0770n70451R3789Q68343N22664
35063E26828l21740m90875k01741k60426m30230o8716M76534M95409K20683K39679
$$ plain form
35132 -452028 -452817 48257 217910 -413444 -950422 -548225 182783 313908 208992 682421
35122 682421 1319460 1138838 428844 357248 988432 1233064 758719 464823 862936 1350382
35112 1350382 1428128 1401088 1439173 1074655 174738 -530660 -440851 157670 749689 1269412
35102 1269412 1742133 1969426 1930000 1831638 1526439 620964 -629761 -1392300 -1451252 -1409060
35092 -1409060 -1442862 -947728 166649 976443 968982 883664 1373982 1857958 1598281 1010811
35082 1010811 896513 1127605 1108627 908563 955978 1162871 1251031 1372093 1536360 1108679
35072 1108679 -139270 -1172519 -1023610 -346747 -387517 -957968 -864179 4164 526828
35063 526828 205088 -285787 -487528 -747954 -1178184 -1246900 -770366 -274957 -54274 185405
35053A85405K88454j17904m93770j16518N58711N15463j28585k85731L70917R24468
35043A700910N28525n57015j332542j056362L1343Q18678N06672l05503l93366
35034e8660K78406N87135J89454n496K97059R4252r13881j326751k70368R04721
35024b24129O48822l73313n47225J13984M12553J21641n8485m7115k42129l90468
35014e85864j00736J20562k21505m09135K65406R30577N08125j95298K59585J289390
35004A861107J048463n37334j637139j278197k75298N07371R43795P89040j14679
34995A307129q37429l38481O95603P66115M4623l4582N62244M04335p61983j470937
34985C36637r06532J15268P71191J055363Q83427J37178m12654K5842O90758L78722
$$ plain form
35053 185405 473859 355955 -137815 -254333 304378 819841 691256 405525 776442 1700910
35043 1700910 2229435 1672420 339878 -716484 -685141 133537 640209 334706 -58660
35034 -58660 219746 806881 996335 990839 1287898 1382150 468269 -858482 -1128850 -224129
35024 -224129 424693 51380 -495845 -381861 30692 152333 93848 46733 -195396 -585864
35014 -585864 -686600 -566038 -787543 -1196678 -931272 -695 507430 312132 571717 1861107
35004 1861107 2909570 2372236 735097 -543100 -818398 -311027 632768 1421808 1307129
34995 1307129 469700 131219 826822 1592937 1637560 1602978 2165222 2569557 1807574 336637
34985 336637 -569895 -454627 316564 1371927 2255354 2392532 1979878 2005720 2696478 3075200
34975C075200l40718j08693O38340M84952j89783M0209P57082N43853N0526Q49113
34965E800081J899154J015628o94797k51515J708373J805518K08569M56025K615423
34956A4562459K877628R83699J169128L982965M779038K985336M389946J0353193
34948D6083392J4438425J5639501K3558040L9825560M4908109J9928257k2916100
34941A81465184m9377839m3484500k3032978j1548672j0843062r492537m700718
34934B8984878k643320m443083m754898k072007m77403j563346k311610j230138
34926I489073m11805r48638j276424o69777l46413o59322n71514j16122l80621
34917D108437j047894p39074L01103M93148k57360n20767L9929L65023J38439
$$ plain form
34975 3075200 2734482 2625789 3264129 3749081 3559298 3599507 4356589 4900442 4950968 5800081
34965 5800081 7699235 8714863 8020066 7768551 9476924 11282442 11491011 11947036 14562459
34956 14562459 17440087 18423786 19592914 23575879 28354917 31340253 35730199 46083392
34948 46083392 60521817 76161318 99719358 139544918 184453027 204381284 181465184
34941 181465184 132087345 88602845 65569867 54021195 43178133 33685596 28984878
34934 28984878 26341558 21898475 17143577 15071570 14594167 13030821 10719211 9489073
34926 9489073 9077268 8128630 6852206 6182429 5836016 5176694 4605180 4489058 4108437
34917 4108437 3060543 2321469 2622572 3115720 2858360 2337593 2377522 2742545 2880984
34908B880984L2975M5389l27968n84902M2151P51880K21816r18575r06283J74092
34898A411559N58703j64865n50550K6133M15610j53175r03920j019472p10165
34889a090142l36488J40627N11964L71341o451J7631K83734J68677j08188J47098
34879I9803O29316L96988l93396o15170l1415M28222K88929Q438k23208p34798
34869a46291j279333j042354K2771J008630J307750J023894K81698o95881j057832
34860e76948k34623Q03579O34269m40514q48583k37654K09704k7307j23771L09384
34850e32464N40918K67359J77570M42285K50813n32324q20646j44414M50172J63302
34840B62571k93421j16565J91529j05021n82757m40451J30812L63793J07888k04835
$$ plain form
34908 2880984 2913959 2959348 2631380 2046478 2088629 2840509 3062325 2143750 1237467 1411559
34898 1411559 1970262 1805397 1254847 1280980 1696590 1543415 639495 -379977 -1090142
34889 -1090142 -1426630 -1286003 -774039 -402698 -409149 -391518 -107784 60893 -47295 99803
34879 99803 729119 1126107 732711 117541 86126 514348 803277 811715 588507 -146291
34869 -146291 -1425624 -2467978 -2445207 -1436577 -128827 895067 1176765 480884 -576948
34860 -576948 -811571 -7992 626277 185763 -662820 -900474 -690770 -718077 -841848 -532464
34850 -532464 8454 275813 453383 895668 1146481 614157 -206489 -350903 99269 262571
34840 262571 -30850 -147415 44114 -60907 -643664 -1084115 -953303 -589510 -481622 -686457
34830f86457k80918l7538N32210J086359J070790M99737K3587k1270N3584N2910
34820B292994J45694J85427k38661q52143q63554l43520k54700p55780p95562
34811a479805M6765O76695K37461n13181n38057r7789P3509J41393N15508O74057
34801b63444k7108r31247p77083M35530J387456J152740Q9760q99312j242898
34792a075606q57769n2158O51385R11807P61817L52870j61767m36434j58603L85638
34782C21180N53483K98739K08242M36903M28000m9835m74972n36315o11236q48914
34772b74725p15530Q290O71771P64796O17498N50242K71640k73523m60593q9903
34762A069963Q5266k88307l62520M17619J090808O15639l83373n98041o1205J35159
$$ plain form
34830 -686457 -967375 -1004913 -472703 613656 1684446 2184183 2207770 2186500 2240084 2292994
34820 2292994 2438688 2624115 2385454 1533311 669757 326237 71537 -684243 -1479805
34811 -1479805 -1433040 -756345 -518884 -1032065 -1570122 -1667911 -1594402 -1453009 -937501 -263444
34801 -263444 -290552 -1221799 -1998882 -1563352 -175896 976844 1066604 167292 -1075606
34792 -1075606 -1933375 -1985533 -1334148 -422341 339476 692346 530579 94145 -64458 321180
34782 321180 874663 1173402 1381644 1818547 2246547 2196712 1721740 1185425 574189 -274725
34772 -274725 -990255 -981965 -310194 454602 1072100 1622342 1893982 1620459 1159866 1069963
34762 1069963 1155229 866922 504402 922021 2012829 2628468 2245095 1647054 1585849 1721008
34752A721008l32168p27932n39045k1743L43076K23829l77644p91574j95991J002994
34742C04810J291396K50571o04726j90536L83406j29667p49781J3598J231919
34733A800990Q08370r45979j598267m08186O71025K22709p02290o61800J08737
34724g04691O39867O79556L28141m31620j089732p83191K15936N21436j88806
34715h13104m89500M25703J230060N68263o58759p03980K38898M08207p16460
34706e10672j610474r01562Q23477J863490J384083J33502n57771k29358L27343
34697G22058J88933m45847o08016o0924L24206p3263o63053n53246J52187N78111
34687d38854K84249k84774m33952J5731N35768M12909l70000r35460n99864Q0476
$$ plain form
34752 1721008 1388840 660908 121863 100120 443196 667025 289381 -502193 -698184 304810
34742 304810 1596206 1846777 1242051 1051515 1434921 1305254 555473 569071 1800990
34733 1800990 2609360 1663381 65114 -343072 327953 550662 -151628 -813428 -704691
34724 -704691 -64824 614732 942873 511253 -578479 -1361670 -1145734 -624298 -813104
34715 -813104 -1302604 -876901 353159 921422 262663 -441317 -202419 205788 -510672
34706 -510672 -2121146 -3022708 -2199231 -335741 1048342 1181844 624073 394715 722058
34697 722058 910991 465144 -142872 -203796 120410 47147 -615906 -1169152 -1016965 -438854
34687 -438854 -154605 -439379 -873331 -857600 -321832 91077 -278923 -1214383 -1814247 -1733771
34677a733771N6837n77841o78746J41551Q98392Q14619M34420N07753P17224L90759
34667I71197k32933m11038j03637J35854J66547K87824M26082J18765o43063j188114
34657d72516r40294p2401O83066O94262j8206p46525p67349j27582M89946O85440
34647e92159O78530O69722M81356P0673k13448k11158k00699k48231J1129N40729
34637I86444O27164J9369m35484n6463M98827K65760m49014o28695k24083l1120
34627E72705j52391O8896N67846M08485n33748j045679m03736L78684P8009p79405
34617h40334o65108N98708J450947P24750p82298j378066n62561N65658Q00932
34608h7372J60371m04310k44051L51400O50774L27166k88707o66780o39483m55584
$$ plain form
34677 -1733771 -1676934 -2254775 -2933521 -2791970 -1893578 -1078959 -644539 -136786 580438 971197
34667 971197 738264 327226 223589 359443 525990 813814 1239896 1358661 715598 -472516
34657 -472516 -1412810 -1485211 -802145 -107883 -126089 -872614 -1639963 -1767545 -1277599 -592159
34647 -592159 86371 756093 1237449 1308122 1094674 883516 682817 434586 445715 986444
34637 986444 1613608 1632977 1197493 1141030 1639857 1905617 1456603 827908 603825 572705
34627 572705 420314 489210 1057056 1465541 931793 -113886 -517622 -138938 -60929 -840334
34617 -840334 -1505442 -906734 544213 1268963 486665 -891401 -1453962 -888304 -87372
34608 -87372 72999 -331311 -575362 -223962 426812 753978 465271 -201509 -840992 -1296576
34598a296576l22900p1882N30398J216921J345322P25178m0870l17336k00806
34589A567449j51958k07785j05359O0127l2352k56169k04828o556k00325p07011
34579b44767p44740k9384P15348Q06044M35586O1911k91562o10091n02998P7294
34569c27359L65974j87653r32539q74743j12858M48909N01924N09194O45100N38095
34559E74044J40934k2405K76318N50043L41656j43948m44035m58287l84660l32352
34549I7308k49471q6514R7336J30793j03964l96205l00565K60833P26818N64940
34539G41309j3478m10950m91072n54128o28846m11730P9273L93135L34316K58222
34529g03949M63144O87418M71345k26180r60959j197758p14608J87635Q47480
$$ plain form
34598 -1296576 -1619476 -1691358 -1160960 55961 1401283 2126461 2085591 1768255 1567449
34589 1567449 1415491 1207706 1102347 1162474 1130122 873953 669125 662569 462244 -244767
34579 -244767 -989507 -1018891 -303543 502501 938087 999998 708436 98345 -404653 -327359
34569 -327359 38615 -149038 -1081577 -1956320 -2069178 -1620269 -1118345 -609151 35949 574044
34559 574044 714978 692573 968891 1518934 1860590 1716642 1272607 814320 429660 97308
34549 97308 -152163 -238677 -141341 -10548 -114512 -510717 -811282 -550449 176369 741309
34539 741309 727831 316881 -174191 -728319 -1357165 -1768895 -1689622 -1296487 -962171 -703949
34529 -703949 -240805 446613 917958 691778 -269181 -1466939 -2181547 -1993912 -1146432
34520a146432Q25165L52886K8028R6964K65468J76764j71141m71606l76348K04363
34510b15889Q60909R06563J57966o51743o47308P5215N65425K63748l59672n69501
34500C85713l18484j04069j49661j64445P3067K55496n2425o64525q18873j66323
34490a724529O30946P18569K34918N2026L94835N03656j14548q79025j006283
34481a189435n04773K06613R87509J634990J523379M48761o59504q04874l39379
34472A303287l45356q89240r84172k25705O21986Q21139N00956Q6435k80749n03603
34462A04978m46728l20065m81650p12282m01596M03499R19639P90342N09120M22018
34452G87275J85411l65381o47365k16291M34662N59135J27820l95763p43932q02232
$$ plain form
34520 -1146432 -321267 31619 59647 156611 422079 598843 427702 -43904 -420252 -215889
34510 -215889 645020 1551583 1709549 1057806 410498 485713 1051138 1314886 955214 385713
34500 385713 67229 -36840 -186501 -350946 -277879 -22383 -74808 -739333 -1558206 -1724529
34490 -1724529 -1093583 -375014 -140096 -88070 306765 810421 695873 -183152 -1189435
34481 -1189435 -1694208 -1487595 -500086 1134904 2658283 3107044 2447540 1642666 1303287
34472 1303287 957931 68691 -915481 -1141186 -519200 301939 802895 889330 608581 104978
34462 104978 -341750 -661815 -1143465 -1855747 -2257343 -1853844 -934205 -143863 365257 787275
34452 787275 972686 607305 -40060 -256351 178311 737446 865266 469503 -274429 -1076661
34442a076661l73933M49880J069939J039368O15384K41623j02893n67289q67805
34433D27613o48966j29243J59102Q8531o2245j37825j95952k11252r4430P3981
34423g30686J38684J18436J29432J58090Q3686j57935m91602o63750l84084K28957
34413a570772N38871J89080k16102P9003O79314N11032m12994q71607l39870K54038
34403a160007K08859J54175O08157P42370j40501r83641m21668Q82420J092903
34394I83067L3089o35422q1229N93325L17138m09338o17961l16702o1107J6445
34384a78695L3574p4410k04664M8884O33752P84726J01974p16256q14446l11422
34374f96983J08000K09105J55454q7926n46122p54117k55982N80374R45902O96923
$$ plain form
34442 -1076661 -1450594 -1000714 69225 1108593 1723977 1965600 1862707 1295418 427613
34433 427613 -221353 -350596 -191494 -102963 -165208 -303033 -498985 -710237 -804667 -730686
34423 -730686 -592002 -473566 -344134 -186044 -102358 -260293 -751895 -1415645 -1799729 -1570772
34413 -1570772 -1031901 -842821 -1058923 -979920 -300606 210426 -202568 -1074175 -1414045 -1160007
34403 -1160007 -951148 -796973 -188816 553554 413053 -570588 -992256 -109836 983067
34394 983067 1016156 380734 299505 892830 1209968 800630 182669 -134033 -195140 -178695
34384 -178695 -145121 -219531 -424195 -375311 258441 1043167 1145141 428885 -385561 -696983
34374 -696983 -588983 -379878 -224424 -312350 -858472 -1612589 -1868571 -1288197 -342295 354628
34364C54628M25802M66803M95813K12886j73509l51986l43667l14145l10185l82852
34354G9588o44527r72297r26481k41574P41479J336362J121118K13828q50603
34345a43107j384091r64158J02667Q92606P80364J66946n4245L08866N63471K22133
34335D91452k90264l70752j93151l33426p05159n93837K08008R58856R14124K31971
34325C17822l64809m59059j68629J81804L01065P8281k39988k35649J03216K68295
34315b17651o5988n46383o46894l45456M5481L71620N39994K96821l43983p40748
34305a653187l33958M63162P42966L51950m1728o9326n4224j84748j18385K75541
34295f21937M94692J72097k88579l15944K8970L05038L62151L09777J50783q6961
$$ plain form
34364 354628 780430 1247233 1743046 1955932 1782423 1430437 1086770 772625 462440 79588
34354 79588 -564939 -1537236 -2463717 -2705291 -1963812 -627450 493668 707496 -143107
34345 -143107 -1527198 -2491356 -2388689 -1496083 -715719 -548773 -603018 -294152 269319 491452
34335 491452 201188 -169564 -362715 -696141 -1401300 -1995137 -1787129 -828273 85851 317822
34325 317822 -46987 -506046 -674675 -492871 -191806 -113525 -353513 -589162 -485946 -217651
34315 -217651 -283639 -830022 -1476916 -1822372 -1776891 -1405271 -865277 -568456 -912439 -1653187
34305 -1653187 -1987145 -1523983 -781017 -429067 -470795 -540121 -594345 -779093 -897478 -621937
34295 -621937 -127245 44852 -243727 -559671 -530701 -225663 136488 446265 597048 510087
34285E10087j27362J81576M90108L83353L310k00043j55981j45756k31902k19345
34275D88045j31280k24436m82924n27498j42115M15307P00824M66573j83498p53467
34265c74469o23218K41723R83927P72236o0688m26588k0407L24299P617m57635
34255C66797l95532j8513J30564J30960K79862K87684j81801n97140k67724L22441
34245E7598J28452o13350n78720M16619R31499K36072m12675J32074R30759N41165
34235A769493n07266o15743J71020L37983m10307o75005J28544P25786J76642
34226A101147n76648l87434K71652L79790J23623K19252L43797k74783j220057
34217a9661j304104m27345K83686J82662k03112k66362p1533J51017L63474L98894
$$ plain form
34285 510087 382725 564301 1054409 1437762 1441072 1241029 1085048 939292 707390 488045
34275 488045 356765 132329 -350595 -878093 -1020208 -604901 95923 562496 378998 -374469
34265 -374469 -997687 -755964 227963 1000199 939511 512923 492516 816815 824432 366797
34255 366797 -28735 -47248 83316 214276 494138 781822 600021 2881 -264843 57598
34245 57598 186050 -427300 -1006020 -589401 342098 578170 165495 297569 1228328 1769493
34235 1769493 1262227 646484 817504 1155487 745180 70175 198719 924505 1101147
34226 1101147 524499 137065 408717 788507 912130 1131382 1475179 1200396 -19661
34217 -19661 -1323765 -1751110 -1467424 -1284762 -1487874 -1754236 -1825769 -1674752 -1311278 -912384
34207i12384P5725k51923n4482L94240L02465k44277k21558O33883J133315L34071
34197A189075r48463j230146l76312M35384M54339Q7385p7858q8771k05215l09827
34187a070409j59779J15604J57727j13551m09484m31160j17239M11464R24933
34178f91894J095765P08016j3002n06560n03229l17593k66127j12585M27519R16037
34168G36347O83622J4093r4503M68969O11595j94394r09317n43500K12742J74741
34158A160395l11725n8395P03254N20534p68558j499642o92932M74206N74072
34149A01209j2882p4334M06148N14719J16447j5102L93755O81740L10063m44772
34139A976991r86065j017771o04119o5223J62493p2836m05129l91956l6139M04526
$$ plain form
34207 -912384 -836659 -1088582 -1143064 -748824 -446359 -690636 -912194 -278311 855004 1189075
34197 1189075 240612 -989534 -1365846 -930462 -476123 -388738 -466596 -555367 -760582 -1070409
34187 -1070409 -1230188 -1114584 -956857 -1070408 -1479892 -1911052 -2028291 -1616827 -691894
34178 -691894 403871 1111887 1098885 592325 89096 -228497 -494624 -607209 -179690 736347
34168 736347 1419969 1434062 1339559 1808528 2420123 2225729 1316412 772912 985654 1160395
34158 1160395 848670 790275 1493529 2014063 1245505 -254137 -947069 -472863 101209
34149 101209 88327 13993 420141 934860 1051307 1036205 1429960 2111700 2421763 1976991
34139 1976991 990926 -26845 -630964 -696187 -533694 -606530 -1011659 -1403615 -1439754 -1035228
34129a035228Q36255J168218J066574M14212k31607k49651J39389J97776k30580
34120B075358o29096p35561p68061o74166n9807Q23940R33480r8997j086082p42076
34110i61068M64837R41835K48004m14007j55017L35021J16848m00048k42891L59354
34100B92868K93850n15876q64350k18477L53812j17074r30582q20710J00733O28770
34090a797036L01886j57348j18766K46608N93089Q62085R51123O36856K4567m64703
34080A078361o46241o53380n47528l59338l18316m26209j19724Q35673J505687
34071C48985R40914j47868k63789M63468M30061o75034j165761j45551Q76891
34062F62316L95838o81710o48512K25650L90251l06020n66207N2740O00144N17900
$$ plain form
34129 -1035228 -198973 969245 2035819 2450031 2218424 1968773 2108162 2305938 2075358
34120 2075358 1446262 710701 -57360 -731526 -791333 32607 966087 867090 -218992 -961068
34110 -961068 -496231 445604 693608 279601 124584 459605 576453 176405 -66486 292868
34100 292868 586718 70842 -793508 -1011985 -658173 -775247 -1705829 -2526539 -2425806 -1797036
34090 -1797036 -1495150 -1652498 -1771264 -1524656 -931567 -69482 881641 1518497 1543064 1078361
34080 1078361 432120 -221260 -768788 -1128126 -1446442 -1872651 -1992375 -1156702 348985
34071 348985 1289899 1142031 878242 1341710 1771771 1096737 -69024 -214575 662316
34062 662316 1058154 376444 -272068 -46418 343833 37813 -528394 -475654 124490 642390
34052F42390L74992N58947N75858P3736m65904m87555q6673K88838K93556k11748
34042A556437r54850j254090q15616k81930l11713n14287j84824L55339L12354
34033b093180m1949K34449R81836J075692L86749J6145L18938L57502j74362k13970
34023H47850O41986J046636M9284j133093r73200n0327Q7905m60828l95263L01831
34013c7219L79568k74943k95984P15148J286262M08235q27343j016670n75677
34004b38623p35346j326767j118572N0797R94174J029750P55268O95697M38686
33995E45064k75495o63850k5522R28569R08518j14107q91160o48375P1173M26803
33985B61618K95797j2969l25880m81340k36452K58906L97491k4125l57413j9195
$$ plain form
34052 642390 1017382 1576329 2152187 2225923 1760019 1272464 1185791 1474629 1768185 1556437
34042 1556437 601587 -652503 -1468119 -1750049 -2061762 -2576049 -2760873 -2405534 -2093180
34033 -2093180 -2135129 -1900680 -918844 156848 543597 559742 878680 1236182 1061820 847850
34023 847850 1489836 2536472 2585756 1452663 479463 429136 517041 56213 -339050 -37219
34013 -37219 342349 67406 -228578 486570 1772832 2181067 1353724 337054 -238623
34004 -238623 -973969 -2300736 -3419308 -3368511 -2374337 -1344587 -589319 106378 545064
33995 545064 269569 -394281 -419803 508766 1417284 1303177 412017 -236358 -165185 261618
33985 261618 557415 544446 218566 -262774 -499226 -240320 157171 133046 -224367 -243562
33975b43562N99248P43125M20595K01813J67369j10555n91082o20472J4524N88863
33965A169866L94591k78205n74925k35415J40761l0672n41790o90698k17702L50130
33955e14059M05702N4203j21784O6022K44989J88381J57251L75269O56985P87115
33945B300074Q02918O68987J91193m64029p35044n04210l67110o38047p54392
33936E00340k44750L70811L71161n0146k52624k21361l21706m36666k57116n3465
33926e95522k26938m18899k2416O90763R07355M94586l8531n05365r78142j078615
33916a771724m34331M10088O64541N93820R16225J224018N00776r09557j482008
33907b88152p87488R181J75805K88282O52892N42015k74765p64832k76040L82267
$$ plain form
33975 -243562 355686 1098811 1519406 1721219 1888588 1778033 1186951 566479 581003 1169866
33965 1169866 1564457 1286252 711327 475912 616673 586001 44211 -646487 -864189 -514059
33955 -514059 -108357 -54154 -175938 -109916 135073 323454 480705 855974 1512959 2300074
33945 2300074 3102992 3771979 3963172 3499143 2764099 2259889 1892779 1254732 500340
33936 500340 255590 626401 997562 947416 694792 473431 151725 -284941 -542057 -595522
33926 -595522 -822460 -1241359 -1263775 -573012 334343 828929 790398 285033 -693109 -1771724
33916 -1771724 -2206055 -1795967 -1131426 -537606 378619 1602637 2103413 1193856 -288152
33907 -288152 -1075640 -1066459 -890654 -602372 50520 592535 317770 -447062 -723102 -340835
33897c40835L87525J76528L27984L78241j71528p06208m91475J9855k5737m56559
33887i02209m40788K32774J039398J405146R54698k75085j386820j215053J03703
33878d84236J051462P31731q6632m69058o01014q06868o03043K37464Q56765O50019
33868D76590L33675N89448P90115K51117m18609m86054m24509p16366n90192M85976
33858B91191J312215P44313k16176j02089L86230k94617j526109j425551j65407
33849i96000L09822l23194l88040O12746J109498L01663n51655m39764j5411J23952
33839b56383N01822J178274J068806p3355q06009k99218K13271m12092j205552
$$ plain form
33897 -340835 46690 223218 551202 929443 757915 51707 -439768 -419913 -445650 -902209
33887 -902209 -1342997 -1110223 -70825 1334321 2289019 2013934 627114 -587939 -484236
33878 -484236 567226 1298957 1212325 743267 142253 -664615 -1267658 -1030194 -173429 476590
33868 476590 810265 1399713 2189828 2440945 2022336 1536282 1111773 395407 -194785 291191
33858 291191 1603406 2347719 2131543 2029454 2415684 2121067 594958 -830593 -996000
33849 -996000 -686178 -1009372 -1397412 -784666 324832 626495 74840 -364924 -380335 -256383
33839 -256383 245439 1423713 2492519 2419164 1613155 1313937 1527208 1115116 -90436
$$ [...]
##END NTUPLES=NMR SPECTRUM
##END=
