##TITLE=31Pdec_PR192M_TW
 D2O, 24 sc
 23.10.2020
##JCAMPDX= 6.0         $$ Bruker NMR JCAMP-DX V2.0
##DATA TYPE= NMR SPECTRUM
##DATA CLASS= NTUPLES
##ORIGIN= UXNMR, Bruker Analytische Messtechnik GmbH
##OWNER= root
$$ XWIN-NMR		Version 3.5
$$ Fri Oct 23 12:11:50 2020 Russian Standard Time (UT+4h)  she@DPX200
##.OBSERVE FREQUENCY= 81.013821
##.OBSERVE NUCLEUS= ^31P
##.ACQUISITION MODE= SIMULTANEOUS
##.ACQUISITION SCHEME= undefined
##.AVERAGES= 24
##.DIGITISER RES= 17
##SPECTROMETER/DATA SYSTEM= spect
##.PULSE SEQUENCE= zgpg30
##.SOLVENT NAME= D2O
##.SHIFT REFERENCE= (INTERNAL, D2O, 0, 182.463)
##AUDIT TRAIL= $$ (NUMBER, WHEN, WHO, WHERE, WHAT)
$$ ##TITLE= Audit trail, XWIN-NMR		Version 3.5
$$ ##JCAMPDX= 5.01
$$ ##ORIGIN= Bruker BioSpin GmbH
$$ ##OWNER= she
$$ F:/spectra/data/she/nmr/P31/1/pdata/1/auditp.txt
$$ ##AUDIT TRAIL=  $$ (NUMBER, WHEN, WHO, WHERE, WHAT)
(   1,<2020-10-23 12:10:44.25 +0400>,<she>,<DPX200>,
      <created by zg, POWCHK disabled, PULCHK disabled
       configuration hash MD5:
       00 E9 B6 7A A2 85 ED C7 34 08 36 98 17 FE 4E 26
       data hash MD5: 32K
       60 B7 47 33 DB 35 8D 19 E4 AE 4B 12 66 C9 C8 7C>)
(   2,<2020-10-23 12:10:51.92 +0400>,<she>,<DPX200>,
      <Start of raw data processing
       efp BC_mod = 2 LB = 1 FT_mod = 6 PKNL = 1 PHC0 = -2403.092 PHC1 = 73.00069 SI = 64K 
       data hash MD5: 64K
       0F 6A 2D 18 D9 56 56 67 6C B6 E4 67 82 64 CB E5>)
(   3,<2020-10-23 12:11:07.98 +0400>,<she>,<DPX200>,
      <pk PHC0 = -5.8631 PHC1 = 0 
       data hash MD5: 64K
       01 E7 E4 4A 97 A7 81 19 1F 15 39 3A 19 ED FF D3>)
$$ ##END=
$$ 
$$ hash MD5
$$ 73 6C D1 B6 E6 14 48 3B 47 67 64 77 2C 05 8C F2
##$RELAX= 
##$RELAX= 
##$RELAX= 
##$RELAX= 
##$RELAX= 
##$RELAX= 
##$RELAX= 
##$RELAX= 
$$ Bruker specific parameters
$$ --------------------------
##$DU= <F:/spectra>
##$EXPNO= 1
##$NAME= <P31>
##$PROCNO= 1
##$TYPE= <nmr>
##$USER= <she>
##$AMP= (0..31)
100 100 100 100 100 100 100 100 100 100 100 100 100 100 100 100 100 100 
100 100 100 100 100 100 100 100 100 100 100 100 100 100 
##$AQSEQ= 0
##$AQ_mod= 1
##$AUNM= <au_zg>
##$AUTOPOS= <>
##$BF1= 81.014009
##$BF2= 200.13
##$BF3= 200.13
##$BF4= 200.13
##$BF5= 200.13
##$BF6= 200.13
##$BF7= 200.13
##$BF8= 200.13
##$BYTORDA= 1
##$CFDGTYP= 0
##$CFRGTYP= 5
##$CHEMSTR= <none>
##$CNST= (0..31)
1 1 145 1 1 1 1 1 1 1 1 1 1 1 1 1 1 1 1 1 1 1 1 1 1 1 1 1 1 1 1 1 
##$CPDPRG= <waltz16>
##$CPDPRG1= <>
##$CPDPRG2= <waltz16>
##$CPDPRG3= <>
##$CPDPRG4= <mlev>
##$CPDPRG5= <mlev>
##$CPDPRG6= <mlev>
##$CPDPRG7= <mlev>
##$CPDPRG8= <mlev>
##$CPDPRGB= <>
##$CPDPRGT= <>
##$D= (0..31)
0 1 0 0 0 0 0 0 0 0 0 0.03 2e-05 3e-06 0 0 0 0 0 0 0 0 0 0 0 0 0 0 0 0 
0 0 
##$DATE= 1603440643
##$DBL= (0..7)
120 120 120 11 120 120 24 19 
##$DBP= (0..7)
150 150 150 150 150 150 150 150 
##$DBP07= 0
##$DBPNAM0= <>
##$DBPNAM1= <>
##$DBPNAM2= <>
##$DBPNAM3= <>
##$DBPNAM4= <>
##$DBPNAM5= <>
##$DBPNAM6= <>
##$DBPNAM7= <>
##$DBPOAL= (0..7)
0.5 0.5 0.5 0.5 0.5 0.5 0.5 0.5 
##$DBPOFFS= (0..7)
0 0 0 0 0 0 0 0 
$$ [...]
##$SUBNAM2= <"">
##$SUBNAM3= <"">
##$SUBNAM4= <"">
##$SUBNAM5= <"">
##$SUBNAM6= <"">
##$SUBNAM7= <"">
##$SUBNAM8= <"">
##$SUBNAM9= <"">
##$SW= 369.568048894756
##$SWIBOX= (0..15)
0 1 3 0 0 0 0 0 0 0 0 0 0 0 0 0 
##$SW_h= 29940.119760479
##$TD= 32768
##$TD0= 1
##$TE= 0
##$TE2= 300
##$TE3= 300
##$TEG= 300
##$TL= (0..7)
0 120 53 12 22 120 120 120 
##$TP= (0..7)
150 150 150 150 150 150 150 150 
##$TP07= 0
##$TPNAME0= <>
##$TPNAME1= <>
##$TPNAME2= <>
##$TPNAME3= <>
##$TPNAME4= <>
##$TPNAME5= <>
##$TPNAME6= <>
##$TPNAME7= <>
##$TPOAL= (0..7)
0.5 0.5 0.5 0.5 0.5 0.5 0.5 0.5 
##$TPOFFS= (0..7)
0 0 0 0 0 0 0 0 
##$TUNHIN= 0
##$TUNHOUT= 0
##$TUNXOUT= 0
##$USERA1= <user>
##$USERA2= <user>
##$USERA3= <user>
##$USERA4= <user>
##$USERA5= <user>
##$V9= 5
##$VALIST= <valist>
##$VCLIST= <CCCCCCCCCCCCCCC>
##$VD= 0
##$VDLIST= <DDDDDDDDDDDDDDD>
##$VPLIST= <PPPPPPPPPPPPPPP>
##$VTLIST= <TTTTTTTTTTTTTTT>
##$WBST= 1024
##$WBSW= 4
##$XGAIN= (0..3)
0 0 0 0 
##$XL= 0
##$YL= 0
##$YMAX_a= 11682
##$YMIN_a= -16622
##$ZGOPTNS= <>
##$ZL1= 120
##$ZL2= 120
##$ZL3= 120
##$ZL4= 120
##$ABSF1= 0
##$ABSF2= 0
##$ABSG= 0
##$ABSL= 0
##$ALPHA= 0
##$AQORDER= 0
##$ASSFAC= 0
##$ASSFACI= 0
##$ASSFACX= 0
##$ASSWID= 0
##$AUNMP= <proc_1d>
##$AZFE= 0.1
##$AZFW= 0.5
##$BCFW= 0
##$BC_mod= 2
##$BYTORDP= 0
##$COROFFS= 0
##$CY= -3
##$DATMOD= 1
##$DC= 0
##$DFILT= <>
##$DTYPP= 0
##$F1P= 0
##$F2P= 0
##$FCOR= 1
##$FTSIZE= 65536
##$FT_mod= 6
##$GAMMA= 0
##$GB= 0
##$INTBC= 1
##$INTSCL= 5.30512e-09
##$ISEN= 30
##$LB= 1
##$LEV0= 0
##$LPBIN= 0
##$MAXI= 10000
##$MC2= 0
##$MEAN= 0
##$ME_mod= 0
##$MI= 50
##$NCOEF= 0
##$NC_proc= -7
##$NLEV= 6
##$NOISF1= 182.463
##$NOISF2= 159.3651
##$NSP= 0
##$NTH_PI= 0
##$NZP= 0
##$OFFSET= 182.463
##$PC= 4
##$PHC0= -2408.955
##$PHC1= 73.00069
##$PH_mod= 1
##$PKNL= yes
##$PPARMOD= 0
##$PSCAL= 0
##$PSIGN= 0
##$REVERSE= no
##$SF= 81.014009
##$SI= 65536
##$SIGF1= 159.3651
##$SIGF2= -187.1042
##$SINO= 113.3802
##$SIOLD= 16384
##$SREGLST= <1H.CDCl3>
##$SSB= 0
##$STSI= 65536
##$STSR= 0
##$SW_p= 29940.119760479
##$SYMM= 0
##$S_DEV= 0
##$TDeff= 32768
##$TDoff= 0
##$TI= <>
##$TILT= no
##$TM1= 0
##$TM2= 0
##$TOPLEV= 0
##$USERP1= <user>
##$USERP2= <user>
##$USERP3= <user>
##$USERP4= <user>
##$USERP5= <user>
##$WDW= 1
##$XDIM= 65536
##$YMAX_p= 520220035
##$YMIN_p= -28830625
$$ End of Bruker specific parameters
$$ ---------------------------------
##NTUPLES= NMR SPECTRUM
##VAR_NAME=  FREQUENCY,     SPECTRUM/REAL,   SPECTRUM/IMAG
##SYMBOL=    X,             R,               I
##VAR_TYPE=  INDEPENDENT,   DEPENDENT,       DEPENDENT
##VAR_FORM=  AFFN,          ASDF,            ASDF
##VAR_DIM=   65536,         65536,           65536
##UNITS=     HZ,            ARBITRARY UNITS, ARBITRARY UNITS
##FACTOR=    0.456856943014862, 1,           1
##FIRST=     14782.0589164895, 0,            0
##LAST=      -15158.0608439895, 0,           0
##MIN=       -15158.0608439895, -28830625,   0
##MAX=       14782.0589164895, 520220035,    0
$$ Real data points
##PAGE= N=1
##DATA TABLE= (X++(R..R)), XYDATA
$$ [...]
36697d725005J286187J143198J272449J197043J002972J043680O81422q19105
36689B082841k527251k855423j813074l71320J493014L740215M364509J758695
36681E872206j692429k077592K05983J167823j29306n38200N64353o54996n051091
36672b333249o746219j501925N578062O552529J843565j418961m24101Q23752
36664B373453l06268j390826q25540j031790l208676m275014k273702j70656n82373
36655a1691392r20522J771801M676349L249632q28343j601886J904938M093544
36647F54121J362545k766127l322574p82603Q53627M04619L52228K108567L652341
36638B516744K629194k71870k420607k683349k165885j759059q05750Q96206J430712
$$ plain form
36697 -4725005 -3438818 -2295620 -1023171 173872 1176844 2220524 2901946 2082841
36689 2082841 -444410 -3299833 -5112907 -5484227 -3991213 -250998 4113511 5872206
36681 5872206 4179777 2102185 2308168 3475991 3346685 2808485 3372838 2717842 -2333249
36672 -2333249 -9079468 -10581393 -5003331 1549198 3392763 1973802 1549701 2373453
36664 2373453 2067185 676359 -149181 -1180971 -4389647 -8664661 -10938363 -11109019 -11691392
36655 -11691392 -12611914 -10840113 -6163764 -2914132 -3742475 -5344361 -3439423 654121
36647 654121 2016666 -749461 -4072035 -4854638 -4001011 -3596392 -3244164 -1135597 2516744
36638 2516744 5145938 4874068 2453461 -229888 -2395773 -4154832 -4960582 -4064376 -2633664
36629b633664q04360l703037l146850J405154N472899N011772J346426j082351
36621A865989l98645J320648J477164k26277k185169k666932j219763Q53671J723842
36612E44528J159102N96109P44084N63764o60977j938290k273992j986997j278662
36603d531331L27421J865082J046939j589522j910634J581293M175259J628592
36595B593099k810509l275163n05647K03302j421711o19676K958666L783087Q5957
36586I91405k744276j420395q1480k161364l844476j212870K097750J066894j746892
36577i055704q02467K579041K895408M23805J15368J845908N48351l666554m329909
36568i446753M38702L977233J541116k459163k195870P35290J612091P92609J529644
$$ plain form
36629 -2633664 -3438024 -7141061 -10287911 -8882757 -3409858 1601914 2948340 1865989
36621 1865989 1467344 2787992 4265156 4038879 1853710 -813222 -2032985 -1179314 544528
36612 544528 1703630 2299739 3043823 3607587 2946610 1008320 -1265672 -3252669 -4531331
36603 -4531331 -4203910 -2338828 -1291889 -2881411 -4792045 -3210752 964507 2593099
36595 2593099 -217410 -3492573 -3998220 -3794918 -5216629 -5836305 -2877639 905448 991405
36586 991405 -1752871 -3173266 -3254746 -5416110 -9260586 -10473456 -8375706 -7308812 -9055704
36577 -9055704 -9858171 -7279130 -4383722 -3959917 -3844549 -1998641 -1450290 -5116844 -9446753
36568 -9446753 -9008051 -5030818 -3489702 -5948865 -8144735 -7409445 -5797354 -5004745 -3475101
36559c475101L015678J909655j088011k055807l96899O99979N8077j65402P89590
36550g08241R51907o4718J89048K319157L097656M74321k635119k424756K32077
36541A431332J362506l04599k131008j737725K10169J619321J419940m7228j639096
36532A83612j942018l56174J886196K688359J393536p32921k444413l682379m336500
36523g342702l333877k66368L002383L961161K439932O28821J96276P23231J102385
36514A111242J057904P40255o363j200056k270504k565924j738662L64554L093235
36505a414319M334354K295739j507414l130917j216131J014446M90647j210863
36497c44458p32238J536367K239123M25637j549424k289494k763300l059626j586828
$$ plain form
36559 -3475101 -459423 1450232 362221 -1693586 -2090485 -1390506 -1332429 -1497831 -708241
36550 -708241 243666 178948 367996 2687153 5784809 6259130 3624011 1199255 1431332
36541 1431332 2793838 2489239 358231 -1379494 -1169325 449996 1869936 1822708 183612
36532 183612 -1758406 -2114580 -228384 2459975 3853511 3120590 676177 -3006202 -7342702
36523 -7342702 -10676579 -10942947 -7940564 -3979403 -1539471 -910650 -714374 8857 1111242
36514 1111242 2169146 2909401 2903038 1702982 -567522 -3133446 -4872108 -4507554 -1414319
36505 -1414319 2920035 5215774 3708360 577443 -638688 375758 866405 -344458
36497 -344458 -1076696 459671 2698794 3124431 1575007 -714487 -3477787 -6537413 -8124241
36488h124241J346775K799062J703501O85506J387301J533620o19101k418999
36480a706576j154584P25607n58965l125660j773222L316877N978674L101075
36472D803226j030054j604353P1348K4449j790739k295165o58870R55566J165262
36463c59330O84116K24826k38857l07638L90232Q13373j12011j064993K163J866943
36453A898824J035578k496804m123332j311650J942252P58193k968591l148773
36445h414303J092567L749777Q90707l428277l210237R33914L325855J432880
36437c627117j771483l079165k453150o96125K246491N110615M899575J002020
36429A631661k809690k978398p32374M55282M9276N2912Q54023R84430M92208
$$ plain form
36488 -8124241 -6777466 -3978404 -2274903 -1589397 -202096 1331524 712423 -1706576
36480 -1706576 -2861160 -2135553 -2694518 -5820178 -7593400 -4276523 1702151 4803226
36472 4803226 3773172 2168819 2240167 2264616 473877 -1821288 -2480158 -1524592 -359330
36463 -359330 324786 549612 310755 3117 393349 1206722 1094711 29718 31881 1898824
36453 1898824 2934402 437598 -3685734 -4997384 -3055132 -2296939 -5265530 -8414303
36445 -8414303 -7321736 -3571959 -2681252 -6109529 -9319766 -8385852 -5059997 -3627117
36437 -3627117 -5398600 -8477765 -10930915 -11627040 -9380549 -4269934 629641 1631661
36429 1631661 -1178029 -4156427 -4888801 -4433519 -4384243 -4331331 -3477308 -2492878 -2000670
36420b000670J051902K464765K278485k22638k376845j740286P60015K443375
36412B658103J955964j99252k578619l358838j523747J667206L713942L773011
36404F107770K939715J637900p81020l324054l246799r0398K875168L001772J493819
36395A0613873L90913q20281k945247m141047k647495m01466k49921j171561k03038
36386a575270K113343K546797Q90322L60585K011369K989287J259108j659903
36378H935638l696308m505310l794223r88244K164227K279149p12321k707349
36370c024741j286290J027785J338053N34966L22404k85933k174043k988704o50224
36361g186727K453972K721455P99918j16921L17915Q5064p06067k04662J051825
$$ plain form
36420 -2000670 -948768 1515997 3794482 3571844 1194999 -545287 214728 2658103
36412 2658103 4614067 4414815 1836196 -1522642 -3046389 -1379183 2334759 6107770
36404 6107770 9047485 10685385 9904365 6580311 3333512 3243114 6118282 9120054 10613873
36395 10613873 11004786 10184505 7239258 3098211 450716 49250 -200671 -1372232 -1575270
36386 -1575270 538073 3084870 3975192 4335777 6347146 9336433 10595541 8935638
36378 8935638 5239330 734020 -3060203 -4048447 -1884220 394929 -317392 -3024741
36370 -3024741 -4311031 -3283246 -1945193 -1410227 -1087823 -1373756 -3547799 -6536503 -7186727
36361 -7186727 -4732755 -2011300 -1211382 -1328303 -1010388 -925324 -1631391 -1836053 -784228
36352g84228P05479r80376j292621L18395J591643J450587R04661j5880k193744
36343b96084m067558k680698J086485K606386J55030k556532k118743J94320J715146
36334e962248K320434K718572K128524K68310j091517r14787o82252j373079j457228
36325d045271Q9091J762119K531503L464744M211300K004626k869141n162143
36317A986828k294726O71636j105087l902807j734843K777626K354638k159423
36309c406158k580572K788652N904242K112481k601543j965110J036319R37510
36301B225821o47526M96168K285153R2265l781994k839017K662208N550424K797788
36292H841290p79659j284442j098698k703905l458012p18964K606573K360548
$$ plain form
36352 -784228 -78749 -1059125 -2351746 -2033351 -441708 1008879 1913540 1897660 -296084
36343 -296084 -4363642 -7044340 -5957855 -3351469 -3196439 -5752971 -7871714 -7677394 -5962248
36334 -5962248 -3641814 -923242 1205282 1473592 382075 -532712 -1214964 -2588043 -4045271
36325 -4045271 -3956180 -2194061 337442 3802186 8013486 10018112 7148971 1986828
36317 1986828 -307898 363738 -741349 -4644156 -6378999 -3601373 -1246735 -3406158
36309 -3406158 -5986730 -3198078 2706164 4818645 2217102 251992 1288311 2225821
36301 2225821 1578295 2074463 4359616 4451881 669887 -2169130 493078 6043502 8841290
36292 8841290 8061631 6777189 5678491 2974586 -483426 -1202390 1404183 3764731
36284C764731l61224j616209j016539j060344j843740j256180M31424Q78319L38988
36275a740774J340371L312278K395787j976219m955794l125350O63470K311855
36267a774376K434438L318571L385842K2980m134719l775648O43670K909760L02641
36258C333159k803844k429510o77214q70812j721788m86068J635377J866028J081349
36249a073323J906029L333824K233322n65836p30799K666865N265496L749768
36241A6785346L72357p02107J123322L016752K687805N99630j115417j275425
36233B1492263j306991l425671o517968o090287o57564M268637K725831k701365
36225G786885l829250J223383N126687K277128k996740l041378K286316O101133
$$ plain form
36284 3764731 3403507 1787298 770759 -289585 -2133325 -3389505 -2958081 -2079762 -1740774
36275 -1740774 -400403 2911875 5307662 3331443 -1624351 -4749701 -4086231 -1774376
36267 -1774376 660062 3978633 7364475 7387455 3252736 -522912 120758 3030518 3333159
36258 3333159 529315 -1900195 -2577409 -3448221 -5170009 -5656077 -4020700 -2154672 -1073323
36249 -1073323 832706 4166530 6399852 5834016 5103217 7770082 13035578 16785346
36241 16785346 17157703 16455596 17578918 20595670 23283475 23883105 22767688 21492263
36233 21492263 20185272 16759601 10241633 4151346 3493782 7762419 10488250 7786885
36225 7786885 3957635 5181018 10307705 12584833 9588093 6546715 8833031 14934164
36217A4934164L906816j662243n094382m022232p50162P13627r52761k839850
36209D232977j642133J464587K262677k43296k441177j772213L0331Q36711J231790
36200C960254J608661L34470k331320k681855N21694K754268O71890j811256J68067
36191C194873L816678L133592p78988j617865J158403J594333k013178l951622
36183D536226j088531J581640n32190l808913k394696K457123M656355K292241
36175G699255q07767j335877L6428J190276J214214K93057q58841j289620q15085
36166E326040l97332o83064j051356r14768p28028p92901m62884M21877P18404
36157A435988l18470j850469k860735l227049k597031j41784L352945N093283
$$ plain form
36217 14934164 18840980 17178737 12084355 8062123 7311961 8025588 7072827 4232977
36209 4232977 2590844 4055431 6318108 6074812 3633635 1861422 1891753 2728464 3960254
36200 3960254 5568915 5903385 3572065 890210 1411904 4166172 4838062 3026806 3194873
36191 3194873 7011551 10145143 9366155 7748290 8906693 10501026 8487848 4536226
36183 4536226 3447695 5029335 4497145 688232 -1706464 750659 5407014 7699255
36175 7699255 6891488 5555611 5592039 6782315 7996529 8289586 7430745 6141125 5326040
36166 5326040 4928708 4245644 3194288 2279520 1551492 758591 295707 717584 1435988
36157 1435988 1117518 -732951 -3593686 -6820735 -9417766 -9559550 -6206605 -1113322
36149a113322L567928O77299q85944q79691p40321j111595j620398j765986q34559
36140d706589J551205L813714L389308N54598j082832M39444K537055K283957
36132H779860Q11857O20742R77375l25344k411333k635215j471136j848020l773645
36123a274859l828784p95116J965370J333321j209085j920583L55731L359173
36115b014832M307344K478891l36689j359287N16036L353534M153279J985393
36107A3083669j643437m816330o215375m941271j408848J877374K572159J468597
36099b3462J172807J992115J739096j01196r90162O71915K779327K548232L33795
36090A0122467j502851j937463j443843j70610J643349K272990K37719k585799
$$ plain form
36149 -1113322 2454606 3131905 2245961 1366270 625949 -485646 -2106044 -3872030 -4706589
36140 -4706589 -3155384 658330 4047638 4602236 3519404 3958848 6495903 8779860
36132 8779860 9591717 10212459 11189834 10864490 8453157 5817942 4346806 2498786 -1274859
36123 -1274859 -5103643 -5898759 -3933389 -2600068 -3809153 -5729736 -5374005 -2014832
36115 -2014832 2292512 4771403 4434714 3075427 3591463 6944997 11098276 13083669
36107 13083669 11440232 6623902 408527 -4532744 -5941592 -4064218 -1492059 -23462
36099 -23462 1149345 3141460 4880556 4779360 3789198 4461113 7240440 9788672 10122467
36090 10122467 8619616 6682153 5238310 5067700 6711049 8984039 9221758 6635959
36082F635959k292518J675842M817193L046934j719954l955644j817876R44421
36074G334357R65461r0393Q42027K532530J310547k290616l313063J93342L679009
36065A1163201K444125j794820l880106k378718j50293P23014P23188K57178r87886
36056F118883j895207n24834K457611L843988K196233m18497j741181j847118
36048H189878j469528l68457J258597J901996Q35156n44087p53597j01458N22466
36039I470966R96687R31490p84596l693316m719018j672990L113217M927026K293991
36030A0863457j383453k066693M77533L122350L353031J741839M09093K3014m44378
36021A6095793j126220l56643K434986M611413L365756J898j438045L22633K300546
$$ plain form
36082 6635959 4343441 6019283 10836476 13883410 12163456 8207812 6389936 7334357
36074 7334357 8299818 8209425 9051452 11583982 12894529 10603913 7290850 7484192 11163201
36065 11163201 13607326 11812506 7932400 5553682 5403389 6126403 6849591 7106769 6118883
36056 6118883 4223676 3698842 6156453 10000441 12196674 11778177 10036996 8189878
36048 8189878 6720350 6351893 7610490 9512486 10347642 9803555 9049958 8948500 9470966
36039 9470966 10467653 11399143 10614547 6921231 2202213 529223 3642440 8569466 10863457
36030 10863457 9480004 7413311 7890844 11013194 14366225 16108064 16517157 16540171 16095793
36021 16095793 14969573 14612930 17047916 21659329 25025085 25026983 23588938 23911571 26212117
36012B6212117J682669p06202k210943j556234O51461K849658L215036J182568
36004C1320130j165241j093807J030226K260822J740943J903387L971468N491681
35996D5459609M292073J989990J066644R58417m9609j105661k10294K036664L308263
35987E7746096L275384L428708L833081L179177J915288K259858M572677O306584
35979H6516853N534004L580030L032964M423341N980228O083192N063056M442144
35971A24655812M791353N238861N747999Q510080J4578440J9486347J5909862
35964A98918754K380424j3542680k3001956k4277495k1272049j6736969j1021398
35957I1446631n636666l220198l820412m816460m895262n150495o051295o333396
$$ plain form
36012 26212117 27894786 27188584 24977641 23421407 24072868 26922526 30137562 31320130
36004 31320130 30154889 29061082 30091308 32352130 34093073 35996460 39967928 45459609
35996 45459609 49751682 51741672 52808316 53766733 53717124 52611463 52401169 54437833 57746096
35987 57746096 61021480 64450188 68283269 71462446 73377734 75637592 80210269 86516853
35979 86516853 92050857 95630887 98663851 103087192 109067420 115150612 120213668 124655812
35971 124655812 129447165 134686026 140434025 148944105 163522545 183008892 198918754
35964 198918754 201299178 187756498 164754542 140477047 119204998 102468029 91446631
35957 91446631 85809965 82589767 78769355 73952895 69057633 63907138 57855843 51522447
35949E1522447n462894m552317m134566l307613j766018o95436j004800k229538
35941B8369265l460651l971217l126142j222811M7116l44854j036911n35647r784
35932A4708364j246408l015582k720804q06858J38165R3710J258890L060685K118805
35923A3588967j903146m809063l786289q97972J005799J991546K635869J745730
35915I571441q21318k247645n57363K156918K837896J476508k16875j649248k510177
35906H040137j643105P12346J940126Q06476k89766N99286J434308j29669k278101
35897I192038k043694m53181m41884j460702q11729P92532K6212k799745l250423
35888a250576L38695L718227K529898j778354m187093k430408J078386K845634
$$ plain form
35949 51522447 46059553 41507236 37372670 34065057 32299039 31603603 30598803 28369265
35941 28369265 24908614 20937397 17811255 16588444 16635560 16290706 15253795 14718148 14708364
35932 14708364 13461956 10446374 7725570 6918712 7056877 7150587 8409477 11470162 13588967
35923 13588967 11685821 6876758 3090469 2192497 3198296 5189842 7825711 9571441
35915 9571441 8750123 6502478 5945115 8102033 10939929 12416437 12199562 10550314 8040137
35906 8040137 6397032 7109378 9049504 9855980 9566214 10165500 11599808 11470139 9192038
35897 9192038 7148344 6695163 6253279 4792577 3980848 4773380 4799592 1999847 -1250576
35888 -1250576 -911881 2806346 5336244 3557890 -629203 -3059611 -1981225 864409
35880H64409K049358M53441m61988j084353j827181j124507K341618N899616M954204
35871A2064617k53974l838981k342872L79760l19579k420541j227112K130548
35863D171866K325293j270564l574960j926082N12434O55606k95990l65821j12183
35854A19599k39559L98477K049961K349154k33589l433194l755436n72669L472440
35845A55184M851140J830885l356093n488155k073042K723397L277631M93029
35837B413976k77987J466617P70112l178484m335560J21626M160488K360440j231271
35828B269957j95007L368085K825710j382755k614314O84769K853664Q53162j341797
35819G321474l27415J267187J90048j708555j128606Q92820R10687j298221k592229
$$ plain form
35880 864409 2913767 3367208 2905220 1820867 -6314 -1130821 1210797 7110413 12064617
35871 12064617 11810643 7971662 5628790 6008550 5688971 3268430 2041318 4171866
35863 4171866 6497159 5226595 1651635 -274447 237987 893593 597603 231782 119599
35854 119599 -119960 278517 2328478 4677632 4444043 1010849 -2744587 -3317256 155184
35845 155184 5006324 6837209 3481116 -2007039 -4080081 -1356684 1920947 2413976
35837 2413976 2135989 3602606 4372718 1194234 -3141326 -3019700 1140788 3501228 2269957
35828 2269957 2074950 5443035 8268745 6885990 4271676 4956445 7810109 8663271 7321474
35819 7321474 6994059 8261246 8451294 6742739 5614133 6506953 7417640 6119419 3527190
35810C527190j028158J997170L717768K548180p08858l198539k563588Q087P19711
35801E018963j769923l951108j986123K677464M731435J850402k338200l055711
35793A177199l19307J756761Q61414p20649k4377K023013K188007J7949j604330
35784E355680j085811k04226n04634o48582O74641J865946J076166m23035m99496
35775E606649M1339p82587k132394j831852o70661j109549k405983j543015J112124
35766c715929J926034L33460n6896J916183K529028j72351k443633j190371M93584
35757c80891j051342k866431Q1402N614728O446801J156822l458333k224117J904482
35748E223121L458230J753559n55990k380580l856917l770201j316259J114713
$$ plain form
35810 3527190 2499032 4496202 8213970 10762150 10053292 6854753 4291165 4299252 5018963
35801 5018963 3249040 -702068 -2688191 -10727 4720708 6571110 4232910 1177199
35793 1177199 857892 2614653 3476067 2755418 2731041 4754054 6942061 6960010 5355680
35784 5355680 4269869 4065643 3561009 2912427 3587068 5453014 6529180 6106145 5606649
35775 5606649 5647988 4865401 2733007 901155 230494 -879055 -3285038 -4828053 -3715929
35766 -3715929 -1789895 -1456435 -1513331 402852 2931880 2759529 315896 -874475 -380891
35757 -380891 -1432233 -4298664 -4217262 1397466 7844267 9001089 5542756 3318639 5223121
35748 5223121 8681351 10434910 9878920 7498340 3641423 -128778 -1445037 -330324
35740c30324P49134q56609K21961L769856M940956J318102l189270l660847o28994
35731B333965J534932Q72637o27617r07875j55866P88557J592926J476099m59382
35722F448376l116136l852129k039289l1171M86256O65058J508535J507840k22447
35713A354893j037116J445595M494564L517340o99029k706261n53591J654642
35705G471037P37863q15252J40807J684947Q2070l801620n546389l426276J08853
35696c363960K535388L357077K392948m25170k979234k014222K288515N290532
35688G081874L279232j786899m725917l235346K55722K287619K060090J077363
35680F293738M99214J6020q25847j258963j64265J813044K133419p52364m832888
$$ plain form
35740 -330324 418810 -437799 -215838 3554018 8494974 9813076 6623806 2962959 2333965
35731 2333965 3868897 4741534 4113917 3206042 3050176 3838733 5431659 6907758 6448376
35722 6448376 3332240 -519889 -2559178 -2590349 -2104093 -1439035 69500 1577340 1354893
35713 1354893 317777 1763372 6257936 9775276 9076247 6369986 5816395 7471037
35705 7471037 8208900 7393648 7534455 9219402 9301472 5499852 -46537 -3472813 -3363960
35696 -3363960 -828572 2528505 4921453 4496283 1517049 -497173 1791342 7081874
35688 7081874 10361106 8574207 3848290 612944 868666 3156285 5216375 6293738
35680 6293738 6792952 6808972 5983125 4724162 4559897 6372941 8506360 7753996 2921108
35671B921108o059409k816176J964884L896570J908241j030629j904581j040714
35663b160706o49782j183221j082399J05716P43105J232n16528M82349J732141
35654b528093J913568K252141L756326L850691j87246n484201o047806j229456
35646c704076L053106K693640K95758k62859M67871K58085l48210O222K12682
35637B672219r62305j988088j520111j326454k479948j877678K666841O854178
35629B038654N256071J07436j707759P72937J973914m49521k517867j779116j128223
35620B566526k325070k253916Q55037L192669J529586j188455q80920J071424
35612B566881R64613q21730j394937p70630r63287j522125m65722J632742K485078
$$ plain form
35671 2921108 -3138301 -5954477 -3989593 -93023 1815218 784589 -1119992 -2160706
35663 -2160706 -2810488 -3993709 -5076108 -4970392 -4227287 -4226055 -4742583 -4260234 -2528093
35654 -2528093 -614525 1637616 5393942 9244633 9057387 3573186 -2474620 -3704076
35646 -3704076 -650970 2042670 2338428 2075569 2543440 2801525 2453315 2459537 2672219
35637 2672219 1709914 -278174 -1798285 -3124739 -5604687 -7482365 -4815524 2038654
35629 2038654 7294725 7402161 5694402 6467339 8441253 7991732 5473865 3694749 2566526
35620 2566526 241456 -2012460 -1157423 2035246 3564832 2376377 1495457 2566881
35612 2566881 3531494 2709764 1314827 544197 -419090 -1941215 -2406937 -774195 1710883
35603A710883J895180J264788O97952p0560K86596K023965J860034k322769o320529
35594A025540m577946R80575L196079M22737j581694N14797K703679J238141j029194
35585B892714j48108J900017Q08550k565653l595898j141055J414055J765603
35577A330225J069460O03515j77259j423455j738600m83627Q84873R36927J73116
35568A175175j47546J95928O16062O91307J96870q49495j523389m88725J928996
35559A795183L243383J749892p39146q27470J889695M016590K720620p70331l231766
35550I846650l595727l206996k794276j574686M61322J601881P03628j099420
35542C42376j919812j146333P04207K690863L231947R94458k669792l898894p79038
$$ plain form
35603 1710883 3606063 4870851 5568803 5498243 5784839 7808804 9668838 7346069 1025540
35594 1025540 -3552406 -2571831 624248 1046985 -534709 -19912 2683767 3921908 2892714
35585 2892714 2744606 4644623 5453173 2887520 -708378 -1849433 -435378 1330225
35577 1330225 2399685 3003200 2825941 1402486 -336114 -819741 65132 1002059 1175175
35568 1175175 1027629 1223557 1839619 2530926 2727796 1878301 354912 -133813 1795183
35559 1795183 5038566 6788458 6049312 5221842 7111537 11128127 13848747 13078416 9846650
35550 9846650 6250923 3043927 249651 -1325035 -863713 738168 1441796 342376
35542 342376 -1577436 -2723769 -2019562 671301 3903248 4897706 2227914 -1670980 -2450018
35533b450018L634320M670331J457062k786705m817054l782158o47146K483901
35525b237467L146031Q73644j658525j767856j92668P02127Q29419J557196K118588
35516C370489O17059j702655j220011K472180N431310M719007J552049j665877
35508A3573551l901510m176361j612770J787297K318050J56191l85583J923656
35500I682521K659742o06232l273916r88392K569568J201848l696682n325617
35492B222840k072015J041497J152126R07992J962122J566080j771599m407502
35484F01541k734304J308551L084203J226612j805876l293851k327634J98773
35476c741985K182214K148859J122644J019071J218791n62908l772347m848208
$$ plain form
35533 -2450018 1184302 5854633 7311695 4524990 -292064 -4074222 -4721368 -2237467
35525 -2237467 908564 1782208 123683 -1644173 -1836841 -1134714 -305295 1251901 3370489
35516 3370489 3987548 2284893 1064882 3537062 8968372 13687379 15239428 13573551
35508 13573551 9672041 5495680 3882910 5670207 7988257 8144448 7758865 9682521
35500 9682521 12342263 11736031 8462115 7473723 10043291 11245139 7548457 2222840
35492 2222840 150825 1192322 2344448 3252440 5214562 6780642 5009043 601541
35484 601541 -2132763 -824212 2259991 3486603 1680727 -1613124 -3940758 -3741985
35476 -3741985 -1559771 589088 1711732 2730803 3949594 3386686 -385661 -5233869
35468e233869k537550K01861J091639J575895K881589K913675J92226k429368
35460a343902j725546P36925J251327k12925q20544K0752M52839J66774O67899
35451h06401J942679K417650J966908J664430R96251j171950l244967k382293
35443A382307O55197K079674P90359n45799o26221j223188k620874k146891O17427
35434a638009J839277l47493k049636K3437K462314O06444k967501j755838M059759
35425B32754O908311K617867l829852n573289k379149J050267J872741Q57356
35417A757006m90248j279047p88916O65438J087090p97033l089461k807183M040
35408e738314K393709K638856K046991K209456K523557J568986m38309j904734
$$ plain form
35468 -5233869 -7771419 -7569558 -6477919 -4902024 -2020435 893240 1085466 -1343902
35460 -1343902 -3069448 -2332523 -1081196 -1294121 -2114665 -2093913 -1641074 -1474300 -806401
35451 -806401 1136278 3553928 5520836 7185266 8181517 7009567 3764600 1382307
35443 1382307 2037504 4117178 4907537 4361738 3735517 2512329 -108545 -2255436 -1638009
35434 -1638009 201268 -146225 -2195861 -2172424 289890 896334 -2071167 -3827005 232754
35425 232754 7141065 9758932 5929080 355791 -2023358 -973091 899650 1757006
35417 1757006 1266758 -12289 -801205 -135767 951323 154290 -2935171 -5742354 -5738314
35408 -5738314 -3344605 -705749 1341242 3550698 6074255 7643241 7204932 5300198
35400E300198j904403r11568J08045M60733j15083j169887j535371m45124J266176
35391A053716J893143J010795N0596K57778R65174Q28425Q2880J67961J279814
35382G590282J856177Q32760j030722k568282l342209k673257K72550L802169
35374D739468L498043k198953p820090o479358O10692M898095J921677k814529
35366c644955k236548K313795M087683J189930j726493j299518M37096P57652
35358a21358M52730J226897K269112J929984O28194j24117k9933M04283J122264
35349G758056J797817J324773m00900j570974r05137L32674L43125n26776q32342
35340G320316n17451n27498r91463j492769k041865k179037o41125K088040K742184
$$ plain form
35400 5300198 3395795 2484227 2592272 3053005 2937922 1768035 232664 -212460 1053716
35391 1053716 2946859 3957654 4008250 4266028 5231202 6059627 6142507 6310468 7590282
35382 7590282 9446459 10279219 9248497 6680215 3338006 664749 937299 4739468
35374 4739468 8237511 6038558 -1781532 -8260890 -7650198 -2752103 -830426 -3644955
35366 -3644955 -5881503 -3567708 519975 1709905 -16588 -1316106 -879010 -121358
35358 -121358 331372 1558269 3827381 5757365 6385559 6261442 6231509 6635792 7758056
35349 7758056 9555873 10880646 10479746 8908772 8003635 8336309 8679434 8152658 7320316
35340 7320316 6802865 6275367 5283904 3791135 1749270 -429767 -1070892 1017148 3759332
35331C759332l82258l662589k391726K137169M007672J201296j681322m63445
35323B524129K875121L736186J065008k532760m470891l575695J08573M348249
35315D077920N266360J549397l070140l975559j246167J281479J371545O7906
35307E322741j123620j655029q11009J723057L886260K816355q69785l154901
35299F134069k010399O2384L62115J2669J212671K779994J816438j285130l045675
35290F039136k060474n62403r8930R39847L589419N123510K781701j162629j958117
35281A2631060N15409J382557j599179m199436k010876K722458M242667J219694
35273A4904354k517196m141628m329891l652374j113031K433129L629785J580729
$$ plain form
35331 3759332 3377074 -285515 -2677241 -540072 3467600 4668896 2987574 2524129
35323 2524129 5399250 9135436 10200444 7667684 3196793 -378902 -270329 4077920
35315 4077920 9344280 10893677 7823537 3847978 2601811 3883290 5254835 5322741
35307 5322741 4199121 2544092 1733083 3456140 7342400 10158755 9288970 6134069
35299 6134069 4123670 4186054 4548169 4560838 5773509 8553503 10369941 9084811 6039136
35290 6039136 3978662 3416259 3317329 4257176 7846595 12970105 15751806 14589177 12631060
35281 12631060 13146469 14529026 12929847 8730411 6719535 9441993 13684660 14904354
35273 14904354 12387158 8245530 3915639 263265 -849766 1583363 5213148 6793877
35265F793877j21467J099589K664835J404829r41495r56019K85858o97468l074641
35256F457898k705240M12159J561265p66085k152188J04348K034425l58065l876503
35247G12014k777683K056908M285166J490185k013348k140135R3770K074776L619713
35238G401366N008555M409477O45833l448954l926068j219667L66158j337377
35230G899323l766137l831191k177865j471689k050509j632149R39419L765951
35222b324847M457448L283950K525835L116252L220599P28036l431614n540014
35214F035645l251322J113207K805711M82852j907195n30191K608588K302247
35206I659542j862204m095690o64692M131026L788569j019305l590506r63724
$$ plain form
35265 6793877 6672410 7771999 10436834 11841663 10900168 9944149 10230007 9532539 6457898
35256 6457898 3752658 4164817 5726082 4959997 2807809 2912157 4946582 4588517 712014
35247 712014 -2065669 -8761 4276405 5766590 3753242 1613107 1706877 3781653 7401366
35238 7401366 12409921 16819398 17465231 14016277 10090209 8870542 9236700 7899323
35230 7899323 4133186 301995 -1875870 -3347559 -5398068 -7030217 -6090798 -2324847
35222 -2324847 2132601 5416551 7942386 11058638 14279237 15007273 11575659 6035645
35214 6035645 2784323 3897530 6703241 7186093 5278898 4748707 7357295 9659542
35206 9659542 7797338 3701648 3036956 7167982 10956551 9937246 6346740 5383016
35198E383016K525565K422679J40881o83607M3099K35847O8672J082569K357999
35189A3576720J563465o90874j290114L93199J411868J0476j614674q41889J487112
35180A4005289K546907J287709j015709k857365l537901k794168q38811J326540
35172H122491K412511J677245o81567l344209m280364k545728K64175J691213
35164C315767J571876J782563K730149K549804O39520p31954m8374Q09125r0660
35155A2527816j157663j94060J178732j295k425866k025281J175103K670355P78021
35146A2525862p47511N78508J618874n87482k963397j091059L178411M233822
35138A6746028J313776r09894p6591R28494l19108k064766k198034j591905j296762
$$ plain form
35198 5383016 7908581 10331260 10472141 9788534 9831633 10067480 10136152 11218721 13576720
35189 13576720 15140185 14449311 13159197 13552396 14964264 14974740 13360066 12518177 14005289
35180 14005289 16552196 17839905 16824196 13966831 10428930 7634762 6795951 8122491
35172 8122491 10535002 12212247 11530680 8186471 3906107 1360379 1624554 3315767
35164 3315767 4887643 6670206 9400355 11950159 12589679 11857725 11809351 12618476 12527816
35155 12527816 11370153 11176093 12354825 12353530 9927664 7902383 9077486 11747841 12525862
35146 12525862 11778351 12356859 13975733 13388251 10424854 9333795 12512206 16746028
35138 16746028 18059804 17149910 17073319 18001813 17682705 15617939 13419905 11828000 10531238
35129A0531238j01521K282829K844566m46850m366816m266507p69816J171534
35121F878657n92392k827418j908278J501586L838193K912801j57595k365782
35113G279772j746882O65371K148301J850521J729426L060556L941225K198982
35105B1127272r27060k545616k158865j116496N67241L256757M540503J438375
35097B4182111m114355o414455l586739R3712P96741j61248j82978K14886k77510
35088A0550165o34525N7700J07038j441031j935453N49659K788105Q99989k870184
35079H071463l097731K91267K005585j10968k077616n10895K510321L443021K221356
35070A2745803P19423o00980j855093j921586j31168J788459J703737j15472j895589
$$ plain form
35129 10531238 10429717 12712546 15557112 15110262 10743446 6476939 5707123 6878657
35121 6878657 6286265 3458847 1550569 3052155 6890348 9803149 9645554 7279772
35113 7279772 5532890 6198261 8346562 10197083 11926509 14987065 18928290 21127272
35105 21127272 20200212 17654596 15495731 14379235 14946476 18203233 22743736 24182111
35097 24182111 20067756 13653301 10066562 10160274 10957015 10795767 10612789 10827675 10550165
35088 10550165 9915640 9973340 10080378 8639347 6703894 7253553 10041658 10941647 8071463
35079 8071463 4973732 5264999 7270584 7159616 5082000 4571105 7081426 10524447 12745803
35070 12745803 13465226 12864246 11009153 9087567 8956399 10744858 12448595 12333123 10437534
35061A0437534k844082l048064k085431K96377K708608L106181J275984p23754
35053I123353p34075J325214L374659L266697J210381m01038k43150p1373j857608
35044A4993060l987421l076043O49105L047530J923493l6409J95051J439548P77229
35035A5925143j570318k695700j301152R79830K168424J917501J024375L39811
35027A6787914J65357R2899k65388l91101K37626N33781r72937l146926l062585
35018I978640n15851J258810O69705J93643J581181K224233k87321l078653j936882
35009A0087505J689523K608518q7925j946452l17965K117352K190430O08169l50426
35000A6598729m22918o05751r30488q17200l27989J40329M78355O35286O03956
$$ plain form
35061 10437534 7593452 4545388 2459957 2756334 5464942 8571123 9847107 9123353
35053 9123353 8389278 9714492 13089151 16355848 17566229 17165191 16922041 16850668 14993060
35044 14993060 11005639 7929596 8578701 11626231 13549724 13513315 13708366 15147914 15925143
35035 15925143 14354825 11659125 10357973 11337803 13506227 15423728 16448103 16787914
35027 16787914 16953271 17046170 16780782 16389681 16627307 17161088 16188151 13041225 9978640
35018 9978640 9462789 10721599 11391304 11584947 13166128 15390361 15103040 12024387 10087505
35009 10087505 11777028 14385546 14297621 12351169 12033204 14150556 16340986 16949155 16598729
35000 16598729 16175811 15570060 14639572 13822372 13494383 13634712 14113067 14748353 15352309
34991A5352309N52233J29976j437700l264397k497701J571088M961844L928291
34983A9295943P17430J02104J603348P27763k566003l267942k11150J415474r05765
34974A6911202k324657Q32762M121061K306204j576214j374388J786000J870674
34966B2552644j555943l090960j117399L8839j623042k533627n99889R02424n44918
34957A2428129k145934r48547J018292Q02891p3629J131599K547700K65930m495488
34948A0530943n899567j660032L401689L620549m21694l251848j662681J718609
34940F375968K292603n74235k925204j452211K311947M272503L040985Q54088
34932A4196444k70552p11837j159031r49940K13345R96264N36070J03924Q18215
$$ plain form
34991 15352309 15904542 16034518 14596818 11332421 8834720 10405808 15367652 19295943
34983 19295943 20013373 20115477 21718825 22446588 19880585 16612643 16401493 17816967 16911202
34974 16911202 14586545 15419307 19540368 21846572 20270358 18895970 20681970 22552644
34966 22552644 20996701 17905741 16788342 16827181 15204139 12670512 12070623 12973047 12428129
34957 12428129 10282195 9333648 10351940 11154831 11081202 12212801 14760501 15026431 10530943
34948 10530943 4631376 2971344 6373033 9993582 9571888 6320040 4657359 6375968
34940 6375968 8668571 8094336 5169132 3716921 6028868 10301371 13342356 14196444
34932 14196444 13925892 13214055 12055024 11105084 11318429 12314693 12850763 12954687 13772902
34923A3772902J216578n65684l141273l060997L15535L534192L462532J227992
34915A6761777L78843K010658L320725J282008l291502o336123n067281r46934
34907H112171K255850K440837M74249j495752j749477J74953K712702K927764
34899A5853297j19818l168659k367925J153785K449099r8429k452237j281821
34891I967292J098356R68070p90125p69179J003023J513613J65261n86305J31762
34882A2701768M11372n05578r39998m07860q40590k595900k748652K84310L344846
34873H703718K729507k85153j346429P16542K752385K122803j80876j679917j434571
34864A2098009j90085Q59728O85920r22506k548263k042143Q79843L689235L676187
$$ plain form
34923 13772902 14989480 14423796 11282523 8221526 8537061 12071253 15533785 16761777
34915 16761777 17140620 19151278 22472003 23754011 20462509 14126386 9059105 8112171
34907 8112171 10368021 12808858 13283107 11787355 10037878 10212831 12925533 15853297
34899 15853297 15733479 12564820 10196895 11350680 13799779 13701350 11249113 9967292
34891 9967292 11065648 12033718 11243593 10474414 11477437 12991050 13156311 12570006 12701768
34882 12701768 13113140 12607562 11667564 11259704 10419114 7823214 5074562 5358872 8703718
34873 8703718 11433225 11148072 9801643 10518185 13270570 15393373 15212497 13532580 12098009
34864 12098009 11907924 12767652 13453572 12531066 9982803 7940660 8820503 12509738 16185925
34855A6185925J113427j228114j599223j056502j177601j286607L12961K719676
34847A3983942K531163j236527m496630k898214J865330L779556N51480l522370
34839A0557730l900228j624865l39638k52679J154930L663957L773580J79342
34831A3212129l635480l884662j250469O80945K74314q22247n91056Q35506J806764
34822F625744J366590L00282j5347M14284M5630j832997l387680k347251M69355
34813A638610J688905n4844k071004j361338J247926K561659J494546j17452p92484
34804D234524j154314j936992k256376j102157O55839J159656L2844j130832o91542
34795b189350J326948L402470L824290J931586j266099l536562l125153n06895
$$ plain form
34855 16185925 17299352 16071238 14472015 13415513 12237912 10951305 11264266 13983942
34847 13983942 16515105 15278578 10781948 7883734 9749064 13528620 14080100 10557730
34839 10557730 6657502 5032637 4692999 4440320 5595250 9259207 13032787 13212129
34831 13212129 9576649 5691987 4441518 5122463 5396777 4574530 3983474 4818980 6625744
34822 6625744 7992334 8292616 8277269 8691553 8737183 6904186 3516506 1169255 1638610
34813 1638610 3327515 3272671 1201667 -159671 1088255 3649914 5144460 5027008 4234524
34804 4234524 3080210 1143218 -1113158 -2215315 -1559476 -399820 -366976 -1497808 -2189350
34795 -2189350 -862402 2540068 6364358 8295944 7029845 3493283 368130 -138765
34787a38765J835666J877832J95981q38880L5451J580604J866196P01923n32263
34778F583745r89407j135020j425772j418424p02256K08486O20771O67172R05325
34769C314620J442158K038808K510396K453987J339893l70170j097336k43339
34761A1389017M77021o65968k488496k265637J69522J941329J188481n40629r16714
34752H287926J5377O42279K67970o36178j483609j530535l35K273661K638980
34743A0475536n2799l064687l019469o71993L09606j015335j638570L66430K754672
34734D443391K684741Q24386l54027m95935r48113j566879q32823J050753J881767
34725F687261Q28567k45726J01985M43781j146472l609053l968034j501147J300647
$$ plain form
34787 -138765 1696901 3574733 3770714 2931834 2967285 4547889 6414085 7116008 6583745
34778 6583745 5594338 4459318 3033546 1615122 912866 1121352 1742123 2409295 3314620
34769 3314620 4756778 6795586 9305982 11759969 13099862 12729692 11632356 11389017
34761 11389017 11866038 11200070 8711574 6445937 6615459 8556788 9745269 9204640 8287926
34752 8287926 8303303 8945582 9213552 8577374 7093765 5563230 5562895 7836556 10475536
34743 10475536 10422737 7358050 4338581 3666588 3976194 2960859 1322289 1688719 4443391
34734 4443391 7128132 7952518 7598491 7102556 6154443 4587564 3754741 4805494 6687261
34725 6687261 7515828 7270102 7372087 7815868 6669396 3060343 -907691 -2408838 -1108191
34716a108191K296782K191491K354562J972683m38029l495371l646900O33L762360
34707C890020L658270J49861k906908k977660r25294R07826J098494l1464p80730
34698B082415K81158K182333K263529J95065p26504J379509K883735m10724n632476
34689D498040n523840Q80251N978721M127488q96587k458880m28206P77140m2390
34680F911737o27092o40938j567808k210010J25331L986396M586361R36184k598461
34671H901700k860808j469807n47845N36458K205344K640667J121766j94799j52175
34662A0180501p23309k832931l726183j491702J254254J594165R36350J587025
34654F778170J879724n87312l383001k297944J470426K695444K12058j756887
$$ plain form
34716 -1108191 1188591 3380082 5734644 7707327 7269298 3773927 127027 127660 3890020
34707 3890020 7548290 7698151 4791243 1813583 888289 1796115 2894609 2863145 2082415
34698 2082415 2363573 4545906 6809435 7004500 6277996 7657505 10541240 10130516 4498040
34689 4498040 -1025800 -145549 5833172 9960660 9064073 6605193 6176987 6954127 6911737
34680 6911737 6284645 5643707 4075899 1865889 1991220 5977616 10563977 11500161 8901700
34671 8901700 6040892 4571085 4023240 4559698 6765042 9405709 10527475 10332676 10180501
34662 10180501 9457192 6624261 2898078 1406376 2660630 4254795 5191145 6778170
34654 6778170 8657894 8070582 4687581 2389637 3860063 6555507 6767565 5010678
34646E010678p14237Q59093N62524l45506l29310m57576j532996j681467N70579
34637A941782L295294L638229J396732j684610m123836m501538j529777L317494
34629A749770N464849K460365k034790k624446M91851K060593m67551l379544
34621C721097k272041J654200L392950R52861k360218k712719m76309J233383
34613C133204J200066R31327J250318Q72942p04332j499416j14287J590976J311757
34604G972555K3254o169N97026l22515j920821j375427Q48035J325155k23277
34595F917816o2212K789237L897786L31706m140746m465441j428382O75165O69195
34586E184124M58655N15444p0852m04542R68121K446633J180534j959685l191575
$$ plain form
34646 5010678 4296441 5155534 5718058 5372552 5043242 4585666 3052670 1371203 1941782
34637 1941782 5237076 8875305 10272037 8587427 4463591 -37947 -1567724 1749770
34629 1749770 7214619 9674984 7640194 5015748 5507599 7568192 7100641 3721097
34621 3721097 1449056 3103256 6496206 7449067 5088849 2376130 1899821 3133204
34613 3133204 4333270 5264597 6514915 7387857 6683525 5184109 5069822 6660798 7972555
34604 7972555 7995809 7989640 8586666 8264151 6343330 4967903 5815938 7141093 6917816
34595 6917816 6855604 9644841 13542627 13874333 9733587 5268146 3839764 4514929 5184124
34586 5184124 5642779 6158223 6087371 5682829 6650950 9097583 10278117 8318432 5126857
34577E126857j463700M70162O72544J01092j61304k63024K06701J976801L556554
34568A0222683K274397j417614l814154k947729p88510K60034J36596l26745p18575
34559B880383k25549J622586K939958J398580j549295k140348m27824l66334k680348
34550A451809k946886P73605L690942J514609k569217k867630L43160K386437
34542A776829J668773M05388m03547j608914k496643j465706M39560R46160Q07237
34533F9137K263684L994618K585720j090972k311388p0646J173417r40834k639946
34524C032790n51604K216071P73687l641524n112393j456488K834411K701905
34516G96855j056809k970584K28390N200729N561147q4261n611296m740937P77423
$$ plain form
34577 5126857 3663157 4133319 4805863 4906955 4745651 4482627 4689328 6666129 10222683
34568 10222683 12497080 11079466 7265312 4317583 3529073 3789107 3925703 3598958 2880383
34559 2880383 2654834 4277420 7217378 8615958 7066663 4926315 4498491 4132157 1451809
34550 1451809 -1495077 -721472 2969470 4484079 1914862 -952768 -609608 1776829
34542 1776829 3445602 3850990 3447443 1838529 -658114 -2123820 -1684260 -738100 69137
34533 69137 2332821 6327439 8913159 7822187 5510799 5440153 6613570 5672736 3032790
34524 3032790 2481186 4697257 5470944 1829420 -3282973 -4739461 -1905050 796855
34516 796855 -259954 -3230538 -3002148 2198581 7759728 7675467 2064171 -2676766 -1899343
34507a899343L661015R75819k800211l206911j608631j253369j605619l17793
34499h055043J785552J808441l16434j675874q00463P24794J109418M25237l52483
34490e346855n06672L20350J735797K460579J808676P90018N12638L92100m83987
34481A682644j260794o16557O87121Q31117q7267m83343j83543k79827m46626
34472a57075N79563J810206P30932k022793k336952J286858M626354L330998j056764
34463F791327l764249l320854j793095k4246K963238O001357N689386J519840
34455A4062704k602509l780545l764170m795161m997421j567601L497078N214553
34447A266928K606361k32431l71799N63560L51330k02251L64188J209254J108252
$$ plain form
34507 -1899343 1761672 2737491 -62720 -3269631 -4878262 -6131631 -7737250 -8055043
34499 -8055043 -6269491 -4461050 -4777484 -6453358 -7253821 -6529027 -5419609 -4994372 -5346855
34490 -5346855 -5853527 -5533177 -3797380 -1336801 471875 1261893 1774531 2166631 1682644
34481 1682644 421850 -194707 492414 1323531 1236264 752921 569378 289551 -157075
34472 -157075 422488 2232694 2963626 940833 -1396119 -109261 4517093 7848091 6791327
34463 6791327 3027078 -293776 -2086871 -2111117 852121 6853478 12542864 14062704
34455 14062704 11460195 7679650 3915480 -879681 -5877102 -7444703 -3947625 1266928
34447 1266928 3873289 3640858 3269059 3832619 4183949 3981698 4345886 5555140 6663392
34438F663392R23857J524279J351283r82320l416199l018673n73322P46306K81060
34429C499663q9169m6454r43604k039117j000964J289150R72905k327601l763359
34420d448550l89344L936784M033508O21461j609299q62152O99554J348330J501002
34411D831294J536111J073964M18510K96862K35470q05013k396716l020983k179834
34402a0335o46201Q27550J653479J101113o49348k006190j871258r53129l443
34393b557762J504698L355858L429027Q68799j613426j305016N18939J000367
34385E201484K7500j048733k673395n022302n000713m41161M399737L553903j231224
34376b234904k458317J386128L385450l72745m154851j719809L687352M254382
$$ plain form
34438 6663392 7587249 9111528 10462811 9480491 6064292 3045619 2472297 3218603 3499663
34429 3499663 3410494 3364040 2420436 381319 -619645 669505 1642410 -685191 -4448550
34420 -4448550 -4837894 -901110 3132398 3753859 2144560 1282408 1981962 3330292 4831294
34411 4831294 6367405 7441369 7859879 8156741 8392211 7587198 5190482 2169499 -10335
34402 -10335 -656536 171014 1824493 2925606 2276258 270068 -1601190 -2554319 -2557762
34393 -2557762 -1053064 2302794 5731821 6600620 4987194 3682178 4201117 5201484
34385 5201484 5228984 4180251 1506856 -3515446 -8516159 -8957320 -4557583 -1003680 -2234904
34376 -2234904 -4693221 -3307093 78357 -294388 -4449239 -6169048 -2481696 1772686
34368A772686j019025n694642n067997r25902K585650L823410L609171K825753
34360A909104J308193j218902l375311k421063K000906N542387L792738j193703
34352F344349l135254m91855J820220Q43973j26296J542328K489171n21489m086506
34343D678641l366362q0058O52297j333734k159513j128988p92860j080720L41640
34334d269657K398480J504598j695062k495085K02678K209909J379645Q87652
34326A23158K915267M269815J620373k826712m468717k525075N7706J195384J432338
34317A793537J947662K680988K353569p405l193692m353884k687116j017994j391707
34308c876042j229348K274374N876117M022962j766116l863027J3420L102069
$$ plain form
34368 1772686 753661 -4940981 -10008978 -10934880 -8349230 -4525820 -916649 1909104
34360 1909104 3217297 1998395 -1376916 -3797979 -1797073 3745314 7538052 6344349
34352 6344349 3209095 2717240 4537460 5381433 5255137 6797465 9286636 8765147 4678641
34343 4678641 1312279 1232221 1884518 550784 -1608729 -2737717 -3530577 -4611297 -4269657
34334 -4269657 -1871177 -366579 -2061641 -4556726 -4354048 -2144139 -764494 123158
34326 123158 3038425 7308240 8928613 6101901 1633184 -891891 -834185 361199 1793537
34317 1793537 3741199 6422187 8775756 8768351 5574659 1220775 -1466341 -2484335 -3876042
34308 -3876042 -5105390 -2831016 3045101 7068063 5301947 1438920 1452340 4554409
34300D554409K26076m253637l700906O73646K678860Q39399p35679L15111J772444
34291B369723J241109p15068k285369k437864j010573J161768K313847J477440
34283B115013l14480j558257j828214r02882J604647M321132M265273R97253j804382
34274F895103j366548J04325n88758k096650j007328J880398K414700k36809k205026
34265C793407q30226J729571K055548p1532k180265k378234j007822J11464k86563
34256I35348j275268p82093J196083J982072R6291k093860j613022Q84837K497305
34247A827693K221633J124817k51948j782556k241188r56467M2373j268896l019579
34238d304118j812971J663399L253848J496503o32367n67599P88654J623435J656897
$$ plain form
34300 4554409 4780485 526848 -3174058 -2500412 178448 1017847 282168 597279 2369723
34291 2369723 3610832 2895764 610395 -1827469 -2838042 -1676274 637573 2115013
34283 2115013 1800533 242276 -1585938 -2488820 -884173 3436959 7702232 8699485 6895103
34274 6895103 5528555 5632880 5044122 2947472 1940144 3820542 6235242 5998433 3793407
34265 3793407 2963181 4692752 6748300 6676768 4496503 2118269 1110447 1221911 935348
34256 935348 -339920 -1122013 74070 2056142 2152433 58573 -1554449 -669612 1827693
34247 1827693 4049326 5174143 4922195 3139639 898451 -58016 -15643 -1284539 -4304118
34238 -4304118 -6117089 -4453690 -1199842 296661 -335706 -903305 -114651 1508784 3165681
34229C165681J087538k27403j701534k299369k146501j804523n33026J987869
34221b471268L183592O19127l119081l093982M34058K111016j56252k257368r05789
34212e655947J677200K609134K909448L977149L963152J461636r19026o06509
34204I416237N64264r1707j326556q82343k32734j780112l746873k744484L67200
34195d57108K007603J777436J981922K530143J471642j72915M77383K421444J686853
34186A3724403j565582k533026L02427K368294N17648j856989o98562K068635
34178A2327248K118974r8831n18275J753052L294678J850526o64282j243406O16655
34169A9436339L086744M071301K659391j56369j899615q22227K087531M130461
$$ plain form
34229 3165681 4253219 4025816 2324282 24913 -2121588 -3926111 -4459137 -2471268
34221 -2471268 712324 1331451 -1787630 -4881612 -4447554 -2336538 -2492790 -4750158 -5655947
34212 -5655947 -3978747 -1369613 1539835 5516984 9480136 10941772 10022746 9416237
34204 9416237 9980501 9888794 8562238 7679895 7447161 5667049 1920176 -824308 -457108
34195 -457108 1550495 3327931 5309853 7839996 9311638 9138723 9616106 12037550 13724403
34186 13724403 12158821 9625795 9928222 12296516 12814164 10957175 10258613 12327248
34178 12327248 14446222 14347391 13829116 15582168 18876846 20727372 20063090 18819684 19436339
34169 19436339 22523083 26594384 29253775 29097406 27197791 26375564 28463095 32593556
34161C2593556L926835K613702K086509K910823M095845M327732L353915K507643
34153E8416560L641355P098511J1079289J3554234J4396498J4971329J6192242
34146A39350018J8101066K1048843K5737097L1644217L6751568L9789090M1803570
34139C54225469M4164882M5346024M1064361K8073566P345733j6265385l6610010
34132D67344640m8892567n1748426m7860186m1666813l5690489k9859522k4488896
34125A87137741k1613625k1767078k1636341j7860520j2004314q493069q196801
34118G5565993p829026n895462m966721o547928p752766n771998k443856j202064
34110C3156172j970895k432787k281641k621452k811820j729375q71421k155291
$$ plain form
34161 32593556 36520391 39134093 41220602 44131425 48227270 52555002 55908917 58416560
34153 58416560 62057915 69156426 80235715 93789949 108186447 123157776 139350018
34146 139350018 157451084 178499927 204237024 235881241 272632809 312421899 354225469
34139 354225469 398390351 443736375 484800736 512874302 520220035 503954650 467344640
34132 467344640 418452073 366703647 318843461 277176648 241486159 211626637 187137741
34125 187137741 165524116 143757038 122120697 104260177 92255863 83762794 75565993
34118 75565993 67736967 61841505 56874784 50326856 42574090 36802092 34358236 33156172
34110 33156172 31185277 28752490 26470849 23849397 21037577 19308202 18436781 16281490
34102A6281490l607521j736532K195441L174455J83989k104908q62779O83493
34094A4207128p85898l031122k407219k32943m14953k742602l292370q57046J399940
34085A842915J128674r3553n3112O25138J45227j176118j369275Q5224J298201
34076B433321M20793j806097k679880p70873K121087L010394J418336k32612j10819
34067C803650O90385K37119j197267j710811o70714N65717O64519j98204q90196
34058A294198n17752Q20938J871449J266454o12449j622846p00830L24459o10241
34049A513380k219552j385462J807173L368115Q94707k663336k920230j96015
34041a801220J127754q74183k860579j242917K381376L451061J098379o82552
$$ plain form
34102 16281490 12673969 10937437 13132878 16307333 16491322 14386414 13523635 14207128
34094 14207128 13421230 10390108 7982889 7749946 7334993 4592391 1300021 442975 1842915
34085 1842915 2971589 2878036 2824924 3450062 3595289 2419171 1049896 1135120 2433321
34076 2433321 2854114 1048017 -1631863 -2402736 -281649 2728745 4147081 3914469 3803650
34067 3803650 4494035 4731154 3533887 1823076 1152362 1718079 2382598 2184394 1294198
34058 1294198 776446 1597384 3468833 4735287 4122838 2499992 1799162 2123621 1513380
34049 1513380 -706172 -2091634 -284461 3083654 3978361 1315025 -1605205 -1801220
34041 -1801220 -673466 -1547649 -4408228 -5651145 -3269769 181292 1279671 597119
34033E97119P77695K625064R19353k879232l602200r7946K840889J536206j347398
34024A369550j388913O64148N77684k098238k987488L15480M313430M325847M53071
34015E544571l343705m302322k800518m50112J499671K281028J911933J328372
34007A668918J129852O49920o68598j791180j480253m36585j97878m13460N25622
33998a013642K212262K201192j4968j569504k83213J968764K021296l7125j532523
33989C952539j442064j253439j799267j946292j073754n24542j277151j820912
33981g184882n7381L351094N036733K563368k574146n930964m363401N63366M014369
33972d581844L240503N40239k62888R14030R82714j010059k250778o61804J777092
$$ plain form
34033 597119 1374814 3999878 4919231 2039999 -1562201 -1660147 1180742 2716948 1369550
34024 1369550 -19363 644785 1222469 -875769 -3863257 -3547777 765653 5091500 5544571
34015 5544571 2200866 -2101456 -4901974 -5352086 -3852415 -1571387 340546 1668918
34007 1668918 2798770 3448690 2780092 988912 -491341 -927926 -1125804 -1539264 -1013642
33998 -1013642 1198620 3399812 3384844 1815340 1532127 3500891 5522187 5485062 3952539
33989 3952539 2510475 1257036 -542231 -2488523 -3562277 -4086819 -5363970 -7184882
33981 -7184882 -7242263 -3891169 1145564 3708932 1134786 -4796178 -9159579 -8596213 -4581844
33972 -4581844 -1341341 -801102 -1063990 -149960 832754 -177305 -2428083 -3089887 -1312795
33963a312795J964711p5479j833099j795809m91996Q85449J335183M60978p30737
33954a593594n34895R69803J695386Q10721N6599L41258k35472k573042l664832
33945d728068j033149K296165J636785k047510l430319p07923K659012L963469
33937a391538M008156L331273Q00260k645202l621055j560445k116o67978p00298
33928b448943J819538M096683L382382J324064K31904q95649k869487l026468
33920A614024o5401J707905j459390n470860l595231K945326O243140K935186
33912D854699k169602l976687k697496n41605J742062L272289K482221L3565j258217
33903A741229o25315p3391l46921j43215J38492j495775l879617l183847L28263
$$ plain form
33963 -1312795 651916 576437 -1256662 -3052471 -3544467 -2659018 -1323835 -862857 -1593594
33954 -1593594 -2128489 -1158686 536700 1347421 1404020 1745278 1509806 -1063236 -4728068
33945 -4728068 -5761217 -3465052 -1828267 -3875777 -7306096 -8014019 -5355007 -1391538
33937 -1391538 2616618 5947891 6748151 4102949 481894 -1078551 -1080667 -1748645 -2448943
33928 -2448943 -629405 3467278 6849660 8173724 8405628 7509979 4640492 1614024
33920 1614024 1548623 3256528 1797138 -3673722 -7268953 -4323627 1919513 4854699
33912 4854699 2685097 -1291590 -3989086 -4530691 -2788629 483660 2965881 2999446 1741229
33903 1741229 1115914 1042523 695602 552387 690879 -804896 -4684513 -7868360 -7540097
33894g540097J600578q50695j797441J927161N409507L484367n64349n42089K260110
33885C387052J559599l078475n435642k513817J561627K559810J313264K25752
33877d20830n39029j381555j582718r97201l54424Q59318L281617M233434K49653
33868C348265n938063o636282P6469O453433N695466J151617k05704J283108L99772
33859E628081k779477l150130j22158J033462j615409l399244j341240Q74596
33851d871519k28272j817884r6132K868736K866544O44321j71635L51147l33211
33842g87905j304464M25982L378876K805488j214254l096364n94775J682279R2342
33833A387205k290715j356388J378561K208646J555045J921475K368050L35976
$$ plain form
33894 -7540097 -5939519 -6790214 -8587655 -6660494 -1250987 2233380 1669031 1126942 3387052
33885 3387052 4946651 1868176 -3567466 -6081283 -4519656 -1959846 -646582 -420830
33877 -420830 -959859 -2341414 -3924132 -4921333 -5275757 -4416439 -1134822 3098612 3348265
33868 3348265 -2589798 -9226080 -9149611 -2696178 2999288 4150905 3945201 5228309 5628081
33859 5628081 2848604 -301526 -423684 609778 -1005631 -4404875 -5746115 -4871519
33851 -4871519 -5099791 -6917675 -7013807 -4145071 -1278527 -634206 -805841 -454694 -787905
33842 -787905 -2092369 -1666387 1712489 4517977 3303723 207359 -387416 1294863 1387205
33833 1387205 -903510 -2259898 -881337 1327309 2882354 4803829 7171879 7507855
33825G507855k705875k771215P4557J569708j73953k392885k569917j547651p25215
33816c734591J72498J114202P49006r73597j818651n52342J033149R60817m6702
33807c096211j17049R40975J820365J545190J05866j659134k317975j266781n592
33798d050346l03974j278962p22115P78015L87685j692284j470311K444494N508814
33789c98984L340026j821753m292388k457032N60525K221753K734397K580602
33781B467146J505007R1886m42178j79381n5403J23214R03321J080418q17163
33772D676867l306493l295853p38108J150771P33243j52509K3507M0371j128680
33763a996884j763974n6225K633830L480537J957588p0711j156209j414946j391894
$$ plain form
33825 7507855 4801980 2030765 2105322 3675030 3501077 1108192 -1461725 -3009376 -3734591
33816 -3734591 -3562093 -2447891 -1698885 -2672482 -4491133 -5043475 -4010326 -3049509 -3096211
33807 -3096211 -3213260 -2272285 -451920 1093270 1199136 -459998 -2777973 -4044754 -4050346
33798 -4050346 -4354320 -5633282 -6355397 -5577382 -5189697 -6881981 -8352292 -5907798 -398984
33789 -398984 2941042 1119289 -3173099 -5630131 -5069606 -2847853 -113456 2467146
33781 2467146 3972153 4064039 3621861 3442480 3387077 3510291 4413612 5494030 4676867
33772 4676867 1370374 -1925479 -2663587 -1512816 -779573 -932082 -908575 -868204 -1996884
33763 -1996884 -3760858 -3817083 -1183253 2297284 4254872 4184161 3027952 1613006 221112
33754B21112j192656n53826Q57168K621058K896730J31906l959077n257338k500897
33745f735820N25802L00494j063573Q64161N449816P221541L686134j303761l372155
33736E572639k892992k099144n85181K557154M691116K457092k269244l956771
33728C474669j262303J171872k4591k245037j849601l1136k29764k280345l078341
33719f354577j700830j36721M50135Q00286J142196P87365J38434L33930R75980
33710c563802R08872Q98069K391479L924237K530743j053359k746488j475160
33702A814591p24005k189718k621387K34676K946464J635044j478426j372574
33694a755335K072321M285747K841078j07813j852824j986450j148579J96414
$$ plain form
33754 221112 -971544 -1525370 -668202 1952856 4849586 4981492 1022415 -4234923 -6735820
33745 -6735820 -6210018 -5909524 -6973097 -6108936 -659120 6562421 10248555 8944794 5572639
33736 5572639 2679647 580503 -4678 2552476 7243592 9700684 7431440 3474669
33728 3474669 2212366 3384238 3359647 1114610 -734991 -766127 -995891 -3276236 -6354577
33719 -6354577 -8055407 -8192128 -7741993 -6941707 -5799511 -5012146 -4873712 -4539782 -3563802
33710 -3563802 -2654930 -1756861 634618 4558855 7089598 6036239 3289751 1814591
33702 1814591 1090586 -1099132 -3720519 -3485843 -539379 1095665 -382761 -1755335
33694 -1755335 316986 4602733 7443811 7335998 5483174 3496724 2348145 2544559
33686B544559J468510K352096L122981L274276J334946k139684l614434j312241
33678G031009J335520L34526k913038m219622l142227k234987j456755J196764
33670d068810M301899M087240R75586o90196O6022j83432k053950j638436J803737
33661B599660K995186r34622m971456l664987P79517K791296J778052R21532Q55985
33652C150163m269j117387r46055o18597j647225j879618J138167M458043L166544
33643E699766j403127l046811l42200J394257q84970l135161j247615K238427
33635g27434K460775k61887j642087k65008R10070m39558k648627k441686R67342
33626d088100M867206N718051K773330j006426k155628n75995Q17994J16011j479353
$$ plain form
33686 2544559 4013069 6365165 9488146 12762422 14097368 11957684 8343250 7031009
33678 7031009 8366529 8701055 5788017 1568395 -1573832 -3808819 -5265574 -4068810
33670 -4068810 233089 4320329 5295915 4605719 4671741 4488309 2434359 795923 2599660
33661 2599660 5594846 4660224 -311232 -3976219 -3196702 -405406 1372646 2294178 3150163
33652 3150163 3145894 2028507 1082452 463855 -1183370 -3062988 -1924821 2533222 5699766
33643 5699766 4296639 1249828 907628 2301885 1416915 -1718246 -2965861 -727434
33635 -727434 1733341 1471454 -170633 -435641 474429 34871 -2613756 -5055442 -4088100
33626 -4088100 779106 6497157 9270487 8264061 6108433 5532438 6350432 6466443 4987090
33617D987090j820072n09439J183126J813208O31500j782146l312243k131531
33609i40507P67978K388148J642859O71993J321701K324446J640014j22171r13272
33600H781189p94683j610406l324806l403090o69155K384762K640871L54950j560307
33591B799325j491430n41332j07674Q5344Q34119J781361K071340J771242J377346
33582H579641N71432j097973k740459k964650k019488j345433j053473O918J401976
33573f61509R96177j267547k303865n62686R77705n32190k541615o74712L714289
33564b855953M637503N30858k946732j333087J970405J217065k750156m022306
33556e552403p88260K207087J100723j687228j811620M52841J314268m89428k177129
$$ plain form
33617 4987090 3167018 2657579 3840705 5653913 6285413 4503267 1191024 -940507
33609 -940507 -172529 2215619 3858478 4530471 5852172 8176618 9816632 9694461 8781189
33600 8781189 7986506 6376100 3051294 -351796 -1020951 1363811 4004682 4359632 2799325
33591 2799325 1307895 766563 658889 744233 1578352 3359713 5431053 7202295 8579641
33582 8579641 9151073 8053100 5312641 2347991 328503 -1016930 -2070403 -2063485 -661509
33573 -661509 334668 -932879 -3236744 -3799430 -2821725 -3353915 -5895530 -6570242 -2855953
33564 -2855953 1781550 2312408 -634324 -1967411 2994 1220059 -1530097 -5552403
33556 -5552403 -6340663 -4133576 -3032853 -4720081 -6531701 -6078860 -4764592 -5254020 -7431149
33547g431149j301693J239631L169628L446133J965149j156183m479881n257232
33539i805597k546696R17144J994964J152740R12190J455877Q97858n84378n97523
33530f203421J017477J361593n66312j766842k23368J461359L60725j811026j661544
33521h031359K49431Q42990K3431L40203J889357K039533L34860o17195J62254
33512b766495N19951m82400o95748Q34582J475208m79899k081946P0814M036860
33503D30927M767582J371453j497782j23112L191064L196759j398492o029523
33495C908876n671807r59449K598904J512142j595526k137917M7892J185173m47509
33486a559221k360363k069519l34992R75480J584040J840081J342250K20483j77950
$$ plain form
33547 -7431149 -8732842 -7493211 -4323583 -877450 1087699 -68484 -4548365 -9805597
33539 -9805597 -12352293 -11435149 -9440185 -8287445 -7375255 -5919378 -5021520 -5605898 -6203421
33530 -6203421 -5185944 -3824351 -4390663 -6157505 -6380873 -4919514 -4558789 -6369815 -8031359
33521 -8031359 -7781928 -6938938 -6915507 -6575304 -4685947 -2646414 -2311554 -2928749 -2766495
33512 -2766495 -2246544 -2728944 -3424692 -2590110 -1114902 -1594801 -3676747 -3605933 430927
33503 430927 5198509 6569962 5072180 4949068 8140132 11336891 9938399 3908876
33495 3908876 -1762931 -2722380 -123476 1388666 -206860 -2344777 -2296885 -1111712 -1559221
33486 -1559221 -3919584 -5989103 -6324095 -5348615 -3764575 -1924494 -582244 -361761 -539711
33477e39711L91807k0500k378520m190020k620210J206873L550424K952362J339039
33468c08456N45837J89940n87357j242232p12518Q01475J872703J520364L97152
33459B476908n3297K87699k52462k511195m234708k497317J729120L995397K177616
33450A117761p06333j038677M39365N96642r01189j341796O26920K964957L005999
33441D763649O40823j735288j749147M76510K218912J263228r42216r78742J341314
33432E299043K112594q43734m126333l450380P0429J922761J051069N70226J920170
33423D525845K612771R06060r61704l63810J418540J062787j897768m421622l958860
33414a077761j286240J041888J813602J789704J763289J377686L86058k03300
$$ plain form
33477 -539711 -147904 -168404 -2546924 -6736944 -9357154 -8150281 -4599857 -1647495 -308456
33468 -308456 237381 427321 -160036 -1402268 -2114786 -1313311 559392 2079756 2476908
33459 2476908 2423611 2711310 2458848 -52347 -4287055 -6784372 -5055252 -1059855 1117761
33450 1117761 411428 -627249 -187884 408758 -492431 -1834227 -1207307 1757650 4763649
33441 4763649 5404472 3669184 1920037 2396547 4615459 5878687 4936471 3957729 5299043
33432 5299043 7411637 6567903 2441570 -1008810 -938381 984380 2035449 2605675 4525845
33423 4525845 7138616 8044676 7082972 6719162 8137702 9200489 7302721 2881099 -1077761
33414 -1077761 -2364001 -1322113 491489 2281193 4044482 5422168 5808226 5604926
33406E604926L78327R53523J76250o18497R48898L883558M363118J500745r94657
33397A6196191m55371J177814J725615K801828O093620R188697R319892Q118429
33389E4166715P806866N672738j604540j0195520j2621880q360838m056093l089656
33381B7717792k304172k41320o62597m627467o337716j845922L761073L493302
33373A8952973j453534m453382l176340q41663J92886N12588K01168j739242m424983
33364C770471n252410l307031j94369K071422K119679l94636l308658k868242
33356g363774J245686M167993K337587r21368n02524K324888K315870p64174j899461
33347I40723M37201J728126q21422l683013k892069Q1708J530804R15980k10970
$$ plain form
33406 5604926 5983253 6936776 7113026 6494529 7443427 11326985 15690103 17190848 16196191
33397 16196191 15740820 16918634 18644249 21446077 27539697 36728394 46048286 54166715
33389 54166715 61973581 67646319 66041779 55846259 43224379 34863541 30807448 27717792
33381 27717792 25413620 25172300 24509703 19882236 13544520 11698598 15459671 18952973
33373 18952973 17499439 13046057 9869717 9028054 9220940 9733528 9934696 8195454 3770471
33364 3770471 -1481939 -4788970 -4983339 -2911917 -792238 -1186874 -4495532 -7363774
33356 -7363774 -6118088 -1950095 387492 -533876 -1036400 1288488 3604358 2840184 940723
33347 940723 1377924 3106050 2284628 -1398385 -4290454 -4208746 -2677942 -1761962 -1972932
33338a972932j642639l341806l194330K55517M201323M389306J034940j400755
33330a671376m82765J256763O52943j434491j856630j55835P89823p51457k589346
33321f242371j776076J055668K796091K464166J824745J485511o8199k487166
33313i47631k483480Q86809L540125K389880N99354K200122M498096K024779l594936
33304I113118m919114j43907L835804J765675l034235n045000m008700k235904
33296d672263K62342L323368L746885O6208l227411j549409K460697K936935j74615
33287C172737j920400p12041K39265m76951l85474J564737K789784J597694k87562
33278E581789j111892j362228j521390j015165l82769j054679k107855r05596
$$ plain form
33338 -1972932 -3615571 -6957377 -10151707 -9896190 -5694867 -1305561 -270621 -1671376
33330 -1671376 -2154141 -897378 -244435 -1678926 -3535556 -3691391 -2901568 -3653025 -6242371
33321 -6242371 -8018447 -6962779 -4166688 -1702522 122223 1607734 1539535 -947631
33313 -947631 -3431111 -2544302 995823 3385703 3985057 6185179 10683275 12708054 9113118
33304 9113118 4194004 4050097 7885901 9651576 6617341 1572341 -2436359 -4672263
33296 -4672263 -4409921 -1086553 2660332 2726540 -500871 -2050280 410417 3347352 3172737
33287 3172737 1252337 540296 779561 302610 -82864 1481873 4271657 5869351 5581789
33278 5581789 4469897 3107669 1586279 571114 188345 -866334 -2974189 -3879785
33270c879785K091193L138235J092452p63397m97981n60648k473101l161966l85514
33261e400512K275654P12004k477641j606337K916938M820328J291065l219765
33253f88266l673109o33943K049581K507543J628170P13305L38877L69878j39193
33244B472843k054008m407896m757934k158152J281185K712571J664845N8172
33236e188374l09776M95336J173745J008332O24923P13552N82727p50557k141575
33227c791667j085534K209861L904031J670806j422898j201784J096595N90936
33219A970346l415371n806351k933888K305084M689036L066139K24265j436905
33211a337645j621576q58255K88573J266696K000071K600385K213041j69152l108550
$$ plain form
33270 -3879785 -1788592 1349643 2442095 1678698 1180717 620069 -1853032 -5014998 -5400512
33261 -5400512 -3124858 -2412854 -4890495 -6496832 -3579894 1240434 2531499 -688266
33253 -688266 -4361375 -4995318 -2945737 -438194 1189976 1903281 2242158 2612036 2472843
33244 2472843 418835 -3989061 -8746995 -10905147 -9623962 -6911391 -5246546 -5188374
33236 -5188374 -5498150 -5002814 -3829069 -2820737 -2195814 -1482262 -899535 -1650092 -3791667
33227 -3791667 -4877201 -2667340 1236691 2907497 1484599 282815 1379410 1970346
33219 1970346 -1445025 -7251376 -10185264 -7880180 -3191144 -125005 99260 -1337645
33211 -1337645 -2959221 -3817476 -3528903 -2262207 -262136 2338249 4551290 4382138 1273588
33202A273588l295250j32839K562496J419437j961408l588198k375611l42408
33194f440193R80117J625327J729378J504019J763485K308892J158125k173384
33186B455766m402093k707273M33769O19128j554115j664658J033939K657087
33178c128450J652330J010123J920700J028710k945146n199569j914124K924949
33170d650477L082873m72019j460972J883015M733886L419243M0590j777446j606006
33161C192687j068056j057229j631725k413508k106206K40725K886429K787969
33153H31086Q0253j518011L4667K055304J080652k290939m501244l470072j37162
33144g835466L216164M549796K982132l40443k916523l358754k380662r64252
$$ plain form
33202 1273588 -2021662 -2154501 407995 1827432 -133976 -3722174 -6097785 -6440193
33194 -6440193 -5460076 -3834749 -2105371 -601352 1162133 3471025 4629150 2455766
33186 2455766 -1946327 -4653600 -4219831 -3600703 -5154818 -6819476 -5785537 -3128450
33178 -3128450 -1476120 -465997 1454703 2483413 -461733 -5661302 -7575426 -4650477
33170 -4650477 -1567604 -2039623 -3500595 -1617580 3116306 6535549 6576139 4798693 3192687
33161 3192687 2124631 1067402 -564323 -2977831 -5084037 -4843312 -1956883 831086
33153 831086 911339 -606672 -572005 1483299 2563951 273012 -4228232 -7698304 -7835466
33144 -7835466 -4619302 -69506 2912626 2572183 -344340 -3703094 -6083756 -7048008
33136g048008P34780J972062J298295o18037n45221K591303M877174K518350k027610
33127C753088l056096J00741K270296K67275k902656l181009q90849J296932K539579
33118A97301L001905J500710k408031n574568m313249J56609K786952J364352
33110c288019j084112j178394N71350J765525J778014J446936R11769k0403l68454
33101E34212R65405K892559K765250l17827m004501m999860k383301J581932L701570
33092G35439K936978J274364J182300K400033K318372k13144k968280l280225
33084D385837j604653n31550j024963j496053m31251J692757L204377K697186
33076F891687j20813l685286n049051k844842M38311J148047o76796j621191k85219
$$ plain form
33136 -7048008 -6313228 -4341166 -3042871 -3660908 -4206129 -1614826 3262348 5780698 3753088
33127 3753088 696992 797733 3068029 3335304 432648 -2748361 -3639210 -2342278 197301
33118 197301 3199206 4699916 2291885 -3282683 -7595932 -7439323 -4652371 -3288019
33110 -3288019 -4372131 -5550525 -4979175 -3213650 -1435636 11300 923069 902666 534212
33101 534212 1499617 4392176 7157426 6839599 2835098 -2164762 -4548063 -2966131 735439
33092 735439 3672417 4946781 6129081 8529114 10847486 10634342 7666062 4385837
33084 4385837 2781184 2249634 1224671 -271382 -702633 990124 4194501 6891687
33076 6891687 6770874 3085588 -1963463 -4808305 -4369994 -3221947 -3898743 -5519934 -5805153
33067e805153P57686l76952j457906J93216L077470L648737J542466m35322o20083
33058E24159K01176J157553J956911J571064o00484k380475j008590K060782K274188
33049E756284j172920l536962j518175J656951J161537k310890m014760j963954
33041e942889J359079L123853K664830N05631j995810k464022k2043K403280J491554
33032A123463j185835j148883J683705K344991j181965m170964k320735J458233
33024c397990J730310r09429j164024K265676M614331K323563k029963l826230
33016c93756k243371Q4746J090147Q23700J98788o8236K13477M45631j97560j454673
33006a501107j989586j116176L45771J266832J381861J077302R26178J396318
$$ plain form
33067 -5805153 -5047467 -5424419 -6882325 -6689109 -3611639 37098 1579564 1144242 524159
33058 524159 725335 1882888 3839799 5410863 4810379 2429904 1421314 3482096 5756284
33049 5756284 4583364 1046402 -471773 1185178 2346715 35825 -3978935 -5942889
33041 -5942889 -4583810 -1459957 1204873 1710504 -285306 -2749328 -2771371 -368091 1123463
33032 1123463 -62372 -1211255 472450 2817441 1635476 -2535488 -4856223 -3397990
33024 -3397990 -1667680 -2577109 -3741133 -1475457 3138874 5462437 3432474 -393756
33016 -393756 -2637127 -2552381 -1462234 -638534 -439746 -507982 -294505 151126 -46434 -1501107
33006 -1501107 -3490693 -4606869 -4261098 -2994266 -1612405 -535103 391075 1787393
32998A787393J964608R66342k032354m304313k913537O10871J786110j83260j135590
32989c453730J168037L071450Q96504k891483l489310r89104Q38341J028787J566222
32980b254286K155161L91781k815176l435065q38846J022266L98056M74241L028182
32971a873686M507040J957427j537700j676355K98115M44565r16015l76210J918341
32962B745522K224142l89685k514458k016987r16859j312237k040166j288892
32954e509620J58295L66596p54884j626855j166965L21216J652664J599583P4170
32945d885800j317033r32457O69532J444437Q36775M76396J542452K926230K738162
32936C498694O73951j694151k471948j273767M1480r18144l810550n075407k237150
$$ plain form
32998 1787393 3752001 4718343 2685989 -1618324 -4531861 -3920990 -2134880 -2318140 -3453730
32989 -3453730 -2285693 785757 1682261 -1209222 -4698532 -5687636 -4849295 -3820508 -2254286
32980 -2254286 -99125 292656 -2522520 -5957585 -6796431 -5774165 -5376109 -4901868 -1873686
32971 -1873686 2633354 4590781 3053081 1376726 1674841 2119406 1203391 827181 2745522
32962 2745522 4969664 4579979 2065521 48534 -868325 -2180562 -4220728 -5509620
32954 -5509620 -5351325 -4984729 -5739613 -7366468 -8533433 -8212217 -6559553 -4959970 -4885800
32945 -4885800 -6202833 -7135290 -6465758 -5021321 -4184546 -3708150 -2165698 760532 3498694
32936 3498694 4172645 2478494 6546 -1267221 -1225741 -2143885 -5954435 -11029842 -13266992
32927a3266992K345073M133472K085862p37310j730543j122223Q9402J504875
32919f698384K154240R93192n57012M19145L554201M470167P94354l850228m472574
32910c192899j255748J435442J224551j82785o48498m61996q92508j783620j749754
32901g507815k05161J543511J557221k91468j760296r75696R01689J285771K9843
32892e422401m61432R13508K440155K593498K042466J512429J60162k209881l542586
32883a974082k311285k35261l101j472067k210589j002077R96784K074647J670356
32874d466675P46379J016040K850701L977752K173814q23512j117199J202303
32866E559603J698276j214504l359257j823323l2582j518942l145810m66886L575336
$$ plain form
32927 -13266992 -10921919 -6788447 -4702585 -5439895 -7170438 -8292661 -8203259 -6698384
32919 -6698384 -4544144 -3550952 -4107964 -3688819 -134618 4335549 5129903 1279675 -3192899
32910 -3192899 -4448647 -3013205 -1788654 -1971439 -2619937 -3081933 -3974441 -5758061 -7507815
32901 -7507815 -7712976 -6169465 -4612244 -4903712 -6664008 -7639704 -6738015 -5452244 -5422401
32892 -5422401 -5883833 -4970325 -2530170 63328 2105794 3618223 3778385 1568504 -1974082
32883 -1974082 -4285367 -4520628 -4523729 -5995796 -8206385 -9208462 -8211678 -6137031 -4466675
32874 -4466675 -3720296 -2704256 146445 4124197 6298011 5474499 4357300 5559603
32866 5559603 7257879 6043375 2684118 860795 828213 -690729 -3836539 -4303425 -728089
32857g28089K424793l339712o433095l820064m4077J290452K313182M940068O491312
32848C094770M605349J503055j08472j173594l030742l970780k576125r86939
32840b643478j182534j143688J467597M566296M595224K002544j86504j395514
32832F079943l060277m625235m119693j981745n36240q4204J035764K788388L206047
32823a297252J820294K84428n23891j199444j606355r31362j48921j347499l886457
32814h836459m181022o35049L611339M482420J851015q51110p36667K007142M745392
32805A457001M569696O90954m362184o504374l949867Q72060L775567L056660
32797c94487Q76441L81117J862077K540911N16422k196683k166394M78584J999118
$$ plain form
32857 -728089 1696704 -1643008 -8076103 -11896167 -11940244 -10649792 -8336610 -3396542 3094770
32848 3094770 7700119 9203174 9094702 7921108 4890366 919586 -1656539 -2643478
32840 -2643478 -3826012 -4969700 -3502103 1064193 5659417 7661961 7475457 6079943
32832 6079943 3019666 -1605569 -5725262 -7707007 -8243247 -8327451 -7291687 -4503299 -1297252
32823 -1297252 523042 807470 283579 -915865 -2522220 -3453582 -3602503 -4950002 -8836459
32814 -8836459 -13017481 -13652530 -10041191 -5558771 -3707756 -4558866 -5295533 -3288391 1457001
32805 1457001 6026697 6717651 2355467 -4148907 -8098774 -7226714 -3451147 -394487
32797 -394487 481954 863071 2725148 5266059 5782481 3585798 1419404 1897988 3897106
32788C897106L71550k038849k405223j307951n43590L59128K332431L433165J176322
32779E274089k680899l689252j118595R37597l55708k816947l006288r00572J090065
32770g266510J788269J989112K625245L624699M059195K867885J35846k318616
32762G505125k724091j575658p37546p03839n06779P7935M41779R18897K047509
32753D743332K300410k52868l828468m159279p58975J867791Q47638j118918p43732
32744a103069P48012P35631J07712J076617K526839J753288p85230k453680k828913
32735b22793l102451k410294O91112L833727K951850r51564k150304J464205N037515
32726E141003L812631n27452l276393l125748k025024j097399n2517P37104N37686
$$ plain form
32788 3897106 4268656 2229807 -175416 -1483367 -2026957 -1667829 664602 4097767 5274089
32779 5274089 2593190 -1096062 -2214657 -1277060 -1632768 -4449715 -7456003 -8356575 -7266510
32770 -7266510 -5478241 -3489129 -863884 2760815 6820010 9687895 9823741 7505125
32762 7505125 4781034 3205376 2467830 1763991 1257212 1335147 1776926 2695823 4743332
32753 4743332 7043742 6790874 2962406 -1196873 -1955848 -88057 759581 -359337 -1103069
32744 -1103069 -355057 380574 488286 1564903 4091742 5845030 5059800 2606120 -222793
32735 -222793 -3325244 -5735538 -5044426 -1210699 1741151 789587 -1360717 103488 5141003
32726 5141003 8953634 8426182 5149789 2024041 -983 -1098382 -1150899 -413795 123891
32717A23891r8765k44747m10171j431728k337822j441708Q66969K366373J894174
32708g13534L97951p99606j348956j427905j094211l15782Q59294K017443K153849
32699b71457O21337j347018j410501P66410K612788K016379Q1581r98823j255070
32690H15626j966799k587202j324775J541404L395424K562881M5260k063513k321883
32681a903577m27870K258120L114573J183119q60283l3658K287156K141224q28874
32672F929930k784165j908250j021327k213993k990342p81465K115610K020452
32664f33550j02319m00724J468774K111778J36283k080843k684034k504055k093021
32655f781711l23126K501346L455195J143723j565123j508409Q7503k08144k434866
$$ plain form
32717 123891 25126 -219621 -629792 -2061520 -4399342 -5841050 -4974081 -2607708 -713534
32708 -713534 -315583 -1115189 -2464145 -3892050 -4986261 -5302043 -4442749 -2425306 -271457
32699 -271457 349880 -997138 -2407639 -1641229 971559 2987938 3069519 2070696 815626
32690 815626 -1151173 -3738375 -5063150 -3521746 -126322 2436559 2481819 418306 -1903577
32681 -1903577 -2331447 -73327 3041246 4224365 3364082 3330424 5617580 7758804 6929930
32672 6929930 4145765 2237515 1216188 -997805 -3988147 -4769612 -2654002 -633550
32664 -633550 -735869 -1136593 332181 2443959 2580242 499399 -2184635 -4688690 -6781711
32655 -6781711 -7104837 -4603491 -1148296 -4573 -1569696 -3078105 -2990602 -3198746 -5633612
32646e633612l065586l63028K974753L504692J378515m53162k64719Q24336J035468
32637f2343K86670k60109j33318K5449k44107o15064q71322j273912j466184k50653
32627d864893K408599M222646L095622K44651j092792J9438J160650K02695j917758
32618C478858k994881k518796j570942q64543k57364L55161P82381R07076O40900
32609b042150o8514o83116k47798J120199J625727j95700l118208l998777j218369
32600h826706L268354N761308M556010J526657k10327R6030L26703j250996l399884
32591A847149l626893j623688N37844J307426J153350J142649J517042J898626
32583D153505J697827L28156j750959k589590j041041R76451Q00921p22336l13147
$$ plain form
32646 -5633612 -8699198 -9062226 -6087473 -2582781 -1204266 -1657428 -1922147 -1097811 -62343
32637 -62343 224327 -35782 -169100 -143651 -387758 -1002822 -1874144 -3148056 -4614240 -4864893
32627 -4864893 -2456294 1766352 4861974 5106625 4013833 4033271 5193921 5396616 3478858
32618 3478858 483977 -2034819 -3605761 -4470304 -4727668 -4372507 -3590126 -2683050 -2042150
32609 -2042150 -2110664 -2793780 -3041578 -1921379 -295652 -491352 -3609560 -7608337 -8826706
32600 -8826706 -5558352 202956 4758966 6285623 6075296 6171326 6498029 5247033 1847149
32591 1847149 -1779744 -3403432 -2865588 -1558162 -404812 737837 2254879 4153505
32583 4153505 5851332 6179488 4428529 1838939 797898 1774349 2575270 1852934 1539787
32574A539787K205138L046026L62126k640341k656738j029576o64174j120217
32566i57969l57389Q25333Q8902k010773k747232j627076m61314L43400J818901
32557e085217L058873J766816j447920l048466j622678M66598J339651J960498
32549b611845K944565K601729K56585j542554o77255J078133Q89595p87926j489399
32540F61628r11970q38048j624259j658442l79162N97453P690j140181j054775
32531f340066M46976J844782J788898N63976k48900N41231K346336L191962J661341
32522E796536j503457l770554l023830J96513K801164K271659l13177j533580
32514I21274j37755J438816R13209n76723q12511j46691k67012q57995n81945
$$ plain form
32574 1539787 3744925 6790951 7153077 4512736 1855998 826422 162248 -957969
32566 -957969 -1315358 -490025 -401123 -2411896 -5159128 -6786204 -7247518 -6904118 -5085217
32557 -5085217 -2026344 -259528 -1707448 -4755914 -6378592 -5911994 -4572343 -2611845
32549 -2611845 332720 2934449 3191034 1648480 971225 2049358 2938953 2151027 661628
32540 661628 -250342 -1088390 -2712649 -4371091 -4750253 -4152800 -4145110 -5285291 -6340066
32531 -6340066 -5893090 -4048308 -2259410 -1695434 -1944334 -1403103 943233 4135195 5796536
32522 5796536 4293079 522525 -2501305 -2304792 496372 2768031 2454854 921274
32514 921274 783519 2222335 3135544 2558821 1746310 1599619 1332607 474612 -107333
32505a07333l06592j836640l946482l447716k94290K137681K276709J964154K104038
32496a456471R89030j465699k064770O27768L247142K469856k26880j550591j203657
32487f34272n92814M82282K312813K805230L19747k777223l074464j137797K3465
32478b273033L8261P81645J967034J356923q79806j966270r74064l5011n38215
32469b522536j124809k97754J281584J845779L95161k449393m289372k655499
32461i816839J586618M191188K945264R09215J418588K544139P09838k575269
32453A912742k988432q18340j7734o11427J112169M476983L885467j619289n384996
32444e2857l044568J066509J511310j61385O3693J291627O81760m10449N73622
$$ plain form
32505 -107333 -413925 -2250565 -6197047 -9644763 -9939053 -7801372 -5524663 -3560509 -1456471
32496 -1456471 -467441 -1933140 -3997910 -3370142 -123000 2346856 2119976 569385 -634272
32487 -634272 -1227086 -744804 1568009 4373239 4692986 1915763 -1158701 -2296498 -2273033
32478 -2273033 -2234772 -1453127 513907 1870830 991024 -975246 -1949310 -1984321 -2522536
32469 -2522536 -3647345 -3945099 -2663515 -817736 -422575 -2871968 -7161340 -9816839
32461 -9816839 -8230221 -4039033 -1093769 -184554 1234034 3778173 4488011 1912742
32453 1912742 -1075690 -1894030 -1911764 -2523191 -1411022 3065961 6951428 5332139 -52857
32444 -52857 -3097425 -2030916 -519606 -680991 -617298 674329 1356089 945640 1519262
32435A519262J584307n36189l438644k718533J29866J64385k034700j359610K237411
32426d452445L126749P0367j113331K268965M510088R39148l824813l074761J278849
32417b71184K123769j474285l469338q06482K371518J705210j437020l238320
32409d496132k858932j955111j279598l83150O03260R94671Q05041O54011Q32584
32400g083356J201218J444323J017419k52619j180528j88602K084921K783333
32392a73891P19676j297326l6900L255630M023695L98554m295648n667880l042043
32383f116133P75345K975217K845516J453424L76456K12354j79600k080790m218924
32374c957135l332260J339269N679335M933047k98090m427866l323295J418463
$$ plain form
32435 1519262 3103569 2567380 -871264 -3589797 -3459931 -3295546 -5330246 -6689856 -4452445
32426 -4452445 -1325696 -1255329 -2368660 -99695 4410393 5349541 1524728 -1550033 -271184
32417 -271184 1852585 378300 -3091038 -3897520 -1526002 179208 -1257812 -4496132
32409 -4496132 -7355064 -9310175 -10589773 -10972923 -10369663 -9374992 -8569951 -7915940 -7083356
32400 -7083356 -5882138 -4437815 -3420396 -3673015 -4853543 -5042145 -2957224 -173891
32392 -173891 545785 -751541 -788441 2467189 6490884 6889438 2593790 -3074090 -6116133
32383 -6116133 -5340788 -2365571 479945 1933369 2309825 2522179 2342579 261789 -3957135
32374 -3957135 -7289395 -5950126 -270791 4662256 4364166 -63700 -3386995 -1968532
32366a968532M988324M539468J096935k402637l774633k783420p84032N22164
32358e66363L51994p01917j283332n70870P02006Q31498o87287k100741j621928
32349e646940j56241O4041o98595P9098K623851L771996J984555J22509O49242
32340B793516J291879q59885l698388l190177k09609R38360k63632m30241R52843
32331b675334P26960j288377j165390J812109K967109K11228j881052J27841K459866
32322A294960Q78348j740614q36609J233356n18610l858774k244115L471725N082111
32313B761778j4012m244315j594923L238922K628084k261921l941698k00732L292178
32304c36639K028557j199558j319767J527167K845537O65471j985577k040978
$$ plain form
32366 -1968532 3019792 7559260 8656195 6253558 2478925 -304495 -1088527 -566363
32358 -566363 -214369 -916286 -2199618 -2770488 -2068482 -1236984 -1924271 -4025012 -5646940
32349 -5646940 -5803181 -5739140 -6437735 -6358637 -3734786 37210 2021765 2144274 2793516
32340 2793516 4085395 3225510 -472878 -3663055 -3872664 -2934304 -3197936 -3628177 -2675334
32331 -2675334 -1948374 -3236751 -4402141 -2590032 377077 588305 -1292747 -1164906 1294960
32322 1294960 2173308 432694 -403915 829441 310831 -3547943 -5792058 -2320333 2761778
32313 2761778 2747766 -1496549 -3091472 147450 2775534 513613 -3428085 -3628817 -336639
32304 -336639 1691918 492360 -827407 699760 3545297 4210768 2225191 184213
32296A84213p54498r02859j796685o19747K072581K498962n6315j601407K9257
32287i46498J564877L20600p19108J575044L906405J578212k806111k768548J401281
32278C106154L050493R8384k286642j144645Q3657o34580J37324L401307L324925
32269I136377l184442q790694n190454M016744P991613L728983j612321k563809
32261C531997j499044j861498k376439q82492J160904J222944m80899k147183
32253c331710k858174k223856k7201K324123K437216M01183q02881L23326J629745
32244b128229J146290L23089J098558K090890P69976j985522k773697p72695J026611
32235a204729K62711j539036j487594M33080J506888L98896o71386R91343M151810
$$ plain form
32296 184213 -570285 -1473144 -3269829 -3889576 -1816995 681967 625652 -975755 -946498
32287 -946498 618379 938979 219871 1794915 5701320 7279532 4473421 1704873 3106154
32278 3106154 6156647 6255031 3968389 2823744 2907401 2272821 2410145 5811452 9136377
32269 9136377 5951935 -2838759 -8029213 -4012469 3979144 7708127 6095806 3531997
32261 3531997 2032953 171455 -2204984 -3087476 -1926572 -703628 -1184527 -3331710
32253 -3331710 -6189884 -8413740 -8440941 -6116818 -3679602 -3278419 -4081300 -3757974 -2128229
32244 -2128229 -981939 -658850 439708 2530598 3300574 1315052 -1458645 -2231340 -1204729
32235 -1204729 -942018 -2481054 -3968648 -3535568 -2028680 -1629784 -2301170 -1309827 2841983
32226B841983M371305o2947m786009m201236J016666M195058J192726m144820
32218D22726n178274j140841K538128K026696k78882j29116K347787L365242J197127
32209E170593j677136k328676r02554N93605J185053J136108N48197m85956j052234
32200B187000m93051J08435p25601k324007k566864j002715Q33605K187817L531864
32191A736483L819423O59400m994913p549236l356702L497393N759659K311318
32183A882825j100842l98103J790798J121148j985971l649259k289352k3878J050513
32174c602121J227687J433736J236914j10648j736660j803674q8876J305538M84437
32165a653667j688688k543546r27577J427487K091926O68742j069179j217193
$$ plain form
32226 2841983 7213288 7150341 2364332 -1836904 -820238 3374820 4567546 422726
32218 422726 -4755548 -5896389 -3358261 -1331565 -1610447 -1739563 608224 3973466 5170593
32209 5170593 3493457 1164781 262227 855832 2040885 3176993 3725190 3239234 2187000
32200 2187000 1693949 1802384 1076783 -1247224 -3814088 -4816803 -3983198 -1795381 1736483
32191 1736483 5555906 6215306 1220393 -6328843 -9685545 -6188152 -428493 1882825
32183 1882825 781983 383880 2174678 3295826 1309855 -2339404 -4628756 -4652634 -3602121
32174 -3602121 -2374434 -940698 296216 185568 -1551092 -3354766 -3443642 -2138104 -1653667
32165 -1653667 -3342355 -5885901 -6813478 -5385991 -3294065 -2625323 -3694502 -4911695
32157d911695L85463J946945J509700m96565j132323J272776L953864K822188
32149E350353j270292k767272O98293M167969K106039l436545n520778j801657
32141b473890L141386M787348L530866J559001q95398l760073m744103k101704
32133i56567J691740K183955j344586m870150m698332j559472J276778K348879
32125e927755K660975K681640J209102j810707l601455k037773O27351O62279
32117e536343j266479j108199J563345K476443J33145j111986J284896K867778
32109f97400j12680k879993N93794O172928M644572l149205o397538p93017N114821
32100B496282L705534q29921j220478J078322L38044k828614l460614j335798
$$ plain form
32157 -4911695 -4526232 -2579287 -1069587 -1566152 -2698475 -1425699 2528165 5350353
32149 5350353 4080061 1312789 2011082 6179051 8285090 4848545 -672233 -2473890
32141 -2473890 667496 5454844 8985710 10544711 9649313 5889240 1145137 -956567
32133 -956567 735173 2919128 1574542 -3295608 -7993940 -9553412 -8276634 -5927755
32125 -5927755 -3266780 -585140 623962 -1186745 -4788200 -6825973 -6198622 -5536343
32117 -5536343 -6802822 -7911021 -6347676 -3871233 -3738088 -4850074 -3565178 -697400
32109 -697400 -810080 -3690073 -3096279 3076649 7721221 4572016 -1825522 -2618539 2496282
32100 2496282 6201816 5371895 4151417 5229739 5567783 2739169 -721445 -2057243
32092b057243l23670q80669l82227O20055n32504k286337o46040L028169L076067
32083c84399r71067k925182L13799M054292L552055O76180o45998p47777j828656
32074A093247k949174j853883N44308J521042R23031P27112J188664N89170j473085
32065C10432l105059k645445n27613J529256K166336J283215l8967o22541l56377
32056b006763J05635M86834P88922M99143o52980j490146p12908P83372Q89389
32047a309502n77614j845118k036332j568689q3364K835897M964667L325156o61638
32038C043463k119054N7183J542341M524j040321R56154K212019q69063m270744
32029d83498k079924L211598L659036j751504n360481k563898J936072K481220
$$ plain form
32092 -2057243 -2380913 -3261582 -3643809 -3023754 -3556258 -5842595 -6488635 -3460466 -384399
32083 -384399 -1355466 -4280648 -3966849 87443 3639498 4315678 3669680 2921903 1093247
32074 1093247 -1855927 -3709810 -3165502 -1644460 -721429 5683 1194347 1783517 310432
32065 310432 -2794627 -5440072 -5967685 -4438429 -2272093 -988878 -1027845 -1650386 -2006763
32056 -2006763 -1901128 -1414294 -625372 -126229 -779209 -2269355 -2982263 -2198891 -1309502
32047 -1309502 -1887116 -3732234 -5768566 -7337255 -7420619 -4584722 379945 3705101 3043463
32038 3043463 924409 981592 2523933 2528457 1488136 2444290 4656309 3787246 -483498
32029 -483498 -2563422 648176 4307212 2555708 -2804773 -5368671 -3432599 -951379
32021i51379P95009J443604L533093K570976j561403l930090j741173J995834
32013B154471K977596Q86010j245343j225677J62750O45785p77039k610315k502254
32004a534016k44766J546988N79297j896596k475963k30348J856607J089001r00866
31995b210662m46615K443606L552664N92061k826101j847050K631103M915845
31987F804851K138635k470216m603086l913330k428832q31426J136048K487724
31979a679632K025277N94695J467L89644O61444O38324P58917M83708p91325j939144
31969A143375j504817l32463m34900j656554j882759l77064J428385K346800K376631
31960A106634J437175m47959j891435j576032p40220j478379k782702j611634
$$ plain form
32021 -951379 -156370 1287234 4820327 7391303 5829900 1899810 158637 2154471
32013 2154471 5132067 6018077 4772734 3547057 3709807 4355592 3578553 968238 -1534016
32004 -1534016 -1778782 -231794 347503 -1549093 -4025056 -4255404 -2398797 -1309796 -2210662
31995 -2210662 -2657277 -213671 3338993 3931054 1104953 -742097 1889006 6804851
31987 6804851 8943486 6473270 1870184 -2043146 -4471978 -5303404 -4167356 -1679632
31979 -1679632 345645 940340 941807 1331451 1992895 2631219 3390136 3873844 3082519 1143375
31969 1143375 -361442 -693905 -1128805 -2785359 -4668118 -5045182 -3616797 -1269997 1106634
31960 1106634 2543809 2095850 204415 -1371617 -2111837 -3590216 -6372918 -7984552
31952g984552J808216L406001J073273k368733l555986k788260j926395r29998
31944a3266434J109495L495500M638734L858177J277997k193801l969064j648225
31936f697621K900371M500469J557417j445025q16242P24440r72274m159471l747182
31927h155118O59520M202823L553835K3605l589545n309584l676420P77054M014458
31918g499372K553890j132346j555303J559329K947747L71421j953127n31519
31910e239280J881948J215023j458864k198177j35378K472767M021720M100028
31902D659787K136252j258636l236322k202164q10480k068541l928884j888148
31894h597136L656935P101100N256687J251858o24392m40794p11495j668761j479752
$$ plain form
31952 -7984552 -6176336 -2770335 -1697062 -4065795 -7621781 -10410041 -12336436 -13266434
31944 -13266434 -12156939 -8661439 -4022705 -164528 1113469 -1080332 -5049396 -6697621
31936 -6697621 -3797250 703219 2260636 815611 -631 723809 -248465 -4407936 -8155118
31927 -8155118 -7495598 -3292775 261060 284665 -3304880 -8614464 -12290884 -11513830 -7499372
31918 -7499372 -4945482 -6077828 -7633131 -6073802 -3126055 -2754634 -4707761 -5239280
31910 -5239280 -3357332 -2142309 -3601173 -5799350 -5934728 -3461961 559759 4659787
31902 4659787 6796039 5537403 2301081 98917 -711563 -2780104 -6708988 -8597136
31894 -8597136 -4940201 2160899 7417586 8669444 8045052 7604258 6892763 5224002 3744250
31885C744250K9884P55654m75991k079264j811355L37053K146368J768990k83852
31876D131737j988564k271449j851513j456408l57161K135582M450609L939245
31868F732078N52038k450561k416654n02173M14512j50978k63528P62455J052851
31859C730040p15779k864007k930619j134647K42037L20790M02615J236295J634908
31850g8367O14672q61566j490090j559644j862115j866305o64019J118823K119060
31841d529551K284913K312027J704269l64426k600365k621753p18774P3661j491762
31832e951761k832011j453534J324599K480595J465209K57164M17683J924353
31824b367703L918882M868875L080513r52564l689054k362803R39667J583418
$$ plain form
31885 3744250 3774134 4529788 4053797 1974533 163178 500231 2646599 4415589 4131737
31876 4131737 2143173 -128276 -1979789 -3436197 -3793358 -1657776 2792833 6732078
31868 6732078 7284116 4833555 2416901 1914728 2329240 2178262 1914734 2677189 3730040
31859 3730040 3014261 150254 -2780365 -3915012 -3672975 -3352185 -2949570 -1713275 -78367
31850 -78367 536305 -325261 -1815351 -3374995 -5237110 -7103415 -7767434 -6648611 -4529551
31841 -4529551 -2244638 67389 1771658 1407232 -1193133 -3814886 -4533660 -4459999 -5951761
31832 -5951761 -8783772 -10237306 -8912707 -6432112 -4966903 -4709739 -4292056 -2367703
31824 -2367703 1551179 6420054 9500567 8548003 4858949 2496146 3435813 5019231
31816E019231j339704l726106k062366K122896M649944L653285N95986k347858
31808F565308m078599m240950k826747n15761J413856J991092J262650J41423
31800b87728l30633J97301J036715J126546L31039k00189M72708J340507K08734
31791C895000l132255n456074l505931J255958L537176R02266k684396k225705
31783g413961J304392K794122Q69600n50103Q13067J915807P2417j947698m59692
31774b602049K538045K158449j529007l502008j461527J235463J209491n24043
31766b477186j404169j180331q59240l94240M73066R68809O61653M59630Q25084
31757b926924P71562K7019J61915J799440K746931J176600j120024j397700n04118
$$ plain form
31816 5019231 3679527 -46579 -2108945 13951 4663895 8317180 8913166 6565308
31808 6565308 2486709 -1754241 -4580988 -5096749 -3682893 -1691801 -429151 -287728
31800 -287728 -618361 -421060 615655 1742201 2073240 1873051 2345759 3686266 3895000
31791 3895000 762745 -4693329 -8199260 -6943302 -3406126 -2503860 -5188256 -7413961
31783 -7413961 -6109569 -3315447 -2445847 -2995950 -2182883 -267076 -194659 -2142357 -2602049
31774 -2602049 -64004 2094445 565438 -2936570 -4398097 -3162634 -1953143 -2477186
31766 -2477186 -3881355 -5061686 -5920926 -6315166 -5842100 -4873291 -4211638 -3752008 -2926924
31757 -2926924 -2155362 -2128343 -1966428 -166988 2579943 3756543 2636519 1238819 734701
31748G34701j473310m107950m572071j146649K767014L180269P85540o77167K1810
31739d487813N48951n30290j186290N75790K725597J541647k578348m752118k024483
31730a0167357K556844M218872K604603Q74712K82908p08084k304438k273043
31722d914983J10256K272754K078634P79403N46783J263027J553714J132040L55303
31713E176931q69195k113718k102434r31276o52680j894806k176592J10037K400278
31704c053455J678166n54075p23445Q83562Q59118j316413k447758j081388M89089
31695e266599O76524J030300K523905L076045J192146q73136m26401J331715J217616
31686D482115j096657l008364k991585k038045j274408m78560O11606J238005
$$ plain form
31748 734701 -738609 -4846559 -9418630 -10565279 -7798265 -4617996 -3832456 -4509623 -4487813
31739 -4487813 -3938862 -4469152 -5655442 -5079652 -2354055 -812408 -3390756 -8142874 -10167357
31730 -10167357 -7610513 -3391641 -787038 87674 370582 -337502 -2641940 -4914983
31722 -4914983 -4804727 -2531973 -453339 326064 872847 2135874 3689588 4821628 5176931
31713 5176931 4307736 2194018 91584 -839692 -1492372 -3387178 -5563770 -5453733 -3053455
31704 -3053455 -1375289 -1929364 -2652809 -1769247 -910129 -2226542 -4674300 -5755688 -5266599
31695 -5266599 -4590075 -3559775 -1035870 2040175 3232321 2359185 1932784 3264499 4482115
31686 4482115 3385458 377094 -2614491 -4652536 -5926944 -6405504 -5793898 -4555893
31678d555893O30441q16806j929806j948789j142745l85378j06906K05782J110599
31669h939501K122141K345050J937617J723222J480987L04225j156686r49553
31661a132498Q40933J301941j120285l713722l149210m72203N15393r14662j524922
31652i369235O60482L397351L783094K239953J009414M86138n33474j834416j636382
31643a797075K70566J468429J56909k029128k122448k5266J389497N23857p29992
31634b894651k07604R71171L36232j522365j547290O28876J405836j405968m766374
31625i002137m473338j014912J686201K073951K049194K737959K891079K071178
31617i80825J915677K818804K445284m83528l580615m296128l616163l446640
$$ plain form
31678 -4555893 -3925452 -4742258 -6672064 -8620853 -9763598 -10148976 -10255882 -10050100 -8939501
31669 -8939501 -6817360 -4472310 -2534693 -811471 669516 973741 -182945 -1132498
31661 -1132498 -291565 1010376 -109909 -3823631 -6972841 -7445044 -6929651 -7844313 -9369235
31652 -9369235 -8708753 -5311402 -1528308 711645 1721059 2207197 1673723 -160693 -1797075
31643 -1797075 -1526509 -58080 98829 -1930299 -4052747 -4078013 -2688516 -2164659 -2894651
31634 -2894651 -3102255 -2131084 -1794852 -3317217 -4864507 -4235631 -2829795 -4235763 -9002137
31625 -9002137 -13475475 -14490387 -12804186 -10730235 -8681041 -5943082 -3052003 -980825
31617 -980825 934852 3753656 6198940 5715412 2134797 -2161331 -5777494 -9224134
31609i224134k548503J107341N273293N238013Q40575k641621j799147O52805
31601c101378R10689k73328m5863J256763J102346n54531j501874j441478k024936
31592e673590k804707j249097K283037L568071N77012k793601j908826K053247
31584e948454L965389J728794j864025l562854k845526p43786J621544K851624
31576d797294K069704O02516P63670K344069K522620J44622k224366j949463Q715
31567e15207R48698L51476k09254n6023r6100r13728j990038k631171k281550
31558g392897m27322K269625L402104J367473j860768k659321l84611K154709
31550c531008K913046K680430K392700J283656q54074k199957j686954j002150
$$ plain form
31609 -9224134 -11772637 -10665296 -5392003 -153990 686585 -1955036 -3754183 -3101378
31601 -3101378 -2190689 -2464017 -2509880 -1253117 -150771 -705302 -2207176 -3648654 -5673590
31592 -5673590 -8478297 -9727394 -7444357 -3876286 -3299274 -6092875 -8001701 -5948454
31584 -5948454 -1983065 -254271 -2118296 -5681150 -8526676 -9270462 -7648918 -4797294
31576 -4797294 -2727590 -2125074 -1361404 982665 3505285 3649907 1425541 -523922 -515207
31567 -515207 433491 784967 575713 519690 423590 -490138 -2480176 -5111347 -7392897
31558 -7392897 -7820219 -5550594 -2148490 -781017 -2641785 -5301106 -5685717 -3531008
31550 -3531008 -617962 2062468 4455168 5738824 4884750 2684793 997839 -4311
31542d311j585728j894721m96805L01169k159127n262839l680342K405460O492241
31533e885003M512104n8932k051184j426503j030207r99169L64774K300214K528896
$$ plain form
31542 -4311 -1590039 -3484760 -3981565 -3680396 -5839523 -11102362 -14782704 -12377244 -5885003
31533 -5885003 -1372899 -1431831 -3483015 -4909518 -5939725 -6938894 -6574120 -4273906 -1745010
$$ [...]
##END NTUPLES=NMR SPECTRUM
##END=
