##TITLE=31Pdec_PR191_rm
 CDCl3, 24 sc
 2.3.2020
##JCAMPDX= 6.0         $$ Bruker NMR JCAMP-DX V2.0
##DATA TYPE= NMR SPECTRUM
##DATA CLASS= NTUPLES
##ORIGIN= UXNMR, Bruker Analytische Messtechnik GmbH
##OWNER= root
$$ XWIN-NMR		Version 3.5
$$ Mon Mar  2 14:26:44 2020 Russian Standard Time (UT+4h)  she@DPX200
##.OBSERVE FREQUENCY= 81.013821
##.OBSERVE NUCLEUS= ^31P
##.ACQUISITION MODE= SIMULTANEOUS
##.ACQUISITION SCHEME= undefined
##.AVERAGES= 24
##.DIGITISER RES= 17
##SPECTROMETER/DATA SYSTEM= spect
##.PULSE SEQUENCE= zgpg30
##.SOLVENT NAME= D2O
##.SHIFT REFERENCE= (INTERNAL, D2O, 0, 182.463)
##AUDIT TRAIL= $$ (NUMBER, WHEN, WHO, WHERE, WHAT)
$$ ##TITLE= Audit trail, XWIN-NMR		Version 3.5
$$ ##JCAMPDX= 5.01
$$ ##ORIGIN= Bruker BioSpin GmbH
$$ ##OWNER= she
$$ F:/spectra/data/she/nmr/P31/1/pdata/1/auditp.txt
$$ ##AUDIT TRAIL=  $$ (NUMBER, WHEN, WHO, WHERE, WHAT)
(   1,<2020-03-02 14:24:42.90 +0400>,<she>,<DPX200>,
      <created by zg, POWCHK disabled, PULCHK disabled
       configuration hash MD5:
       00 E9 B6 7A A2 85 ED C7 34 08 36 98 17 FE 4E 26
       data hash MD5: 32K
       46 82 02 A2 10 7D 1F 10 D7 C6 E8 B7 6E F7 F8 A0>)
(   2,<2020-03-02 14:24:46.04 +0400>,<she>,<DPX200>,
      <Start of raw data processing
       efp BC_mod = 2 LB = 1 FT_mod = 6 PKNL = 1 PHC0 = -1506.52 PHC1 = 690.4013 SI = 64K 
       data hash MD5: 64K
       36 5D 78 1A 8D FF 1F 61 4C C9 19 47 6E 35 41 21>)
(   3,<2020-03-02 14:25:00.09 +0400>,<she>,<DPX200>,
      <pk PHC0 = -113.3074 PHC1 = 0 
       data hash MD5: 64K
       CA 8E 2D BD 3B 88 BF 8E B2 C5 01 1C 78 FB E4 54>)
(   4,<2020-03-02 14:25:05.56 +0400>,<she>,<DPX200>,
      <abs ABSG = 5 
       data hash MD5: 64K
       3E B5 FA F4 6F C3 06 39 4F 81 DF B7 EC 8B D1 0A>)
(   5,<2020-03-02 14:25:24.53 +0400>,<she>,<DPX200>,
      <pk PHC0 = -2.20603 PHC1 = 0 
       data hash MD5: 64K
       55 98 10 71 16 B2 2F CC 4C 67 A9 1F D6 DD FD 14>)
(   6,<2020-03-02 14:25:27.93 +0400>,<she>,<DPX200>,
      <abs ABSG = 5 
       data hash MD5: 64K
       46 C5 BF CE B4 24 36 94 D4 9B 64 2C E0 27 17 EA>)
$$ ##END=
$$ 
$$ hash MD5
$$ FD 9D 08 84 39 AD C6 BD EE CB EC DA 91 56 67 31
##$RELAX= 
##$RELAX= 
##$RELAX= 
##$RELAX= 
##$RELAX= 
##$RELAX= 
##$RELAX= 
##$RELAX= 
$$ Bruker specific parameters
$$ --------------------------
##$DU= <F:/spectra>
##$EXPNO= 1
##$NAME= <P31>
##$PROCNO= 1
##$TYPE= <nmr>
##$USER= <she>
##$AMP= (0..31)
100 100 100 100 100 100 100 100 100 100 100 100 100 100 100 100 100 100 
100 100 100 100 100 100 100 100 100 100 100 100 100 100 
##$AQSEQ= 0
##$AQ_mod= 1
##$AUNM= <au_zg>
##$AUTOPOS= <>
##$BF1= 81.014009
##$BF2= 200.13
##$BF3= 200.13
##$BF4= 200.13
##$BF5= 200.13
##$BF6= 200.13
##$BF7= 200.13
##$BF8= 200.13
##$BYTORDA= 1
##$CFDGTYP= 0
##$CFRGTYP= 5
##$CHEMSTR= <none>
##$CNST= (0..31)
1 1 145 1 1 1 1 1 1 1 1 1 1 1 1 1 1 1 1 1 1 1 1 1 1 1 1 1 1 1 1 1 
##$CPDPRG= <waltz16>
##$CPDPRG1= <>
##$CPDPRG2= <waltz16>
##$CPDPRG3= <>
##$CPDPRG4= <mlev>
##$CPDPRG5= <mlev>
##$CPDPRG6= <mlev>
$$ [...]
##$SUBNAM3= <"">
##$SUBNAM4= <"">
##$SUBNAM5= <"">
##$SUBNAM6= <"">
##$SUBNAM7= <"">
##$SUBNAM8= <"">
##$SUBNAM9= <"">
##$SW= 369.568048894756
##$SWIBOX= (0..15)
0 1 3 0 0 0 0 0 0 0 0 0 0 0 0 0 
##$SW_h= 29940.119760479
##$TD= 32768
##$TD0= 1
##$TE= 0
##$TE2= 300
##$TE3= 300
##$TEG= 300
##$TL= (0..7)
0 120 53 12 22 120 120 120 
##$TP= (0..7)
150 150 150 150 150 150 150 150 
##$TP07= 0
##$TPNAME0= <>
##$TPNAME1= <>
##$TPNAME2= <>
##$TPNAME3= <>
##$TPNAME4= <>
##$TPNAME5= <>
##$TPNAME6= <>
##$TPNAME7= <>
##$TPOAL= (0..7)
0.5 0.5 0.5 0.5 0.5 0.5 0.5 0.5 
##$TPOFFS= (0..7)
0 0 0 0 0 0 0 0 
##$TUNHIN= 0
##$TUNHOUT= 0
##$TUNXOUT= 0
##$USERA1= <user>
##$USERA2= <user>
##$USERA3= <user>
##$USERA4= <user>
##$USERA5= <user>
##$V9= 5
##$VALIST= <valist>
##$VCLIST= <CCCCCCCCCCCCCCC>
##$VD= 0
##$VDLIST= <DDDDDDDDDDDDDDD>
##$VPLIST= <PPPPPPPPPPPPPPP>
##$VTLIST= <TTTTTTTTTTTTTTT>
##$WBST= 1024
##$WBSW= 4
##$XGAIN= (0..3)
0 0 0 0 
##$XL= 0
##$YL= 0
##$YMAX_a= 52839
##$YMIN_a= -63192
##$ZGOPTNS= <>
##$ZL1= 120
##$ZL2= 120
##$ZL3= 120
##$ZL4= 120
##$ABSF1= 182.463
##$ABSF2= -187.1042
##$ABSG= 5
##$ABSL= 3
##$ALPHA= 0
##$AQORDER= 0
##$ASSFAC= 0
##$ASSFACI= 0
##$ASSFACX= 0
##$ASSWID= 0
##$AUNMP= <proc_1d>
##$AZFE= 0.1
##$AZFW= 0.5
##$BCFW= 0
##$BC_mod= 2
##$BYTORDP= 0
##$COROFFS= 0
##$CY= -3
##$DATMOD= 1
##$DC= 0
##$DFILT= <>
##$DTYPP= 0
##$F1P= 0
##$F2P= 0
##$FCOR= 1
##$FTSIZE= 65536
##$FT_mod= 6
##$GAMMA= 0
##$GB= 0
##$INTBC= 1
##$INTSCL= 5.30512e-09
##$ISEN= 30
##$LB= 1
##$LEV0= 0
##$LPBIN= 0
##$MAXI= 10000
##$MC2= 0
##$MEAN= 0
##$ME_mod= 0
##$MI= 50
##$NCOEF= 0
##$NC_proc= -3
##$NLEV= 6
##$NOISF1= 182.463
##$NOISF2= 159.3651
##$NSP= 0
##$NTH_PI= 0
##$NZP= 0
##$OFFSET= 182.463
##$PC= 4
##$PHC0= -1622.033
##$PHC1= 690.4013
##$PH_mod= 1
##$PKNL= yes
##$PPARMOD= 0
##$PSCAL= 0
##$PSIGN= 0
##$REVERSE= no
##$SF= 81.0140089999434
##$SI= 65536
##$SIGF1= 159.3651
##$SIGF2= -187.1042
##$SINO= 113.3802
##$SIOLD= 16384
##$SREGLST= <1H.CDCl3>
##$SSB= 0
##$STSI= 65536
##$STSR= 0
##$SW_p= 29940.119760479
##$SYMM= 0
##$S_DEV= 0
##$TDeff= 32768
##$TDoff= 0
##$TI= <>
##$TILT= no
##$TM1= 0
##$TM2= 0
##$TOPLEV= 0
##$USERP1= <user>
##$USERP2= <user>
##$USERP3= <user>
##$USERP4= <user>
##$USERP5= <user>
##$WDW= 1
##$XDIM= 65536
##$YMAX_p= 502433246
##$YMIN_p= -5196259
$$ End of Bruker specific parameters
$$ ---------------------------------
##NTUPLES= NMR SPECTRUM
##VAR_NAME=  FREQUENCY,     SPECTRUM/REAL,   SPECTRUM/IMAG
##SYMBOL=    X,             R,               I
##VAR_TYPE=  INDEPENDENT,   DEPENDENT,       DEPENDENT
##VAR_FORM=  AFFN,          ASDF,            ASDF
##VAR_DIM=   65536,         65536,           65536
##UNITS=     HZ,            ARBITRARY UNITS, ARBITRARY UNITS
##FACTOR=    0.456856943014862, 1,           1
##FIRST=     14782.0589164792, 0,            0
##LAST=      -15158.0608439998, 0,           0
##MIN=       -15158.0608439998, -5196259,    0
##MAX=       14782.0589164792, 502433246,    0
$$ Real data points
##PAGE= N=1
##DATA TABLE= (X++(R..R)), XYDATA
$$ [...]
37271H5343P7685l0931n2349K8658L2502q1548j65432j51916j22638r7442P2J31166
37259c46830J36412R757m8870M8038J19586J2187j39151j16741N5102J75970J65351
37248G0811J14095R7441J00612J00775Q3799M227j45397k56347k25260j20827
37238a76071q2481q2100L1662K44345L33632J79713o7996k24526k84899k83087
37228d11808j36827J61715L63116K42266k5317o9167J22295J86161k5133j94554
37218B12747n2412J78957J29430j51470k95510j61073M5774J43019J53650J11821
37208C14933j6372j63472j72572n6907j2204q5881p8016J06883K53307J60353
37198B50052l2862p2728R898j7314j84791k60935j04372J33213K17534J07752
$$ plain form
37271 85343 163028 132097 79748 108406 140908 59360 -106072 -257988 -380626 -478068 -477996 -346830
37259 -346830 -210418 -200661 -249531 -201493 -81907 -69720 -208871 -325612 -270510 -94540 70811
37248 70811 184906 282347 382959 483734 567533 571760 426363 170016 -55244 -176071
37238 -176071 -258552 -340652 -308990 -64645 268987 448700 380704 156178 -128721 -411808
37228 -411808 -548635 -386920 -23804 218462 193145 123978 246273 432434 407301 212747
37218 212747 160335 339292 468722 317252 21742 -139331 -93557 49462 203112 314933
37208 314933 298561 135089 -37483 -94390 -106594 -192475 -270491 -163608 89699 250052
37198 250052 217190 144462 154360 137046 -47745 -308680 -413052 -279839 -62305 45447
37188D5447m4770r3927l8152J3162q360l2644M0259J48697J15985o3396j44776
37177f2475K7636K40982J75142j30634l08535j66156O9036R3698o5489j32854
37167b59649L0394K71850L55903K10991m6476k51501l06286k02093j971J75103
37157b3735K06294O8295j14375j80342j00234J4406P3077J05754J71336K33880
37147D54356J87626j4899k83141m27438l08766n554K10414J62689j969r135J53582
37136A17765K37189J28630L243l8L271r2297j44492k0529J13234M5557q9558j1302
37124B90673K04783J91982j25860l76097k68888J2903J20240L862j19240j07520
37114a73162p883Q7800J34614J17610N7037J3236J8961L4448J4230k2246k8095
$$ plain form
37188 45447 677 -93250 -131402 -118240 -126600 -159244 -118985 29712 145697 82301 -62475
37177 -62475 -34839 206143 381285 250651 -57884 -224040 -155004 -61306 -126795 -259649
37167 -259649 -229255 42595 398498 609489 563013 311512 5226 -196867 -198838 -23735
37157 -23735 182559 250854 136479 -43863 -144097 -129691 -56614 49140 220476 454356
37147 454356 641982 627083 343942 -83496 -392262 -397816 -187402 -24713 -26682 -35817 117765
37136 117765 354954 483584 486827 486789 490060 397763 253271 232742 345976 391533 301975 290673
37124 290673 495456 687438 561578 185481 -83407 -70504 49736 53598 -65642 -173162
37114 -173162 -181045 -93245 41369 158979 216016 229252 248213 282661 296891 274645 246550
37103B46550j021J5516j7730r0276j28029n6463Q4282J46269O4649l0877K449
37092B35319J07825J37529R3090O7909J3233j89956m26662l93807l8450K92833
37082a01137K81837K4390j63325j57946p1665m834M6595Q3703O7199n432p4322
37071g4937p4488P765J05215J03783j7050r9137Q458J89981J76924m7114j80579
37060I8821m0063J66990J68990K3041m0559n012k9490j15906j00708K6742O2545
37049B15391q8699k39214j76590M3876J86506J35852l398p9018o1420j1390N1433
37038b6671J58071K67293K43397L8932j82278k29263j35528p5840p7176j2345
37028c1408J23516J64634N7919l5757j7006J2o7466j00914j8994K6944j01441
$$ plain form
37103 246550 245529 261045 243315 153039 25010 -31453 52829 199098 263747 232870 235319
37092 235319 343144 480673 573763 641672 654905 464949 38287 -355520 -393970 -101137
37082 -101137 180700 205090 41765 -116181 -187846 -192680 -146085 -62382 4817 -615 -74937
37071 -74937 -149425 -141660 -36445 67338 50288 -48849 -40391 149590 326514 279400 98821
37060 98821 58758 225748 394738 417779 377220 372208 342718 226812 126104 152846 215391
37049 215391 126692 -112522 -289112 -245236 -58730 77122 73724 -5294 -66714 -78104 -26671
37038 -26671 131400 398693 642090 681022 498744 269481 133953 58113 -19063 -31408
37028 -31408 92108 256742 314661 278904 261898 261910 194444 93530 74536 101480 39
37017C9k65408k46454o2487J16411K22658K57522J62940m0832j43491k3575J11038
37006H8361L4192j09592n4149R9434M2932j76444j98399M3272K04466J06311j80
36995H0204R4532K02416P6604j88860l29468k60553o7405J52233K71118J64631
36985A95452p5578j59622J4151J97169J63092O602j00287j84358k75281k03183
36975d21843J01512L30937J86265j18815j40041J03188J51575j58609m14572k31043
36965f11446K07279M30464K83045O430j39270j14055j7158M7665K0266q3843j68039
36954a38662j44925l6703N8195Q6543P6118N6614J2780n2722o7742K4965J51206
36943B5667J66302N4419l3805j879M5259j5112r9983n5166N8311L8911j06271
$$ plain form
37017 39 -265369 -511823 -574310 -457899 -235241 22281 185221 144389 898 -22677 88361
37006 88361 122553 12961 -41188 58246 101178 -75266 -273665 -230393 -25927 80384 80204
36995 80204 174736 377152 453756 264896 -64572 -325125 -392530 -240297 30821 195452
36985 195452 119874 -39748 -25597 171572 334664 341266 240979 56621 -218660 -421843
36975 -421843 -320331 10606 196871 78056 -61985 41203 192778 34169 -380403 -611446
36965 -611446 -404167 26297 309342 315772 176502 62447 45289 92954 113220 29377 -138662
36954 -138662 -283587 -320290 -262095 -175552 -99434 -42820 -30040 -82762 -150504 -125539 25667
36943 25667 191969 246388 212583 210704 255963 240851 140868 85702 144013 182924 76653
36932G6653j39357K6534J74429J25240j029k5512j306o0767j45399j22200m1603
36921a34317l4878m8112O5631K44499K71784J22592M790K3784M2459n5024j67138
36910C36070j48539k5789O9862P7437K0666p0152j67628k29528k27645j64225
36900e29471m8655R3221J91469J84746J04590M0017J9338l346m9367q0471o7436
36889a45365k9340m22j853k9171l3470L5789J29135J22028M421o7431r161L3300
36877H460q2593k30896j93955q364J09001J18207J66627K61519K28030L8045r9628
36866C14453o5529M934j6101n9710m9874n0081q4724l9105J07039J65421L7365
36855B64088q6628l3701M8794m9763k16835j83747L1971J58987R4540l615l7409
$$ plain form
36932 76653 -62704 -36170 138259 263499 262470 236958 235652 174885 29486 -92714 -134317
36921 -134317 -169195 -217307 -151676 92823 364607 487199 491989 515773 558232 503208 336070
36910 336070 187531 161742 231604 309041 329707 259555 91927 -137601 -365246 -529471
36900 -529471 -578126 -484905 -293436 -108690 -4100 35917 55255 51909 2542 -77929 -145365
36889 -145365 -174705 -175127 -176980 -206151 -239621 -203832 -74697 47331 51752 -15679 -24840 8460
36877 8460 -74133 -305029 -498984 -507348 -398347 -280140 -113513 148006 376036 414081 314453
36866 314453 248924 253858 237757 178047 128173 78092 -6632 -45737 61302 226723 264088
36855 264088 177460 143759 192553 142790 -74045 -257792 -225821 -66834 27706 24091 -13318
36844a3318q7103j68438j45530J7654J44908J07424J4137J5815P5645Q0493N4463
36833I6150Q9520J36824N2063j53673k71172j60499N2284J38183N9024j8044J6420
36822C7080P3110M0516k2779M539Q7600Q7028M59k7680M5222Q7073K6065k4346
36810D13887K5714Q0092L6732k3513P882N3215k0251j53634j85047j17982r0683
36799B6412j15565o7193O7834J35972N0890r0444j71804j86241j53931n4978R2805
36788d66243J99610K00732J08849l7896j80429k04482m0865J90214K76283J69712
36778B15485P381j21191k35956k78742j07023K20224L78968J80151j34651k00323
36768g5677j2196J17309K1177j33892j37374k0650K8001p1750j96089j59235Q0015
$$ plain form
36844 -13318 -100421 -268859 -414389 -396735 -251827 -144403 -130266 -114451 -38806 41687 96150
36833 96150 185670 322494 374557 220884 -50288 -210787 -158503 -20320 38704 20660 37080
36822 37080 110190 150706 127927 132466 220066 307094 307553 279873 325095 412168 438233 413887
36810 413887 439601 519693 556425 532912 540794 594009 573758 420124 235077 117095 26412
36799 26412 -89153 -156346 -88512 47460 98350 7906 -163898 -350139 -504070 -559048 -466243
36788 -466243 -266633 -65901 42948 5052 -175377 -379859 -420724 -230510 45773 215485
36778 215485 222866 101675 -134281 -413023 -520046 -299822 79146 259297 124646 -75677
36768 -75677 -87873 29436 50613 -83279 -220653 -241303 -213302 -285052 -481141 -640376 -560361
36757e60361L54259M45899L09684Q8526q9899k26957l22280k71271k7159K26332
36747g3227K39827J8290j77427j60162q300J00792J09442O4369O91n6481m7901
36736I913N1501J51601J34904J9413n7919l2432N815l6966j08904r5533l826L5002
36724G2569n9811k24617l36986l18691j53699R8303K87519K83563J43240O2196
36714a46414J12294J56854R5858L2600O7483Q6972m9253k34569k56269j26531
36704b60975l2296j6303L0598R8191P0028M444Q5889K53574K14389p3772k68612
36693A05155j50725N6476P6761j5252l2250l4671j46234k37182j25551P3564J24342
36682c05567N3631M1394O9380J6492k7695Q1666J81393L539l16466l69567j06297
$$ plain form
36757 -560361 -206102 239797 549481 638007 548108 321151 -1129 -272400 -299559 -73227
36747 -73227 166600 184890 7463 -152699 -160999 -60207 49235 113604 114295 57814 9913
36736 9913 61414 213015 347919 367332 309413 276981 282796 245830 136926 41393 37567 72569
36724 72569 12758 -211859 -548845 -867536 -1021235 -922932 -635413 -351850 -208610 -146414
36714 -146414 -34120 122734 218592 251192 318675 405647 356394 121825 -134444 -260975
36704 -260975 -293271 -309574 -278976 -180785 -110757 -106313 -20424 233150 447539 373767 105155
36693 105155 -45570 10906 87667 72415 40165 5494 -140740 -377922 -503473 -429909 -305567
36682 -305567 -251936 -210542 -141162 -124670 -152365 -70699 110694 114233 -202233 -571800 -678097
36671f78097J04505R2911R9475K55464L17940J31907n7845k1973P9082K3692q0880
36660B66181n0480Q208p3692j56004j7307K08314K01405l0311j73619j04095j6185
36649F2415m9428r7375m8878L7161P6854P9962N6233k5752j27873j42505n7008
36638b36194J3220J158k2650J9935J00717J44178J21897O0101Q431K528J7082
36627B30403r342o6891p5334m8670j23980l09636l57929q3446L08320M45618K70331
36616A79444M8824m0479n4622m3211L5474J13869L0579j62844j91864K0937J94662
36605A30769J08681p1337q7404J7664M5378k696Q766N1272q343j14450p5420R3607
36593I6487J49021q962j75768j48933o306M8990j3751n7805j3521L5392L498o0973
$$ plain form
36671 -678097 -573592 -480681 -381206 -125742 192198 324105 266260 244287 323369 347061 266181
36660 266181 215701 223909 150217 -5787 -23094 185220 386625 356314 182695 78600 62415
36649 62415 12987 -84388 -133266 -96105 -19251 60711 116944 91192 -36681 -179186 -236194
36638 -236194 -222974 -221816 -244466 -224531 -123814 20364 142261 202362 210793 213321 230403
36627 230403 221061 154170 78836 30166 -93814 -403450 -761379 -844825 -536505 -90887 179444
36616 179444 228268 187789 133167 89956 125430 239299 269878 107034 -84830 -63893 130769
36605 130769 239450 168113 80709 98373 143751 141055 149821 201093 192750 78300 2880 96487
36593 96487 245508 236546 60778 -88155 -94461 -45471 -59222 -117027 -130548 -95156 -91658 -152631
36581a52631m6382N4209J15162M8676n1125k4147J05890J26640n8342k49280k03765
36570c35095J8598J38267M8961o6145m2462L6349K2094m1903j4628Q2297R2237
36559f1430l919m0378M9819Q6842p8117k68768j83075J47054L36410J61852j16765
36548B9525j17021J36088K68025Q0266k22263l47359k42832m0686J34619J96219
36538a25419R1237j01203j83873p8169N4862N0055j8136K0892J45820J86372R8854
36527A41292L486l6744q3225j51001j50935n2192M8244P6968P4719P9482M7332
36516b574m1470j13891j16087q9014o2252J3779J42784K04582J17041j7058n1495
36505a5655q960j3930o9890n7962N5538J48026R4089j00769l11436l59926j25722
$$ plain form
36581 -152631 -199013 -144804 -29642 19034 -32091 -56238 49652 176292 117950 -131330 -335095
36570 -335095 -316497 -178230 -129269 -195414 -237876 -201527 -179433 -221336 -235964 -153667 -61430
36559 -61430 -65349 -105727 -55908 30934 -47183 -315951 -499026 -351972 -15562 146290 29525
36548 29525 -87496 48592 316617 396883 174620 -172739 -415571 -456257 -321638 -125419
36538 -125419 -34182 -135385 -319258 -397427 -342565 -292510 -310646 -289754 -143934 42438 141292
36527 141292 144778 108034 24809 -126192 -277127 -329319 -281075 -204107 -129388 -49906 -2574
36516 -2574 -44044 -157935 -274022 -363036 -425288 -411509 -268725 -64143 52898 35840 -15655
36505 -15655 -24615 -38545 -108435 -166397 -110859 37167 131256 30487 -280949 -640875 -766597
36494g66597K82646N18635L40544m7127j95822J8370K52462J98210k0184j11068
36484D70069n6782m7400j22416j58350j40762j68271k06056j13134O2273R1357
36474c89472o3868j56119l9364J07953R9866M2364J14274K52557K89919K45160
36464E03270K33472K24553J42646P9582J29229J30818r2267l27320k01284J96803
36454A019502L52450P1904k33811j88427L0254Q0865J2081O3263J75874J21121
36444A505076l5953j9920J66610K36274J08647L1862J35923K11003P9042j04023
36434B314541j18510l7167q1493k54390l44730k47802q6387l556J5755O1185J22958
36423A340404Q5774j01175l02940l13280j01899J25135J64049M2348p0440j03236
$$ plain form
36494 -766597 -483951 34684 375228 328101 132279 150649 403111 601321 581137 470069
36484 470069 413287 365887 243471 85121 -55641 -223912 -429968 -543102 -480829 -389472
36474 -389472 -453340 -609459 -648823 -540870 -441004 -398640 -284366 -31809 258110 503270
36464 503270 736742 961295 1103941 1183523 1312752 1443570 1351303 1023983 822699 1019502
36454 1019502 1371952 1443856 1210045 1021618 1051872 1132737 1144818 1208081 1383955 1505076
36444 1505076 1469123 1449203 1615813 1852087 1960734 1992596 2128519 2339522 2418564 2314541
36434 2314541 2196031 2158864 2077371 1822981 1478251 1230449 1144062 1140506 1156261 1217446 1340404
36423 1340404 1426178 1325003 1022063 708783 606884 732019 896068 938416 867976 764740
36413G64740j06407r1309j8994N9153L3978n3840k5709J38341K00832J779k59067
36402F43497k65089k4391J39742L2107j75361k12604p1051K7890m2503j54735
36392a02498j14263Q3104K51687K47374J21930K3154K373j5573q9875j61960j27351
36381A18102J7922J42019J12337l7666j21896k3228J43705J78416P3524J2071
36371F15306P4107J17270K6077r5318j16621j07292j76657k17906n8005K04675
36361B65636K79463R8839r5220j16772n2992m7923q5063q4509m2557J9322R5947
36350B34171J22023J5286j44315j60898j8306P0244m104q0693j8634P5189O9736
36339A59699M5840J10696J71716J19290N8358J08518J33543m2891k74744k63791
$$ plain form
36413 764740 658333 567024 548030 607183 641161 587321 561612 699953 900785 902564 643497
36402 643497 378408 354017 493759 525866 350505 137901 66850 94740 52237 -102498
36392 -102498 -216761 -133657 118030 365404 487334 510488 512861 497288 407413 245453 118102
36381 118102 136024 278043 390380 352714 230818 207590 351295 529711 603235 615306
36371 615306 689413 806683 832760 737442 620821 513529 336872 118966 60961 265636
36361 265636 545099 643938 548718 431946 378954 331031 245968 161459 118902 138224 234171
36350 234171 356194 371480 227165 66267 47961 118205 114101 33408 14774 89963 159699
36339 159699 205539 316235 487951 607241 665599 774117 907660 864769 590025 326234
36329C26234k5647J33517Q6197J2918L5981L6270p1387j48756o1237R8015J47838
36318E69943N1090r1134j66148j07244O0217J85138J26280m4947j13698j8933
36308D50564Q2122Q5195Q1948J47597J74421N2424j27321j97049j40889o9199
36298E39813m4472m8272n3249k8770N6658J51355J21806o3389k34435k18960o9317
36287A08768K8657J3420j7976N929N1756Q0192R9202J02136N7070j4114l1487
36276D83553L4036J15962J49130J46308J32974O7287r4430k72801l01561j28953
36266C31505Q3762J37034L0341o1600l1754N0764Q8104Q3025P1037M9447M5711
36255H77376J21081K11138J22321j66651l67536k53501j1244M4357l4740K7960
$$ plain form
36329 326234 300587 434104 520301 533219 569200 605470 534083 385327 324090 422105 569943
36318 569943 621033 529899 363751 256507 316724 501862 628142 583195 469497 450564
36308 450564 532686 617881 699829 847426 1021847 1074271 946950 749901 609012 539813
36298 539813 495341 447069 393820 365050 421708 573063 694869 631480 397045 178085 108768
36287 108768 137425 150845 132869 138798 190554 270746 369948 472084 529154 515040 483553
36276 483553 517589 633551 782681 928989 1061963 1129250 1034820 762019 460458 331505
36266 331505 415267 552301 582642 521042 489288 540052 628156 711181 782218 831665 877376
36255 877376 998457 1209595 1331916 1165265 797729 544228 532984 577341 542601 570561
36245E70561J84912J01212k27210l62974j02417J72925Q7992j57841j58561O3835
36235A72434J88864J46116J15787J15980R086j40714j15479N6628J15107J291
36225F65100o9918j3404J348r0550j08626K3455J02521o267j18703l0892J51767
36214E05831J95581P7462n4337j17588j12622k5453J11553J64084N8196q8593
36204G14114j26364o4144J0512P6678J16394M6179j30491k33306j41962k557j1436
36193B53617j08867r7531L1453J18323J07948P3102K2487p6115j28101k4245J08023
36182B80094M5187j41751j47087O9569J76472o200j96465q6144J74145K12594
36172C80414q035j77832j10896N3735J23473Q6381K2553l8340r4492j21734j09874
$$ plain form
36245 570561 755473 856685 629475 266501 164084 337009 425001 267160 108599 172434
36235 172434 361298 507414 623201 739181 748267 607553 492074 548702 663809 665100
36225 665100 595182 581778 583126 492576 383950 407405 509926 503659 384956 354064 505831
36214 505831 701412 778874 724537 606949 494327 468874 580427 744511 802707 714114
36204 714114 587750 523606 534118 610796 727190 773369 642878 409572 267610 265053 253617
36193 253617 144750 47219 78672 196995 304943 378045 400532 324417 196316 172071 280094
36182 280094 325281 183530 36443 106012 282484 276284 79819 -6325 167820 380414
36172 380414 372379 194547 83651 137386 260859 347240 369793 331453 236961 115227 5353
36161E353q0396l8125L4602J23748J83351J94653J70709J07554n676j26138j69327
36150D00308j01708J2623P2617M2218j752N7354K09967K62158N5873k56660l27527
36139D25471o8726J87004J16761j62360k85245j36861P1099J45386Q8027l8608
36129C41948j77280k06296m4790J52667J44243l0557q7761N1655J42168L9976
36119C25973o0269J7135J26253Q2607p011K7618P8622l6180j88062j02839J74911
36108D38758L19990J97210j2755j41553j85690j31985N4292K27343J56495j01118
36098H20987k19645r0419J9116o6949j23335Q5349L63382L37185J034k88676l00124
36087E37905j43594j5582L8085N3983K3290p2635j76513j76580j2787K37975L92245
$$ plain form
36161 5353 -75043 -113168 -78566 45182 228533 423186 593895 701449 695773 569635 400308
36150 400308 298600 311223 383840 426058 424306 481660 691627 953785 1009658 752998 425471
36139 425471 356745 543749 660510 498150 212905 76044 147143 292529 380556 341948
36129 341948 164668 -41628 -86418 66249 210492 179935 92174 143829 285997 325973
36119 325973 265704 282839 409092 491699 484688 512306 590928 554748 366686 263847 438758
36108 438758 758748 955958 943203 801650 615960 483975 538267 765610 922105 820987
36098 820987 601342 510923 530039 463090 339755 425104 788486 1125671 1126705 838029 537905
36087 537905 394311 378729 416814 470797 494087 421452 244939 68359 55572 293547 685792
36076F85792L28656J35107J5171L5430O5676k363j04016j33266j01415p4076n6402
36065G94294l7916n5788j14370j29523m8123O1024J17769J33648J27099O2382
36055I10496l1969l2089O8695P7983r9116k44292j22963J42497K52942J79054
36045A101238J33654J58148O8418j60682k78553j39242N4955L9182j61169l01653
36035E14296k23457J3055K07383J80463m5097k16795j30524Q6345J54258P2289
36025F12216R5662K56052K50965l8077k60641j04531J86357J60089j52536k99727
36015G05829r8688J46008J62525O9744O4929P2900n5374k11266j72741K4078J15070
36004H23014j6175k11090k96898k77923k23773j60676j67478l90449p82160r55375
$$ plain form
36076 685792 1014448 1149555 1164726 1200156 1265832 1263469 1159453 1026187 924772 850696 794294
36065 794294 756378 700590 586220 456697 408574 469598 587367 721015 848114 910496
36055 910496 878527 846438 915133 993116 894000 649708 526745 669242 922184 1101238
36045 1101238 1234892 1393040 1461458 1300776 1022223 882981 937936 977118 815949 514296
36035 514296 290839 303894 511277 691740 646643 429848 299324 385669 539927 612216
36025 612216 707878 963930 1214895 1176818 916177 811646 998003 1158092 1005556 705829
36015 705829 607141 753149 915674 985418 1050347 1123247 1067873 856607 683866 707944 823014
36004 823014 806839 595749 298851 20928 -202845 -363521 -530999 -921448 -1703608 -2658983
35994b658983n52249K47063Q25716Q21142N13862L93969N23953N61572L24860
35985A000905N2735M6061K64658M19395L52936J86290J16940J80113K38030J64321
35975C022384J620q7583k2668R9974J52681J48612J79560K35199K16719J22207
35965D068705P4403J24497J56897O3251q4787j26633k3221R9104R0804p7557k87791
35954D077672l65951k37924j5546J02579K2357j81998l70193m41849l68479k08353
35944B012315q1210m3723r477J07883K08144J12222j47049l18120k57963r8600
35934A484422k0793k8927m6716p6880j33753j44593o1805K2925J1951l8836l2930
35923I34065k2771j22637k77357k88345q4004J63279K29201P4812j35612k16340
$$ plain form
35994 -2658983 -3211232 -2964169 -2138453 -1317311 -803449 -409480 114473 676045 1000905
35985 1000905 1053640 1099701 1364359 1783754 2136690 2322980 2439920 2620033 2858063 3022384
35975 3022384 3024004 2936421 2913753 3013727 3166408 3315020 3494580 3729779 3946498 4068705
35965 4068705 4143108 4267605 4424502 4487753 4402966 4276333 4253112 4352216 4443020 4365463 4077672
35954 4077672 3711721 3473797 3458251 3560830 3583187 3401189 3030996 2589147 2220668 2012315
35944 2012315 1931105 1887382 1877905 1985788 2193932 2306154 2159105 1840985 1583022 1484422
35934 1484422 1463629 1434702 1387986 1311106 1177353 1032760 970955 993880 1005831 966995 934065
35923 934065 911294 788657 511300 222955 138951 302230 531431 606243 470631 254291
35913B54291j42016m5174k8153l5122J2557K9235j12103k95392k40656P1232L03642
35902b27659K26208L3406J1974J13272J14034K5195K7153R7003K8737j90762l21849
35891f3288k22934j7301J30120J84904J56147N1278l4537J5073J30588J11501
35881D41551n8932j58494o0621P7287O4495o3990j60680j83266j67181j08427
35871c78258j0674M6618J3368l0749J0042R9260J36899J21419J36243J99470K20497
35860E64135J19259n9856j80038j63125r2146j07236j90081j62169L1933J78004
35850f1320Q1534j16953j35579K0393R3013P416l3588O3852J17254P937r8330
35839e4371m5189M7301J5958n5537r668R4474J06786O4488R2944J33482L2413
$$ plain form
35913 254291 112275 67101 38948 3826 16383 45618 -66485 -361877 -602533 -531301 -227659
35902 -227659 -1451 31955 43929 157201 271235 296430 323583 420586 449323 258561 -63288
35891 -63288 -286222 -303523 -173403 11501 167648 218926 184389 199462 330050 441551
35881 441551 382619 224125 163504 240791 305286 241296 80616 -102650 -269831 -378258
35871 -378258 -388932 -342314 -328946 -359695 -349653 -250393 -113494 7925 144168 343638 564135
35860 564135 683394 623538 443500 280375 188229 80993 -109088 -271257 -239324 -61320
35850 -61320 20214 -96739 -232318 -211925 -118912 -111496 -145084 -81232 36022 43959 -54371
35839 -54371 -99560 -52259 -36301 -91838 -101506 -7032 99754 164242 257186 390668 423081
35828D23081j59690k33127j41127m2718k5692r038N6726J00599Q8954Q7158J02667
35817B47793L5388j33117k44368j61630L4605J51545J21081L8007l086j3274l5450
35806C7494l6693M9471J73037J57493o9334k99213k54600K9119K19441J36576
35796A42791j9422q751R3272Q2061q834P729J22467J50897O4260J2580J6135o8687
35784E86498k21044j98021O1805K48806R7669k11993l02628j08082J04510J39751
35774A97271N4397m7191j57758k49595k06514Q778K30524K56252R2343o4559p7583
35763C6365j3430j3460r0441j22280l4866Q3411R4268k596o3346J0376J34536
35752A8537J39468j6128j75872j51410O2987K77654L16409J94704N2660m0761
$$ plain form
35828 423081 263391 30264 -110863 -153581 -179273 -188311 -131585 -30986 57968 145126 247793
35817 247793 283181 150064 -94304 -255934 -221329 -69784 51297 89304 86218 72944 37494
35806 37494 801 50272 223309 380802 311468 12255 -242345 -213226 6215 142791
35796 142791 123369 114618 207890 289951 281117 288846 411313 562210 626470 639050 655185 586498
35784 586498 365454 167433 229238 478044 575713 363720 61092 -46990 57520 197271
35774 197271 251668 204477 46719 -202876 -409390 -400612 -170088 86164 178507 113948 36365
35763 36365 22935 9475 -80966 -203246 -238112 -154701 -60433 -63029 -126375 -115999 18537
35752 18537 158005 141877 -33995 -185405 -122418 155236 471645 666349 719009 678248
35742F78248j27522k19755k43192j66092p0326j3076P5787K40789L40496K11742
35732G07099m7785j56977l3142R2651J5978j59212k09531j25759p5106j00409
35722i2193o5941Q1903J93694J43832K7062l813J6939l5507j01316O746K46819
35711D18225L07465N7991j94217j28273R0382N6809k23123l24249p7271J57765
35701A41504O2015j63623j61493L1813J31496R0283P2474Q3872R244o3477M9595
35690B83703K25938J47959j53001k76796p1470J41983J19217N4901J51470K12140
35680H36044Q934k51510k36922m5994k1471j50939j21597Q2525J34144k5096j8246
35669A89872L20093N60620K72519l01495n51821l16147N682Q5137J7252j0089
$$ plain form
35742 678248 550726 330971 87779 -78313 -148639 -161715 -85928 154861 495357 707099
35732 707099 659314 502337 469195 561846 577824 418612 209081 83322 8216 -92193
35722 -92193 -158134 -76231 117463 261295 288357 284544 301483 265976 164660 171406 418225
35711 418225 725690 783681 589464 461191 551573 608382 385259 61010 -16261 141504
35701 141504 203519 39896 -121597 -89784 41712 131995 204469 288341 297585 234108 283703
35690 283703 509641 657600 504599 227803 156333 298316 417533 472434 623904 836044
35680 836044 844978 593468 356546 310552 289081 138142 16545 99070 233214 208118 189872
35669 189872 509965 1070585 1343104 1041609 489788 173641 179323 264460 281712 271623
35659B71623k9426j03731j05462O9017K41644J73327n4783j44568k5109P5464
35649C67996J9350n3907j6945K6217l6788j02651m6858L6400J1165l4247M7423
35638B17155J52280P4215j11108j34888J1285N2547r6108j82575n5135Q6273N0829
35627F4770l2992P822O9822o876j14507o8619M4709K4594o3699Q614K16772K95886
35615D46296J60919N716m3776q1142j58682j51851k703J26079Q1962n6945j19553
35604B06320o9573J3513O8629P2098J9306l5086j0695O7443P5098k2889j10396
35593B73768j03209o0582m1174O016J01934J30907J6617j08032p2033O8597J10101
35582C22910O914p7156l1215M8696K3075q8539j48588q7981K1868P5402O5187
$$ plain form
35659 271623 242197 138466 33004 102021 343665 516992 462209 317641 292532 367996
35649 367996 387346 333439 316494 342711 305923 203272 156414 192814 203979 169732 217155
35638 217155 369435 443650 332542 197654 208939 261486 165378 -17197 -72332 13941 64770
35627 64770 31778 39600 109422 102546 -11961 -80580 -35871 -11277 -74976 -66362 150410 446296
35615 446296 607215 612931 569155 488013 329331 177480 174777 300856 382818 325873 206320
35604 206320 136747 150260 218889 290987 310293 275207 264512 331955 407053 384164 273768
35593 273768 170559 109977 68803 74819 176753 307660 324277 216245 144212 212809 322910
35582 322910 329824 252668 221453 270149 293224 204685 56097 -31884 -10016 65386 130573
35571A30573Q0400J72875K60540K14947L6445j28417j62163r5428j8245M4541
35561E36068J09700J64450J99669K53242L32903L53790K57521J43071J47235K20321
35551B717970J76386j4218j45411o5075R3312R2198q7251k49431k68463k11159
35541B038858j65483j01409K1330J24589J13556N1190R6832K65412L64703K25863
35531C035441p4262k83097k33493K720J92257J43892j26420l99103m54169l00277
35521A503489j58047j88613l08904l33460k22935r3855l3046j9344r245J3349
35511A49389O6632J40470J42771n21j86018k12384m9879J09268J15740L0410l8203
35500B67675r8409j67786j60176l4051P7434N8038Q718N3044O4309j34534l67754
$$ plain form
35571 130573 210973 383848 644388 859335 895780 767363 605200 509772 491527 536068
35561 536068 645768 810218 1009887 1263129 1596032 1949822 2207343 2350414 2497649 2717970
35551 2717970 2894356 2880138 2734727 2669652 2762964 2855162 2767911 2518480 2250017 2038858
35541 2038858 1873375 1771966 1793296 1917885 2031441 2082631 2179463 2444875 2809578 3035441
35531 3035441 2961179 2678082 2444589 2447309 2639566 2783458 2657038 2257935 1803766 1503489
35521 1503489 1345442 1156829 847925 514465 291530 197675 164629 145285 136040 149389
35511 149389 216021 356491 499262 498741 312723 100339 50460 159728 275468 305878 267675
35500 267675 169266 1480 -158696 -192747 -115313 -57275 -48557 4487 68796 -65738 -433492
35489d33492k54930J90399M66143K50133j44850k32904k3137J00835R779n0204
35479a22228O0802J56019Q1537k2223M669M9836o1167k24824j83908P2477K64229
35468G5219J88687l8014j54485n9527J02811J12761q0481k67117j90052J10113
35458b00085K79619R1780k21435k65624k2295J58378Q0093o6719n5511O5922J46948
35447h929J76964J79008O5204j82125l43238k19716M5736J53014O9801J4505O1403
35436A1627N0430q4810j75631r8871K4472L4986l1630m5051J5373P8708J09576
35425a10821J15065R7606P3867O9431N1627l6941j43809j35722j6726L3243p3769
35414g6949j80690j24992J0357M4737j6795l3564J6079K9810n149P780P5737Q3416
$$ plain form
35489 -433492 -688422 -498023 -31880 218253 73403 -159501 -182638 -81803 -72024 -122228
35479 -122228 -61426 94593 176130 153907 158576 208412 147245 -77579 -261487 -189010 75219
35468 75219 263906 225892 71407 11880 114691 227452 146971 -120146 -310198 -200085
35458 -200085 79534 171314 -50121 -315745 -338040 -179662 -99569 -166288 -221799 -155877 -8929
35447 -8929 168035 347043 412247 230122 -113116 -332832 -287096 -134082 -64281 -49776 11627
35436 11627 62057 -22753 -198384 -297255 -272783 -237797 -269427 -314478 -299105 -220397 -110821
35425 -110821 4244 101850 175717 245148 296775 259834 116025 -19697 -36423 -3180 -76949
35414 -76949 -257639 -382631 -372274 -327537 -344332 -377896 -361817 -332007 -337156 -329376 -253639 -170223
35402a70223K411k7613R4690K62497K90169J45308k9114r4472n8943m0605j12948
35391B61157k04554j79582j9857J33066J53317P8452J6251k1463q5328j42989
35381a1530j05063J5355J04037J18360J26168J43515P6507j03946k55191k37942
35371a29730j09848k3814M949Q7524K32423K84017J49115l3897o4089M2084P3004
35360E11738p2391k35637k22011n9975P8901J37058J84136K07752R5766j28677
35350D96660k54798j75420n6928o9957j09078J3947K14369K25689N673k00725
35340H9432k17021j17050r354J18557K47148K41414O6450r1333p9141n306l9878
35329B03918j21130o8701R7033J72497P9632m9058j00811j07418j05480n2930
$$ plain form
35402 -170223 -167812 -195425 -100735 161762 451931 597239 568125 473653 414710 374105 261157
35391 261157 56603 -122979 -142836 -9770 143547 221999 238250 216787 131459 -11530
35381 -11530 -116593 -101238 2799 121159 247327 390842 467349 363403 108212 -129730
35371 -129730 -239578 -263392 -258443 -170919 61504 345521 494636 460739 396650 438734 511738
35360 511738 439347 203710 -18301 -78276 625 137683 321819 529571 625337 496660
35350 496660 241862 66442 9514 -60443 -169521 -155574 58795 284484 290157 89432
35340 89432 -127589 -244639 -253993 -135436 111712 353126 419576 328243 249102 243796 203918
35329 203918 82788 14087 111120 283617 363249 314191 213380 105962 482 -52448
35319e2448M1754O0353m9157j48407p9950J03431J97977J10266m3624j01806l4063
35308D326P0024J24829J09916L8670o9412j65746j68469l9879J30936J80800M7640
35297B63635j36542j75556k5728J56388J87296M7468j11120j28420O249J54708
35287B38378J77073O5273p4754j44773j22215l4840N8269O2971p2346k36293k18070
35276c01327K3691K47598K07672k1792j52458p5640L9663O0263Q4579K13936L11876
35265F38061J87670p2927j78799l2972J31343P3517j46693k83745k27304q6592
35255A559K592L3586P2446J26750J26089K1811j23610j72711o1678R9613J30597
35244B57044J838j11600n3514R7731J33583M211j25162j25296p0886p6687q6756
$$ plain form
35319 -52448 -10694 49659 502 -147905 -227855 -124424 73553 183819 140195 38389 4326
35308 4326 74350 199179 309095 347765 278353 112607 -55862 -95741 35195 215995 263635
35297 263635 127093 -48463 -74191 82197 269493 316961 205841 77421 83670 238378
35287 238378 415451 480724 405970 261197 138982 104142 162411 225382 153036 -83257 -301327
35276 -301327 -277636 -30038 177634 155842 3384 -72256 -32593 27670 112249 326185 638061
35265 638061 825731 752804 574005 541033 672376 745893 599200 315455 88151 1559
35255 1559 4151 37737 110183 236933 363022 384833 261223 88512 26834 126447 257044
35244 257044 258882 147282 93768 191499 325082 329293 204131 78835 7949 -68738 -155494
35233a55494K7807K19475K82912J37069n9688j30313q7632m0186l806O5363J18006
35222C73513M3499j46663k91983k70634j26056J9503R4720R2257L7802l511M0241
35211a37312J51676K16649J65521O3533K240l2253r8172j61422j32899k4426M4596
35200E7731J1234n0514l9679M9491J37873J43524N2253m3635o993J61773K49279
35189G22337P2667k27531l23889j47753K7079K1167O931J54264K74805J12974
35179F93051j86250k62019j01670k3548j01648m3237K43581L91979J37499k18816
35169E28922k45828j6933P5348m0280q2977M5864J24906M0743l1818K1042N5137
35158D74126l5814j11873m4963N6243O2400N0323J13694J38963J743j63969j46366
$$ plain form
35233 -155494 -127687 91788 374700 511769 452081 321768 234136 193950 190144 255507 373513
35222 373513 417012 270349 -21634 -292268 -418324 -398821 -304101 -211844 -174042 -177553 -137312
35211 -137312 14364 231013 396534 460067 462307 430054 331882 170460 37561 13135 57731
35200 57731 68965 18451 -21228 28263 166136 309660 361913 318278 311285 473058 722337
35189 722337 795004 567473 243584 95831 122910 144077 151008 305272 580077 693051
35179 693051 506801 244782 143112 119564 17916 -25321 218260 610239 747738 528922
35169 528922 283094 266161 341509 301229 218252 264116 389022 429765 397947 418989 474126
35158 474126 438312 326439 281476 337719 400119 450442 564136 703099 704842 540873 394507
35147C94507n672J6805j09085j58642j2148J69793J88386M7099j18350k09197
35137B03496j91062o7556R3198J81538J60434J05163Q9311Q5948K4478r5084j87069
35126D02795j69335n4978M5024L2320n6711q5489K392J04641J10540N1183K1425
35115D03807K6092O771l6322n7666n1245k0616O4279J61816J09327j47309l67404
35104I1530k88620k5842P5572l8650p9945P2710J75144P2728q229J28694K61907
35093D36999J08612j67896j98521n876O0505p4028j11130P2453K00194O9402j08929
35082B81785o7508R5366J11416l2404j32517j14651q5374r3638o9831K307L9407
35071f5642N466l5845l8258k9161k9400j2758L3872Q3908J16436J30558J22306
$$ plain form
35147 394507 388835 405640 296555 137913 125765 295558 483944 531043 412693 203496
35137 203496 12434 -55122 38076 219614 380048 485211 574522 660470 684948 589864 402795
35126 402795 233460 178482 223506 255826 199115 113626 116018 220659 331199 382382 403807
35115 403807 429899 436670 400348 342682 291437 270821 335100 496916 606243 458934 91530
35104 91530 -197090 -222932 -147360 -186010 -265955 -193245 -18101 54627 46398 175092 436999
35093 436999 545611 377715 179194 173318 233823 159795 48665 121118 321312 390714 281785
35082 281785 214277 309643 421059 388655 256138 141487 56113 -37525 -107356 -105049 -65642
35071 -65642 -60176 -96021 -134279 -163440 -192840 -205598 -171726 -87818 28618 159176 281482
35060B81482J04420J21871J74009J57855l244j89925j79520N6397K68204K18903
35050A010452k5898j93857j43050L817N8508l901o6135n0705K892K7540J4253
35039F33916j0342k5737q401M9389P7222j8947j70996j47303J15861L04557R2093
35028H91312l42293m68260j21334K63407K73966N1947l9433J7885Q665n3518N493
35017D87837J03664Q09k07126j49961J86256L42614P6500k43444j92886J00702
35007E04965K27315J10605L612L6955J07840J24071P5923n3308k06597j95940
34997G35441K3630J63119j8590k81704k19481R5072K02753k5339k21321j36804
34987C16776K6137M6776K1297N4582J3885j39172j37611J36349L10944M2706l78614
$$ plain form
35060 281482 385902 507773 681782 839637 836393 646468 466948 523345 791549 1010452
35050 1010452 984554 790697 647647 651464 709972 706071 639936 589231 592123 619663 633916
35039 633916 623574 597837 589436 638825 716047 697100 526104 378801 494662 799219 891312
35028 891312 549019 80759 -40575 222832 496798 548745 509312 527197 535862 482344 487837
35017 487837 591501 592310 385184 235223 421479 764093 840593 597149 404263 504965
35007 504965 732280 842885 846497 883452 991292 1115363 1191286 1137978 931381 735441
34997 735441 759071 922190 903600 621896 402415 497487 700240 674901 453580 316776
34987 316776 342913 389689 410986 465568 479453 340281 202670 339019 649963 692669 314055
34976C14055l99844k0978K34690J05408j23059j45469j6078J04013J98133K44682
34966D95553J40340o0796j12538M8756J57910L1612j32358q5471P8830J24703
34956F86541P0359Q7593J43934O3679j21434j89989q9411m91k1553m0507K9632
34945F18353J14587J41939J37124R3086n2245k29938k39553m6562J11363N1048
34935F99202r7724j16494j9971L2069J0947j928j3039p2048r8499J1305J41606
34924D75426P5037j38170j93744J3348K04428J23531q9147j25055M6133J84605
34914E76392J54622O1633K4345J5102k1412m8017j8674J9410k586n5712m4199
34903F60904O2822J86931K31129J85250J27188J20695J25392M0440j48903l12171
$$ plain form
34976 314055 -85789 -106767 127923 233331 110272 -35197 -51275 52738 250871 495553
34966 495553 635893 575097 462559 511315 669225 700837 568479 483008 561838 686541
34956 686541 756900 844493 988427 1052106 930672 740683 651272 650781 629228 588721 618353
34945 618353 732940 874879 1012003 1105089 1052844 822906 583353 536791 648154 699202
34935 699202 601478 484984 465013 497082 508029 506101 493062 421014 322515 333820 475426
34924 475426 550463 412293 218549 231897 436325 559856 470709 345654 391787 576392
34914 576392 731014 792647 816992 832094 810682 762665 743991 763401 760815 705103 660904
34903 660904 723726 910657 1141786 1327036 1454224 1574919 1700311 1740751 1591848 1279677
34893A279677l08650j54581K977O2069M4122K514n1382r7307p8007k368n417j85620
34881E08027m05163l91898q3512K49545L12080J24436o0875j09659j06415j22589
34871h6023q6039M6664J60174J45841O4954J0220o6147k08169k58689n0617K61605
34860f6226L38364J34076m1122l358N5302n7361j86949r7991J14221J54875l5807
34849C08024k36717k74910j69339J1079K03809K81400J44908r0396j88197r0690
34839a01029M0014Q2068P3407N9037J6160k5332K3532J31581J35837j1478j43748
34828B80049j18974j4156K1444j8272m2110k8229k9395o3185q1650k7765J04846
34817a7397K29559K03044o306k08901j84497K3323J58915J10160K7344M4015Q2117
$$ plain form
34893 1279677 971027 816446 819423 881492 925614 928128 876746 779439 701432 699064 693647 508027
34881 508027 102864 -289034 -372546 -123001 189079 313515 252640 142981 36566 -86023
34871 -86023 -172062 -125398 34776 180617 245571 255791 189644 -18525 -277214 -327831 -66226
34860 -66226 272138 406214 365092 361734 417036 359675 172726 74735 188956 343831 308024
34849 308024 71307 -203603 -372942 -361863 -158054 123346 268254 177858 -10339 -101029
34839 -101029 -61015 21053 94460 153497 169657 144325 167857 299438 435275 423797 280049
34828 280049 161075 146919 168363 150091 107981 79752 50357 -12828 -94478 -122243 -17397
34817 -17397 212162 415206 408900 199999 15502 38825 197740 307900 335244 379259 461376
34806D61376L1104o0803r9133r6371q9018m3078L1259J5987j14232j65928J5409
34795a13428K64291K77042K8756j84456j27046J05311K37294J39445n1043j07464
34785D68702J9594J51719J28284K4133N976M5029k2564j68383j67446J7546J21338
34774F23928j7950j89454j36991N7304J39502O4254k5075o7356j05767j29983
34764B12412r4767k3397N0810J36279J64017O614k34529k12703J59316M47314
34754F11366K57072j69902l01661p1361J40909J45132Q5837J7875j59631l29784
34744B25852k15853R9366J85332o4451k28228k4410K42447J76395j26188k98157
34734b7895k31464p3813R1704K55491L14595J80984j7679o3267P0808K05194J68826
$$ plain form
34806 461376 492480 431677 332544 236173 147155 104077 135336 151323 37091 -128837 -113428
34795 -113428 150863 427905 456661 272205 145159 250470 487764 627209 576166 468702
34785 468702 488296 640015 768299 792432 798408 843437 820873 652490 485044 502590 623928
34774 623928 605978 416524 279533 336837 476339 540593 515518 448162 342395 212412
34764 212412 117645 94248 145058 281337 445354 451968 217439 4736 164052 611366
34754 611366 868438 698536 396875 325514 466423 611555 697392 715267 555636 225852
34744 225852 9999 109365 294697 230246 2018 -22392 220055 396450 270262 -27895
34734 -27895 -259359 -333172 -241468 14023 328618 509602 491923 428656 499464 704658 873484
34723H73484n3449k99952l22065l7522K83508K84265L794j59357k3380J43520
34713F92846Q4426q3028j57642j88005k55923k15050L8386K63156J82546p0834
34703B90878j54240k7637O6034L3734N225K4594l731o6116l2128Q3521J14710
34692C34844L4070Q058J08934J87966J14412l0659q7899k9824L9087K7007m6774
34681F59222p9146j4759O0347L4351l1365K4405J60990J31676j07679k35529j9753
34670E82760K83788K77641J8132p0445J75726M42939L92881P8047j80563j65910
34660A834996O0278K67314L07368K77613L74402N92684P52375Q63777J159156
34651F489963J568645J504302N58155p85367j581300j493552j018864o92540n43079
$$ plain form
34723 873484 820035 520083 198018 160496 444004 728269 732063 572706 549326 692846
34713 692846 777272 694244 536602 348597 92674 -122376 -83990 179166 361712 290878
34703 290878 136638 109001 175035 208769 213994 238588 234857 168741 136613 220134 334844
34692 334844 368914 376972 485906 673872 788284 757625 669726 639902 678989 705996 659222
34681 659222 580076 565317 625664 660015 628650 653055 814045 945721 838042 602513 582760
34670 582760 866548 1144189 1162321 1091876 1267602 1710541 2103422 2181469 2000906 1834996
34660 1834996 1895274 2162588 2469956 2747569 3121971 3714655 4467030 5330807 6489963
34651 6489963 8058608 9562910 10121065 9335698 7754398 6260846 5241982 4549442 4006363
34642D006363m07638l19005l42604l45790j89703L2154J41738J22858O8235L871
34632B770479r4002j92815k28946j95081j42537j25669j48283j33290M267K02248
34622A716371K69972J51515L3217N2515O7544q0457k47980k07949m5958j5059
34612A693731r7766o9633O2208O5172q9125j85682j73780k21485l13266k03210
34602D67164J18833L03242J41363j47645k85243k67135j79650j5442J49656J12930
34592C98073j24149k66705j50716K8085P7476Q4538J35980R9783p3358j55281
34582E3726j9767R2418j5765j27019J0307K13461J62860o2206j51616q3210n5450
34571A7739m6421J18376L35083K99576J8540j54902m8238J13056R3873m3774j25028
$$ plain form
34642 4006363 3598725 3279720 2937116 2591326 2401623 2433777 2575515 2698373 2766608 2770479
34632 2770479 2676477 2483662 2254716 2059635 1917098 1791429 1643146 1509856 1514123 1716371
34622 1716371 1986343 2137858 2171075 2223590 2291134 2210677 1962697 1754748 1708790 1693731
34612 1693731 1595965 1526332 1588540 1653712 1564587 1378905 1205125 983640 670374 467164
34602 467164 585997 889239 1030602 882957 597714 330579 150929 135487 285143 398073
34592 398073 273924 7219 -143497 -115412 -37936 46602 182582 282365 209007 53726
34582 53726 33959 126377 110612 -16407 -6100 207361 370221 308015 156399 73189 17739
34571 17739 -28682 89694 424777 724353 742893 587991 539753 652809 746682 702908 577880
34560E77880j11908n9205K162M8126M9208J8788j5801p0184j30877r5258P3898
34549B86829K10668J40142m8655j12641O637J46088J90226J77120J39789L2478
34539A168681j49173l09832l48370k37525l6265J16992J04926J154J7142J79934
34529E07664K29680k990k92703l11725q0500J23293J82874J91048J70390M9304
34519G66335j09045j35056k0192P5628P7498L8136m0832j87670k86742j88416
34509a0356J0167O0271m8118o3482J20095L05283L12933K05313R4786k8035j55208
34498H03649j71206n1493K6570o7278j92438j31286P9915J86607O8841q6944l9169
34487D25768J56518J83437q9344l41860j93908K08743L21553k5412l52621k29244
$$ plain form
34560 577880 465972 406767 408929 457055 506263 525051 509250 439066 308189 212931 286829
34549 286829 497497 637639 588984 476343 482980 629068 819294 996414 1136203 1168681
34539 1168681 1019508 709676 361306 123781 87516 204508 309434 310588 327730 507664
34529 507664 737344 734354 441651 129926 49426 172719 355593 546641 717031 766335
34519 766335 657290 522234 502042 577670 655168 693304 652472 464802 178060 -10356
34509 -10356 -189 60082 11964 -51518 68577 373860 686793 892106 986892 958857 803649
34498 803649 632443 580950 607520 540242 347804 216518 296433 483040 551881 464937 425768
34487 425768 582286 765723 676379 334519 140611 349354 670907 645495 292874 63630
34477F3630J20809K39849J39029J31428J97943N6983k35101l05825j00854K2583
34467C30474q5695j52747j7908R2637K2515k2159J16536K33142J33632j1031J7523
34456F56919J03771M0762r0920r4289n368K1659M683K7526L668j63995l13610
34445A90806k04038J11436L41230L29078J63326j9977j44935j63743q9399j1377
34435E02407L4478J05421J66131N8428j87727k54203N461K42341R0271k25647
34425E37361j92751J78983L50643R3423j73855p1580J67366J28487j16634j74155
34415G27288K9552J83617J13501j6648o0418j03926k04069k06156j6057J67680
34405F14364J26037l4839o5463J3514k4161j79376j90796K2314J99437J50870
$$ plain form
34477 63630 184439 424288 563317 694745 892688 949671 714570 408745 307891 330474
34467 330474 244779 92032 74124 166761 189276 167117 283653 516795 650427 639396 656919
34456 656919 760690 801452 710532 616243 610875 632534 637217 664743 668411 504416 190806
34445 190806 -13232 98204 439434 768512 931838 911861 766926 603183 513784 502407
34435 502407 536885 642306 808437 866865 679138 424935 430396 672737 763008 537361
34425 537361 344610 523593 874236 967659 793804 722224 889590 1018077 901443 727288
34415 727288 756840 940457 1053958 1037310 976892 872966 668897 462741 446684 614364
34405 614364 740401 705562 640099 653613 629452 450076 259280 281594 481031 631901
34395F31901M3036P6311J26850k4094k73283l04870m5392K49341L39999K25803
34385A045602L4852j19726j67844j09931k1487M6892J11557J35416J3762k04655
34375G64438k70828q7035R2466L8584q2722r232J47102R7445r8336j16617Q7433
34364E62698K32894J91163J20417J16602J04841R2324J61466K02733L5189j97943
34354A622384j59684J32702L15186K62749K06071K10590N6543k35612k95774k9910
34344B085245J52112l957j89709r3812Q4875M5947r0952p4090k578j09407l04023
34333A499651l12029j02883J19546J99701R6131j31130k40062N291M06851M48897
34323A989964M4804k42937o003M10458M66960J88603n0382j43825j96477j47708
$$ plain form
34395 631901 674937 751248 878098 854004 580721 275851 230459 479800 819799 1045602
34385 1045602 1080454 960728 792884 682953 661466 708358 819915 955331 969093 764438
34375 764438 493610 406575 499041 537625 454903 445671 592773 690218 591882 475265 562698
34364 562698 795592 986755 1107172 1223774 1328615 1420939 1582405 1785138 1820327 1622384
34354 1622384 1462700 1595402 1910588 2173337 2379408 2589998 2646541 2410929 2115155 2085245
34344 2085245 2237357 2233400 2043691 1949879 2034754 2080701 1989749 1915659 1913081 1803674 1499651
34333 1499651 1187622 1084739 1204285 1403986 1500117 1368987 1128925 1134216 1541067 1989964
34323 1989964 2034768 1791831 1785828 2196286 2663246 2851849 2801467 2657642 2461165 2313457
34313B313457P1297K35557J33894j9619R5427L69542M60988L43418K47677K39035
34303D490673K58070L97783P20101R73515R35557Q84417J267163K007442K625827
34294A4560548L019982L634576M692906N543665N004420K445146j360546m548410
34286C2992287n669447m967895l867352l249568k804433k097738j410670j104526
34278G820658r34226o10498m10503n71190o66504l14457M3306j41055n28053m68222
34268C219256j19578o9855k33091j04376J87407R6347k80379l59637j32409q0887
34258B122798j82629j7100K49445N9132m04800l82668J37254L71029J02684m0359
34248B014786J61367J56451k06654k89778J46896M28891J23115k54821j99166
$$ plain form
34313 2313457 2384754 2620311 2754205 2734586 2830013 3199555 3660543 4003961 4251638 4490673
34303 4490673 4748743 5146526 5866627 6840142 7775699 8660116 9927279 11934721 14560548
34294 14560548 17580530 21215106 25908012 31451677 36456097 38901243 37540697 32992287
34286 32992287 27322840 22354945 18487593 15238025 12433592 10335854 8925184 7820658
34278 7820658 6886432 6275934 5865431 5294241 4627737 4313280 4356586 4215531 3687478 3219256
34268 3219256 3099678 3029823 2796732 2692356 2879763 2976110 2695731 2336094 2203685 2122798
34258 2122798 1940169 1923069 2172514 2231646 1826846 1444178 1581432 1952461 2055145 2014786
34248 2014786 2176153 2332604 2125950 1836172 1983068 2411959 2535074 2280253 2081087
34239B081087P951J182o488J95635L08514J10297r9653p6299k1501n3033N5665
34228B503357K94439K75656k9335j35648J01763K39031R7195N1540K17167K09264
34218C824429k2280k3754K37932K40980m5180j9983L63973M06616j9367j59823
34208D783543K15561L72760M2114n0503L71960N51179J81691N5449N15023P42874
34198G781651L73783K73117Q37107J124122O51160L93997R37591J362897J115063
34189A4850488J134070J888900K289952J931066K216744L711344M818487M893342
34181C7734393N901470Q844486J1721821J3715437J7737517K5491995L4563154
34174A55710273M5025029O2530327Q5348974R2760066O1058577n041018o8501567
$$ plain form
34239 2081087 2089038 2090220 2083732 2279367 2587881 2698178 2598525 2522226 2500725 2447692 2503357
34228 2503357 2797796 3073452 3044117 2908469 3010232 3249263 3346458 3397998 3615165 3824429
34218 3824429 3802149 3778395 4016327 4257307 4212127 4192144 4556117 4962733 4943366 4783543
34208 4783543 4999104 5371864 5413978 5363475 5735435 6286614 6468305 6523754 7038777 7781651
34198 7781651 8155434 8428551 9265658 10389780 11040940 11434937 12372528 13735425 14850488
34189 14850488 15984558 17873458 20163410 22094476 24311220 28022564 32841051 37734393
34181 37734393 43635863 52480349 64202170 77917607 95655124 121147119 155710273
34174 155710273 200735302 263265629 348614603 441374669 502433246 497392228 428890661
34167D28890661r4776142q3490325n9715939m2494292l2208459k3414871j6212379
34160G6578254j2510476j0536508p945529n615609m969858m908169l960083k783269
34152B3348753k432349k370177j891810j558842j785747j782509j133437p49679
34144I644203j149442j403982q39214k42258l52728o13031m21930k49187n08647
34135C863784o23509j96811J08206j92843m65032j85077N7113k42829m53748j2208
34125A657046M03733M6962n12890l77663J29598J40538k11660j82093J54875J07921
34115A356367l12652m35009j24925P8639l9423j31554l7908n285j26116j94829
34105B7305j44933j08101o7864Q5857K34261J88628O1174P4716J45631N8264j02674
$$ plain form
34167 428890661 334114519 250624194 190908255 148413963 116205504 92790633 76578254
34160 76578254 64067778 53531270 45585741 39970132 35000274 30092105 26132022 23348753
34152 23348753 20916404 18546227 16654417 15095575 13309828 11527319 10393882 9644203
34144 9644203 8494761 7090779 6251565 6009307 5656579 5043548 4621618 4372431 3863784
34135 3863784 3240275 3043464 3151670 2958827 2493795 2308718 2365831 2123002 1669254 1657046
34125 1657046 2060779 2107741 1594851 1217188 1346786 1487324 1275664 1093571 1248446 1356367
34115 1356367 1043715 608706 483781 562420 522997 391443 353535 348250 222134 27305
34105 27305 -117628 -225729 -293593 -207736 26525 215153 276327 351043 496674 554938 452264
34094D52264j01834J3218K3171n9612p3127m7659j08029j80884j38324p4761j15419
34083d10996j33181R300J37125M3620j04776l0413J65472J77349J4295o3428j4207
34072b09840j7524q2451m1913R9610J63686J20752J03212J24838Q1702L322J8887
34061C64281R3961O6581o8732j55581j38065j06917j04446q6927n6914n3088m7114
34050b92961p595N367l5206j3029J34733K34061J08101j12794j59669k6111N3074
34039a12029j8338q8458k9920Q9926J38400O2736j02042k48086k38029n0189J49865
34028d46164J86531P8564k4472m2781p586K4330K310r9639k18876k40800j51363
34017i39946m2712O0830K13353L47588K94662Q6870j9096N1788N0982j45417k54771
$$ plain form
34094 452264 350430 363648 386819 327207 254080 206421 98392 -82492 -220816 -295577 -410996
34083 -410996 -544177 -534877 -397752 -354132 -458908 -489321 -323849 -146500 -132205 -195633 -209840
34072 -209840 -227364 -309815 -351728 -252118 -88432 32320 135532 260370 342072 345394 364281
34061 364281 458242 524823 456091 300510 162445 55528 -48918 -135845 -192759 -245847 -292961
34050 -292961 -300556 -295189 -330395 -343424 -208691 25370 133471 20677 -138992 -165103 -112029
34039 -112029 -130367 -218825 -248745 -158819 -20419 42317 -59725 -307811 -545840 -596029 -446164
34028 -446164 -259633 -181069 -205541 -248322 -255908 -231578 -229268 -328907 -547783 -788583 -939946
34017 -939946 -982658 -921828 -708475 -360887 -66225 20645 1549 53337 104319 -41098 -295869
34006b95869l0559K85495L02082O6262o6290j2027j3442j68306k82101k09195
33996d23950l1562J35957K59974K90140J86532N5222L3174N2454m2370j71358
33986C44213j03851J22434J86205k6339k16631j17246J08592J21119j08573k88836
33976B1087k08272M3949K39241K45675R2362r3288j76197j05813L9844J26333
33966B24921J00820L4314N332j5107r6096j92716j76559m4109M5256J4408k474
33955a02010R3054J50951J2393j78027j67593l738O1884R963L5064J13765Q575
33944C4281k34910k37633J01579L58781J90588j71307l06823j74918j069J20600
33934c20831J99449J60974m025j06363m6447j2595j29000j75762K8500K47672
$$ plain form
34006 -295869 -326428 -40933 261149 327411 261121 249094 235652 67346 -214755 -423950
33996 -423950 -455512 -319555 -59581 230559 417091 472313 505487 557941 515571 344213
33986 344213 240362 362796 549001 522662 306031 188785 297377 418496 309923 21087
33976 21087 -187185 -143236 96005 341680 434042 340754 164557 58744 98588 224921
33966 224921 325741 360055 365387 350280 254184 61468 -115091 -159200 -113944 -99536 -102010
33955 -102010 -8956 141995 154388 -23639 -191232 -194970 -133086 -123123 -88059 25706 34281
33944 34281 -200629 -438262 -336683 22098 212686 41379 -265444 -440362 -441431 -320831
33934 -320831 -121382 39592 35567 -70796 -117243 -129838 -258838 -434600 -406100 -158428
33924a58428K01824N0881Q3244J70605K0439k25217j84675Q6076J68501n989p5373
33913A31888Q6040J62777k2795k18472k00907r8859o4709l534J53340K31652J03190
33902B59611o6915p5114K7581P9075N8860L5268J3556k7909p0278j06141j42759
33891a5165j24563K578J45323J53251N0747n132K6516O7416J11947J74206J14222
33880G01346j67468m13420k69972J32143K78886K2738k11574j13417P1801K7032
33870E8095j17811p9121Q0922J05478j7193r5938p3585l6356k735M9453N0311
33859g8480m5740j12079k5609J06374R4015m4094j23641o0149O7958J55678J38643
33848G2876M610j44564j41272K2731J36317N6065p9753p0978M0399O1532n1632
$$ plain form
33924 -158428 43396 94277 177521 348126 368565 143348 -41327 44749 213250 207261 131888
33913 131888 217928 380705 357910 139438 -61469 -160328 -225037 -228571 -75231 156421 259611
33902 259611 192696 117582 145163 224238 283098 318366 331922 304013 233735 127594 -15165
33891 -15165 -139728 -137150 8173 161424 212171 207039 233555 300971 412918 587124 701346
33880 701346 533878 120458 -149514 -17371 261515 284253 72679 -40738 31063 58095
33870 58095 -59716 -138837 -57915 47563 30370 -65568 -139153 -175509 -178244 -128791 -78480
33859 -78480 -124220 -236299 -261908 -155534 -61519 -105613 -229254 -289403 -221445 -65767 72876
33848 72876 77486 -67078 -208350 -185619 -49302 6763 -72990 -143968 -103569 -42037 -93669
33837i3669j61143j52398k8078J44099K53886J89522j9460j69043j10569N1142
33827i5711J02293l870j29231j50554o8962L5008O7655j2073j25006j24813K4236
33816d81028J84193K03627P3414j03051k04749j40890P7319K83045K97138J51088
33806C40106K8332k6718j46829l40693l82123j32754K03806L14663J54130m9851
33796c7931r0133K2196J06794J4407j78541k13659R581K30212J59421p7703j27739
33785a83095K3284M9651j28202j97080j4458J26476J5016j11871j3771J27213
33775c06837P7367L726J38603K74723P0158l25924m36839j63177J21947J58884
33765c87369P6747N8237Q7930J02846J12045R9037J7224r1806j51827j92385k52823
$$ plain form
33837 -93669 -254812 -407210 -435288 -291189 -37303 152219 132759 -36284 -146853 -95711
33827 -95711 6582 2712 -126519 -277073 -346035 -311027 -243372 -255445 -380451 -505264 -481028
33816 -481028 -296835 -93208 -19794 -122845 -327594 -468484 -391165 -108120 189018 340106
33806 340106 368438 341720 194891 -145802 -527925 -660679 -456873 -142210 11920 -37931
33796 -37931 -128064 -105868 926 15333 -163208 -376867 -367286 -137074 22347 -55356 -183095
33785 -183095 -159811 -110160 -238362 -435442 -449900 -323424 -308408 -420279 -434050 -306837
33775 -306837 -229470 -225744 -87141 187582 257740 -68184 -505023 -668200 -546253 -387369
33765 -387369 -310622 -252385 -164455 -61609 50436 149473 166697 74891 -76936 -269321 -522144
33754e22144k22673l677K44382K76087J27871N5630J43453K31084K03528R9731
33744F33272m5992k20844l08296j90671L3645J60658J71233J76798J46470j4270
33734E42003j58389j8824L39498N29685L81307J52522R6243J17411K4091j34210
33724A871337j79669q9150J5092M8777P354q6573j74804j75892q2547J2674L6363
33713A202962K3386N5190J47743K13305J33347q2090k22769r9267J51097J89721
33703A712625k2476j28158O0642K18944K1652k93084k79959K682J07779q4750
33693A315897k49639j88369n8992l765K6051J8684j22329k86137k24421K5130
33683B52110J67319J41214J59957K15824M4990k94570l48137M116K52262J2009
$$ plain form
33754 -522144 -744817 -748494 -504112 -228025 -100154 -44524 98929 330013 533541 633272
33744 633272 587280 366436 58140 -132531 -98886 61772 233005 409803 556273 542003
33734 542003 383614 364790 704288 1233973 1615280 1767802 1864045 1981456 2005547 1871337
33724 1871337 1691668 1602518 1617610 1666387 1673741 1587168 1412364 1236472 1153925 1166599 1202962
33713 1202962 1226348 1281538 1429281 1642586 1775933 1693843 1471074 1371807 1522904 1712625
33703 1712625 1690149 1561991 1622633 1841577 1863229 1570145 1290186 1292868 1400647 1315897
33693 1315897 1066258 877889 818897 815132 841183 859867 737538 451401 226980 252110
33683 252110 419429 560643 720600 936424 981414 686844 338707 342823 595085 607094
33673F07094l79765m06978j28479L6491j7512o3000O68P2042J09773J38974J02595
33662G1903k1439q2890J2763R3618p804j42147p8458J06182J66017Q2993K7977
33651B28715L5296P545l9816j7125K4085k7343j09080q0459J0654q13j08338j48791
33639b25470o9949K7668Q1869J09890R6995J9586o0849p6452o4950p3550n0155
33628b85367L2892P4261J6798k0418M7315R4337J4958n4618J8853Q5855l4926
33617a0060j90667j07726J46071K52278J22359l9463j01902j15630r3440L658
33607a34522Q2022K2035n2628P5188L11411L27512O1442j85093j98450r0883k2044
33596A95990J6137M6432J1515o6885o7997J0466L6521l986K1574J23514J46601
$$ plain form
33673 607094 227329 -179649 -308128 -271637 -289149 -352149 -351481 -279439 -169666 -30692 71903
33662 71903 50464 -32426 -19663 73955 66151 -75996 -154454 -48272 117745 200738 228715
33651 228715 264011 271556 231740 214615 238700 211357 102277 21818 32472 31659 -76679 -225470
33639 -225470 -295419 -267751 -185882 -75992 21003 40589 -20260 -96712 -161662 -235212 -285367
33628 -285367 -252475 -178214 -161416 -181834 -134519 -40182 -25224 -79842 -60989 24866 -10060
33617 -10060 -200727 -308453 -162382 89896 212255 172792 70890 -44740 -138180 -134522
33607 -134522 -52500 -30465 -83093 -7905 303506 631018 692460 507367 308917 218034 195990
33596 195990 212127 258559 270074 203189 135192 145658 182179 178193 199767 323281 469882
33585D69882M8960l7062p2030j51982k26632r9958J83828K92952J03031q8425
33575D22564l9408O9858M349r6442N414J71209Q0900k11286l07595n1588K52088
33564C00063K77292P5619q4874r8572q5927j55423k42246k11586n8192P1384P2411
33553a40051K0016L3737P1205j97j47862j69023J4838K23085K59608J56223P0155
33542C91734M6905O378r1199j71300j35632J0572J23669N0640j58894k40759k8525
33531a96411K88858L81326J98499k0708j23820j81356k33533j80141j4754Q5253
33521C213L3174k6176J0341J4236j16461k19071j07399J08938J82539R5897L8048
33510A7279Q0491J00320J3555r9534j24858m8363O0490J28068J36289J27680J23430
$$ plain form
33585 469882 518842 481780 409750 257768 31136 -68822 115006 407958 510989 422564
33575 422564 383156 453014 457363 360921 366335 537544 618444 407158 99563 47975 300063
33564 300063 577355 652974 568100 469528 383601 228178 -14068 -225654 -283846 -212462 -140051
33553 -140051 -120035 -86298 -15093 -15290 -163152 -332175 -317337 -94252 165356 321579 391734
33542 391734 438639 445017 353818 182518 46886 57458 181127 231767 72873 -167886 -196411
33531 -196411 92447 473773 672272 651564 527744 346388 112855 -67286 -82040 3213
33521 3213 36387 10211 20552 34788 -81673 -300744 -408143 -299205 -116666 -20769 17279
33510 17279 97770 198090 211645 112111 -12747 -61110 -620 127448 263737 391417 514847
33499E14847O2647p8256j49273k429K00022J20609k31901m16135j67299J95281
33489D8113K30302j890j10966Q10P0003m3125j74242j80742j28466q6916m389
33478c81508J26601J98351J69907J36914J43360R4831n6020j88235j75611o5613
33468B977j0937q5994k15354k38227n0938K51889M18083L11602R0784n479J9721
33457D88127k1094j71749k68275k01423m6158R1381J71309J47201k631j34991
33447E1697m6439K17105L66779K72663J41305J71813K54060J84013p838j55722
33437A449436k40261l34144l68495k16367K5068R4874n8151j89197j15844L8023
33427H4942O7748j1365m3771J341K6382J5038N8798J60354J80321N0515r2081
$$ plain form
33499 514847 577494 499238 349965 347536 547558 668167 436266 20131 -147168 48113
33489 48113 278415 276525 165559 166369 236372 193247 19005 -161737 -290203 -377119 -381508
33478 -381508 -254907 -56556 113351 250265 393625 488456 432436 244201 68590 2977
33468 2977 -7960 -93954 -309308 -547535 -598473 -346584 71499 383101 473885 468406 488127
33457 488127 467033 295284 27009 -174414 -220572 -129191 42118 189319 186688 51697
33447 51697 5258 222363 589142 861805 1003110 1174923 1428983 1612996 1605158 1449436
33437 1449436 1209175 875031 506536 290169 315237 410111 351960 162763 46919 84942
33427 84942 152690 141325 97554 98895 125277 140315 199113 359467 539788 590303 498222
33416D98222q9455J2138M4356l5336j16994j36592j52210j97454j92464o5399
33406d31188J25314K47861K18049M5318j63909k45677j32470K4222K3619q3250
33396c72111n5658J30326J93203j34j60428k183K76761K71982p897j72220n5527
33385D6114Q9538N3938l4742j1122M2972k848p2030j4426J64643L55870M75174
33374A093081M25817J20216l12437n32561l91956j60932j48025k56748j80116
33365c43661Q3444K15867N6427j92033k78219j89216m8534P6152J60284J61985
33355b97504Q5213J8168K9150Q5494J21721J18108P1071l9243j96202l11621k92017
33344f07662j22735J13977K71775K25634P328j65179j03853J02473J83033M7524
$$ plain form
33416 498222 408767 420905 465261 429925 312931 176339 24129 -173325 -365789 -431188
33406 -431188 -305874 -58013 160036 205354 41445 -204232 -336702 -312480 -288861 -372111
33396 -372111 -427769 -297443 -104240 -104374 -264802 -266985 9776 281758 273861 101641 46114
33385 46114 135652 189590 154848 143726 186698 183850 111820 97394 262037 617907 1093081
33374 1093081 1518898 1639114 1326677 794116 402160 241228 93203 -163545 -343661
33365 -343661 -260217 -44350 12077 -179956 -458175 -647391 -695925 -619773 -459489 -297504
33355 -297504 -212291 -194123 -164973 -79479 42242 160350 231421 192178 -4024 -315645 -607662
33344 -607662 -730397 -616420 -344645 -119011 -111683 -276862 -380715 -278242 -95209 -47685
33334d7685r7776o1752O5262Q9242K2941K5210R9553Q0164o5799j41808k3740
33323e6188J18131N3926j56696k28938l3514K47376L57413K30325r429j92397
33313C30009k07284o4182Q7089Q7351l3666q3072K0023J18455N8262p3817j02069
33302A37099m6199n9288j38298j17780M3725J84770J90065J16452J2041j68065
33292A54522l56935l17487K1426L50622L34425N5458j35766j16186n5731m3158
33282a08810K6017J50132J36780n1610j52555K530J85889J07671j32079k12272
33272d8307r0583j4797p8075r9187M621M6571q6427j86062k9534K46951L16478
33261a8351J06640j38843j99037q9604M5760R4988K4173j03125j45594k7356J48809
$$ plain form
33334 -47685 -145461 -207213 -141951 -52709 -29768 -4558 94995 175159 109360 -32448 -56188
33323 -56188 61943 115869 -40827 -269765 -303279 -55903 301510 531835 522406 330009
33313 330009 122725 58543 145632 232983 199317 116245 136268 254723 312985 239168 137099
33302 137099 90900 31612 -106686 -224466 -180741 4029 194094 310546 322587 154522
33292 154522 -202413 -519900 -498474 -147852 186573 242031 106265 -9921 -65652 -108810
33282 -108810 -82793 67339 204119 152509 -46 2484 188373 296044 163965 -48307
33272 -48307 -138890 -153687 -231762 -330949 -326328 -279757 -366184 -552246 -581780 -334829 -18351
33261 -18351 88289 -50554 -249591 -339195 -293435 -198447 -174274 -277399 -422993 -450349 -301540
33250c01540K24122J78388R4474p30j04649j19670K2442J54813M7459k06506k62803
33239b74200n3936O5233j39517l87388k88001Q3499L29020L04036K16428K07888
33229F3062J73686L5939r1912j07773o9293m1437K0043J25916J53087J4998j78390
33218I7926k54032j95753j22772j00600p9296n840R0370J47208J55348J52944
33208a14497J48077J02497K2420q03P2131J08041l2807k35411k39522l5994R6578
33197a09290M0446L0362K10682L09742O9870k52941k31845N2811J43340o1420
33187B01757k00707j04902m3943j84985k75115r9264J38420J63513M2054k7287
33177c90459m8473q5348m5859J10436J85792M7367j06049o2661M6474J6689l9758
$$ plain form
33250 -301540 -77418 100970 195444 194714 90065 -29605 -7163 147650 195109 -11397 -274200
33239 -274200 -328136 -262903 -402420 -789808 -1077809 -994310 -665290 -361254 -144826 63062
33229 63062 236748 272687 180775 73002 3709 -37728 -17685 108231 261318 276316 97926
33218 97926 -156106 -351859 -474631 -575231 -654527 -660367 -569997 -422789 -267441 -114497
33208 -114497 33580 136077 158497 157694 229825 337866 305059 69648 -169874 -205868 -109290
33197 -109290 -68844 -38482 172200 481942 551812 298871 67026 119837 263177 201757
33187 201757 1050 -103852 -147795 -332780 -607895 -707159 -568739 -405226 -363172 -390459
33177 -390459 -438932 -524280 -570139 -459703 -273911 -226544 -332593 -395254 -348780 -332091 -371849
33166c71849O8544J93950Q4547j14547m5445K50562L57759J22816j59156k44615
33156A42566k23881k06779j05814J04515K22361J04429j02921j76740q7901N3284
33146b76881J54653J57258N3668m6985l3116R133q6980k42560j92380P2963K23545
33135b07682P5147j26014q4509J23628K25817J51157K8059o6545j36306j52075
33125a69323j00905n9558o3045p271J62119K87576K08941K7201l7757L1710P3967
33114C53655K8136j8266l0734p3397j47060j57358p3444J8942M8541L2148N101
33103a3736k1689l0625j3671j2012n3004p2968o153P6870M6698p5642j23569k3505
33091c23006R9575J06497K4696k8367j9898p840j3716J4993J04559J84904J65214
$$ plain form
33166 -371849 -303305 -109355 -24808 -139355 -184800 65762 423521 546337 387181 142566
33156 142566 -81315 -288094 -393908 -289393 -67032 37397 -65524 -242264 -330165 -276881
33146 -276881 -122228 35030 88698 41713 8597 17730 -69250 -311810 -504190 -431227 -207682
33135 -207682 -132535 -258549 -343058 -219430 6387 157544 185603 119058 -17248 -169323
33125 -169323 -270228 -329786 -392831 -400102 -237983 49593 258534 285735 247978 279688 353655
33114 353655 381791 363525 332791 259394 112334 -45024 -118468 -99526 -50985 -18837 -13736
33103 -13736 -35425 -66050 -79721 -91733 -144737 -217705 -223858 -146988 -100290 -175932 -299501 -323006
33091 -323006 -223431 -116934 -92238 -120605 -140503 -148343 -162059 -147066 -42507 142397 307611
33080C07611N7127k7585j3088N0526O4838J0634n3382q4983q1023l1033O2297
33069B61939J26335Q4428j3499l4846L7453O4814m4423k01108k64442k08595r6440
33058b88384K2141J15024J47484J20498O7352j4900j38285k15924j28372N7080
33048b56286J09955k9200j23293J2341K12229K04337J1041j18556q5253j4575
33038g7260J062R941M8887O9845L9482k0040q0426r0730K2394K04901K31458L978
33026C63492k12858j11467J79515K46721K404k02808j30399L7701P1569L5260
33016B79130N1025K1434j40476k37390o0653K14843K34442j5037j99833j34607
33006A2878J4589N7975L5824M5209M2007l3598r0174j2407J27076J41419o053
$$ plain form
33080 307611 364738 337153 324065 374591 439429 450063 396681 311698 230675 199642 261939
33069 261939 388274 472702 459203 424357 461810 526624 482201 281093 16651 -191944 -288384
33058 -288384 -266243 -151219 -3735 116763 184115 169215 30930 -184994 -313366 -256286
33048 -256286 -146331 -175531 -298824 -286483 -74254 130083 141124 22568 -62685 -77260
33038 -77260 -76198 -66257 -17370 52475 91957 71917 -8509 -99239 -76845 128056 359514 363492
33026 363492 150634 39167 218682 465403 467807 264999 134600 172301 243870 279130
33016 279130 330155 351589 211113 -26277 -86930 127913 362355 347318 147485 12878
33006 12878 27467 85442 121266 166475 208482 174884 84710 72303 199379 340798 334745
32995C34745j42481j17403K197L6843n3008j20435o4857j0520j36488l67160l99557
32984a038124r8651K80226L91242K25164P3463J03033J54607K2566k09885k49714
32974c46073K2686L63781M17048J15257k44919l55531k40861j52592j85846j81491
32964g88541l5274J06778R0746J6624N9028J47581P2440j40768k23377n4502J78536
32953e70729K72093K36742J48363o925j98185k57009j04746P4172P7958j4218
32943c42484O797J33259J76131Q5721p033m7859j07099j52028l2040K23429L27929
32932B64723J04649k40197l68540k19032j7905L6523l4382p2001L4843K17432
32922b93887K57619L9103k29213k11828Q3378K58231P3520j96389j76658N8811
$$ plain form
32995 334745 192264 74861 77058 113901 60893 -59542 -124399 -134919 -271407 -638567 -1038124
32984 -1038124 -1136775 -856549 -465307 -240143 -166680 -63647 90960 113526 -96359 -346073
32974 -346073 -323387 40394 457442 572699 327780 -27751 -268612 -421204 -607050 -788541
32964 -788541 -823815 -717037 -626291 -609667 -550639 -403058 -330618 -471386 -694763 -749265 -570729
32953 -570729 -298636 -61894 86469 79544 -118641 -375650 -480396 -406224 -328266 -342484
32943 -342484 -335687 -202428 -26297 59424 52391 4532 -102567 -254595 -286635 -63206 264723
32932 264723 369372 129175 -239365 -458397 -476302 -439779 -474161 -546162 -511319 -293887
32922 -293887 -36268 2835 -226378 -438206 -354828 -96597 -23077 -219466 -396124 -337313
32912c37313J59285O4434K4660J11527J09851m9059j24284K4404J85208J43097
32902C11810J3408O733P6075M0837r2669j72409j54809j05101l2829P4233J29764
32891I5043N5654n4837n9049J5654M6467K8434K4660p510j17580j68953j1638
32880a53655J96140J42628j44073k75334o5512J87423J48832q2138j70695l0472
32870b46856J33939J61082Q0064k5355j01807r3602R361R4244L6156j13373j74571
32859b40718p7699O6653J38317J22704M0509r9261k22735j93556J5545K35533
32849b14708K80893J62458L2548k9962o8671j10236j06160l6894L7823P8426J17625
32838A43142J57466J17817k6870j54898j55750r8796j04706j23259k3439J36509
$$ plain form
32912 -337313 -178028 -113594 -88934 22593 132444 83385 -40899 -16495 168713 311810
32902 311810 325218 331951 408026 448863 356194 183785 28976 -76125 -108954 -34721 95043
32891 95043 150697 95860 36811 52465 98932 127366 152026 144516 26936 -142017 -153655
32880 -153655 42485 185113 41040 -234294 -299806 -112383 36449 -45689 -216384 -246856
32870 -246856 -112917 48165 128229 102874 1067 -92535 -83174 11070 47226 -66147 -240718
32859 -240718 -318417 -251764 -113447 9257 49766 -49495 -272230 -465786 -450241 -214708
32849 -214708 66185 228643 261191 231229 162558 52322 -53838 -90732 -52909 25517 143142
32838 143142 300608 418425 391555 236657 80907 -17889 -122595 -245854 -269293 -132784
32828a32784J52414N012q3453Q038J26874J30685J20753K21468L21278K54209
32818A124494J00426O9676J74385K45295K10189J41149P4561l787l8211J9808
32808B117985O1250k7613j16696q089J71983Q8203k49988l98684r5983L28871
32798A871239L86150N4368k63044k75540o4624J34301K04592J88202J70985J64252
32788B570881R0398q5215k43829k46491j58734j77759l18338l66758k12576k6314
32778H25265M033o7597q8827n5839n4748p1786k7423O7546J22577R0824l636j09851
32766F30538j67519j47631j01096q0300k7064J19444K33366J36252q1835j42812
32756C71343j6794L3515p6226r6599Q2442J81525M516j92504j24520M3882J3420
$$ plain form
32828 -132784 19630 24642 -58811 -50773 76101 206786 327539 549007 870285 1124494
32818 1124494 1224920 1294596 1468981 1714276 1924465 2065614 2140175 2136388 2098177 2117985
32808 2117985 2179235 2151622 2034926 2026837 2198820 2287023 2037035 1638351 1542368 1871239
32798 1871239 2257389 2311757 2048713 1773173 1708549 1842850 2047442 2235644 2406629 2570881
32788 2570881 2661279 2576064 2332235 2085744 1927010 1749251 1430913 1064155 851579 825265
32778 825265 829298 761701 672874 617035 562287 490501 463078 530624 653201 744025 740389 630538
32766 630538 463019 315388 214292 133992 106928 226372 459738 595990 514155 371343
32756 371343 354549 388064 311838 215239 297681 479206 483722 291218 166698 210580 224000
32745B24000j26335r7397O2497J22728J02193J48392J42064r7636l47334k44947
32735a11775N7020O6107k29643l08579K6316L24164K18902n1199j30345q0129
32725b19161r7749r5999O4808K25292J72035J3847j4582N5279L1704q7023j47569
32714i9118j15559p5494n0225j5313K069m876L4039J23062J47823Q1402N6883
32703H4693J11441Q4074p9232j72699p6819J1586o2743j01336R0264K81526J37877
32692C08632k09093l22387j03289J17108J01556l8409j27334j46550j20808m0259
32682e80833N8423J23479J86901K54463J86103p5076k62693r3468K52573L18795
32672C68667L0260k14575j64354l9804r7350k14487j35195J09740K59752J72874
$$ plain form
32745 224000 97665 268 62765 185493 287686 436078 578142 480506 133172 -111775
32735 -111775 -54755 11352 -218291 -526870 -500554 -176390 42512 -8687 -139032 -219161
32725 -219161 -316910 -412909 -348101 -122809 49226 63073 48491 103770 135474 48451 -99118
32714 -99118 -214677 -290171 -340396 -355709 -353640 -358516 -324477 -201415 -53592 27810 84693
32703 84693 196134 280208 200976 28277 -48542 -36956 -99699 -201035 -110771 170755 308632
32692 308632 99539 -222848 -326137 -209029 -107473 -145882 -273216 -419766 -540574 -580833
32682 -580833 -522410 -398931 -212030 42433 228536 153460 -109233 -202701 49872 368667
32672 368667 398927 184352 19998 -19806 -117156 -331643 -466838 -357098 -97346 75528
32662G5528m4987j77814r1398J22368J91419n977k03486o9145K71688L54914N0575
32651D73685k49091k32705q3903q0315j30814k1777J47256J34637q706k9372J01818
32640B0713J76229J05900M638n5957j02707r7713J6881J20300K6199j88429k32365
32629b06311k7787J66635J42695J0711l8647j9329l3166m4474L2387J29989J06618
32618B19321k3768j06647p0187Q131N0013N8872M2816j8005q6327o0521P5681
32607H9379J75378R4885r9635j91871q6271P2042Q9624l6756j48185j44932p5675
32596b62017n864Q2960J95786K24402P4793j37539j72344J0061J45105K83k75420
32585a19794l08305L632L32450L32990O2129j48541j30100n305O9422P9737M3419
$$ plain form
32662 75528 30541 -147273 -238671 -116303 75116 69139 -134347 -203492 68196 423110 473685
32651 473685 224594 -8111 -92014 -172329 -303143 -324920 -177664 -43027 -51733 -81105 20713
32640 20713 196942 302842 307480 251523 148816 51103 67984 188284 214483 26054 -206311
32629 -206311 -234098 -67463 75232 85943 47296 27967 -5199 -49673 -17286 112703 219321
32618 219321 195553 88906 18719 26850 76863 135735 178551 160546 74219 13698 89379
32607 89379 264757 359642 260007 68136 -18135 53907 143531 106775 -41410 -186342 -262017
32596 -262017 -267881 -184921 10865 235267 310060 172521 177 10238 155343 155626 -119794
32585 -119794 -428099 -424467 -92017 240973 303102 154561 24461 19156 88578 168315 211734
32574B11734p3859k35877k85283j44672L9997Q5891J7282p983N5580J11208R4650
32563a31332M5075J9837M1712J01851J30168K8538j62618k24541l5111K08822
32553B2401K33350P2102j9384K7563N0765N054L1255J20235M4480k34865m07676
32542e4720k66534l8229r105p1713L3168K17923J78261p0902j90680o0753M8766
32531b84518n4208j74522o7828J61144K23121O2020j04669r8411L7711J50145
32521a50015J46376N2442k9059k0926L6931L3333n1118r7201k0142Q3557N7749
32510D1927q4955j67455q6021N5233R0176n92r3571r7714m5160j950L2124Q2887
32498b75071J13202N7533o0085j19790m4865J02283J87091J29130m2368k03517
$$ plain form
32574 211734 137875 -98002 -383285 -527957 -487960 -402069 -384787 -392770 -337190 -225982 -131332
32563 -131332 -86257 -66420 -24708 77143 207311 235849 73231 -151310 -186421 22401
32553 22401 255751 327853 308469 336032 386797 391851 423106 543341 587821 352956 -54720
32542 -54720 -321254 -359483 -368588 -440301 -407133 -189210 -10949 -81851 -272531 -333284 -284518
32531 -284518 -338726 -513248 -581076 -419932 -196811 -134791 -239460 -337871 -300160 -150015
32521 -150015 -3639 48803 19744 -1182 35749 69082 17964 -79237 -99379 -15822 41927
32510 41927 -43028 -210483 -296504 -241271 -151095 -151687 -245258 -342972 -388132 -390082 -357958 -275071
32498 -275071 -161869 -104336 -164421 -284211 -329076 -226793 -39702 89428 47060 -156457
32488a56457k05508j5515J88591J69435o6668k28576j00302J59863K24572L4873
32478D308j45168j00322R2235K34652K55190J88606M6737j49066k78157k16276
32468f7261j8676J10399N7182p9726j37100p3728M0909J44489J99306J44988m0361
32457B80421k29726k29887l0227J42413J01167o7792j58696j34520j04223q1437
32447e12507K8633K07146K94975K31545J31257O4304m0848j91346k37106j18807
32437a42754j4111o6252j43342o9700O2081N0250o7194q6043J9436R0986P9002
32426b87641P7521R1455L1825o4070p0442k7040p5170j38410N451K87427L46170
32415A77076Q4453j40075p2046N1951n6707k34475j60963Q7414J84932R8453O2393
$$ plain form
32488 -156457 -361965 -377480 -188889 -19454 -86122 -314698 -415000 -255137 -30565 4308
32478 4308 -140860 -241182 -148947 85705 340895 529501 576238 427172 149015 -67261
32468 -67261 -85937 24462 81644 1918 -135182 -208910 -168001 -23512 175794 320782 280421
32457 280421 50695 -179192 -209419 -67006 34161 -33631 -192327 -326847 -431070 -512507
32447 -512507 -483874 -276728 18247 249792 381049 445353 404505 213159 -23947 -142754
32437 -142754 -156865 -223117 -366459 -436159 -374078 -323828 -391022 -477065 -457629 -366643 -287641
32426 -287641 -210120 -118665 -86840 -150910 -221352 -248392 -323562 -461972 -456521 -169094 177076
32415 177076 261529 121454 49408 101359 44652 -189823 -350786 -263372 -78440 20013 82406
32404H2406J03771K7198j40333j28233Q3494J66489j2406j37667L6789K56131
32394C37639J65682j07295j52755O3590J36071j60755n22055n23756j68517J59550
32384g72601J86313K4295l9581R0905K45434K42517J17756K9651P555o2431j96771
32373a26958k35744r4923O2161N3635m2195l1067O4214N3976o8432r6437L0021
32362d31749J04027q38j14318o9912J042r7442k73404k97926j93998j81768k94397
32351a850683l58344l57353m88304p63325q55992n22258L6544M21014M97456M42290
32341c798955M41552N17654N82219N24550L06055N9226K475J66682L20003K66590
32331f11949R1857m708K4063J12265K27306L03377J91567j05819k99386j66608
$$ plain form
32404 82406 186177 213375 73042 -55191 28303 194792 182386 44719 81508 337639
32394 337639 503321 396026 243271 306861 442932 282177 -239878 -763634 -932151 -772601
32384 -772601 -586288 -561993 -601574 -510669 -265235 -22718 95038 124689 132244 69813 -126958
32373 -126958 -362702 -457625 -395464 -341829 -384024 -415091 -350877 -296901 -365333 -461770 -431749
32362 -431749 -327722 -328560 -442878 -512790 -511748 -609190 -882594 -1180520 -1374518 -1556286 -1850683
32351 -1850683 -2209027 -2566380 -3054684 -3818009 -4674001 -5196259 -5159715 -4738701 -4241245 -3798955
32341 -3798955 -3357403 -2839749 -2257530 -1732980 -1426925 -1367699 -1365224 -1198542 -878539 -611949
32331 -611949 -520092 -524800 -500737 -388472 -161166 142211 333778 227959 -71427 -238035
32321b38035Q5763J02964p8030j06580J13861K99740K51342R4296j3206r0142
32311D21973j51025j19378m0766r3354k59787k78604o5833J14051P1088k1265
32301d22900K6329Q7551P198o1662O5250K20388J41194o4628q9070O6864J42479
32290A18993R4725J20364K22152J64851p8068k16715j02800M1007Q625o8693N869
32279C10310J38926J07114p0563j59198n5551P8632M4156j44712k75198j77520
32269b03604O7287K02541J04922o4967j04209n4331q6455j81586j50602M1065
32259d29939K02149K06530J39845R5665L5317o3435j16341r6949j08510j78038
32249c13706j60766J1524J60517J11237l0419l9888R1136J76731J25728K1581
$$ plain form
32321 -238035 -152272 -49308 -127338 -233918 -120057 179683 431025 525321 512115 421973
32311 421973 270948 151570 110804 17450 -242337 -520941 -586774 -472723 -401635 -422900
32301 -422900 -396571 -309020 -301822 -363484 -298234 -77846 63348 -1280 -90350 -23486 118993
32290 118993 213718 334082 556234 721085 643017 426302 323502 364509 373134 304441 310310
32279 310310 449236 556350 485787 326589 271038 349670 393826 249114 -26084 -203604
32269 -203604 -136317 66224 171146 106179 1970 -52361 -138816 -320402 -471004 -429939
32259 -429939 -227790 -21260 118585 214250 249567 186132 69791 -27158 -135668 -313706
32249 -313706 -474472 -462948 -302431 -191194 -221613 -261501 -170365 6366 132094 153675
32239A53675n0130q2124o5942J3468R4147P5867l6101j21419r4211R755R3828
32228i187Q5285k2815j49157j70442o0565N1882M5962j6680J1847J29113J85411
32217H0654J27987Q1362J20324J15611o1288k83031k99028r5960P1165N3434J2762
32206g6008J21526K40160J30402j14713j62671L3701J38499k7765j85880o3275
32196C3976J34483N5007k08435k62996m9812R9656L2554k7051P5166J78277J46181
32185B07006R2734R4769J8198j65022k12701j4838J42239R012j97905j38178J00657
32174f4029J69411K1881p5684j7943L2624n612j7290M9579R1194N5294P887k8887
32162B18425r8179j67724j62263j13228q8020l1752J07884J88827O9945r0837
$$ plain form
32239 153675 103545 21421 -44521 -31053 63094 138961 102860 -18559 -112770 -103015 -9187
32228 -9187 76098 53283 -95874 -266316 -326881 -274999 -229037 -245717 -233870 -104757 80654
32217 80654 208641 290003 410327 525938 464650 181619 -117409 -213369 -142204 -88770 -76008
32206 -76008 45518 285678 416080 301367 138696 172397 310896 283131 97251 33976
32196 33976 168459 223466 15031 -247965 -297777 -198121 -165567 -192618 -117452 60825 207006
32185 207006 299740 394509 412707 247685 34984 20146 162385 171397 -26508 -164686 -64029
32174 -64029 105382 127263 51579 33636 66260 60648 43358 92937 184131 239425 247312 218425
32162 218425 120246 -47478 -209741 -322969 -410989 -442741 -334857 -146030 -76085 -166922
32152a66922m2869J23028R8440j20944k23515j02370J3435K895J9579J18885J30209
32141a50149L2279M2280J73667J43967p4635r1444K22218L77480J3877m33287
32131B56253l42983J43155L74898J77222m1502n4165n4187j23240o8420R6404
32121C63435O0364k07567k92191P108K92876J63586j72070k40227J442J94723
32111A71479J53589M1893K9470P1245N3396m1599j51262j99709j47382m3878P956
32100e4802j1245j6450K0184Q593q3142j26668j5238J67683K70031K52337J50756
32089E62039j0822j59597j64785k3985P6996L0513j9385O2878J40588K9861j55143
32078C69158j61625j3324L4634p7075j33102j5031J29644J52387Q8054o5j23604
$$ plain form
32152 -166922 -209791 -86763 11677 -109267 -332782 -435152 -421717 -418822 -399243 -280358 -150149
32141 -150149 -117870 -75590 98077 242044 167409 75965 298183 675663 689540 256253
32131 256253 -86730 56425 431323 608545 567043 512878 458691 335451 267031 363435
32121 363435 423799 216232 -75959 -68851 224025 387611 215541 -24686 -23244 171479
32111 171479 325068 366961 396431 467676 521072 479473 328211 128502 -18880 -62758 -54802
32100 -54802 -66047 -82497 -62313 -53720 -136862 -263530 -278768 -111085 158946 411283 562039
32089 562039 551217 391620 226835 202850 279846 310359 290974 353852 494440 524301 369158
32078 369158 207533 194209 228843 151768 18666 3635 133279 285666 373720 373655 250051
32067B50051k26017j62617N7030K05177J42225R775j0894M0517L4412r603J4106
32056C44162R9452J46602J04617j1131j57607k40531j74247m4193m8606j80288
32046a61770j73003Q0160K84606J59479j08939j41560N2347J32368n505j08582
32036I601l3300M5919j0730q1218m4576K1165N4516J42177K58473J60991k07294
32025C15724m63870k50733K16216M01321J64021j19222j30951J9379P2900j0935
32015B13850r6963r4364m69J44795K36558J45925j07404l07359k72862p9363M8605
32004a69051K3524l0417J9031J33311J72957R2287o859k1603J6244P542m8851
31993A88115n3247K6666R4166P7662L7108L3563R2j30251k54269k22416q4472
$$ plain form
32067 250051 24034 -138583 -81553 123624 265849 275624 264730 305247 339659 330056 344162
32056 344162 443614 590216 694833 683702 526095 285564 111317 67124 18518 -161770
32046 -161770 -334773 -254613 29993 189472 80533 -61027 -8680 123688 118183 9601
32036 9601 -23699 22220 11490 -69728 -114304 -93139 -38623 103554 362027 523018 315724
32025 315724 -148146 -398879 -182663 218658 382679 263457 132506 151885 224785 213850
32015 213850 116887 22523 22054 166849 403407 549332 441928 134569 -138293 -217656 -169051
32004 -169051 -145527 -175944 -156913 -23602 149355 241642 234783 213180 229424 236966 188115
31993 188115 134868 161534 255700 333362 370470 404033 404125 273874 19605 -202811 -287283
31982b87283k3401n2826R229K13120L34388J84629r4587k16371j27356k2794l1511
31971a14763p2214m1158J9280J5102l9028m5811L3422J36758J83590J45626M7315
31960B68119n4083q7472j6616J05536J61226P8896q7229k04977j83014l6402J35505
31949G9489K12773J34605l2584j27010n0273J13061J88887J13078k6901j28156
31939D76969j55995r9715L4016J57758J54893M0578m4694m8017p1922j63268j97147
31928H3456q5067N7798J00248J01553J57079J86389R1853p683L5749R1564n4974
31917G57965k70340k00778J58701M03967L14361J32814J08209J28121L6899j7615
31907A552304J30265K88350J72183j20505k51704j52865n4553p2882j01953r5643
$$ plain form
31982 -287283 -310684 -363510 -354281 -141161 193227 377856 283269 66898 -60458 -83252 -114763
31971 -114763 -186977 -228135 -208855 -193753 -232781 -278592 -245170 -108412 75178 220804 268119
31960 268119 214036 126564 109948 215484 376710 455606 368377 163400 -19614 -56016 79489
31949 79489 292262 426867 394283 267273 217000 330061 518948 632026 605125 476969
31939 476969 320974 221259 255275 413033 567926 608504 563810 515793 443871 280603 83456
31928 83456 -1611 56187 156435 257988 415067 601456 693309 685626 721375 812939 757965
31917 757965 487625 286847 445548 849515 1163876 1296690 1404899 1533020 1569919 1552304
31907 1552304 1682569 1970919 2143102 2022597 1770893 1618028 1563475 1490593 1388640 1292997
31897A292997j27383j50683k0567J86852J88974n8525k22601o4652J96680K09082
31887A430174j2421j54012o7668P8756R4104k558p9376p2374m896P4799J04262
31876A388790J5307j87823l73657l85231k28595r8618j45333k56155j91672N6541
31866d06446K07294P9295j18940o9091J85874K86738O4916k32895k97578j36454
31856d37287K0038M2471j0152l6810O247J05303J83621J33134n9749k50604k73959
31845e77747j18573Q7581K21739K36043J40442J007p9967o2067j8709k5512m3785
31834b39548l358M8160N322j01872j19149l317R2122M2023n6527l0631J03450
31823b63325J62323O2703p0460r1394j4142N3727O8967O3089N2752K6411j0644
$$ plain form
31897 1292997 1165614 1014931 994364 1181216 1370190 1311665 1089064 1024412 1221092 1430174
31887 1430174 1417753 1263741 1196073 1274829 1368933 1366375 1286999 1214625 1209729 1284528 1388790
31876 1388790 1404097 1216274 842617 457386 228791 130173 -15160 -271315 -462987 -406446
31866 -406446 -199152 -119857 -238797 -307888 -122014 164724 229640 -3255 -300833 -437287
31856 -437287 -417249 -374778 -384930 -421740 -415493 -310190 -126569 6565 -53184 -303788 -577747
31845 -577747 -696320 -608739 -387000 -150957 -10515 -9508 -89475 -151542 -170251 -195763 -239548
31834 -239548 -242906 -194746 -189424 -291296 -410445 -413762 -321640 -279617 -336144 -366775 -263325
31823 -263325 -101002 -38299 -108759 -200153 -214295 -160568 -91601 -28512 24240 50651 40007
31812D0007n3544j27868k17890k00145K7848L45930M71165K80930k0999j38346
31802D07088j5741J36946J05586j14246l35580l59095j56691R2621J80026Q6262
31792B7176l4248p7284p8728o1944L7832K03860K53978P9985j51927k17717j51907
31781a70924j42470j86468j00577J32758K81603J89758j8550j43766j51095j13209
31771d22940n9742Q352N6952O2007M2380K930p0154j32904j12836l7959r623k5977
31759f99514J4607J07323J26508P1587J07649K54775K69423J1330k76520k83511
31749b96343p0470O0337J8860k7107M153J3004k7372L730J32912K08039J41362
31738A61105M0588K091m4841j67778k62344k01674m6976L9686K5703J4194N7976
$$ plain form
31812 40007 -13537 -141405 -359295 -559440 -531592 -185662 285503 566433 545434 407088
31802 407088 391347 528293 633879 519633 184053 -175042 -331733 -239112 -59086 27176
31792 27176 -7072 -84356 -163084 -225028 -187196 16664 270642 350627 198700 -19017 -170924
31781 -170924 -313394 -499862 -600439 -467681 -186078 3680 -14870 -158636 -309731 -422940
31771 -422940 -482682 -474330 -417378 -355371 -312991 -310061 -380215 -513119 -625955 -663914 -673537 -699514
31759 -699514 -684907 -577584 -451076 -379489 -271840 -17065 252358 263688 -12832 -296343
31749 -296343 -366813 -306476 -287616 -314723 -310570 -297566 -324938 -321208 -188296 19743 161105
31738 161105 201693 203784 158943 -8835 -271179 -472853 -519829 -480143 -454440 -440246 -382270
31727c82270R5783P3810L1748M2081J15468J84191J63439M0865q7153j07868l5250
31716A34844N94o1140j19396p5058l882m2334j48040j35289L5384J67529J05581
31705a41207l8906o1877L7197R5333O2894N1690J05094J11936J3319p1763l3496
31694A30214M7237L1460o2237j11033q5709n8143o0305o4774o5180n6449J3959
31683c40960J45380J97188O3655j18334j28947j236K6976r4446j32854N0274K55421
31672g7883K20406k1007k07372j78284j3701R2504K3781j41470j87924k2562J56924
31661c56588J06257r2896j39016J3904R0564k6160r2573N2357J78880O2548j05341
31650c08064l6031J53644J33309q8829j90455m7639J31766J71488J10018J6953
$$ plain form
31727 -382270 -286487 -212677 -180929 -138848 -23380 160811 324250 365115 277962 170094 134844
31716 134844 135438 74298 -45098 -120156 -124038 -166372 -314412 -449701 -414317 -246788 -141207
31705 -141207 -180113 -241990 -204793 -109460 -46566 5124 110218 222154 235473 163710 130214
31694 130214 177451 208911 146674 35641 -50068 -108211 -168516 -233290 -298470 -354919 -340960
31683 -340960 -195580 1608 65263 -53071 -182018 -183254 -156278 -250724 -383578 -333304 -77883
31672 -77883 142523 121516 -85856 -264140 -277841 -185337 -161556 -303026 -490950 -513512 -356588
31661 -356588 -250331 -343227 -482243 -468339 -377775 -403935 -496508 -444151 -265271 -202723 -308064
31650 -308064 -344095 -190451 -57142 -145971 -336426 -384065 -252299 -80811 29207 46160
31640D6160r5123j66719j40164r1363q8221m354K40037L66391O6078m08058m51682
31629g27018K3007M09769K70377q4958j54183K3661P1898p2371j36208k009J61756
31618b16279K16983J93387J18464k8920j76747j86626n9858M5827L5557j9219
31608g7431k1361K2804N1456M5550M0856P2412J20601J19342M5350k4860j7705
31597C77014O856n5873j54438j34707j0319K1001r8923j59729o334J98130K06514
31586A89192L4714j14039j50733j26103m9817R8485K26709K06309P7149l762r116
31575C78988n4614j55207j61599r064J31698P1408j24647k14970j09489J0811
31565b36685m4533j88603j64633O8995K30977R3027j79843k41391k6512K14145
$$ plain form
31640 46160 -48963 -215682 -355846 -447209 -535430 -539784 -299747 66644 132722 -275336 -727018
31629 -727018 -704011 -294242 -23865 -108823 -263006 -239345 -167447 -239818 -376026 -378035 -216279
31618 -216279 704 194091 312555 283635 106888 -79738 -139596 -93769 -58212 -77431
31608 -77431 -98792 -75988 -24532 21018 61874 134286 254887 374229 419579 394719 377014
31597 377014 383870 327997 173559 38852 28533 49534 -49389 -209118 -215452 -17322 189192
31586 189192 223906 109867 -40866 -166969 -216786 -118301 108408 314717 391866 388104 378988
31575 378988 324374 169167 7568 -1496 130202 201610 76963 -138007 -247496 -236685
31565 -236685 -281218 -469821 -634454 -565459 -334482 -241455 -421298 -662689 -689201 -475056
31555d75056K97141K76890K26087J09721m9822j21828q1309o1076r9463o5824
31545d4539N9812Q9532m7856j44736n3657O9798O5182M0039J00830Q8312j09804
31534A12913k41996o6480J72814P9633k31977k84831J1131K42290J58403o685
31524e4785J688Q2935M7015o7130j28787j24295p3875M0693J39562N8182j75623
31513b54420k91648j36569J11929K13966J60197P2497j069n5326n1435K033K4823
31502b05022Q734L8257J06082R3683M468j949R6301R7036p6722j84847k8798K02376
31490A49599J83406r2027l40190l71796k31024k3483J84797L23189L37929K53814
31480C74214J18860n9932k37020k78481j21527Q6183J37758J2380j34698j74527
$$ plain form
31555 -475056 -177915 98975 325062 434783 384961 263133 181824 120748 21285 -44539
31545 -44539 15273 104805 56949 -87787 -141444 -71646 -6464 33575 134405 222717 112913
31534 112913 -129083 -195563 -22749 56884 -175093 -459924 -448793 -206503 -48100 -54785
31524 -54785 -53097 29838 76853 9723 -119064 -243359 -317234 -276541 -136979 -78797 -254420
31513 -254420 -546068 -682637 -570708 -356742 -196545 -124048 -125117 -180443 -231878 -229845 -205022
31502 -205022 -196288 -158031 -51949 41734 46202 44253 140554 237590 160868 -23979 -52777 149599
31490 149599 333005 240978 -99212 -471008 -702032 -725515 -540718 -217529 120400 374214
31480 374214 493074 433142 196122 -82359 -203886 -117703 20055 32435 -102263 -276790
31470b76790j01428J6527R3090P6655J1622j1232O53m9820j57378j77022n4267
31459f29390O4404N8989J6948N1360R1559K8545n7053j3507J13767J33478N7j18411
31447b59254p4754P3357J38043J2218j88095k08748L5427K80118K13038o3417
31437d2067j39262Q2146K10360j2534k70709j61855J60607K36304Q115j56062
31427h4957p4384N0828N5068K6596K5350m6984j71245j27772J41620L50879K42509
31416C87508n0965k07826j39646l2043m5676j33479j41242o093J55967J68248
31406d5247K5141o1616N6911K19429J50806j36080l30156k25353M4457K09997
31396i1711J56870k3313j47508q9617Q1810J41725l183j46127o7874J12053J15110
$$ plain form
31470 -276790 -378218 -361691 -268601 -191946 -180324 -191556 -190903 -240723 -398101 -575123 -629390
31459 -629390 -564986 -505997 -489049 -437689 -346130 -317585 -374638 -388145 -274378 -140900 -140843 -259254
31447 -259254 -334008 -260651 -122608 -110390 -298485 -507233 -471806 -191688 21350 -42067
31437 -42067 -181329 -99183 111177 98643 -172066 -333921 -173314 62990 71105 -84957
31427 -84957 -159341 -108513 -53445 -26849 -1499 -48483 -219728 -347500 -205880 144999 387508
31416 387508 336543 128717 -10929 -42972 -88648 -222127 -363369 -369462 -213495 -45247
31406 -45247 -20106 -81722 -24811 194618 345424 209344 -120812 -346165 -301708 -91711
31396 -91711 65159 41846 -105662 -195279 -113469 28256 25073 -121054 -188928 -76875 38235
31385C8235m9546j23529m4760o459n6532j6605J19538J00022j19867k10739Q243
31374c61999K34271J54086o0183o8533P9477R1234m0839o3742O6196J20568J382
31363A51918j18162r1564J9688R8520R9397J3958j06634j20172K4771J29440n805
31352I5355k29887k16960K7767J54252L235j66718j03551Q2110J61450J40945
31342e2002J49412J54438L9839j34205j82999p6820K3082J1437l1546J1352J25340
31331C7328J90255J26629j1809q3124j0022J12501J16287k0936j38291j14052
31321B04766k8681k5271r3985j14605o1820l0520o3877q6062l2600O0885J38752
31310a33018J93256K01219R6964j03975k39902j81924k7857J7140p0020j17807
$$ plain form
31385 38235 -11311 -134840 -179600 -186059 -242591 -259196 -139658 -39636 -159503 -370242 -361999
31374 -361999 -127728 26358 -33825 -102358 -22881 68353 27514 -36228 29968 150536 151918
31363 151918 33756 -57808 -38120 60400 159797 173755 67121 -53051 -28280 101160 95355
31352 95355 -134532 -351492 -323725 -169473 -166238 -332956 -436507 -354397 -192947 -52002
31342 -52002 97410 251848 291687 157482 -25517 -102337 -79255 -67818 -99364 -88012 37328
31331 37328 227583 354212 342403 259279 249257 361758 478045 457109 318818 204766
31321 204766 176085 150814 56829 -57776 -119596 -150116 -213993 -300055 -332655 -271770 -133018
31310 -133018 60238 261457 358421 254446 14544 -167380 -195237 -178097 -248117 -365924
31300c65924n1196q968q1986j16738M5602K63133K58538L6824j16511o9404o961
31289b13591o9408r6203P1518K47644J44695j47418k38525L413K59402K14224
31279A75751l5416j77938j14948j302L9392L3083J3349m9707j35981j38035k0900
31268d12652Q2323M1954o2549m0864J10977J59690m4955l15101l31496o0805J94970
31257f78508J91908L4422j4551J06862K26826K07649R6248K922m2169o4000o1582
31246F027j7337N2333J04224J07988N4148m9691j57567j82136o7136J18865K04901
31235A74619R3587r1037j13398P1536K14657P9225k13852l18947j40724L6085
31225b08249k2483j52461o5739J81812K60818O2395j48589j26733L6367J03417
$$ plain form
31300 -365924 -417120 -426088 -508074 -624812 -579210 -316077 -57539 -20715 -137226 -206630 -213591
31289 -213591 -282999 -379202 -307684 -60040 84655 -62763 -301288 -297875 -38473 175751
31279 175751 140335 -37603 -152551 -153853 -114461 -81378 -68029 -117736 -253717 -391752 -412652
31268 -412652 -330329 -288375 -350924 -391788 -280811 -121121 -166076 -481177 -812673 -873478 -678508
31257 -678508 -486600 -452178 -466729 -359867 -133041 74608 170856 173778 131609 67609 6027
31246 6027 -11310 41023 145247 253235 307383 257692 100125 -82011 -149147 -30282 174619
31235 174619 268206 177169 63771 135307 349964 429189 215337 -103610 -244334 -208249
31225 -208249 -230732 -383193 -448932 -267120 -6302 56093 -92496 -219229 -182862 -79445
31215g9445K9625m3281l2403J118j6709p0171q9115k8970Q1940J50883J06712
31204A0184m672o2609l0755P70k6241l0091P3735K00655J84290J1221j49270j60142
31192A7075n9867L8084R6389J44029J76702J49060O0241j5430j7309K821p8673
31181E13122k82545m25032k80287J20847M42839L92027O3998j72527j20724N6865
31171C08583J17264L7679n8056j28415k07253k49887j70484j3661Q0036Q6229
31161a97965J10411J68527J36103j9057j32687q1849K8734N1057K1706M2689O0343
31150A88012l2799j56289j24490N4805J71790J10950k6140j06340j02185l2492
31140e5178O3007P9223m6673j75544j10220R0856J69796O5246j1518M1186N7310
$$ plain form
31215 -79445 -49820 -93101 -125504 -124386 -141095 -211266 -300381 -329351 -247411 -96528 10184
31204 10184 5512 -57097 -87852 -87082 -113323 -143414 -69679 130976 315266 326487 177217 17075
31192 17075 -42792 -4708 91681 235710 412412 561472 621713 606283 588974 591795 513122
31181 513122 230577 -194455 -474742 -353895 88944 480971 544969 372442 251718 308583
31171 308583 425847 463526 405470 277055 69802 -180085 -350569 -364230 -284194 -197965
31161 -197965 -87554 80973 217076 198019 65332 -16517 12217 63274 84980 127669 188012
31150 188012 155213 -1076 -125566 -70761 101029 211979 185839 79499 -22686 -55178
31140 -55178 7829 87052 40379 -135165 -245385 -154529 15267 80513 68995 110181 167491
31129A67491m5159o9935Q9042J80634r471k40122j46281J75025L00062J20330
31119E21616m9094j1042M8627o0196k14262k10717q7055k0332n2417q1997m7973
31108b64842P571K4044l190j8450L2407J08043Q6584n3352j39427k2677J72893
31097g0396J89541l39j56611j11563L0758Q0349k706j13081j31377j8635J33908
31086a70152J61704K6256r9629p1043J23n4790j35889k3933K02082K29377J4491
31075G8597j24373r878J35278Q6415l3476j2636R2347R4879j1903j02413j29164
31064F3673j03266r390R8839Q0014n9799r5806P5227K23768J30272n8783p7313
31053B67436K9801K3123j03636j31791l833R4868M2412p7185j51990j57317q5931
$$ plain form
31129 167491 122332 52397 141439 322073 312602 72480 -73801 101224 401286 521616
31119 521616 472522 461480 510107 449911 235649 24932 -62123 -82455 -134872 -216869 -264842
31108 -264842 -257271 -233227 -236417 -254867 -222460 -114417 -27833 -81185 -220612 -243289 -70396
31097 -70396 119145 118806 -37805 -149368 -118610 -38261 -40967 -154048 -285425 -304060 -170152
31086 -170152 -8448 17808 -81821 -152864 -152741 -207531 -343420 -367353 -165271 64106 78597
31075 78597 -45776 -55654 79624 166039 132563 119927 212274 307153 295250 192837 63673
31064 63673 -39593 -48983 49856 129870 70071 -25735 49492 273260 403532 344749 267436
31053 267436 297237 320360 216724 84933 81100 175968 218380 141195 -10795 -168112 -254043
31042b54043N3572J64651J48083N1601p72R228J5959Q628J683n2924j64066k04667
$$ plain form
31042 -254043 -200471 -35820 112263 163864 163092 172320 188279 196907 198590 145666 -18400 -223067
$$ [...]
##END NTUPLES=NMR SPECTRUM
##END=
