##TITLE=31Pdec_PR190_rm
 CDCl3, 24 sc
 2.3.2020
##JCAMPDX= 6.0         $$ Bruker NMR JCAMP-DX V2.0
##DATA TYPE= NMR SPECTRUM
##DATA CLASS= NTUPLES
##ORIGIN= UXNMR, Bruker Analytische Messtechnik GmbH
##OWNER= root
$$ XWIN-NMR		Version 3.5
$$ Mon Mar  2 14:33:29 2020 Russian Standard Time (UT+4h)  she@DPX200
##.OBSERVE FREQUENCY= 81.013821
##.OBSERVE NUCLEUS= ^31P
##.ACQUISITION MODE= SIMULTANEOUS
##.ACQUISITION SCHEME= undefined
##.AVERAGES= 24
##.DIGITISER RES= 17
##SPECTROMETER/DATA SYSTEM= spect
##.PULSE SEQUENCE= zgpg30
##.SOLVENT NAME= D2O
##.SHIFT REFERENCE= (INTERNAL, D2O, 0, 182.463)
##AUDIT TRAIL= $$ (NUMBER, WHEN, WHO, WHERE, WHAT)
$$ ##TITLE= Audit trail, XWIN-NMR		Version 3.5
$$ ##JCAMPDX= 5.01
$$ ##ORIGIN= Bruker BioSpin GmbH
$$ ##OWNER= she
$$ F:/spectra/data/she/nmr/P31/1/pdata/1/auditp.txt
$$ ##AUDIT TRAIL=  $$ (NUMBER, WHEN, WHO, WHERE, WHAT)
(   1,<2020-03-02 14:32:33.93 +0400>,<she>,<DPX200>,
      <created by zg, POWCHK disabled, PULCHK disabled
       configuration hash MD5:
       00 E9 B6 7A A2 85 ED C7 34 08 36 98 17 FE 4E 26
       data hash MD5: 32K
       06 05 5C 16 19 9A CC 10 4B 5F 1B 96 31 5E C7 46>)
(   2,<2020-03-02 14:32:36.59 +0400>,<she>,<DPX200>,
      <Start of raw data processing
       efp BC_mod = 2 LB = 1 FT_mod = 6 PKNL = 1 PHC0 = -1622.033 PHC1 = 690.4013 SI = 64K 
       data hash MD5: 64K
       E0 22 5C D1 F7 F8 AD E9 23 35 FA E6 0C BD 6C DD>)
(   3,<2020-03-02 14:32:54.43 +0400>,<she>,<DPX200>,
      <pk PHC0 = 2.019669 PHC1 = 0 
       data hash MD5: 64K
       D1 D5 94 56 2B 98 FE 7C A1 06 BB 00 2A E7 9E 6E>)
(   4,<2020-03-02 14:32:57.51 +0400>,<she>,<DPX200>,
      <abs ABSG = 5 
       data hash MD5: 64K
       46 26 78 6C A5 86 C3 19 DB AD AA 55 5D 52 FD 28>)
$$ ##END=
$$ 
$$ hash MD5
$$ 47 ED B7 3E 6D 7A 0D A7 2E 7E 18 79 8B 6B 73 29
##$RELAX= 
##$RELAX= 
##$RELAX= 
##$RELAX= 
##$RELAX= 
##$RELAX= 
##$RELAX= 
##$RELAX= 
$$ Bruker specific parameters
$$ --------------------------
##$DU= <F:/spectra>
##$EXPNO= 1
##$NAME= <P31>
##$PROCNO= 1
##$TYPE= <nmr>
##$USER= <she>
##$AMP= (0..31)
100 100 100 100 100 100 100 100 100 100 100 100 100 100 100 100 100 100 
100 100 100 100 100 100 100 100 100 100 100 100 100 100 
##$AQSEQ= 0
##$AQ_mod= 1
##$AUNM= <au_zg>
##$AUTOPOS= <>
##$BF1= 81.014009
##$BF2= 200.13
##$BF3= 200.13
##$BF4= 200.13
##$BF5= 200.13
##$BF6= 200.13
##$BF7= 200.13
##$BF8= 200.13
##$BYTORDA= 1
##$CFDGTYP= 0
##$CFRGTYP= 5
##$CHEMSTR= <none>
##$CNST= (0..31)
1 1 145 1 1 1 1 1 1 1 1 1 1 1 1 1 1 1 1 1 1 1 1 1 1 1 1 1 1 1 1 1 
##$CPDPRG= <waltz16>
##$CPDPRG1= <>
##$CPDPRG2= <waltz16>
##$CPDPRG3= <>
##$CPDPRG4= <mlev>
##$CPDPRG5= <mlev>
##$CPDPRG6= <mlev>
##$CPDPRG7= <mlev>
##$CPDPRG8= <mlev>
##$CPDPRGB= <>
##$CPDPRGT= <>
##$D= (0..31)
0 1 0 0 0 0 0 0 0 0 0 0.03 2e-05 3e-06 0 0 0 0 0 0 0 0 0 0 0 0 0 0 0 0 
0 0 
##$DATE= 1583145153
##$DBL= (0..7)
120 120 120 11 120 120 24 19 
##$DBP= (0..7)
150 150 150 150 150 150 150 150 
##$DBP07= 0
##$DBPNAM0= <>
##$DBPNAM1= <>
##$DBPNAM2= <>
$$ [...]
##$SUBNAM3= <"">
##$SUBNAM4= <"">
##$SUBNAM5= <"">
##$SUBNAM6= <"">
##$SUBNAM7= <"">
##$SUBNAM8= <"">
##$SUBNAM9= <"">
##$SW= 369.568048894756
##$SWIBOX= (0..15)
0 1 3 0 0 0 0 0 0 0 0 0 0 0 0 0 
##$SW_h= 29940.119760479
##$TD= 32768
##$TD0= 1
##$TE= 0
##$TE2= 300
##$TE3= 300
##$TEG= 300
##$TL= (0..7)
0 120 53 12 22 120 120 120 
##$TP= (0..7)
150 150 150 150 150 150 150 150 
##$TP07= 0
##$TPNAME0= <>
##$TPNAME1= <>
##$TPNAME2= <>
##$TPNAME3= <>
##$TPNAME4= <>
##$TPNAME5= <>
##$TPNAME6= <>
##$TPNAME7= <>
##$TPOAL= (0..7)
0.5 0.5 0.5 0.5 0.5 0.5 0.5 0.5 
##$TPOFFS= (0..7)
0 0 0 0 0 0 0 0 
##$TUNHIN= 0
##$TUNHOUT= 0
##$TUNXOUT= 0
##$USERA1= <user>
##$USERA2= <user>
##$USERA3= <user>
##$USERA4= <user>
##$USERA5= <user>
##$V9= 5
##$VALIST= <valist>
##$VCLIST= <CCCCCCCCCCCCCCC>
##$VD= 0
##$VDLIST= <DDDDDDDDDDDDDDD>
##$VPLIST= <PPPPPPPPPPPPPPP>
##$VTLIST= <TTTTTTTTTTTTTTT>
##$WBST= 1024
##$WBSW= 4
##$XGAIN= (0..3)
0 0 0 0 
##$XL= 0
##$YL= 0
##$YMAX_a= 50643
##$YMIN_a= -61387
##$ZGOPTNS= <>
##$ZL1= 120
##$ZL2= 120
##$ZL3= 120
##$ZL4= 120
##$ABSF1= 182.463
##$ABSF2= -187.1042
##$ABSG= 5
##$ABSL= 3
##$ALPHA= 0
##$AQORDER= 0
##$ASSFAC= 0
##$ASSFACI= 0
##$ASSFACX= 0
##$ASSWID= 0
##$AUNMP= <proc_1d>
##$AZFE= 0.1
##$AZFW= 0.5
##$BCFW= 0
##$BC_mod= 2
##$BYTORDP= 0
##$COROFFS= 0
##$CY= -3
##$DATMOD= 1
##$DC= 0
##$DFILT= <>
##$DTYPP= 0
##$F1P= 0
##$F2P= 0
##$FCOR= 1
##$FTSIZE= 65536
##$FT_mod= 6
##$GAMMA= 0
##$GB= 0
##$INTBC= 1
##$INTSCL= 5.30512e-09
##$ISEN= 30
##$LB= 1
##$LEV0= 0
##$LPBIN= 0
##$MAXI= 10000
##$MC2= 0
##$MEAN= 0
##$ME_mod= 0
##$MI= 50
##$NCOEF= 0
##$NC_proc= -4
##$NLEV= 6
##$NOISF1= 182.463
##$NOISF2= 159.3651
##$NSP= 0
##$NTH_PI= 0
##$NZP= 0
##$OFFSET= 182.463
##$PC= 4
##$PHC0= -1620.013
##$PHC1= 690.4013
##$PH_mod= 1
##$PKNL= yes
##$PPARMOD= 0
##$PSCAL= 0
##$PSIGN= 0
##$REVERSE= no
##$SF= 81.0140089999434
##$SI= 65536
##$SIGF1= 159.3651
##$SIGF2= -187.1042
##$SINO= 113.3802
##$SIOLD= 16384
##$SREGLST= <1H.CDCl3>
##$SSB= 0
##$STSI= 65536
##$STSR= 0
##$SW_p= 29940.119760479
##$SYMM= 0
##$S_DEV= 0
##$TDeff= 32768
##$TDoff= 0
##$TI= <>
##$TILT= no
##$TM1= 0
##$TM2= 0
##$TOPLEV= 0
##$USERP1= <user>
##$USERP2= <user>
##$USERP3= <user>
##$USERP4= <user>
##$USERP5= <user>
##$WDW= 1
##$XDIM= 65536
##$YMAX_p= 427114768
##$YMIN_p= -7362554
$$ End of Bruker specific parameters
$$ ---------------------------------
##NTUPLES= NMR SPECTRUM
##VAR_NAME=  FREQUENCY,     SPECTRUM/REAL,   SPECTRUM/IMAG
##SYMBOL=    X,             R,               I
##VAR_TYPE=  INDEPENDENT,   DEPENDENT,       DEPENDENT
##VAR_FORM=  AFFN,          ASDF,            ASDF
##VAR_DIM=   65536,         65536,           65536
##UNITS=     HZ,            ARBITRARY UNITS, ARBITRARY UNITS
##FACTOR=    0.456856943014862, 1,           1
##FIRST=     14782.0589164792, 0,            0
##LAST=      -15158.0608439998, 0,           0
##MIN=       -15158.0608439998, -7362554,    0
##MAX=       14782.0589164792, 427114768,    0
$$ Real data points
##PAGE= N=1
##DATA TABLE= (X++(R..R)), XYDATA
$$ [...]
37196c51919P0472N0622J95518J71950p9643k30848j49939n0002k7900L9497J24446
$$ -351919 -281447 -230825 -35307 136643 57000 -173848 -323787 -373789 -401689 -362192 -237746
37185b37746N7107p8301j7171J97544K46421P6656k0994Q0571J76893J33285O8768
$$ -237746 -180639 -258940 -276111 -78567 167854 244510 223516 304087 480980 614265 683033
37174F83033O1226J1311j16644k05932k00658j71180j55787j46456j81595k46347
$$ 683033 744259 755570 638926 432994 232336 61156 -94631 -241087 -422682 -669029
37164f69029j95386j9J08652J0113l9058J48489K79326P6137j28230R1041L98381
$$ -669029 -864415 -864434 -755782 -745669 -784727 -636238 -356912 -280775 -409005 -317964 80417
37153H0417J37348m92790n78697R1856O35108L91704j57022k57353N536O5364
$$ 80417 217765 -275025 -853722 -761866 -126758 264946 107924 -149429 -143893 -78529
37143g8529j36170j79866N3489K29854J27955q5250j69760j05848k3717j0827
$$ -78529 -214699 -394565 -341076 -111222 16733 -68517 -238277 -344125 -367842 -378669
37133c78669l9237m4973o2272j77542k72782m0371M98613P63764L46508k62893
$$ -378669 -417906 -462879 -525151 -702693 -975475 -1015846 -517233 246531 593039 330146
37123C30146k93224J23956J78803k30607k99193K61790O23552J93969l71001k79872
$$ 330146 36922 160878 339681 109074 -190119 71671 695223 889192 518191 238319
37113B38319Q1401q1351n15308l69543K67697M78481O3132j88627R7963L02616
$$ 238319 319720 238369 -276939 -646482 -378785 99696 162828 -25799 72164 374780
37103C74780l0252m18454l29212m7574o4678k16932p8353K33346K85767Q2064
$$ 374780 344528 -73926 -403138 -450712 -515390 -732322 -810675 -577329 -291562 -209498
37093b09498q056J00957J49346L1421r1459j35129j73479k02364j47143p3791
$$ -209498 -217554 -116597 32749 64170 -27289 -162418 -335897 -538261 -685404 -759195
37083g59195r2143r3002J02049L55694L26640N055k06170o2757J68430J10516
$$ -759195 -851338 -944340 -842291 -486597 -159957 -154902 -361072 -423829 -255399 -144883
37073a44883j99869m10656l28224p2348J57683K59830K06390M6381n4877L9604
$$ -144883 -344752 -755408 -1083632 -1155980 -998297 -738467 -532077 -485696 -540573 -500969
37063e00969K09117J69366j17307l11956j47905J42964J13255k47797m53347j79031
$$ -500969 -291852 -122486 -239793 -551749 -699654 -556690 -443435 -691232 -1144579 -1323610
37053a323610L01180N04408L30449L5961j94422l47290l49718r2440K78504M04518
$$ -1323610 -1022430 -518022 -187573 -151612 -346034 -693324 -1043042 -1135482 -856978 -452460
37043d52460J78097p2343k7673J74615J52030j59913l91113k15394K17570M40279
$$ -452460 -274363 -346706 -374379 -199764 -47734 -207647 -598760 -814154 -596584 -156305
37033a56305K15124j82225k85805N807L20045K87279j4421k15918j52345o752
$$ -156305 58819 -123406 -409211 -403404 -83359 203920 189499 -26419 -178764 -185516
37023a85516J7952l6952j8537Q6419J38168L1162j62407k33963n4799K26461L03087
$$ -185516 -167564 -204516 -223053 -136634 1534 32696 -129711 -363674 -418473 -192012 111075
37012A11075J04599p6220o968J12755j9070k57150k01246J00268J35516k56443
$$ 111075 215674 139454 132486 245241 226171 -30979 -232225 -131957 3559 -252884
37002b52884n51886l05609J77945L30713J49308O8738K21537L23948K13471L0575
$$ -252884 -804770 -1110379 -932434 -601721 -452413 -383675 -162138 161810 375281 405856
36992D05856j19962k58801k75770j9109L11262L08713j332j38852M2393O1994
$$ 405856 285894 27093 -248677 -267786 43476 352189 350857 212005 254398 316392
36982C16392l58079o63230k16301O25160Q52498J89145n13333m53434Q1006K34384
$$ 316392 -41687 -704917 -921218 -296058 556440 745585 232252 -221182 -140176 94208
36972I4208k00278n89416m05209J11157L86215K77319J07235R8874J25932N5378
$$ 94208 -106070 -695486 -1100695 -989538 -603323 -326004 -218769 -119895 6037 61415
36962F1415K0694J64334L10312J60128k50502n39975m44747r8480J89986K61624
$$ 61415 82109 246443 556755 716883 466381 -73594 -518341 -616821 -426835 -165211
36952a65211J58610J6649k0573Q7551J95529J22897q9974k35547k52608k60028
$$ -165211 -6601 10048 -10525 77026 272555 395452 305478 69931 -182677 -442705
36942d42705k51180o4982K23985K45655r1400l09037j3001M42530M26411q249
$$ -442705 -693885 -758867 -534882 -289227 -380627 -689664 -702665 -260135 166276 158027
36932A58027k11285L0457J67036k05470o58011n39968Q3676N53636M90600J30198
$$ 158027 -53258 -22801 144235 -61235 -719246 -1259214 -1175538 -621902 -131302 -1104
36922a104j45890k26719j73482j7796J94032L22616K44434n438k52802l20396
$$ -1104 -146994 -373713 -547195 -564991 -370959 -48343 196091 190653 -62149 -382545
36912c82545j51390J45762L72140M01165K70484J03810j6237p4076q1829o4840
$$ -382545 -533935 -388173 -16033 385132 655616 759426 743189 669113 587284 522444
36902E22444m8078l1296k8768j26638l75324n88058m25145J69676P39725P38152
$$ 522444 474366 443070 414302 287664 -87660 -675718 -1100863 -931187 -191462 546690
36892E46690J65724m01491m65132j31864J02214j7051k41337j96943J19799L56951
$$ 546690 712414 310923 -154209 -286073 -183859 -200910 -442247 -639190 -519391 -162440
36882a62440K81436N6849l8820L949L0013Q0996L30076O43237N66002o8964p87950
$$ -162440 118996 175845 137025 140974 170987 251983 582059 1225296 1791298 1722334 934384
36871I34384r76879n69532j4179K89378K74335O8550j36889j47181M5491J80346
$$ 934384 -42495 -612027 -626206 -336828 -62493 6057 -130832 -278013 -232522 -52176
36861e2176O9260q2845M997J69075J8403l51046l68175J43394O01983M66277k6217
$$ -52176 17084 -65761 -60764 108311 126714 -224332 -592507 -449113 152870 619147 592930
36850E92930l12865l40438m26307n18492k33173L69843O72839L70715n3408n0127
$$ 592930 280065 -60373 -486680 -1005172 -1238345 -868502 -195663 175052 121644 71517
36840G1517K07307J94637q1917j19436K30024M74806J92758l82435p18462o39644
$$ 71517 278824 473461 391544 272108 502132 976938 1169696 787261 68799 -570845
36830e70845l62884r2043J24099K44695K41709K21470L02462L87811K82099K5761
$$ -570845 -933729 -1025772 -901673 -656978 -415269 -193799 108663 496474 778573 804334
36820H04334j24002p3524k0830j36960l28214m05443l10783r0558J82655L72842
$$ 804334 680332 606808 585978 449018 120804 -284639 -595422 -685980 -503325 -130483
36810a30483L46393J81420J35659K83760L58577J05777l39982n86244m02328Q0405
$$ -130483 215910 397330 532989 816749 1175326 1281103 941121 354877 -47451 32954
36800C2954M72906L90204j90956p56373o86599p661N53260M57676K1030r4015
$$ 32954 505860 896064 705108 -51265 -737864 -745525 -192265 265411 286441 192426
36790A92426K04531M13547K00632j95644l35947p8615L09387L85369m8509o30747
$$ 192426 396957 810504 1011136 815492 479545 400930 710317 1095686 1047177 416430
36780D16430p30966k24747K89041K94424M2653L8843J93881O7927k71875l29726
$$ 416430 -314536 -539283 -250242 44182 86835 125678 319559 387486 115611 -214115
36770b14115n4443O7821j33754k40046P199L02448L67998L72753M56100L64886
$$ -214115 -268558 -200737 -334491 -574537 -567338 -264890 103108 475861 931961 1296847
36760A296847n5480m43728m00686o1136J56291Q6911j70164m69156n82651k90219
$$ 1296847 1241367 797639 396953 335817 492108 579019 408855 -60301 -642952 -933171
36750i33171K26130M37941K03919L4410K79693N08789J77110m76693p73457n58145
$$ -933171 -707041 -269100 -65181 -30771 248922 757711 934821 458128 -315329 -873474
36740h73474k32357j4768K13752L98238K49072k18313n48197l93296R7376N09908
$$ -873474 -1105831 -1120599 -906847 -508609 -259537 -477850 -1026047 -1419343 -1321967 -812059
36730h12059N59415K60534q1652j00719K15468M43873K59728j18263k62350j21766
$$ -812059 -252644 7890 -73762 -174481 40987 484860 744588 626325 363975 242209
36720B42209K4201K0150p7913k07628k84813j58479J23164K27062K5609j28538
$$ 242209 266410 286560 208647 1019 -283794 -442273 -319109 -92047 -66438 -194976
36710a94976N802P2192k50384n15285j30545N54140O29970O242m74246l52112
$$ -194976 -189174 -116982 -367366 -882651 -1013196 -459056 170914 177156 -297090 -649202
36700f49202r3721j07413r3366K21634M59443K36859j46774k28099j23724j87273
$$ -649202 -742923 -850336 -943702 -722068 -262625 -25766 -172540 -400639 -524363 -711636
36690g11636k95597q9050L03244L85324P7940j47469K1606L18446L47647J62475
$$ -711636 -1007233 -1096283 -793039 -407715 -329775 -477244 -455638 -137192 210455 372930
36680C72930J40702L81171M94731J38513l99439m68468N3978N22643L97491l0373
$$ 372930 513632 894803 1389534 1528047 1128608 660140 714118 1236761 1634252 1603879
36670A603879j74762o1198j33682l97303m35941k03237q9581j62942n0457K83266
$$ 1603879 1429117 1367919 1234237 836934 400993 197756 108175 -54767 -105224 178042
36660A78042L37621r1622n09327m65072j57435J9499L3993J0643o5519j40849
$$ 178042 515663 424041 -85286 -550358 -707793 -688294 -654301 -643658 -709177 -850026
36650h50026k5631K17785K73550J45749J83726L45461J17537n27870q40433m02205
$$ -850026 -875657 -657872 -384322 -238573 -54847 290614 408151 -119719 -960152 -1362357
36640a362357J93105L14201K32729M30755O41199L79041j08085k62753j66825
$$ -1362357 -1169252 -855051 -622322 -191567 449632 828673 720588 457835 291010
36631B91010k37137l47201j11824K53907K33743n7329r6452Q0321O011k61427
$$ 291010 53873 -293328 -405152 -151245 82498 25169 -71283 9038 15049 -246378
36621b46378k11508J39799K33310l6034j57843N8097J93115J9387j62180j65235
$$ -246378 -457886 -318087 -84777 -120811 -278654 -220557 -27442 -8055 -170235 -335470
36611c35470j99137l08523j91159J97492M47513L24013Q1556j0926K1537J14043
$$ -335470 -534607 -843130 -1034289 -836797 -389284 -65271 16285 5359 26896 140939
36601A40939K33765J80301j53375l71662n8488M06505K74468l58112o29488k65417
$$ 140939 374704 555005 401630 29968 -28520 377985 652453 294341 -335147 -600564
36591f00564R6342R5695J44222M18114L99873q7853l74364p3173J90302j24054
$$ -600564 -504222 -408527 -264305 153809 553682 465829 91465 18292 208594 84540
36581H4540n05759l21480P2875M0938j86082l5771K80281J78268j76754j77638
$$ 84540 -421219 -742699 -669824 -628886 -814968 -850739 -570458 -392190 -568944 -746582
36571g46582J02373J06640r7052O5766N35043O07891J31094k42307j50274m221
$$ -746582 -644209 -537569 -634621 -568855 -33812 574079 705173 462866 312592 308371
36561C08371j23094j83873R8201L99507L24110K3673j17680n8183p986k6239m825
$$ 308371 185277 1404 99605 499112 823222 846895 729215 671032 663046 636807 631982
36550F31982J01902K17538K18274L1069k20350k58602n5322k0087m30808q41855
$$ 631982 733884 951422 1169696 1200765 980415 721813 666491 646404 215596 -626259
36540f26259n70248K76716Q29120N94947K6795k23033q9198J30917L11134M31706
$$ -626259 -1196507 -919791 -90671 504276 531071 308038 218840 349757 660891 1092597
36530A092597L34663l6936l63016k91543N0370K13964M3089j54832o5622K32717
$$ 1092597 1427260 1390324 1027308 735765 786135 1000099 1043188 888356 822734 1055451
36520A055451M09697K91218K5851j26470q4374K5464P6466O8841M9352M2056Q9015
$$ 1055451 1465148 1756366 1782217 1655747 1571373 1596837 1673303 1742144 1791496 1833552 1922567
36509A922567K00945K32012K1746k69471k51669J26369M22369L33087J30468J55793
$$ 1922567 2123512 2355524 2377270 2107799 1856130 1982499 2404868 2737955 2868423 3024216
36499C024216K50335J28968k1325J13704K89039K7429n01840o50035l21901j01772
$$ 3024216 3274551 3403519 3382194 3495898 3784937 3812366 3310526 2660491 2338590 2236818
36489B236818k47008l17334n7402R6199j83590m44191j46683M36702O25818L28301
$$ 2236818 1989810 1672476 1615074 1711273 1527683 1083492 936809 1373511 1999329 2327630
36479B327630L1431l0151j13355l85255o00452m84423j18270J96657K76894J71946
$$ 2327630 2359061 2328910 2215555 1830300 1229848 745425 627155 823812 1100706 1272652
36469A272652N2639M1360J13393J58966J24716K9518j15666k67831k79276o8902
$$ 1272652 1325291 1366651 1480044 1639010 1763726 1793244 1677578 1409747 1130471 1061569
36459A061569J60404J30045r1639j76176o6402n3549k31946k89544m3467K08588
$$ 1061569 1221973 1352018 1260379 1084203 1017801 964252 732306 442762 399295 607883
36449F07883J62254o956K0465J59717J02313j38317k56288j34349N0460J50775
$$ 607883 770137 763181 783646 943363 1045676 907359 651071 516722 567182 717957
36439G17957J76819J31827o738j42766j27129J5047R2543p607j98710k96545j73206
$$ 717957 894776 1026603 1019865 877099 749970 765017 857560 849953 651243 354698 181492
36428A81492J18598L25159K25855n8172j70928r779J25767q235k51984l24445
$$ 181492 300090 625249 851104 792932 622004 612225 737992 729757 477773 153328
36418A53328k04242k7851J47555K61331J81175m0439r6796J26031L06457J84694
$$ 153328 -50914 -78765 68790 330121 511296 470857 374061 500092 806549 991243
36408I91243r91N7357J75418Q239k96772l11938n1923O0061j07619k48194j71303
$$ 991243 990252 1047609 1223027 1231266 934494 622556 570633 630694 523075 274881 103578
36397A03578k4264P0283J55275J90604Q7715j027J33118K98335J33388k01949
$$ 103578 79314 149597 304872 495476 583191 582164 715282 1013617 1147005 945056
36387I45056j61731K59461L75358j64058p83598p86330k58945K26492M00877L59554
$$ 945056 783325 1042786 1418144 1254086 470488 -315842 -574787 -348295 52582 412136
36377D12136J80517o3922j56867j0008J05277m7310k52134j72421J15640K95021
$$ 412136 592653 528731 371864 361856 467133 419823 167689 -4732 110908 405929
36367D05929L15518L28815K89780N7322k23602k78697j74540k06308l57947l15278
$$ 405929 721447 1050262 1340042 1397364 1173762 895065 720525 514217 156270 -159008
36357a59008l3176J45666K3949j81672k16025q7727J15774L78505N77670M73063
$$ -159008 -192184 -46518 -22569 -204241 -420266 -507993 -392219 -13714 563956 1037019
36347A037019O1844l13134l84820k59371j39701j7364J52913K20347N3206j78657
$$ 1037019 1098863 785729 400909 141538 1837 -15527 137386 357733 410939 232282
36337B32282k02355j3888J77427K66064K74810J65003r9983l39986k83761N5297
$$ 232282 29927 16039 193466 459530 734340 899343 799360 459374 175613 230910
36327B30910L48250L47392J37100n5645j33412j49004j85309k66471k97574j11160
$$ 230910 579160 926552 1063652 1008007 874595 725591 540282 273811 -23763 -134923
36317a34923K86298N61728L84494p8987k87208m2394K15675M4710l44358l94377
$$ -134923 151375 713103 1097597 1018610 731402 689008 904683 949393 605035 210658
36307B10658p03L76360L61896O8673k06068l57980m06416l04607k6801K83634
$$ 210658 209955 586315 948211 1016884 810816 452836 46420 -258187 -284988 -1354
36297a354M22082L30935J29292M0O4490K61363L51491J84961o4357j35922j07194
$$ -1354 420728 751663 880955 880995 945485 1206848 1558339 1743300 1678943 1543021 1435827
36286A435827k56841m93907l75491J35531M25140R8760l52969k81029R5220P5576
$$ 1435827 1178986 685079 309588 445119 870259 969019 616050 335021 430241 505817
36276E05817l17474l51572J55532M46681K3600n14921l84506J90785L80850J9002
$$ 505817 188343 -163229 -7697 438984 462584 -52337 -436843 -246058 134792 153794
36266A53794k62500p5922K29524K37313O5548L7044J29639P5822j76322l72498
$$ 153794 -108706 -184628 44896 282209 347757 384801 514440 590262 413940 41442
36256D1442k76359O5064L70319L87886J41194r3774j07315j230j3103j63409k45951
$$ 41442 -234917 -169853 200466 588352 729546 635772 528457 527227 514124 350715 104764
36245A04764j39815O1217K35755L50047L49468J43782k07446m60671m38778j91498
$$ 104764 -35051 26166 261921 611968 961436 1105218 897772 437101 -1677 -193175
36235a93175J40742M44339N49456K73426k76370o40416m85820l0993K30522J29631
$$ -193175 -52433 391906 941362 1214788 938418 298002 -187818 -218811 11711 141342
36225A41342q8093j70454o7810K04394N63182O98736L06300l84723o87025l07210
$$ 141342 53249 -117205 -185015 19379 582561 1281297 1587597 1202874 515849 208639
36215B08639K03615J82600k42287m24959j87157K4284m9325j00514J22172L42080
$$ 208639 412254 594854 352567 -72392 -259549 -235265 -284590 -385104 -262932 79148
36205G9148K46873M2927Q7463K57619J66752j62225l33933k23131r8444r0276
$$ 79148 326021 368948 456411 714030 880782 718557 384624 161493 63049 -27227
36195b7227o694K15843L11153J14209j61112k68198k41775j84367n6354J11813
$$ -27227 -33921 181922 493075 607284 446172 177974 -63801 -248168 -304522 -192709
36185a92709J15816o8165j38141M3492J42559j04897l63333j86302K08649K30164
$$ -192709 -76893 -145058 -283199 -239707 -97148 -202045 -565378 -751680 -543031 -312867
36175c12867j27092k37117J71584N72872M23448p4181l16636j09773J91458K02737
$$ -312867 -439959 -677076 -505492 67380 490828 416647 100011 -9762 181696 384433
36165C84433p1263k79077r2813L76617N76988J58009m46325m79016O4335L50101
$$ 384433 313170 34093 -58720 317897 894885 1052894 606569 127553 191888 541989
36155E41989q4437o04463m18723K20525M17107k2369l84001j82971K02620K43818
$$ 541989 457552 -146911 -565634 -345109 71998 49629 -334372 -517343 -314723 -70905
36145g0905K7832l7587J11319K14418J47166K7293j6327N0962J81044J98123q1081
$$ -70905 -43073 -80660 30659 245077 392243 419536 403209 454171 635215 833338 752257
36134G52257n05959o01461j79714K80247K19963j95354l04059Q0454M34005L57709
$$ 752257 246298 -355163 -534877 -254630 -34667 -230021 -534080 -453626 -19621 338088
36124C38088J35388J67081K82643R0692k48773j84088L07706N30793L6656o49221
$$ 338088 473476 640557 923200 1013892 765119 581031 888737 1419530 1456186 806965
36114H06965o68050K1147N84808M12761j34953k81455J25117M50356J38124n46709
$$ 806965 138915 160062 744870 1157631 1022678 741223 866340 1316696 1454820 908111
36104I08111q30494l95036K15126K70414k18736n26218j78948M10547N10153M9527
$$ 908111 77617 -317419 -102293 168121 -50615 -576833 -755781 -345234 164919 214446
36094B14446l41381k33253Q5282J38985n5746j49207n6130j2477j14339j66206
$$ 214446 -126935 -360188 -274906 -135921 -191667 -340874 -397004 -409481 -523820 -690026
36084f90026l3066J46120J90577J06430o462r2737j04867q12J42160J75453J04615
$$ -690026 -723092 -576972 -386395 -279965 -286427 -379164 -484031 -484843 -342683 -167230 -62615
36073f2615P9396R7511l4799l24491m52589k36480J2072j04889m75530o34515
$$ -62615 16781 114292 79493 -244998 -697587 -934067 -921995 -1026884 -1502414 -2136929
36063b136929m22421j34706l8439r2681j84709l02354l76897k69975n4066j3782
$$ -2136929 -2559350 -2694056 -2732495 -2825176 -3009885 -3312239 -3689136 -3959111 -4013177 -4026959
36053d026959j88895j92486K62124Q57983R96927N33913p2927l17587j37438J53261
$$ -4026959 -4215854 -4408340 -4146216 -3288233 -2291306 -1757393 -1830320 -2147907 -2285345 -2132084
36043b132084K43399R6487n8772J3779K74715M36051L18648Q1289m018R7257J96776
$$ -2132084 -1888685 -1792198 -1850970 -1837191 -1562476 -1126425 -807777 -726488 -730506 -633249 -436473
36032d36473J75099R2404K6683m2394j47139k25439j70714R006J16069n2899l70223
$$ -436473 -261374 -168970 -142287 -184681 -331820 -557259 -727973 -718967 -602898 -655797 -1026020
36021a026020l66532K04982Q79984R32553L50279r9228L1382K19908j50317p26832
$$ -1026020 -1392552 -1187570 -307586 624967 975246 876018 907400 1127308 976991 250159
36011B50159o72374K2319M91413K86731m3741P6442L72323K57068k20038n08043
$$ 250159 -422215 -399896 91517 378248 334507 410949 783272 1040340 820302 312259
36001C12259l91278j82818j59615k24829j71057J0850J67130J73410M8582o4948
$$ 312259 -79019 -261837 -421452 -646281 -817338 -806488 -639358 -465948 -417366 -482314
35991d82314o2385k2102o8728r9213J11531M62946N04358O2237m01847l69558
$$ -482314 -544699 -566801 -635529 -734742 -623211 -160265 344093 406330 4483 -365075
35981c65075K1735K18521N9772q5167K6323J51035J0590k27703j83172J74369
$$ -365075 -343340 -124819 -65047 -150214 -123891 27144 37734 -189969 -373141 -198772
35971a98772M54461L56597P0643K7037K92663M26607Q0815m30613m75647J8174
$$ -198772 255689 612286 682929 709966 1002629 1429236 1510051 1079438 603791 621965
35961F21965M16054K22358l03414o07938n67196m00350j51655K68523O48812N71276
$$ 621965 1038019 1260377 956963 349025 -218171 -618521 -770176 -501653 147159 718435
35951G18435O657n28331n18265L8743O83571Q95252M91456j78609n14768l20344
$$ 718435 725092 196761 -321504 -282761 400810 1296062 1787518 1608909 1094141 773797
35941G73797l3313q3278k54915q0660L27786L87760l1816l59981j54116K83068
$$ 773797 740484 657206 402291 321631 649417 1037177 1005361 645380 491264 774332
35931G74332L63330l3325m94882n51711p8433N74645P97671L25175l52216m99492
$$ 774332 1137662 1104337 609455 57744 -20689 553956 1351627 1676802 1324586 825094
35921H25094p9228K25583K486l63935l60411o7606J10846O6709k9370q3805q1507
$$ 825094 745866 971449 973935 610000 249589 181983 292829 359538 330168 246363 164856
35910A64856L7575K07604J77910r3928k51620n2956J96403Q4554k70758m32892
$$ 164856 202431 410035 587945 494017 242397 189441 385844 470398 199640 -233252
35900b33252l06985j65002j33202p6416N7967J56264J85149K15766K32671J82577
$$ -233252 -540237 -705239 -838441 -914857 -856890 -700626 -515477 -299711 -67040 115537
35890A15537J35436J30790q784l87647o85956m88160R0950M91720M16829J08218
$$ 115537 250973 381763 372979 -14668 -700624 -1188784 -1097834 -606114 -189285 -81067
35880h1067q0041m9489J12887K58324K17041j2081j56979l7051R5925m4374k05251
$$ -81067 -161108 -210597 -97710 160614 377655 365574 208595 171544 267469 223095 17844
35869A7844M6448M84812M20734j84454n33462j96347K14566N0715l19688j52341
$$ 17844 64292 549104 969838 785384 251922 55575 270141 320856 1168 -151173
35859a51173M05771N15134k4222m54047k12976K75394L15155n3751k34488n513
$$ -151173 254598 769732 745510 291463 78487 353881 669036 615285 380797 375284
35849C75284K35496J52099m8018j1353J73099J24909j77603k86763M2606L96425
$$ 375284 610780 762879 714861 703508 876607 1001516 823913 537150 579756 976181
35839I76181K28312l30177n82173j94474L65934M80208J64100n7072R9623L44914
$$ 976181 1204493 874316 292143 97669 463603 943811 1107911 1050839 1150462 1495376
35829A495376K51561j89137n54731m73921k8459L58122L82935J21973j71114l66256
$$ 1495376 1746937 1557800 1003069 529148 500689 858811 1241746 1363719 1192605 826349
35819H26349m52120l74493q2804K97466N10715M05486M6233l45611m86752k18040
$$ 826349 374229 -264 -83068 214398 725113 1130599 1176832 831221 344469 126429
35809A26429K48348M25031J02880l41667m28040j81792L5036J06619J71864K01777
$$ 126429 374777 799808 902688 561021 132981 -48811 -13775 92844 264708 466485
35799D66485N5959j04869K3407L24071L77766J65559Q3629J93906J03744k47775
$$ 466485 522444 417575 440982 765053 1142819 1308378 1392007 1585913 1689657 1441882
35789A441882l72647q8880R1442j66788m16105k08185J16070L7075k51023k41806
$$ 1441882 1069235 980355 1071797 905009 488904 280719 396789 433864 182841 -58965
35779e8965Q252J25314J86045M68975P08316M18565j82852l94226j19312N0816
$$ -58965 -50713 74601 260646 729621 1437937 1856502 1673650 1279424 1160112 1210928
35769A210928j45606l28719k62763j78259j50914Q5277M70596M95558O0533k23036
$$ 1210928 1065322 736603 473840 295581 144667 229944 700540 1196098 1256631 1033595
35759A033595K0624L10268R6020l75613n10221k52963P196J06918J76315K53621
$$ 1033595 1054219 1364487 1460507 1084894 574673 321710 328906 435824 612139 865760
35749H65760K68197K51392K28469P8525k13803l86338k56563j5183R5584J19222
$$ 865760 1133957 1385349 1613818 1692343 1478540 1092202 835639 820456 916040 1035262
35739A035262J38733L2614k03555k59638k6614O5582k94703o60164m25328K04921
$$ 1035262 1173995 1206609 1003054 743416 716802 782384 487681 -172483 -597811 -392890
35729c92890M98110K75221L3143O2005J28224P1101N5441J10122J9805j67241
$$ -392890 105220 380441 413584 475589 603813 674914 730355 840477 860282 693041
35719F93041j02271K10380L08669N8339o0064K16725M13127R4632l58374l49951
$$ 693041 590770 801150 1109819 1168158 1108094 1324819 1737946 1832578 1474204 1124253
35709A124253l2897J1566k05161j35387K92046M71979Q5970l89855m34431k07694
$$ 1124253 1091356 1102922 897761 762374 1054420 1526399 1612369 1222514 788083 580389
35699E80389j38806k08440j28305K9756o4704l41494l07694J98429O71977O00452
$$ 580389 441583 233143 104838 134594 69890 -271604 -579298 -380869 291108 891560
35689H91560J36893j85778j78985p3433o108J33991L23084K93457j2051k26280
$$ 891560 1028453 842675 663690 590257 584149 718140 1041224 1334681 1322630 1096350
35679A096350p6366J52666L1173l09749l17983J50284N67329M40355n2371l57724
$$ 1096350 1019984 1172650 1203823 894074 576091 726375 1293704 1734059 1681688 1323964
35669A323964k58901l4470j2723j96259l20557j51144K70149O08152N27145P6329
$$ 1323964 1065063 1030593 1017870 821611 501054 349910 620059 1228211 1755356 1831685
35659A831685l10358l03717o2769J8929j52352l10071k60377j06058K4410J97716
$$ 1831685 1521327 1217610 1154841 1173770 1021418 711347 450970 344912 369322 567038
35649E67038M38037M84092R5866m60847n84730r7966M50843M52292m606l22578
$$ 567038 1005075 1489167 1585033 1124186 539456 441490 892333 1344625 1340019 1017441
35639A017441k14293L1130R6243N9174J17340K18208K20333J84878K18755K08173
$$ 1017441 803148 834278 930521 989695 1107035 1325243 1545576 1730454 1949209 2157382
35629B157382K3431j53979o9932J26019N1534k70533l84150j01529K02618J89069
$$ 2157382 2180813 2026834 1956902 2082921 2134455 1863922 1479772 1378243 1580861 1769930
35619A769930M5730J05215L15836M34003M62778N15318M68651J85214q0237L2879
$$ 1769930 1815660 1920875 2236711 2670714 3133492 3648810 4117461 4302675 4222438 4255317
35609D255317L74783M42397J45163r3683o7194o6660k42053k42108J36705M22133
$$ 4255317 4630100 5072497 5217660 5123977 5056783 4990123 4748070 4505962 4642667 5064800
35599E064800J12307m69656n65443p9180L18231J86150j56292k33245l9264J72672
$$ 5064800 5177107 4707451 4142008 4062828 4381059 4567209 4410917 4177672 4138408 4311080
35589D311080L12760L66504K13346j39668l88404l16580j48274k00164l77948
$$ 4311080 4623840 4990344 5203690 5064022 4675618 4359038 4210764 4010600 3632652
35580C632652l80698k44255k58555m24235m37051k19920l7240j3380L3824J54659
$$ 3632652 3251954 3007699 2749144 2324909 1887858 1667938 1630698 1617318 1651142 1805801
35570A805801R5882k18948m33225k71747J5292M7959j14860j50703K603J55223
$$ 1805801 1901683 1682735 1249510 977763 993055 1041014 926154 775451 778054 933277
35560I33277K17197J91366m459l26571l97812L2512N52508N32426N2353j83829
$$ 933277 1150474 1341840 1337381 1010810 612998 645510 1198018 1730444 1782797 1598968
35550A598968R7490L83284K46882l5064p3752l3136k25785m53012l13640O6263
$$ 1598968 1696458 2079742 2326624 2291560 2217808 2184672 1958887 1505875 1192235 1258498
35540A258498J80875p0057k64701j39597P6386J02570p956p5050q1904q2976m1205
$$ 1258498 1439373 1369316 1104615 965018 1041404 1143974 1136018 1060968 979064 896088 854883
35529H54883O9653J49494J09424K4663K3506Q4661N2038j56247m08057m50738
$$ 854883 924536 1074030 1183454 1208117 1231623 1316284 1368322 1212075 804018 353280
35519C53280j67974K54554M76291L37705j0470l07025l86135j86364K28232N72185
$$ 353280 185306 439860 916151 1253856 1243386 936361 550226 363862 592094 1164279
35509A164279N08406Q2606k35870j48903P8334Q0652k8888O3238K44540J51699
$$ 1164279 1672685 1755291 1519421 1370518 1448852 1529504 1500616 1563854 1808394 1960093
35499A960093j23997r1112L14960N23941J63322l74981n00641j98269Q7384P9336
$$ 1960093 1836096 1744984 2059944 2583885 2747207 2372226 1871585 1673316 1760700 1840036
35489A840036j27241l11919l18153j12219J64416L03232K73362K00998R3352j35306
$$ 1840036 1712795 1400876 1082723 970504 1134920 1438152 1711514 1912512 2005864 1870558
35479A870558l34042k09453J35507K13840q5631k46288N0465L61856K02691j51328
$$ 1870558 1536516 1327063 1462570 1676410 1590779 1344491 1394956 1756812 1959503 1808175
35469A808175j64611N9973P9396n003K32492O00296M44356k22927o05457l31649
$$ 1808175 1643564 1703537 1782933 1777930 2010422 2610718 3055074 2832147 2226690 1895041
35459A895041J7545q1217k85759p4182L42626L78545j7525l51426k87402N7830
$$ 1895041 1912586 1831369 1545610 1471428 1814054 2192599 2175074 1823648 1536246 1594076
35449A594076L83217M50148J97895j54879k79107j48446m6156p0925k1226R1411
$$ 1594076 1977293 2427441 2625336 2470457 2191350 2042904 1996748 1925823 1904597 1996008
35439A996008n9345m21459l66676L32834Q96215N69929j90024l82991J8676J66437
$$ 1996008 1936663 1515204 1148528 1481362 2377577 2947506 2757482 2374491 2393167 2559604
35429B559604j77597l01448J32717M30330J2516n74354m70676J92328N31951K13546
$$ 2559604 2382007 2080559 2213276 2643606 2656122 2081768 1611092 1803420 2335371 2548917
35419B548917j79862q3123L05679M25152J61645n3221R8957L45861K11725k27383
$$ 2548917 2369055 2285932 2591611 3016763 3178408 3125187 3224144 3570005 3781730 3554347
35409C554347l48900J15143N82871M06960j63411l55406k1347K47566J26334m3500
$$ 3554347 3205447 3320590 3903461 4310421 4147010 3791604 3770257 4017823 4144157 4100657
35399D100657O387M7152m8966M0769M40472O81362M36154J08651J57658L33706
$$ 4100657 4107044 4154196 4105230 4145999 4586471 5267833 5703987 5812638 5970296 6304002
35389F304002J95981o5623k1826J57618K7435k43528j32636K40447K39477j81193
$$ 6304002 6499983 6434360 6412534 6570152 6597587 6354059 6221423 6461870 6701347 6520154
35379F520154l48801K7401M29579M30509K86842L30716M21024L54632K62078K43568
$$ 6520154 6171353 6198754 6628333 7058842 7345684 7676400 8097424 8452056 8714134 8957702
35369H957702J24971r2878n9579L08754N72546M97308M65516P13241P71948K85179
$$ 8957702 9082673 8989795 8930216 9238970 9811516 10308824 10774340 11487581 12259529 12544708
35359A2544708j82360O5419O72402P18355J58022j43550K29122P32574Q39010
$$ 12544708 12362348 12427767 13100169 13818524 13976546 13832996 14062118 14794692 15633702
35350A5633702P15925O81994O80546O26397O97731R20215R43200N94426K44116
$$ 15633702 16349627 17031621 17712167 18338564 19036295 19956510 20899710 21494136 21738252
35341B1738252K60571M74377N39736M83152N13544N85582N43289M54920M35807
$$ 21738252 21998823 22473200 23012936 23496088 24009632 24595214 25138503 25593423 26029230
35332B6029230L64548J34419m8060O18M4820j93511m79457l94458o9595k9483
$$ 26029230 26393778 26528197 26480137 26480755 26525575 26332064 25852607 25458149 25388554 25359071
35322B5359071l63802o34831o37595o57078q40373r02809p03071n68813p13885
$$ 25359071 24995269 24360438 23722843 23065765 22225392 21322583 20619512 20050699 19336814
35313A9336814q15113n87363l61483n77050j003042j035358o16775l02922m41931
$$ 19336814 18521701 17934338 17572855 16995805 15992763 14957405 14340630 14037708 13595777
35304A3595777p86871r68444r15820p20409m61250k72401k63332k98126j70219
$$ 13595777 12808906 11840462 10924642 10204233 9742983 9470582 9207250 8909124 8738905
35295H738905k8831k37449p30799r66092o87073k81828j36060j01016M7777R3653
$$ 8738905 8710074 8472625 7741826 6775734 6088661 5806833 5670773 5569757 5617534 5711187
35285E711187j81411m28561k18723J64910J04564l21017m28096o2959J37047j78050
$$ 5711187 5529776 5101215 4882492 5047402 5151966 4830949 4402853 4339894 4476941 4298891
35275D298891m86478k92613M3437n4422l98770l83621k2681Q1375k63498n48597
$$ 4298891 3812413 3519800 3563237 3508815 3110045 2726424 2703743 2785118 2521620 1973023
35265A973023l91029q1605n4627k27981k00858J20107L96630K94581j32489m80249
$$ 1973023 1581994 1500389 1445762 1217781 1016923 1137030 1533660 1828241 1695752 1215503
35255A215503l67683J60582O11653N44814P6621k80372k57330o5286K6070K9876
$$ 1215503 847820 1008402 1620055 2164869 2241490 1961118 1703788 1638502 1664572 1694448
35245A694448K7877o8350k79343l25217J3998M35719M11004n8205l74008j56801
$$ 1694448 1722325 1653975 1374632 1049415 1063413 1499132 1910136 1851931 1477923 1321122
35235A321122K39532K75202q426j50787m3764o1850l63843n37320k22016K55163
$$ 1321122 1560654 1835856 1827430 1676643 1632879 1571029 1207186 669866 447850 703013
35225G03013K87964j37302m42747l05882k4748P2397R6124K05162J84854j48930
$$ 703013 990977 853675 410928 105046 80298 152695 248819 453981 638835 489905
35215D89905m34956j97438L54236N28468J49301k24226j97919p7179k06972l08834
$$ 489905 54949 -142489 211747 740215 889516 665290 467371 390192 183220 -125614
35205a25614K6984N33343N44878k4839n32759m82284r0320J62499J63283J15907
$$ -125614 -98630 434713 979591 954752 421993 -60291 -150611 11888 175171 291078
35195B91078J26631J18644M2167n0164r6765o1811P0606K26780K36498K6828k21080
$$ 291078 417709 536353 578520 528356 431591 369780 440386 667166 903664 930492 709412
35184G09412k49921n5571R9098L8148q7968k5687J88610K30283n9751l71937k68201
$$ 709412 459491 403920 503018 541166 453198 427511 616121 846404 786653 414716 146515
35173A46515K05658M86672J83548m06123o77154m67240j34625M3091J71406L62814
$$ 146515 352173 838845 1022393 616270 -60884 -528124 -662749 -619658 -448252 -85438
35163h5438M40504K55958J7746k969J05609R9250L5991J30479K48011K6034m59313
$$ -85438 355066 611024 628770 625801 731410 830660 866651 997130 1245141 1271175 811862
35152H11862o47303k98453J09161Q6743j62197j54650O6277N4763k55385m28154
$$ 811862 164559 -133894 -24733 62010 -100187 -254837 -188560 -133797 -389182 -817336
35142h17336k07343J37777K61686J73478P9415Q2647J68190K56210J97392m6619
$$ -817336 -1024679 -886902 -625216 -451738 -372323 -289676 -121486 134724 332116 285497
35132B85497j99454L5886M43233M53914l9105m61152l65670l3708M6026j05053
$$ 285497 86043 121929 565162 1019076 979971 518819 153149 119441 165467 60414
35122F0414j61180q4395m8015j4917J30541K18584M7839j50445j3567K98470K98592
$$ 60414 -100766 -185161 -233176 -248093 -117552 101032 148871 -1574 -15141 283329 581921
35111E81921k3100j68753M7710K26055O9967j77412k09951j17101j05255j27289
$$ 581921 558821 390068 437778 663833 733800 556388 346437 229336 124081 -3208
35101c208m7247J06237K42332L14115K26688n7625k80084j49163J13158j3608
$$ -3208 -50455 55782 298114 612229 838917 781292 501208 352045 465203 451595
35091D51595n00183p28150m65239j95123j85372M269N95539R47216N45482l4557
$$ 451595 -48588 -776738 -1241977 -1437100 -1622472 -1618203 -1022664 -75448 470034 435477
35081D35477k2173K60498J8961n34524n01169J03778L28861p7798k68574J64796
$$ 435477 413304 673802 692763 158239 -342930 -239152 89709 11911 -256663 -91867
35071i1867M58364L3982m75664l05785K05406L08987Q7876J02099L07874K61124
$$ -91867 366497 400479 -75185 -380970 -175564 133423 221299 323398 631272 892396
35061H92396M3275O7616K03376J228l56447k60661J99588K61089k50599o05658
$$ 892396 935671 1003287 1206663 1207891 851444 590783 790371 1051460 800861 195203
35051A95203l74396n9961j21082j91967J45572N14945L77337k5633j27214k6894
$$ 195203 -179193 -239154 -360236 -552203 -406631 108314 485651 460018 332804 305910
35041C05910j96856m67433k18848M67160P53074K97526k53045l03086r1216m5004
$$ 305910 109054 -358379 -577227 -110067 643007 940533 687488 384402 293186 248182
35031B48182m7844J15772J73393j24689l62612n1881M54423M16029j14905l74836
$$ 248182 200338 316110 489503 364814 2202 -49679 404744 820773 705868 331032
35021C31032r3070K01384J45508J821l2341j66178l60943j37856N06691P58066
$$ 331032 237962 439346 584854 586675 554334 388156 27213 -110643 396048 1154114
35011A154114J63930n18034l88421K48586M54351J19415r4599J3451L1464r3337
$$ 1154114 1318044 800010 411589 660175 1114526 1233941 1139342 1152793 1184257 1090920
35001A090920L8810L38508K04764l45858n14069m0885K54077k10956p89731o37006
$$ 1090920 1129730 1468238 1673002 1327144 813075 772190 1026267 815311 25580 -611426
34991f11426j3957K61318J32560J62248L92638K94694k10780n29719l15139O8593
$$ -611426 -625383 -364065 -231505 -69257 323381 618075 407295 -122424 -437563 -368970
34981c68970J91650J11253N0078q279j16564j07580J42134M01605L35020j6560
$$ -368970 -177320 -66067 -15989 -24268 -140832 -248412 -106278 295327 630347 613787
34971F13787k36951m4308L47649M86070K58090L4359J12669K19101r5225o44914
$$ 613787 376836 332528 680177 1166247 1424337 1458696 1571365 1790466 1695241 1050327
34961A050327p02900m1839O32748O17010J25590j74353j56894j81548l04002k19302
$$ 1050327 347427 305588 938336 1555346 1680936 1506583 1349689 1168141 864139 644837
34951F44837P2305J89493K8992p1770L6924O1959j54051k95050j13331R9129m1706
$$ 644837 717142 906635 935627 863857 900781 962740 808689 513639 400308 499437 457731
34940D57731l71595l92798o022L41593K59744r8257k62520l4275K93042L16567
$$ 457731 86136 -306662 -312684 28909 288653 190396 -72124 -106399 186643 503210
34930E03210K0249k43445k31778o4917M7036Q0760O6745o3235k83461l66098k11718
$$ 503210 523459 280014 48236 -16681 30355 111115 177860 114625 -168836 -534934 -746652
34919g46652m9641m2268J9750K82515M18446J27101k50688k09357O7184J7349
$$ -746652 -796293 -838561 -818811 -536296 -117850 9251 -241437 -450794 -383610 -366261
34909c66261k90179k54866J77306L94854K09107J78172N41085O83857J59063m94747
$$ -366261 -656440 -911306 -734000 -339146 -130039 48133 589218 1273075 1432138 937391
34899I37391n57983j79978R099j11089j80793n6299R9851J87134J64917n4568
$$ 937391 379408 199430 208529 97440 -83353 -139652 -39801 147333 312250 257682
34889B57682l19667k00850L42488O78474L75175j06092j74992p3377l21286o48232
$$ 257682 -61985 -262835 79653 758127 1133302 1027210 852218 778841 457555 -190677
34879a90677m14865J70902K88026j22703k59173J65201M70915K24874n6104J19746
$$ -190677 -605542 -434640 -146614 -269317 -528490 -363289 107626 332500 276396 396142
34869C96142L67745J53557k69394l11933M316J89030Q4303m4125m1071j3831n6744
$$ 396142 763887 917444 648050 336117 340433 529463 613766 569641 528570 514739 457995
34858D57995j77415l80466n54697m54620n4863K94277L36206K76497L66566M05641
$$ 457995 280580 -99886 -654583 -1109203 -1164066 -869789 -533583 -257086 109480 515121
34848E15121Q4523l93689n36544l02318j14423j44798q1954K73058O19132N83706
$$ 515121 599644 205955 -330589 -632907 -747330 -892128 -974082 -701024 -81892 501814
34838E01814K26223j23607l05877l71143l42307j91737N213J10438J15386J27759
$$ 501814 728037 604430 298553 -72590 -414897 -606634 -601421 -490983 -375597 -247838
34828b47838J59337R9843m5352p5440J06124K58841J02344k20666k71349N5659
$$ -247838 -88501 11342 -34010 -109450 -3326 255515 357859 137193 -134156 -78497
34818g8497L46892K66449K7050l094J05099K3946k22679k84780q4158N0645r1637
$$ -78497 268395 534844 561894 558800 663899 687845 465166 180386 96228 146873 55236
34807E5236l23524l89754k47260N0803M00828N21259J86251l13071l87677J6845
$$ 55236 -268288 -658042 -905302 -854499 -453671 67588 253839 -59232 -446909 -430064
34797d30064K98321J33523k2267K40125N05233J73535n04862p32183l12623J74197
$$ -430064 -131743 1780 -20487 219638 724871 898406 393544 -338639 -651262 -477065
34787d77065K90597J88553R7153k0400j32109J477L72017N50243K58263k00113
$$ -477065 -186468 2085 99238 78838 -53271 -51794 320223 870466 1128729 928616
34777I28616l61129k04134n1795n0142m5212Q2512K02499J09852j72393l37782
$$ 928616 567487 363353 311558 261416 216204 298716 501215 611067 438674 100892
34767A00892j16788L22779M56214M5226m59230m41355N3992L90985K28931q3483
$$ 100892 -15896 306883 763097 808323 349093 -92262 -38270 352715 581646 498163
34757D98163j16186N2469R7957k5371j33182j63140j59331n2613K23047M66496
$$ 498163 381977 434446 532403 507032 373850 210710 51379 -1234 221813 688309
34747F88309L68708m6628l82574l29362J283K60983K51378M6983j79938l38635
$$ 688309 1057017 1010389 627815 298453 299736 560719 812097 859080 679142 340507
34737C40507m02995l04356J9796M28032N78916K94757j69243m20115m20673m26856
$$ 340507 -62488 -366844 -347048 80984 659900 954657 785414 365299 -55374 -482230
34727d82230m74298k93112J72675N36763M89200K42176J73791K74353K82035J76225
$$ -482230 -956528 -1249640 -1076965 -540202 -51002 191174 364965 639318 921353 1097578
34717A097578J44065J63076L8200j53395p6124L05115N57252L61461l6924k02375
$$ 1097578 1241643 1404719 1442919 1289524 1213400 1518515 2075767 2437228 2400304 2197929
34707B197929r9152j2540k8471N8980L19797M90174L43456M3982p1843M6155J47991
$$ 2197929 2098777 2086237 2057766 2116746 2436543 2926717 3270173 3314155 3242312 3288467 3436458
34696C436458R5599L9888J14590J90526J11903m586M2751J68488J16888q8957
$$ 3436458 3532057 3571945 3686535 3877061 3988964 3984378 4027129 4195617 4312505 4223548
34686D223548j48191L0791J92232J85800J85398K61038J22471l69348p59607n33981
$$ 4223548 4075357 4106148 4298380 4484180 4669578 4930616 5053087 4683739 3924132 3390151
34676C390151Q5203L72158P1459l33447l52101m5024K38269K74687N285m50281
$$ 3390151 3475354 3847512 3918971 3585524 3233423 3188399 3426668 3701355 3706640 3256359
34666C256359o80891l08086L68939M94173k47908j051861r61163j27023M43808
$$ 3256359 2575468 2267382 2636321 3130494 2882586 1830725 869562 742539 1186347
34657A186347K48513k01253k65939L404J86716J98943K64756L83122K39488k84525
$$ 1186347 1434860 1233607 967668 971072 1157788 1356731 1621487 2004609 2244097 1959572
34647A959572p85532p27519j11014M34059L49829j50720l22850J35740O45926
$$ 1959572 1174040 446521 335507 769566 1119395 968675 645825 781565 1427491
34638A427491N01036j84824o49242m90067o8136J29631Q3795J4416n2025j76510
$$ 1427491 1928527 1743703 1094461 604394 536258 665889 749684 764100 712075 535565
34628E35565k33447r5768O2272p637j91717j52761J31619L23217K43093Q4195
$$ 535565 302118 206350 268622 260985 69268 -83493 48126 371343 614436 698631
34618F98631J3414p9679k52871k69942R948K58803Q4356l27767m04079p379L59420
$$ 698631 712045 632366 379495 109553 119501 378304 462660 134893 -269186 -276565 82855
34607H2855K93650L5858K0250K05265K20827l259j76606j74997k10924l82284
$$ 82855 376505 412363 432613 637878 858705 855446 678840 503843 292919 -89365
34597h9365m22154j18523K86478M02213K32212J05068J37214R7215j41544l17779
$$ -89365 -511519 -630042 -343564 58649 290861 395929 533143 630358 488814 171035
34587A71035j41290K48627M26970K32365n9285j57732j43971k63022m53206l55288
$$ 171035 29745 278372 705342 937707 878422 720690 576719 313697 -139509 -494797
34577d94797J45029O21751N64330J7828m66197m87994j71271J40383K86841K72252
$$ -494797 -349768 271983 836313 854141 387944 -100050 -271321 -130938 155903 428155
34567D28155Q8831k18628m44995l98892j38588J00511J48748j6075k89672m22233
$$ 428155 516986 298358 -146637 -545529 -684117 -583606 -434858 -450933 -740605 -1162838
34557a162838j71262L28305N48915K06963k64710k44915K02896M31555J55417
$$ -1162838 -1334100 -1005795 -456880 -249917 -514627 -759542 -556646 -125091 30326
34548C0326j97491j84622O6431J92867J30212L3958l5276p0481q21J31692J03446
$$ 30326 -167165 -351787 -285356 -92489 37723 71681 36405 -34076 -34897 96795 200241
34537B00241j39631k96414j37360J22613J74512R9557J44613K17957M1668k94113
$$ 200241 60610 -235804 -373164 -250551 -76039 23518 168131 386088 427756 133643
34527A33643l72307o0476K87638L09952L4661k57539l43103j85781O6600K06926
$$ 133643 -238664 -299140 -11502 298450 333111 75572 -267531 -453312 -386712 -179786
34517a79786K05920K32502L20037K34622r4461k92484o6800K33011Q8630l24434
$$ -179786 26134 258636 578673 813295 718834 426350 359550 592561 681191 356757
34507C56757l55844Q3385L62732J17832k40269k35343J5037J57632J43066P3231
$$ 356757 913 84298 447030 564862 324593 89250 104287 261919 404985 478216
34497D78216p5814k38841j47504K20554M31725J98837j37701j16807J62680K86283
$$ 478216 402402 163561 16057 236611 668336 867173 729472 612665 775345 1061628
34487A061628J81232Q2098M6756l7039j00652J3948J92004J60929q5573l02559
$$ 1061628 1242860 1324958 1371714 1334675 1234023 1247971 1439975 1600904 1515331 1212772
34477A212772l59784k96610j19460J42950K87739J59304o9153j29424n6164m9198
$$ 1212772 852988 556378 436918 579868 867607 1026911 957758 828334 772170 722972
34467G22972q0279J7687J84823K12908J06651M3828O7347J10697J91161K82127
$$ 722972 642693 660380 845203 1058111 1164762 1208590 1275937 1386634 1577795 1859922
34457A859922J94610q0655j81570N9497J80557k21451o79177m59093K28258M70682
$$ 1859922 2054532 1973877 1792307 1851804 2032361 1810910 1131733 672640 900898 1371580
34447A371580N8843k58133m4905K06253M4339j98687r7918J32526J22487k412
$$ 1371580 1430423 1172290 1127385 1333638 1377977 1179290 1081372 1213898 1336385 1333973
34437A333973L4101J38374J45188J85124L05407J98307k12366m06978m7189L59155
$$ 1333973 1368074 1506448 1651636 1836760 2142167 2340474 2128108 1721130 1673941 2033096
34427B033096K14694j76042j24604K60099K66052j85298l75928M9132N37466M97468
$$ 2033096 2247790 2071748 1947144 2207243 2473295 2287997 1912069 1961201 2498667 2996135
34417B996135J03848r3142O4082K95510L46362K22172Q5941P2967J49878J46622
$$ 2996135 3099983 3006841 3070923 3366433 3712795 3934967 4020908 4093875 4243753 4390375
34407D390375K500j18484r9345j00612k89273m90824m14521j24107L8544n1525
$$ 4390375 4392875 4274391 4175046 4074434 3785161 3294337 2879816 2755709 2794253 2742728
34397B742728j86673j81981p7311J127l2873j86396l05921j75398J20241J66901
$$ 2742728 2556055 2374074 2296763 2297890 2265017 2078621 1772700 1597302 1717543 1884444
34387A884444j77328m49378k38397J23159N0700l44011m33117q7699J84076J41116
$$ 1884444 1707116 1257738 1019341 1142500 1193200 849189 416072 328373 512449 653565
34377F53565J45025M06996N44406K18725k71952m03103j00385K87070M39381K78655
$$ 653565 798590 1205586 1749992 1968717 1696765 1293662 1193277 1480347 1919728 2198383
34367B198383m5812k35254j11605J29092J69003L7301k2015q0286m07039p96190
$$ 2198383 2152571 1917317 1805712 1934804 2103807 2141108 2119093 2038807 1631768 835578
34357H35578o30214J69638Q31917P06796Q7400k86230j46885K16576M41558L27664
$$ 835578 205364 375002 1206919 1913715 2001115 1714885 1568000 1784576 2226134 2553798
34347B553798r8865m78282l92373L1238J86082j10864k83731R5804N99031O14901
$$ 2553798 2454933 1976651 1584278 1615516 1801598 1690734 1407003 1502807 2101838 2716739
34337B716739K54868J3086o6004k29004l39440q0418L35072L54198o0199l85910
$$ 2716739 2971607 2984693 2918689 2689685 2350245 2269827 2604899 2959097 2898898 2512988
34327B512988l52628k09314j30813O9672M72847P60225O12128J16417l56113m81701
$$ 2512988 2160360 1951046 1820233 1889905 2362752 3122977 3735105 3851522 3495409 3013708
34317C013708j66173L74055P06908N63380J06720k99977m52797l05470R8178M46930
$$ 3013708 2847535 3221590 3928498 4491878 4598598 4298621 3845824 3540354 3638532 4085462
34307D085462K79327l44977o59860j67027N64830O76802K57758O5850K71930L53040
$$ 4085462 4364789 4019812 3359952 3192925 3757755 4434557 4692315 4758165 5030095 5383135
34297E383135J34519J3876R9614M2385j34066L9490M87751M93529l7572j96449
$$ 5383135 5517654 5531530 5631144 5673529 5539463 5578953 6066704 6560233 6522661 6326212
34287F326212M84506J134310Q47509R0402j00734K91894M83631K77247J89901
$$ 6326212 6810718 7945028 8792537 8882939 8782205 9074099 9557730 9834977 10024878
34278A0024878L73365M07914J95254J77239N13250P79310O99749N58898O41789
$$ 10024878 10398243 10806157 11001411 11178650 11691900 12471210 13170959 13729857 14371646
34269A4371646P85991P59132O73830P59671J003933J217891J267520J157387J068499
$$ 14371646 15157637 15916769 16590599 17350270 18354203 19572094 20839614 21997001 23065500
34260B3065500J281357J815279K237554K172806J907123K050982K653810L172079
$$ 23065500 24346857 26162136 28399690 30572496 32479619 34530601 37184411 40356490
34252D0356490L356554L599874M221804M956192N472518N978834O913901Q311740
$$ 40356490 43713044 47312918 51534722 56490914 61963432 67942266 74856167 83167907
34244H3167907R826379J1229711J2641570J4411283J6911260K0217251K3849419
$$ 83167907 92994286 104223997 116865567 131276850 148188110 168405361 192254780
34237A92254780K7107562K9804051L2274337L4377336L4857838L2130001K5523512
$$ 192254780 219362342 249166393 281440730 315818066 350675904 382805905 408329417
34230D08329417J5527560L257791r723264k1328895k9565467l3623470l4160706
$$ 408329417 423856977 427114768 417391504 396062609 366497142 332873672 298712966
34223B98712966l2487954k9728857k6629636k3605635k0726408j7938615j5428551
$$ 298712966 266225012 236496155 209866519 186260884 165534476 147595861 132167310
34216A32167310j3498219j2053260j0622806r037703p686720o872933o308925
$$ 132167310 118669091 106615831 95993025 86955322 79268602 72395669 66086744
34209F6086744n574347m737731m126795l741354l339550k930736k712651k616758
$$ 66086744 60512397 55774666 51647871 47906517 44566967 41636231 38923580 36306822
34201C6306822k395939k128199k125411k292463k111139j440700q37974p89921
$$ 36306822 33910883 31782684 29657273 27364810 25253671 23812971 22974997 22185076
34193B2185076j047474j081300q44927o54968n82028m52560l12954l96478o52193
$$ 22185076 21137602 20056302 19211375 18556407 17974379 17521819 17208865 16812387 16160194
34184A6160194p48794n90996m51160n20303o70956p42515p40019o68418m85525
$$ 16160194 15411400 14820404 14369244 13848941 13177985 12435470 11695451 11027033 10541508
34175A0541508l06471l36216n09217n35481m00246m20596o51656o83814k98430
$$ 10541508 10235037 9898821 9389604 8854123 8453877 8033281 7381625 6697811 6399381
34166F399381J04880R9257j37632k21464k40640m86900p54929n55592L5910L64403
$$ 6399381 6504261 6603518 6465886 6244422 6003782 5516882 4761953 4206361 4242271 4606674
34156D606674J08225l13545l84732j00190K25016L65400K41039r5074l78119l50077
$$ 4606674 4714899 4401354 4016622 3916432 4141448 4506848 4747887 4652813 4274694 3924617
34146C924617j54921j68722l63752k93453J35437L92418J25820k47381j79984
$$ 3924617 3769696 3600974 3237222 2943769 3079206 3471624 3597444 3350063 3170079
34137C170079J75166K82704P8800n6522j3185o0323k73031l75570k28589m2220
$$ 3170079 3345245 3627949 3706749 3650227 3637042 3576719 3303688 2928118 2699529 2657309
34127B657309k25k8488l7478p8006j57072j80433j58827k03198k62435j63496
$$ 2657309 2657084 2628596 2591118 2513112 2356040 2175607 2016780 1813582 1551147 1387651
34117A387651K8631K5843k07659l42963j98509j3651p805j7664J43979K83587
$$ 1387651 1416282 1442125 1234466 891503 692994 679343 671538 653874 797853 1081440
34107A081440J40762j30405j86660l6204N1031N1796J59092K91660J34247k48916
$$ 1081440 1222202 1091797 905137 868933 919964 971760 1130852 1422512 1556759 1307843
34097A307843l40668N5415M02371J57417m02776n42048q9695L82557M02279J41788
$$ 1307843 967175 1022590 1424961 1582378 1179602 637554 547859 930416 1332695 1474483
34087A474483j7030m3350j06056j67065q2733N2299J4129j71620k76962k44843
$$ 1474483 1457453 1414103 1308047 1140982 1058249 1110548 1124677 953057 676095 431252
34077D31252j89284o9525K38949N32062M04973p3329l06507m6193J86264m6199
$$ 431252 241968 172443 411392 943454 1348427 1275098 968591 922398 1108662 1062463
34067A062463l21399m4566M76818M37694j51195m23882m228M60707L89281J06994
$$ 1062463 741064 696498 1173316 1611010 1459815 1035933 1031705 1492412 1881693 1988687
34057A988687J41891L30317K18150j13964k52019j66198j41768k07085j63736
$$ 1988687 2130578 2460895 2679045 2565081 2313062 2146864 2005096 1798011 1634275
34048A634275k5038M8055P9085J07445p3689n12021p01419k17191M69444N34014
$$ 1634275 1609237 1657292 1736377 1843822 1770133 1258112 556693 339502 808946 1342960
34038A342960L0800k14058P7120K93024O1902j69456k7819J32846m0533k22561
$$ 1342960 1373760 1159702 1236822 1529846 1591748 1422292 1394473 1527319 1486786 1264225
34028A264225l9750K11790J09274j31456j02204L527k30738n80371m63556P2587
$$ 1264225 1224475 1436265 1545539 1414083 1311879 1315406 1084668 504297 40741 113328
34018A13328L93955K59526O2668N8506J4481k23081l88573k45861N3403K52734
$$ 113328 507283 766809 829477 887983 902464 679383 290810 44949 98352 351086
34008C51086K86427J71352m8533j56328O2020L85064L02125k32616n82699k32905
$$ 351086 637513 808865 760332 604004 666024 1051088 1353213 1120597 537898 304993
33998C04993M87601P95006L96144k34091m65494j96598J25244J02115j10388n7279
$$ 304993 792594 1587600 1983744 1749653 1284159 1087561 1212805 1314920 1204532 1147253
33988A147253K87570M01034P294m08616k95441R9121J35829j82170k86158n2364
$$ 1147253 1434823 1835857 1843151 1434535 1139094 1238215 1374044 1191874 905716 853352
33978H53352M6277j42888j88781O4142J68826n3416q7766L48200O69205L32954
$$ 853352 899629 756741 567960 632102 800928 747512 659746 1007946 1677151 2010105
33968B010105k21095k62117Q7809J90341J9131R5743M61470N57932J71804k26614
$$ 2010105 1789010 1526893 1614702 1805043 1824174 1919917 2381387 2939319 3111123 2884509
33958B884509k42975p9309r6711k92881m11648k89448J1764K26814R2060k67574
$$ 2884509 2641534 2562225 2465514 2172633 1760985 1471537 1483301 1710115 1802175 1534601
33948A534601l47117L2596L00376r8478p48845p28595O2472P37394O51426J21307
$$ 1534601 1187484 1220080 1520456 1421978 673133 -55462 7010 744404 1395830 1517137
33938A517137k58597l76881l86623k72267j4209J94499K25115K14801K60231K25252
$$ 1517137 1258540 881659 495036 222769 208560 403059 628174 842975 1103206 1328458
33928A328458O0278l3075J7371l7422l20260n26473l65827j9900J35301K4630
$$ 1328458 1388736 1355661 1373032 1335610 1015350 488877 123050 103150 238451 263081
33918B63081j64825k81718k29458P4434N12490P44400N70251J25365l81910q13098
$$ 263081 98256 -183462 -412920 -338486 174004 918404 1488655 1614020 1232110 419012
33908D19012q92480l35969N65036R78232N25179j82542m02593k09902r3965o8667
$$ 419012 -473468 -809437 -244401 733831 1259010 1076468 673875 463973 370008 301341
33898C01341J43592L65100J72866k76260l72404K519L35390L33333K53311K68243
$$ 301341 444933 810033 982899 706639 334235 336754 672144 1005477 1258788 1527031
33888A527031J55771j63108l55903k27466m3255k6558J653J80107K56810M1178
$$ 1527031 1682802 1519694 1163791 936325 893070 866512 868165 1048272 1305082 1346260
33878A346260j94771j69767r8294k91820n36830l76373J46012N15254M59491J96603
$$ 1346260 1151489 981722 883428 591608 54778 -321595 -175583 339671 799162 995765
33868I95765k3473j99031l33611k94310n9434J70247K46549K31681J66515o5388
$$ 995765 972292 773261 439650 145340 85906 256153 502702 734383 900898 835510
33858H35510m59212o92367m67917N1409M05152L93112K29569J30870K0798k19709
$$ 835510 376298 -316069 -783986 -732577 -327425 65687 295256 426126 446924 227215
33848B27215m29454l38657J8519L05227L03342J27889j7438q9217j17944p1170
$$ 227215 -202239 -540896 -522377 -217150 86192 214081 196643 107426 -10518 -81688
33838h1688M9805J31503J24050J46976K42796J96981j36720m73428m06529k4471
$$ -81688 -31883 99620 223670 370646 613442 810423 673703 200275 -206254 -230725
33828b30725J74108K0802r1922J14532L20883J28754k58854l20111r405K14435
$$ -230725 -56617 -35815 -127737 -13205 307678 436432 177578 -142533 -151938 62497
33818F2497J33107M9970J87232K51464q4432n67637o37584j92721K91781M02658
$$ 62497 195604 245574 432806 684270 599838 32201 -605383 -798104 -506323 -103665
33808a03665K07007j9930j54158j67535l266K70751L96607K57341J04203J97557
$$ -103665 103342 83412 -70746 -238281 -241547 29204 425811 683152 787355 984912
33798I84912L86794L66814K17099K72649M93269M31671n3053m87689m28269o1742
$$ 984912 1371706 1738520 1955619 2228268 2721537 3153208 3100155 2612466 2184197 2122455
33788B122455J31578M9404l0159N8693K07778K90474L07675K94946K52933J42742
$$ 2122455 2254033 2303437 2273278 2331971 2539749 2830223 3137898 3432844 3685777 3828519
33778C828519j10016m74516o54652l49556K29297M72705K04761k6584J95255M82238
$$ 3828519 3718503 3243987 2589335 2239779 2469076 2941781 3146542 3119958 3315213 3797451
33768C797451L13049o4701p3636J79206J23699k17642k70917J1902L4224l39204
$$ 3797451 4110500 4045799 3972163 4151369 4275068 4057426 3786509 3798411 3832635 3493431
33758C493431m81724j28090R8281k29086n55973l01956J22557N1355k60177j12984
$$ 3493431 3011707 2883617 2981898 2752812 2196839 1894883 2017440 2068795 1808618 1695634
33748A695634L55431L55183k26247o27367m17270n4823l3598j90088j77974n0772
$$ 1695634 2051065 2406248 2180001 1552634 1135364 1080541 1046943 856855 678881 628109
33738F28109n586K0644J45672K54609K19689J39008R8465l8343l26781m67823
$$ 628109 622523 643167 788839 1043448 1263137 1402145 1500610 1462267 1135486 667663
33728F67663j67066L63559N73305K23918l36944n66459k69599K44083M73481K11139
$$ 667663 500597 864156 1437461 1661379 1324435 757976 488377 732460 1205941 1417080
33718A417080k59412m89525l59391j36906p2061j18203j02418J2152J42158K30030
$$ 1417080 1157668 668143 308752 171846 99785 -18418 -120836 -108684 33474 263504
33708B63504K60917K23653J45797R3568O9586o420j49031k32006j53650p205K6916
$$ 263504 524421 748074 893871 987439 1057025 1050605 901574 669568 515918 508713 535629
33697E35629o2554q5047P4851K22736L5809m72342q19450n80138K7770L61470
$$ 535629 473075 388028 462879 685615 721424 249082 -570368 -1150506 -1122736 -761266
33687g61266J82107p0475L2337L17657L97268K97962K75542K58108J3892k62877
$$ -761266 -579159 -649634 -617297 -299640 97628 395590 671132 929240 943132 680255
33677F80255j39927K74581L60752o9642m60079l90878j93002k88499m31169j55148
$$ 680255 540328 814909 1175661 1106019 645940 255062 62060 -226439 -657608 -812756
33667h12756L59537M87001Q9829l05622k78154K637J46576M5874j15534j25260
$$ -812756 -453219 33782 123611 -182011 -460165 -457528 -310952 -265078 -380612 -505872
33657e05872O8543K83640K32832j10838l56786j40606L42927N45021K85674m9798
$$ -505872 -437329 -153689 79143 -31695 -388481 -529087 -186160 358861 644535 594737
33647E94737r0297O6514J18999J4115o5972k648J61241L19247L47729J40226k57119
$$ 594737 504440 570954 689953 704068 638096 635448 796689 1115936 1463665 1603891 1346772
33636A346772n87963n93001k85041M7593J24371n8421k38291j71822Q9822K62928
$$ 1346772 758809 165808 -119233 -71640 52731 -5690 -243981 -415803 -325981 -63053
33626f3053J89205K5289p515O5537P2363P14j5388L9556N6468L8474P5567Q5409
$$ -63053 126152 151441 143926 209463 281826 282540 267152 306708 363176 401650 477217 562626
33614E62626r4827l07044j61790K95393M34110r0509o74917m94170L01318P26489
$$ 562626 467799 160755 -1035 294358 728468 637959 -36958 -531128 -229810 496679
33604D96679L14954k80592k70100K15705M59169K01987j40758j80321k864J10701
$$ 496679 811633 531041 260941 476646 935815 1137802 997044 816723 813859 924560
33594I24560N5153j04000k53963k69415j21462O514p9753k50748j88793R0530
$$ 924560 979713 875713 621750 352335 230873 237387 157634 -93114 -281907 -191377
33584a91377J87051o4013k73188p4443K82401L00065j7394k31446j71694q2478
$$ -191377 -4326 -68339 -341527 -415970 -133569 166496 149102 -82344 -254038 -336516
33574c36516p2038P1698L86582N37731L50064J24030J19713J03267k04918n41457
$$ -336516 -408554 -336856 49726 587457 937521 1061551 1181264 1284531 1079613 538156
33564E38156m39361K4296L16104K12912O518o0190r0974j77124j75021j7577J07024
$$ 538156 98795 123091 439195 652107 658625 598435 507461 330337 155316 137739 244763
33553B44763P7616L2697O2206K5465j13481r9685J87662M34062L49009J42507
$$ 244763 322379 355076 417282 442747 329266 229581 417243 851305 1200314 1342821
33543A342821J43099K01268j7663l26878k26789J99430K71193k29638o25561l39129
$$ 1342821 1485920 1687188 1669525 1342647 1115858 1315288 1586481 1356843 731282 392153
33533C92153K20499K95379q5645k50972K2935K49447R3404j40250j03452K3749
$$ 392153 612652 908031 822386 571414 594349 843796 937200 796950 693498 717247
33523G17247q8921l30405l41026r5339R5704P0909l7260j00489j04000L9494M25061
$$ 717247 628326 297921 -43105 -138444 -42740 28169 -9091 -109580 -213580 -174086 250975
33512B50975Q08615O86556l0857o88656n78472J51150O47801M38323k1163n9575
$$ 250975 1059590 1746146 1715289 1026633 448161 599311 1247112 1685435 1664272 1604697
33502A604697K76360L73653j2971m33339m26245j28392M3301J4613K349J5940
$$ 1604697 1881057 2254710 2241739 1808400 1382155 1253763 1297064 1311677 1314026 1329966
33492A329966j53806m48260m64845k8115M76584N64584K36548j18153k36729j67527
$$ 1329966 1176160 727900 263055 234940 711524 1276108 1512656 1394503 1157774 990247
33482I90247n5421J2714r723j04560j63220j19284m5086J3794J78444N03410P14198
$$ 990247 934826 947540 937817 833257 670037 550753 505667 519461 697905 1201315 1915513
33471A915513M74058r8028m77190l77894q9680l8056k31698l42999k01364K5533
$$ 1915513 2389571 2291543 1814353 1436459 1346779 1308723 1077025 734026 532662 558195
33461E58195J27601J32517J91811K82522J88804j65784n14581n52578l61858k65677
$$ 558195 685796 818313 1010124 1292646 1481450 1315666 801085 248507 -113351 -379028
33451c79028k69846k5846N13133Q28868N59372J00859P989J05228j60563o57634
$$ -379028 -648874 -674720 -161587 667281 1226653 1327512 1335501 1440729 1280166 622532
33441F22532o50870j4986M41197J76550k72362j76555K69473L47202n5209l83197
$$ 622532 -28338 -43324 397873 574423 302061 125506 394979 742181 686972 303775
33431C03775k95001J4858K90850M58964M04723K4643m33860n27353k12152R1126
$$ 303775 8774 23632 314482 773446 1178169 1202812 768952 241599 29447 120573
33421A20573J17444O0040J19062J30617j00691l70309k91110J50563N10372L93587
$$ 120573 238017 298057 417119 547736 447045 76736 -214374 -63811 446561 840148
33411H40148p7069l77258j63577L20447N17378K18504k19417l74176k54050j44427
$$ 840148 763079 385821 222244 542691 1060069 1278573 1059156 684980 430930 286503
33401B86503j70411k36812k45625j39987J27682M43040N09899K40335k0440L4228
$$ 286503 116092 -120720 -366345 -506332 -378650 64390 574289 814624 794184 828412
33391H28412J77960K1030l01211l01107P2823L40542K20941k2121n6673J26456
$$ 828412 1006372 1027402 726191 425084 497907 838449 1059390 1037269 980596 1107052
33381A107052M08635P30348R73087J020400J002221J092692J059711N21887k98768
$$ 1107052 1515687 2246035 3219122 4239522 5241743 6334435 7394146 7916033 7617265
33372G617265o95473n05571l53489n91775p25292l59593j7925l13176q53648q23182
$$ 7617265 6921792 6416221 6062732 5470957 4745665 4386072 4368147 4054971 3201323 2378141
33362B378141l12291j50598n23785o83710j82100M19781M21784m1828l35099k29077
$$ 2378141 2065850 1915252 1391467 707757 525657 945438 1367222 1325394 990295 761218
33352G61218l4827l1178j41829j51381j0478J16262M8170j63931k38139p678L01928
$$ 761218 726391 695213 553384 402003 391525 507787 555957 392026 153887 146209 448137
33341D48137L17240Q607k60785j92711J14066L19847J95128j95260n44865n64458
$$ 448137 765377 773984 513199 320488 434554 754401 949529 754269 209404 -355054
33331c55054k90765o4597q7184j42166M6506L44287L93981J69115j4705r486J8627
$$ -355054 -645819 -710416 -797600 -939766 -893260 -548973 -154992 14123 -582 -10068 8559
33320H559j3239N1630K44733L10071J10417r7675m5131J18438O0554k07075l40893
$$ 8559 -4680 46950 291683 601754 712171 614496 569365 687803 748357 541282 200389
33309B00389j75228N5649Q4117n350O5937L00514L40712l2180m82162m65614K6506
$$ 200389 25161 80810 164927 159577 225514 526028 866740 834560 352398 -113216 -86710
33298h6710L90321J99384k26807k87301J12196N53402P02972N44958J42171m02676
$$ -86710 303611 502995 276188 -11113 101083 654485 1357457 1902415 2044586 1641910
33288A641910p68018o32765j60612J09017k9629j99072n1921K08901J70015j75194
$$ 1641910 873892 241127 80515 189532 159903 -39169 -91090 117811 287826 112632
33278A12632m31279l20587J5133K18390J16921r8055j21875K8751N790l10069
$$ 112632 -318647 -639234 -624101 -405711 -288790 -386845 -508720 -479969 -474179 -784248
33268g84248m96676j66383L64161M69142J66090P3311L82689N42902J95984k11317
$$ -784248 -1280924 -1447307 -1083146 -614004 -447914 -374603 8086 550988 746972 535655
33258E35655j63485J02099L9781l01448l93286o5172K88161K88210j8176l13050
$$ 535655 372170 474269 514050 212602 -180684 -245856 42305 330515 312339 -711
33248g11l16161l932L09795K66836k9861r3568J85717K86102j02585m57286j95043
$$ -711 -316872 -320804 -11009 255827 225966 132398 318115 604217 501632 44346 -150697
33237a50697L29633L24522j75977l65283M5614M21408K60275r4788j37434L4760
$$ -150697 178936 503458 327481 -37802 7812 429220 689495 594707 457273 492033
33227D92033O7773j5473p138P0k01301m69973m69966j74469J41686L26271M32539
$$ 492033 559806 544333 537195 537265 335964 -134009 -603975 -778444 -636758 -310487 122052
33216A22052M28662J71044k61834m73970j59519M80619Q57644N64329j95505p91816
$$ 122052 550714 721758 459924 -14046 -173565 307054 1164698 1729027 1533522 741706
33206G41706q01580l89908j5009J10908J12301J25179J39625J45780J84293K17051
$$ 741706 -59874 -449782 -464791 -353883 -241582 -116403 23222 169002 353295 570346
33196E70346J57648M9140K872k7469j56993k72780j49269J15545J57818o3647
$$ 570346 727994 777134 780006 752537 595544 322764 173495 289040 446858 383211
33186C83211j47317R7340K88371N6017l65287m91398k62540J4408J73671K43307
$$ 383211 235894 333234 621605 677622 312335 -179063 -441603 -427195 -253524 -10217
33176a0217J71615o9621k21783j7916L18729K81289j94841o07770n57033j79053
$$ -10217 161398 91777 -130006 -147922 170807 452096 257255 -350515 -907548 -1086601
33166a086601J73333L47718L59990K44322R4485K9137j85j46402l35483k79288
$$ -1086601 -913268 -565550 -205560 38762 133247 162384 162199 15797 -319686 -598974
33156e98974N6121L00279J98548O035R6838M00435N33188L43521J7153k62481
$$ -598974 -542853 -242574 -44026 -37991 58847 459282 992470 1335991 1353144 1090663
33146A090663m43377m44364j93371J42753K57462J11697o131Q1675J92855J18988
$$ 1090663 647286 202922 9551 152304 409766 521463 515332 597007 789862 908850
33136I08850k2742n8J21462N4524k44079m36663k22802K58606N63750M17408m0849
$$ 908850 886108 886050 1007512 1062036 817957 381294 158492 417098 980848 1398256 1357407
33125A357407m56052o06653n18353l05145k6365K48106L52655J81839q5008j26068
$$ 1357407 901355 294702 -223651 -528796 -555161 -307055 45600 227439 142431 16363
33115A6363P5011J37763j76276n21794l71141K21744O26456M64744P0326o3912
$$ 16363 91374 229137 52861 -468933 -840074 -618330 8126 472870 543196 479284
33105D79284L1240q315k28869l13435j38134K7832k8637j38806n0114J79905K95057
$$ 479284 510524 502209 273340 -40095 -178229 -150397 -179034 -317840 -367954 -188049 107008
33094A07008K05297M1254p2958j13290n7698J22324L38424L89295J70757j71575
$$ 107008 312305 353559 280601 167311 109613 231937 570361 959656 1130413 958838
33084I58838l68349k98439r0668N5686R9332J42705K17321K06853L9250j59236
$$ 958838 590489 292050 201382 257068 356400 499105 716426 923279 962529 803293
33074H03293k12755j16591J4285J30545K17675J63798j05183l83309l52113m2621
$$ 803293 590538 473947 488232 618777 836452 1000250 895067 511758 159645 117024
33064A17024J39745m2387l50680m48980l20110j04447J93478N24511N61404Q1546
$$ 117024 256769 214382 -136298 -585278 -905388 -1009835 -816357 -291846 269558 351104
33054C51104n21459n87903r0304K84392J00275k35102j40800K63752M10717J86390
$$ 351104 -170355 -758258 -848562 -564170 -463895 -698997 -839797 -576045 -165328 21062
33044B1062M3391K24929L97678K34541n9353j05180N8236J02529m6078j74519
$$ 21062 64453 289382 687060 921601 862248 757068 815304 917833 871755 697236
33034F97236k15046l06805m05222k42352J78335M17356J78593k30572l16973p0693
$$ 697236 482190 175385 -229837 -472189 -293854 123502 302095 71523 -245450 -316143
33024c16143J09745K0328j59925k13018r7208J44835L97539M29512J44138j64820
$$ -316143 -206398 -186070 -345995 -559013 -656221 -511386 -113847 315665 459803 294983
33014B94983j43548P1216L2096k84101m01987j20453J50817P0841r9113j097J93079
$$ 294983 151435 222651 254747 -29354 -431341 -551794 -400977 -330136 -429249 -430346 -237267
33003b37267J11052j70993k89569j88753p7355L9690K87339M83390K94560j86702
$$ -237267 -126215 -297208 -586777 -775530 -852885 -813195 -525856 -42466 252094 65392
32993F5392n04273m91571l87993k79233L4260M77540N73781J66309k09380n9860
$$ 65392 -438881 -930452 -1318445 -1597678 -1563418 -1085878 -512097 -345788 -555168 -615028
32983f15028L34836L68185J4143k11957p1784J20265P1195p9008q3227n716p0417
$$ -615028 -280192 87993 102136 -109821 -181605 -61340 9855 -69153 -152380 -158096 -228513
32972b28513k53322k74156J4669L93127M93235K00278k20386l99342k33780M6378
$$ -228513 -481835 -755991 -741322 -348195 145040 345318 124932 -274410 -508190 -461812
32962d61812J69817J23637J11259K27222K68129k6713n54164q28050n15336J10574
$$ -461812 -291995 -168358 -57099 170123 438252 411539 -142625 -970675 -1486011 -1375437
32952a375437M61514L44449J21475J28413K49905K31348J08847N1311L476j73114
$$ -1375437 -913923 -569474 -447999 -319586 -69681 161667 270514 321825 325301 152187
32942A52187l43797k39960J06330L82753M09928K49458k1743l16610l97505j25570
$$ 152187 -191610 -431570 -325240 57513 467441 716899 695156 378546 -18959 -144529
32932a44529J81440P4881l20051l96707L9671M62145L96966L6034k01486k82122
$$ -144529 36911 111792 -208259 -604966 -565295 -103150 293816 329850 128364 -153758
32922a53758l63800l47908o8869K88778L81946J93539k0898j55162k83315l54496
$$ -153758 -517558 -865466 -934335 -645557 -263611 -70072 -90970 -246132 -529447 -883943
32912h83943k02645J34719L76931L24968O8964j31723q6343J43746K41129l7979
$$ -883943 -1086588 -951869 -574938 -249970 -181006 -312729 -399072 -255326 -14197 -52176
32902e2176m59660m75713N9679N99482N61874M3786l97764m63960k90910p5237
$$ -52176 -511836 -987549 -927870 -328388 233486 277272 -120492 -584452 -875362 -950599
32892i50599J16552K38848K80681L50977N04545N58512L31665j7561j55383j2172
$$ -950599 -834047 -595199 -314518 36459 541004 1099516 1431181 1413620 1258237 1246065
32882A246065J86613K66412K44858J80362R6647K8986K960K9887J76956M53256
$$ 1246065 1432678 1699090 1943948 2124310 2220957 2249943 2252903 2282790 2459746 2913002
32872B913002N90320K87661k07984k48944K37384M83470J8933n26338l93424Q9742
$$ 2913002 3503322 3790983 3582999 3334055 3571439 4054909 4073842 3547504 3154080 3243822
32862C243822J17876j93915n6057N61279Q46519N12042J58544J09200o0590n17800
$$ 3243822 3361698 3167783 3111726 3673005 4519524 5031566 5190110 5299310 5238720 4720920
32852D720920p10496l59082Q180J0348K6605L00994L24019k06708o49534m49076
$$ 4720920 4010424 3651342 3659522 3669870 3696475 3997469 4321488 4114780 3465246 3016170
32842C016170j31872l49771o29206j67665O47001P22206j1096n47752m01646j13502
$$ 3016170 2884298 2534527 1905321 1737656 2384657 3106863 3095767 2548015 2146369 2032867
32832B032867j05601j14344J7930l2537l27209l95652p1496J60811K4417p6994
$$ 2032867 1927266 1812922 1830852 1798315 1471106 1075454 1003958 1164769 1189186 1112192
32822A112192J29154K06227k11881o56884m77939J55061N21965L58094K5755j47230
$$ 1112192 1241346 1447573 1235692 578808 100869 255930 777895 1135989 1161744 1014514
32812A014514j85309j86645j45522o7995j891L8510L2276o1596j64442j05944
$$ 1014514 829205 642560 497038 429043 427152 465662 497938 436342 271900 165956
32802A65956Q2618J34630m0217j77251p9500O9619N4655n159O4689J18265n6470
$$ 165956 248574 383204 342987 165736 86236 155855 210510 205351 270040 388305 331835
32791C31835l21057l84261k44349q7149Q1945L26247M59117K65703n8207j33246
$$ 331835 10778 -373483 -617832 -704981 -623036 -296789 162328 428031 369824 236578
32781B36578p121o7423l35486l55010P3455N05627M52259K2619l06731l12084
$$ 236578 229457 162034 -173452 -528462 -455007 50620 502879 525498 218767 -93317
32771i3317j34147M1731J34460J04715o056k8827J33549K95757J73284k21271
$$ -93317 -227464 -185733 -51273 53442 47386 18559 152108 447865 621149 399878
32761C99878n33278m58859o5818L19238M48031L21451J07308j7411L1878J95732
$$ 399878 -133400 -592259 -658077 -338839 109192 430643 537951 520540 552418 748150
32751G48150K75510P1270l83762p53501o87910k17209K42128L28542R8611j00118
$$ 748150 1023660 1094930 711168 -42333 -730243 -947452 -705324 -376782 -278171 -378289
32741c78289k2795K68093M89106L61881j19283n65721n10911J8067M39466L26717
$$ -378289 -401084 -132991 356115 717996 598713 32992 -477919 -459852 -20386 306331
32731C06331l2688r0629J43347J82091j11862l05229j09170J78268J83705o139
$$ 306331 273643 183014 326361 508452 396590 91361 -17809 160459 344164 338025
32721C38025j26580j89776k92318k75292J561K80593K46535N7801O3726J59664
$$ 338025 211445 21669 -270649 -545941 -544380 -263787 -17252 40549 104275 263939
32711B63939j0911l00988j74838L40961N12511j1916n76808m23354K43105O03074
$$ 263939 253028 -47960 -222798 118163 630674 618758 41950 -381404 -138299 464775
32701D64775L35693j33616l26696j90193M2809J06934j11190l79510k70939K33024
$$ 464775 800468 666852 340156 149963 192772 299706 188516 -190994 -461933 -228909
32691b28909N57089L06406r7473n8622K27054J29615k91029l43370J19185M45353
$$ -228909 328180 634586 537113 478491 705545 835160 544131 200761 319946 765299
32681G65299K85455Q7581J59556P7767m32582p77516l73578L16225M24902k0717
$$ 765299 1050754 1138335 1297891 1375658 943076 165560 -208018 108207 533109 512392
32671E12392k55551M222L00697K99578J58932J5420k09952m02016k65908J10707
$$ 512392 256841 261063 561760 861338 1020270 1035690 825738 423722 157814 268521
32661B68521K59713M7795j25728j7230Q1153j07379l52911k83008O5920L31781
$$ 268521 528234 576029 450301 433071 514224 406845 53934 -229074 -163154 168627
32651A68627K71086l6764k71587j29807K94736M60679L1012n35040n07558O4819
$$ 168627 439713 402949 131362 1555 296291 756970 787982 252942 -254616 -189797
32641a89797M25687K63218R2581K80359M11027M7833m82005o02728l43971j34763
$$ -189797 235890 499108 591689 872048 1283075 1330908 848903 246175 -97796 -232559
32631b32559q8193k1008Q0135J08179J34817K23732J79537r2227k46720M327L28859
$$ -232559 -320752 -341760 -261625 -153446 -18629 205103 384640 292413 45693 50020 378879
32620C78879K42485r7336j61369O6539J27272p5603j53091K2210R3301j27576
$$ 378879 621364 524028 362659 429198 556470 480867 327776 349986 443287 315711
32610C15711l55369l49372k21011o2951K13344M76785L48909j44521m02347r1581
$$ 315711 -39658 -389030 -610041 -672992 -459648 17137 366046 221525 -180822 -272403
32600b72403K93251J57643k92457m14162j23369Q6222K6659Q1812M60492P35816
$$ -272403 20848 178491 -113966 -528128 -651497 -565275 -538616 -456804 3688 739504
32590G39504M57730j41577m68690m00408l33789m34317l41895J54609N82472L68930
$$ 739504 1197234 1055657 586967 186559 -147230 -581547 -923442 -768833 -186361 182569
32580A82569k70772n60081k27599K01785K66306J40750J11728N8447j20628p4171
$$ 182569 -88203 -648284 -875883 -674098 -407792 -267042 -155314 -96867 -217495 -291666
32570b91666M20018Q18838M63185l46815o73190k82404R5395m6383k96676j25556
$$ -291666 128352 947190 1410375 1063560 390370 107966 203361 156978 -139698 -265254
32560b65254K57522L06678j4129k61111j67325J03777K39821O7860l20608n72332
$$ -265254 -7732 298946 284817 23706 -143619 -39842 199979 267839 -52769 -625101
32550f25101l57392K18141O64261O69908L93487J14875r5483k16884j27206J43695
$$ -625101 -982493 -764352 -100091 569817 963304 1078179 982696 765812 638606 782301
32540G82301K83828R2469k11430l18009k43489j60744m3541J93151L67525K18739
$$ 782301 1066129 1158598 947168 629159 385670 224926 181385 374536 742061 960800
32530I60800j33702k56243L1409M02520M17890K4585m17642n43501l57648j74665
$$ 960800 827098 570855 602264 1004784 1422674 1447259 1029617 486116 128468 -46197
32520d6197j83959k02042k525K50289K10932n0398p9870K24318L53946m9464n49126
$$ -46197 -230156 -432198 -434723 -184434 26498 -23900 -103770 120548 474494 425030 -124096
32509a24096m51073K16571P16044N55523L6234k42943j27306L3643p2668l27721
$$ -124096 -575169 -358598 357446 912969 949203 706260 578954 612597 539929 212208
32499B12208l74504r8727K27248L03092J39012o9613k20784k65730q8675K66446
$$ 212208 -162296 -261023 -33775 269317 408329 338716 117932 -147798 -236473 29973
32489B9973M10568N2581m60680m97403r305M26104M41971K41714O4505j31074
$$ 29973 440541 493122 32442 -464961 -474266 -48162 393809 635523 700028 568954
32479E68954k95345j80206J63201L18404J66714N3508O6948j71763o65223p47017
$$ 568954 273609 93403 256604 575008 741722 795230 862178 690415 25192 -721825
32469g21825j53823L42040N8136m90762m26196R8300K65352l0494j62146Q0884
$$ -721825 -875648 -533608 -475472 -966234 -1392430 -1294130 -1028778 -1059272 -1221418 -1140534
32459a140534K77127K35884J96310J67222j08309m78802m44061J5845L56535K92495
$$ -1140534 -863407 -627523 -431213 -263991 -372300 -851102 -1295163 -1279318 -922783 -630288
32449f30288P2503q8943k10107j83642R9522K98395K5141l49954j29136M91904
$$ -630288 -557785 -646728 -856835 -1040477 -940955 -642560 -617419 -967373 -1096509 -604605
32439f04605N82746m3628n23122l42227j8538k3813n7498J10851P2682l19411
$$ -604605 -21859 -65487 -588609 -930836 -949374 -973187 -1030685 -919834 -847152 -1166563
32429a166563m13369J46738O33878L59043j96607k60119o0331k35729n55571l60471
$$ -1166563 -1579932 -1433194 -799316 -440273 -636880 -896999 -957330 -1193059 -1748630 -2109101
32419b109101J36840J57979k65555l71618m0270M0554l44655n80779l81912k99228
$$ -2109101 -1972261 -1814282 -2079837 -2451455 -2491725 -2451171 -2795826 -3376605 -3758517 -4057745
32409d057745o66310r18273n14153J46257L47200J19946O0426L74918O90893P10973
$$ -4057745 -4724055 -5642328 -6156481 -6010224 -5663024 -5543078 -5482652 -5107734 -4416841 -3705868
32399c705868N62630M53800L41040R9906j56792j44889J79244M39313K70009j31417
$$ -3705868 -3143238 -2689438 -2348398 -2248492 -2405284 -2550173 -2370929 -1931616 -1661607 -1793024
32389a793024j93423K23660N95389N22591L22913M18382N21551P4046o93308q89238
$$ -1793024 -1986447 -1762787 -1167398 -644807 -321894 96488 618039 692085 -1223 -890461
32379h90461k31831M85042M57678j26173m95404l02953J63369N07949N66242L42080
$$ -890461 -1122292 -637250 -179572 -305745 -801149 -1104102 -940733 -432784 133458 475538
32369D75538l9868l14276k49105R3500L79989L31956o960l33088l88846j96203
$$ 475538 435670 121394 -127711 -34211 345778 677734 670774 337686 -51160 -247363
32359b47363K3366J23250J37692J31183J04203R3618J73933K58238J05496l16044
$$ -247363 -223997 -100747 36945 168128 272331 365949 539882 798120 903616 587572
32349E87572o64994o15180k44455J30774L14517K59446j938k31767r2722L30085
$$ 587572 -77422 -692602 -937057 -806283 -491766 -232320 -234258 -466025 -558747 -228662
32339b28662M45823k1962m87004k90375K79690M21446N8499j38669P8864J95944
$$ -228662 217161 195199 -291805 -582180 -302490 118956 177455 38786 117650 313594
32329C13594p8161k93203q9691J46562m8141m25930m47145j10523J70922K61308
$$ 313594 235433 -57770 -147461 -899 -49040 -474970 -922115 -1032638 -861716 -600408
32319f00408L53400M78886M36092J65708j57380l88406m99013m45046k00850R6118
$$ -600408 -247008 231878 667970 833678 676298 287892 -211121 -656167 -857017 -760899
32309g60899K38818J77368K2183j12016j42697n371K45281M07937L50489J72906
$$ -760899 -522081 -344713 -322530 -434546 -577243 -582614 -337333 70604 421093 593999
32299E93999L5586o9503k34368m08928m12152j44294K87167O13509N71917J51706
$$ 593999 629585 560082 325714 -83214 -495366 -639660 -352493 261016 832933 984639
32289I84639l03526m02410j56036O1430L8052m5173o783J8103j19970k25281l4680
$$ 984639 681113 278703 122667 184097 222149 176976 170193 188296 68326 -156955 -191635
32278a91635K81062K60548j93628o13010n25892j0768M57446N74569M33598K34121
$$ -191635 89427 349975 156347 -456663 -982555 -993323 -535877 38692 472290 706411
32268G06411l82k95295m85080l58129k4059J38597q812j68267o6333J56018K38009
$$ 706411 706029 410734 -74346 -432475 -456534 -317937 -326749 -495016 -561349 -405331 -167322
32257a67322K13503K19123J36501j62554l94040j69814L45105N70804L10685n1774
$$ -167322 46181 265304 401805 239251 -154789 -324603 20502 591306 901991 850217
32247H50217j85367j71653j60260j28066r9000j71928k16279K2328M01974M45455
$$ 850217 664850 493197 332937 204871 105871 -66057 -282336 -260008 141966 587421
32237E87421O7733k51255k03715n1204n8967p1009M6407O1266j48442k51842j0249
$$ 587421 655154 403899 200184 148980 90013 19004 65411 126677 -21765 -273607 -283856
32226b83856K64647K19386K0389j8584L3661J2904O1632K52830K25757k41359
$$ -283856 -19209 200177 220566 201982 235643 248547 310179 563009 788766 547407
32216E47407o69866n07792k000J94728Q173j35112j18148j36395p9100L03657
$$ 547407 -122459 -630251 -632251 -437523 -429350 -564462 -682610 -819005 -898105 -594448
32206e94448P02901N32265p0839l31373l6685J65503r1227k68136J12133N64595
$$ -594448 108453 640718 569879 238506 201821 367324 276097 7961 120094 684689
32196F84689L43859l79540p22688l18518K51736L19219k3806j79243O9216K67960
$$ 684689 1028548 649008 -73680 -392198 -140462 178757 154951 -24292 44924 312884
32186C12884j7686n07888n55303r6044K48992J51982Q2676M53045P98196M47408
$$ 312884 295198 -212690 -767993 -864037 -615045 -463063 -380387 72658 870854 1318262
32176A318262l45852p01022l81007m116L91j01033r744J21184J02995M6257L0157
$$ 1318262 972410 271388 -109619 -113735 -113344 -214377 -224121 -102937 58 46315 76472
32165G6472p7729k43842j74477J64438L68879J86838j07206j66494l0031J04592
$$ 76472 -1257 -245099 -419576 -255138 113741 300579 193373 26879 -3152 101440
32155A01440K11017K98736K61823P9627r9340k12929l33184l84582j89429J21423
$$ 101440 312457 611193 873016 952643 853303 640374 307190 -77392 -266821 -145398
32145a45398J76881l9316j28796M8973J62813N4283K8395K28831L04564O6303
$$ -145398 31483 -7833 -136629 -87656 75157 129440 157835 386666 691230 757533
32135G57533r1069J17782K80792m4335n15006m93379m3850K08416L6814j80663
$$ 757533 666464 784246 1065038 1020703 505697 12318 -31532 176884 213698 33035
32125C3035j38185N6808K13909K81691K19183P228j99628k18484j05464l5853
$$ 33035 -105150 -48342 165567 447258 666441 673669 474041 255557 150093 114240
32115A14240q593P5439J55623J06426j3667o8644r1046j75144k51290k12950j29181
$$ 114240 105647 181086 336709 443135 429468 360824 269778 94634 -156656 -369606 -498787
32104d98787q6770J2189K24747L14463M2877m04136n79897k93865K49630P02856
$$ -498787 -585557 -573368 -348621 -34158 8719 -395417 -975314 -1269179 -1019549 -316693
32094c16693P75799L85853j61800l56202q5193J82778P1123j66679j23867P8800
$$ -316693 459106 844959 683159 326957 241764 424542 495665 328986 205119 283919
32084B83919N9058j35051j38130O8731J44051n417r2007M4361K00968J51250p3952
$$ 283919 342977 207926 69796 138527 282578 277161 185154 229515 430483 581733 507781
32073E07781k70288k27188J05953M45323L67398j03001l96555j84591J20361O1431
$$ 507781 237493 10305 116258 561581 928979 825978 429423 244832 365193 426624
32063D26624j06378M3885K27383r1094o11494n07424K23063O62057L72125j2250
$$ 426624 320246 364131 591514 500420 -111074 -618498 -395435 266622 638747 626497
32053F26497R5483L45851J61520l12894n18067l03492M0640K65708K89290R3919
$$ 626497 721980 1067831 1229351 916457 398390 94898 135538 401246 690536 784455
32043G84455j87348l03368k06953r3854j1669J95310M26618L01751j64996l82284
$$ 784455 597107 293739 86786 -7068 -18737 176573 603191 904942 739946 357662
32033C57662m0232L24553J02646m28366m86065Q7537O42514O17657J45447k94608
$$ 357662 317430 641983 744629 316263 -169802 -82265 560249 1177906 1323353 1028745
32023A028745m56243m15999k99845j09928J67768L71897K60336q6934j74046K84449
$$ 1028745 572502 156503 -143342 -253270 -85502 286395 546731 459797 285751 570200
32013E70200P95804O13622k04464q08281p05635l08254j27664o3547J25215K32424
$$ 570200 1366004 1979626 1775162 966881 261246 -47008 -174672 -238219 -113004 119420
32003A19420L6936j32216J08639M55152L29995j47450k81614J43864N52796M12967
$$ 119420 156356 24140 132779 587931 917926 770476 488862 632726 1185522 1598489
31993A598489j20780n44558n80824k66434J88189M61383L21613o2402k22970N2110
$$ 1598489 1477709 933151 352327 85893 274082 735465 1057078 994676 771706 823816
31983H23816M45653N23865K58721k1842r0115l2434k3580o8202o7369l7448p7646
$$ 823816 1269469 1793334 2052055 2030213 1940098 1907664 1884084 1815882 1748513 1711065 1633419
31972A633419j18284O2733M41037O03852K76945j86786k12469K00586N08631M19951
$$ 1633419 1515135 1577868 2018905 2622757 2899702 2712916 2500447 2701033 3209664 3629615
31962C629615J87375N0864r0374k70841k32081J02964L55986K26889o0747j74830
$$ 3629615 3816990 3867854 3777480 3506639 3274558 3377522 3733508 3960397 3899650 3724820
31952C724820j81476k81935l79621l04190j82456j95383k23323j02935L3755M3569
$$ 3724820 3543344 3261409 2881788 2577598 2395142 2199759 1976436 1873501 1907256 1950825
31942A950825Q2058K23766J33748l69334p69546n10053O3940J36780l40362o07280
$$ 1950825 2032883 2256649 2390397 2021063 1251517 741464 805404 942184 601822 -5458
31932e458k97102Q3671N2013j61188j32390Q1172J70929J15405J24007K49933
$$ -5458 -302560 -218889 -166876 -328064 -460454 -379282 -208353 -92948 31059 280992
31922B80992L33117K23517p2873l71274m12338j45285J26613R5164j16307j34976
$$ 280992 614109 837626 764753 393479 -18859 -164144 -37531 57633 -58674 -193650
31912a93650R6683K59354J48150j02260k98584l76698k87605j6437K45242K49080
$$ -193650 -96967 162387 310537 208277 -90307 -467005 -754610 -771047 -525805 -276725
31902b76725N2511m7570M5086J40346J09339J3312r9108k06294j63558J05346
$$ -276725 -224214 -271784 -226698 -86352 22987 36299 -62809 -269103 -432661 -327315
31892c27315L11873J12528k95735l44097R7064N28653N30875K20426j04189l26831
$$ -327315 -15442 97086 -198649 -542746 -445682 82971 613846 834272 730083 403252
31882D03252l81083j89008Q5479J10404j16056k12603r635J95255J40903l6626
$$ 403252 22169 -166839 -81360 29044 -87012 -299615 -309250 -113995 26908 -9718
31872i718j28681j44289q5559J59519M75203M65593O720m90553o09171l95778
$$ -9718 -138399 -282688 -368247 -208728 266475 732068 738788 248235 -360936 -756714
31862g56714j06393J55466L34403L28137K21787K53885L53541J34338m26261p81008
$$ -756714 -863107 -707641 -373238 -45101 176686 430571 784112 918450 492189 -288819
31852b88819n92404k40355j73667k16195J4919L91141N00426L23303J78538J70566
$$ -288819 -881223 -1121578 -1295245 -1511440 -1496521 -1105380 -604954 -281651 -103113 67453
31842F7453J25939m3156k51688l93372l44724k2251L68962M39255J72215Q790
$$ 67453 193392 150236 -101452 -494824 -839548 -861799 -492837 -53582 118633 127423
31832A27423J44006J97949r6729l80962k65765L2293J29626R6828J35448R7872
$$ 127423 271429 469378 372649 -8313 -274078 -241785 -112159 -15331 120117 217989
31822B17989j12492j39112J98738L56875j21311o90748n39510J31239M64625K90838
$$ 217989 105497 -33615 165123 521998 400687 -290061 -829571 -698332 -233707 57131
31812E7131J47999J75055K3748k05982j5009M40427L80874l16250q29284o39838
$$ 57131 205130 380185 403933 197951 182942 623369 1004243 687993 -141291 -781129
31802g81129j67570J20458L38033N66100M81051M3232k13340l6722J07658j06453
$$ -781129 -948699 -828241 -490208 75892 556943 600175 386835 350113 457771 351318
31792C51318k95912j28676O4009l1319j11654P4748J40743j92223l98861K1942
$$ 351318 55406 -73270 -9261 -40580 -152234 -77486 63257 -128966 -527827 -505885
31782e05885N60612L97138k92980o04946k51612J82249K33666O1238n0201n2494
$$ -505885 54727 451865 158885 -446061 -697673 -515424 -281758 -220520 -270721 -323215
31772c23215M8693K43638L64962K78021J53562J75227J40601j95246n53553m45932
$$ -323215 -274522 -30884 334078 612099 765661 940888 1081489 886243 332690 -113242
31762a13242M2506L31017J78844p5965j30633p0961l3913L0892J25370Q1664j74427
$$ -113242 -70736 260281 439125 363160 232527 161566 127653 158545 283915 365579 191152
31751A91152m68060n62357l54796O5645M03637L45284l5574k60499p9241J55265
$$ 191152 -276908 -839265 -1194061 -1128416 -724779 -379495 -415069 -675568 -754809 -599544
31741e99544P1750r5738N1305L16427K11643j71751k87438n9214L2428j67415
$$ -599544 -527794 -623532 -572227 -255800 -44157 -215908 -503346 -562560 -530132 -697547
31731f97547k35155L1676K31549N8878j86328j33803P9965J36457O8498J05664
$$ -697547 -932702 -901026 -669477 -610599 -796927 -930730 -850765 -714308 -645810 -540146
31721e40146K47741L02603J76108p0314k78647k24268J57356N13081L78757j64504
$$ -540146 -292405 10198 186306 115992 -162655 -386923 -229567 283514 662271 497767
31711D97767n21960l98943j56063j59566k32583o3574K30525L30740K24259J21464
$$ 497767 -24193 -423136 -579199 -738765 -971348 -1034922 -804397 -473657 -249398 -127934
31701a27934P6138J3118m0499l4529m4148j04800q6159N0682R3139q7061k71568
$$ -127934 -51796 -38678 -79177 -113706 -157854 -262654 -348813 -298131 -204992 -292053 -563621
31690e63621k30381q5514n6681p5836K6936J61976J44955M7306M0326N0573p4177
$$ -563621 -794002 -879516 -936197 -1012033 -985097 -823121 -678166 -630860 -590534 -539961 -614138
31679f14138k00074q9403J56943K28891J15402R1850K20670K59285J11261M082
$$ -614138 -814212 -903615 -746672 -517781 -402379 -310529 -89859 169426 280687 284769
31669B84769J08751K77129K86749J21537j02783k99715l89493k79724L302K54277
$$ 284769 393520 670649 957398 1078935 976152 676437 286944 7220 10522 264799
31659B64799K62996K7601k43786l44687k83432k43567k81865j83067J92095N33479
$$ 264799 527795 555396 311610 -33077 -316509 -560076 -841941 -1025008 -832913 -299434
31649b99434M19427N092j13782J63686K28531k18858n64629k38670K89429K36281
$$ -299434 119993 125085 11303 174989 403520 184662 -379967 -618637 -329208 -92927
31639i2927j91234j59316L34492M31746r2489l92617L3683M88517K30121l39864
$$ -92927 -284161 -443477 -108985 322761 230272 -162345 -128662 359855 589976 250112
31629B50112m19246j09985q2868l29757k17561L20104N67229J56044l46314k98385
$$ 250112 -169134 -279119 -361987 -691744 -909305 -589201 -21972 134072 -212242 -510627
31619e10627J35023L51083J66746j02759j96264j49350o4688M4915J58727K01863
$$ -510627 -375604 -24521 142225 39466 -156798 -306148 -370836 -325921 -167194 34669
31609C4669J57446J03916Q9181N5723m4421j24958o4118P4704O0043j76302l48877
$$ 34669 192115 296031 385212 440935 396514 271556 207438 282142 342185 165883 -182994
31598a82994j57252K31292L04502j11305n50591m85480j3271K96491J49115j67411
$$ -182994 -340246 -108954 195548 84243 -466348 -951828 -965099 -668608 -519493 -686904
31588f86904k36037j8434J95409J78453k7205k19835k43097r5277J06076K50751
$$ -686904 -922941 -941375 -745966 -567513 -594718 -814553 -1057650 -1152927 -1046851 -796100
31578g96100L14644K99744J56358j32989m03433l91628o5118K37241J61311j88898
$$ -796100 -481456 -181712 -25354 -158343 -561776 -953404 -1018522 -781281 -619970 -808868
31568h08868l35700n6204K93426K79627K5387o067K24577K67820j0210j06582
$$ -808868 -1144568 -1200772 -907346 -627719 -602332 -608399 -383822 -116002 -126212 -232794
31558b32794K77470N73732J40312n99422o06645K26481Q18126M14950l98954o55423
$$ -232794 44676 618408 758720 159298 -447347 -220866 597260 1012210 613256 -42167
31548d2167l13265R386J29446L46572O18008M95055n2563m27443k50091R6822
$$ -42167 -355432 -346046 -216600 129972 747980 1243035 1190472 763029 512938 609760
31538F09760O8657k74052m48595k70031k4252J2870q1529r1703j9926n4342k25848
$$ 609760 678417 404365 -44230 -314261 -338513 -325643 -407172 -498875 -518801 -573143 -798991
31527g98991k92368p1672K56910L88841L39385L59585M34382K53631k10354n10618
$$ -798991 -1091359 -1163031 -906121 -517280 -177895 181690 616072 869703 659349 148731
31517A48731l45006P678J67139J90426K52918J76530k01014m95201k43991K80658
$$ 148731 -196275 -188597 -21458 168968 421886 598416 397402 -97799 -341790 -61132
31507f1132M03455Q8378p1036J01069J18892j97948l16208Q1772M57854K20099
$$ -61132 342323 430701 359665 460734 579626 381678 65470 147242 605096 825195
31497H25195l68278o34444m45303j59575M8133K47079L52495K21355K6969M6503
$$ 825195 456917 -177527 -622830 -782405 -734272 -487193 -134698 86657 113626 160129
31487A60129J57998J4668l28576m29588j32865J85259J49248j51040l44347k14425
$$ 160129 318127 332795 4219 -425369 -558234 -372975 -223727 -374767 -719114 -933539
31477i33539J24360L52204K45634m8249j47949L0622J05378j64978l80630m0889
$$ -933539 -809179 -456975 -211341 -259590 -407539 -376917 -271539 -436517 -817147 -858036
31467h58036N90851P21691J42604m45774l94097Q6478L60259K37205L6620P40
$$ -858036 -267185 454506 597110 151336 -242761 -156283 203976 441181 477801 478541
31457D78541K7675n4742k25789l19658k00205J09160L89952L83299Q0668k04335
$$ 478541 506216 451474 225685 -93973 -294178 -185018 204934 588233 668901 464566
31447D64566j77188P0174J78158R51k02134j45048O3625Q2418j26757k12988l927
$$ 464566 287378 357552 535710 536661 334527 189479 253104 335522 208765 -4223 -8150
31436h150J43801j27818n20941m27687J24918M39144J79684j51645q6117N4461
$$ -8150 135651 7833 -513108 -940795 -815877 -376733 -197049 -348694 -434811 -380350
31426c80350j90426m90037j94190N07787P29498K04928l15877j97416K34263L28279
$$ -380350 -570776 -1060813 -1255003 -747216 -17718 187210 -128667 -326083 -91820 236459
31416B36459M9070j71531j54963q0847o2940j7357J10500K47076K81152J29520
$$ 236459 285529 113998 -40965 -121812 -184752 -202109 -91609 155467 436619 566139
31406E66139j79061m14978l32278j8796J75379J36606J04715J77421R7571k25372
$$ 566139 387078 -27900 -360178 -378974 -203595 -66989 37726 215147 312718 87346
31396H7346l97429j32299J83041J7345m32314m67810O8149N40896M21346m2850
$$ 87346 -310083 -442382 -259341 -241996 -674310 -1142120 -1073971 -533075 -111729 -154579
31386a54579k77971j55804j8366j11554k80683k32309N5398K72575J54348j30785
$$ -154579 -432550 -588354 -606720 -718274 -998957 -1231266 -1175868 -903293 -748945 -879730
31376h79730j34309K55157N64854L34907k07882m14864r3761K69292K31994m7708
$$ -879730 -1014039 -758882 -194028 140879 -67003 -481867 -575628 -306336 -74342 -122050
31366a22050j75491j16807j14279j97306j34911J40917L63400K74766l6105k44630
$$ -122050 -297541 -414348 -528627 -725933 -860844 -719927 -356527 -81761 -117866 -362496
31356c62496j49244J50361L78423L46432J27391l3482k4561k4004k22849m50088
$$ -362496 -511740 -361379 17044 363476 490867 457385 432824 408820 185971 -264117
31346b64117l26058J49806M68635K87968l9583J5916L15137K47211k59132n46414
$$ -264117 -590175 -440369 28266 316234 276651 292567 607704 854915 595783 49369
31336D9369k46157J29421K2903k78254j83759J68432J71194j64878k06845K01890
$$ 49369 -196788 -67367 -44464 -322718 -506477 -338045 -166851 -331729 -538574 -336684
31326c36684M51199J84796j32107l2186K08935J31577j20469j34996J8728k9163
$$ -336684 114515 299311 167204 135018 343953 475530 355061 220065 238793 209630
31316B09630k42911k31094Q8165L69191L69166J86040l5028k65273m25637l72113
$$ 209630 -33281 -264375 -176210 192981 562147 748187 713159 447886 22249 -349864
31306c49864j28443Q2683J05537J3811j3173J02202K32592J47886j68857l62288
$$ -349864 -478307 -395624 -290087 -276276 -289449 -187247 45345 193231 24374 -337914
31296c37914j16853L11959L76219P0394m3508K18604L44601O3469j26176J03346
$$ -337914 -454767 -142808 233411 303805 260297 478901 823502 886971 760795 864141
31286H64141J77276l80602q67359l77543N79197O79869j43474n62234N1723O89928
$$ 864141 1041417 660815 -206544 -584087 -4890 674979 531505 -30729 20994 710922
31276G10922L76779l53409m25661J54087N25875L19977n0871j92978j54406j35574
$$ 710922 1087701 734292 308631 462718 988593 1308570 1257699 1064721 910315 774741
31266G74741k23738l50866k92753R3444N07089M50389j3499k46257p56J96016
$$ 774741 551003 200137 -92616 828 507917 958306 944807 698550 697794 893810
31256H93810l1725k65427r2762R9645j61067m74528j68811N11049P16244K89405
$$ 893810 862085 596658 503896 603541 442474 -32054 -200865 310184 1026428 1315833
$$ [...]
##END NTUPLES=NMR SPECTRUM
##END=
