##TITLE=31Pdec_PR189_rmp
 D2O, 24 sc
 20.10.2020
##JCAMPDX= 6.0         $$ Bruker NMR JCAMP-DX V2.0
##DATA TYPE= NMR SPECTRUM
##DATA CLASS= NTUPLES
##ORIGIN= UXNMR, Bruker Analytische Messtechnik GmbH
##OWNER= root
$$ XWIN-NMR		Version 3.5
$$ Tue Oct 20 10:57:25 2020 Russian Standard Time (UT+4h)  she@DPX200
##.OBSERVE FREQUENCY= 81.013821
##.OBSERVE NUCLEUS= ^31P
##.ACQUISITION MODE= SIMULTANEOUS
##.ACQUISITION SCHEME= undefined
##.AVERAGES= 24
##.DIGITISER RES= 17
##SPECTROMETER/DATA SYSTEM= spect
##.PULSE SEQUENCE= zgpg30
##.SOLVENT NAME= CDCl3
##.SHIFT REFERENCE= (INTERNAL, CDCl3, 0, 182.463)
##AUDIT TRAIL= $$ (NUMBER, WHEN, WHO, WHERE, WHAT)
$$ ##TITLE= Audit trail, XWIN-NMR		Version 3.5
$$ ##JCAMPDX= 5.01
$$ ##ORIGIN= Bruker BioSpin GmbH
$$ ##OWNER= she
$$ F:/spectra/data/she/nmr/P31/1/pdata/1/auditp.txt
$$ ##AUDIT TRAIL=  $$ (NUMBER, WHEN, WHO, WHERE, WHAT)
(   1,<2020-10-20 10:56:27.96 +0400>,<she>,<DPX200>,
      <created by zg, POWCHK disabled, PULCHK disabled
       configuration hash MD5:
       00 E9 B6 7A A2 85 ED C7 34 08 36 98 17 FE 4E 26
       data hash MD5: 32K
       7A C9 91 ED 1F 69 68 D9 FB 6F AF E7 4C EE B7 E6>)
(   2,<2020-10-20 10:56:30.82 +0400>,<she>,<DPX200>,
      <Start of raw data processing
       efp BC_mod = 2 LB = 1 FT_mod = 6 PKNL = 1 PHC0 = -2807.765 PHC1 = 161.4014 SI = 64K 
       data hash MD5: 64K
       F0 98 32 80 4B 60 B6 13 48 7C 8E 31 35 04 C2 C9>)
(   3,<2020-10-20 10:56:51.48 +0400>,<she>,<DPX200>,
      <pk PHC0 = 61.17346 PHC1 = -118.6 
       data hash MD5: 64K
       CB CF AF 90 83 2D 46 0E 89 A7 AE C1 C7 D8 AF 87>)
(   4,<2020-10-20 10:56:55.04 +0400>,<she>,<DPX200>,
      <abs ABSG = 5 
       data hash MD5: 64K
       E6 79 14 63 FC AC 87 D1 CF 99 DF C7 28 70 18 8A>)
$$ ##END=
$$ 
$$ hash MD5
$$ BE E8 50 D3 07 A7 DE F0 F2 05 DD C6 2D AC 4E D1
##$RELAX= 
##$RELAX= 
##$RELAX= 
##$RELAX= 
##$RELAX= 
##$RELAX= 
##$RELAX= 
##$RELAX= 
$$ Bruker specific parameters
$$ --------------------------
##$DU= <F:/spectra>
##$EXPNO= 1
##$NAME= <P31>
##$PROCNO= 1
##$TYPE= <nmr>
##$USER= <she>
##$AMP= (0..31)
100 100 100 100 100 100 100 100 100 100 100 100 100 100 100 100 100 100 
100 100 100 100 100 100 100 100 100 100 100 100 100 100 
##$AQSEQ= 0
##$AQ_mod= 1
##$AUNM= <au_zg>
##$AUTOPOS= <>
##$BF1= 81.014009
##$BF2= 200.13
##$BF3= 200.13
##$BF4= 200.13
##$BF5= 200.13
##$BF6= 200.13
##$BF7= 200.13
##$BF8= 200.13
##$BYTORDA= 1
##$CFDGTYP= 0
##$CFRGTYP= 5
##$CHEMSTR= <none>
##$CNST= (0..31)
1 1 145 1 1 1 1 1 1 1 1 1 1 1 1 1 1 1 1 1 1 1 1 1 1 1 1 1 1 1 1 1 
##$CPDPRG= <waltz16>
##$CPDPRG1= <>
##$CPDPRG2= <waltz16>
##$CPDPRG3= <>
##$CPDPRG4= <mlev>
##$CPDPRG5= <mlev>
##$CPDPRG6= <mlev>
##$CPDPRG7= <mlev>
##$CPDPRG8= <mlev>
##$CPDPRGB= <>
##$CPDPRGT= <>
##$D= (0..31)
0 1 0 0 0 0 0 0 0 0 0 0.03 2e-05 3e-06 0 0 0 0 0 0 0 0 0 0 0 0 0 0 0 0 
0 0 
##$DATE= 1603176987
##$DBL= (0..7)
120 120 120 11 120 120 24 19 
##$DBP= (0..7)
150 150 150 150 150 150 150 150 
##$DBP07= 0
##$DBPNAM0= <>
##$DBPNAM1= <>
##$DBPNAM2= <>
$$ [...]
##$SUBNAM3= <"">
##$SUBNAM4= <"">
##$SUBNAM5= <"">
##$SUBNAM6= <"">
##$SUBNAM7= <"">
##$SUBNAM8= <"">
##$SUBNAM9= <"">
##$SW= 369.568048894756
##$SWIBOX= (0..15)
0 1 3 0 0 0 0 0 0 0 0 0 0 0 0 0 
##$SW_h= 29940.119760479
##$TD= 32768
##$TD0= 1
##$TE= 0
##$TE2= 300
##$TE3= 300
##$TEG= 300
##$TL= (0..7)
0 120 53 12 22 120 120 120 
##$TP= (0..7)
150 150 150 150 150 150 150 150 
##$TP07= 0
##$TPNAME0= <>
##$TPNAME1= <>
##$TPNAME2= <>
##$TPNAME3= <>
##$TPNAME4= <>
##$TPNAME5= <>
##$TPNAME6= <>
##$TPNAME7= <>
##$TPOAL= (0..7)
0.5 0.5 0.5 0.5 0.5 0.5 0.5 0.5 
##$TPOFFS= (0..7)
0 0 0 0 0 0 0 0 
##$TUNHIN= 0
##$TUNHOUT= 0
##$TUNXOUT= 0
##$USERA1= <user>
##$USERA2= <user>
##$USERA3= <user>
##$USERA4= <user>
##$USERA5= <user>
##$V9= 5
##$VALIST= <valist>
##$VCLIST= <CCCCCCCCCCCCCCC>
##$VD= 0
##$VDLIST= <DDDDDDDDDDDDDDD>
##$VPLIST= <PPPPPPPPPPPPPPP>
##$VTLIST= <TTTTTTTTTTTTTTT>
##$WBST= 1024
##$WBSW= 4
##$XGAIN= (0..3)
0 0 0 0 
##$XL= 0
##$YL= 0
##$YMAX_a= 37209
##$YMIN_a= -51557
##$ZGOPTNS= <>
##$ZL1= 120
##$ZL2= 120
##$ZL3= 120
##$ZL4= 120
##$ABSF1= 182.463
##$ABSF2= -187.1042
##$ABSG= 5
##$ABSL= 3
##$ALPHA= 0
##$AQORDER= 0
##$ASSFAC= 0
##$ASSFACI= 0
##$ASSFACX= 0
##$ASSWID= 0
##$AUNMP= <proc_1d>
##$AZFE= 0.1
##$AZFW= 0.5
##$BCFW= 0
##$BC_mod= 2
##$BYTORDP= 0
##$COROFFS= 0
##$CY= -3
##$DATMOD= 1
##$DC= 0
##$DFILT= <>
##$DTYPP= 0
##$F1P= 0
##$F2P= 0
##$FCOR= 1
##$FTSIZE= 65536
##$FT_mod= 6
##$GAMMA= 0
##$GB= 0
##$INTBC= 1
##$INTSCL= 5.30512e-09
##$ISEN= 30
##$LB= 1
##$LEV0= 0
##$LPBIN= 0
##$MAXI= 10000
##$MC2= 0
##$MEAN= 0
##$ME_mod= 0
##$MI= 50
##$NCOEF= 0
##$NC_proc= -4
##$NLEV= 6
##$NOISF1= 182.463
##$NOISF2= 159.3651
##$NSP= 0
##$NTH_PI= 0
##$NZP= 0
##$OFFSET= 182.463
##$PC= 4
##$PHC0= -2746.592
##$PHC1= 42.8014
##$PH_mod= 1
##$PKNL= yes
##$PPARMOD= 0
##$PSCAL= 0
##$PSIGN= 0
##$REVERSE= no
##$SF= 81.0140089999434
##$SI= 65536
##$SIGF1= 159.3651
##$SIGF2= -187.1042
##$SINO= 113.3802
##$SIOLD= 16384
##$SREGLST= <1H.CDCl3>
##$SSB= 0
##$STSI= 65536
##$STSR= 0
##$SW_p= 29940.119760479
##$SYMM= 0
##$S_DEV= 0
##$TDeff= 32768
##$TDoff= 0
##$TI= <>
##$TILT= no
##$TM1= 0
##$TM2= 0
##$TOPLEV= 0
##$USERP1= <user>
##$USERP2= <user>
##$USERP3= <user>
##$USERP4= <user>
##$USERP5= <user>
##$WDW= 1
##$XDIM= 65536
##$YMAX_p= 412758917
##$YMIN_p= -6903980
$$ End of Bruker specific parameters
$$ ---------------------------------
##NTUPLES= NMR SPECTRUM
##VAR_NAME=  FREQUENCY,     SPECTRUM/REAL,   SPECTRUM/IMAG
##SYMBOL=    X,             R,               I
##VAR_TYPE=  INDEPENDENT,   DEPENDENT,       DEPENDENT
##VAR_FORM=  AFFN,          ASDF,            ASDF
##VAR_DIM=   65536,         65536,           65536
##UNITS=     HZ,            ARBITRARY UNITS, ARBITRARY UNITS
##FACTOR=    0.456856943014862, 1,           1
##FIRST=     14782.0589164792, 0,            0
##LAST=      -15158.0608439998, 0,           0
##MIN=       -15158.0608439998, -6903980,    0
##MAX=       14782.0589164792, 412758917,    0
$$ Real data points
##PAGE= N=1
##DATA TABLE= (X++(R..R)), XYDATA
$$ [...]
36871A351043m4545l31925m53286k66743M8145K10062J18694r6798k25333j79966
36861A29348q7436r2635q3995J73059N78077O76455K68509k66012m89557m41017
36851C64796l44102j25205L21858O54221M34010j35391l82249q1066L09727L70812
36841A387411J91869J6189j18153k14700j93857j08924j44231k54429j62771J32043
36831E30447K36965l4929l17335k21165J00592K27126O6259j31848j79152q6541
36821A90419P0944J89302J53414Q906k1797J37236K53302J33238o8857j26044
36811I20063j19553k46890m03314l06034K3102K41695J74469J5179l0334l3378
36801B35005j39172k81638k89474j66328p1376m7902M2129K55441M01424K88938
$$ y = [1351043, 1306498, 974573, 521287, 254544, 302689, 512751, 631445, 534647, 309314, 129348, 41912, -50723, -134718, 38341, 616418, 1292873, 1561382, 1295370, 805813, 364796, 20694, -104511, 217347, 871568, 1305578, 1170187, 787938, 706872, 1016599, 1387411, 1579280, 1595469, 1477316, 1262616, 1068759, 959835, 815604, 561175, 398404, 530447, 767412, 732483, 415148, 193983, 294575, 521701, 587960, 456112, 276960, 190419, 261363, 450665, 604079, 612985, 591188, 728424, 981726, 1114964, 1046107, 920063, 800510, 553620, 150306, -155728, -132626, 109069, 283538, 298717, 268383, 235005, 95833, -185805, -475279, -641607, -712983, -760885, -718756, -463315, -61891, 227047]
36791B27047M3537l8314O4782O6453j32503k16669N7786M08466L88997M3451j77043
36780G35990q1799N4588l2849k55991l58746j84620K46023O77999P05490K23400
36770A729485k90601l14590k601Q3238j45740k70741j76340k02556l89634l11009
36760b91089J03461L11419O6650j33705O5648K68285J28912M1056L52152N69819
36750A482608J68503l82035l04481K25374M58487L26236L03155L74609L04834
36741B957290O59301K122717L726744L317976L99541k758755l690159k461197
36733D273458r69290l66832k96156j89377j08151k40641m28899m42195k55375
36724I76542N7930L73361M42619R5191m54107p40985n17856M8026N62270O65495
$$ y = [227047, 270584, 232270, 297052, 363505, 231002, 14333, 72119, 480585, 869582, 913033, 735990, 654191, 708779, 675930, 419939, 61193, -123427, 122596, 800595, 1506085, 1729485, 1438884, 1124294, 1121693, 1204931, 1059191, 788450, 612110, 409554, 19920, -291089, -187628, 123791, 190441, 56736, 122384, 390669, 519581, 560637, 912789, 1482608, 1651111, 1269076, 964595, 1189969, 1648456, 1974692, 2277847, 2652456, 2957290, 3616591, 5739308, 9466052, 12784028, 13183569, 10424814, 6734655, 4273458, 3304168, 2937336, 2641180, 2451803, 2343652, 2103011, 1674112, 1231917, 976542, 1034472, 1407833, 1850452, 1945643, 1491536, 750551, 232695, 280721, 842991, 1508486]
36714A508486K63763l27421o08453m25672j30922q3853k02576j83061M3932K84866
36704A39089L50488J83307j11753k42967K1741M45065M62514n5198n06728l25148
36694C60410K54651N64245M10395J89094K02812K84756J35589k60201o28515o71476
36684H41760l35821J09797L36586L22418K92094K87302J10629k04693k70123O1924
36674A551873L43599J23813l91461o45941m67500j20857J62396L11166K50047
36665A117135J5802r4033J17932L55910J92504k72740n19514l22216K1236J65804
36655G77820Q9013k9903l5731J02746K46850K20613J03653J69863L89997L63804
36645B398725J3340j15781L08573P23370M50780k00376l52014J57215O81420Q26605
$$ y = [1508486, 1772249, 1444828, 836375, 410703, 279781, 195928, -6648, -189709, -145777, 139089, 489577, 672884, 561131, 318164, 339905, 784970, 1247484, 1192286, 685558, 360410, 615061, 1179306, 1589701, 1778795, 1981607, 2266363, 2401952, 2141751, 1513236, 841760, 505939, 615736, 952322, 1274740, 1566834, 1854136, 1964765, 1760072, 1489949, 1551873, 1895472, 2019285, 1627824, 981883, 514383, 393526, 555922, 867088, 1117135, 1132937, 1038904, 1156836, 1512746, 1705250, 1432510, 912996, 590780, 612016, 777820, 866833, 836930, 801199, 903945, 1150795, 1371408, 1475061, 1644924, 2034921, 2398725, 2412065, 2296284, 2604857, 3328227, 3779007, 3578631, 3226617, 3383832, 4065252, 4891857]
36635D891857P94156P10284M42107J61709L11632Q51240J226662J212398J100981
36626A1703026R90736O71463L38546N64610J338784J968525K156108K277344K385917
36617B4395059K043480J514418J877107L297874M470047M633325M749574N375760
36609E2356644M794754J311737l416345n769746m867672l581497m308983n889381
36601C0629511n891529m222844k763369k415412k311356j666148q81650o03715
36593I873488p60125r04862q47571o36932l61976j69364j56140j66316j671J67316
36583F035847k1183n06061p87977o40706m24839m84083o03540l95913L3180K09336
36573B414061j2033k54159j74601R4520J91643q708l31477n44627n16010k68911
$$ y = [4891857, 5686013, 6396297, 6838404, 7000113, 7311745, 8162985, 9389647, 10602045, 11703026, 12693762, 13365225, 13703771, 14268381, 15607165, 17575690, 19731798, 22009142, 24395059, 26438539, 27952957, 29830064, 33127938, 37597985, 42231310, 46980884, 52356644, 57151398, 58463135, 55046790, 49277044, 44409372, 40827875, 36518892, 30629511, 24737982, 20515138, 17751769, 15336357, 13025001, 11358853, 10477203, 9873488, 9113363, 8208501, 7360930, 6723998, 6362022, 6192658, 6036518, 5870202, 5868531, 6035847, 6014664, 5508603, 4720626, 4079920, 3655081, 3170998, 2567458, 2171545, 2204725, 2414061, 2402028, 2147869, 1973268, 2067788, 2259431, 2250723, 1919246, 1374619, 858609, 589698]
36563E89698m0733j27425m59973n16089K2881O68914O40868k9798m54036j21474
36553A72833L80304K73578k58173m13001R882L99632K98800m0980j93349j35352
36543D94174o9581n4028n8849j16823j93287j21782J36514L56113L45536K11756
36533I29743J58165J80226J47308N6996Q289k231o8452j80556k00401n9658J22624
36522A092053J80592J11784O3432R1899M4941j90287m03701k65076J72669M54779
36512A353085L15080n642j88996k53683k98731k00333O5858J47138j61943m23980
36502C47853j65229K86158K65035j17095j54719K06149K50081k20889m65707o7828
36492A63809L08303L9385l80583j75149M19012N78543K08793o7362o772L9689
$$ y = [589698, 548965, 421540, -38433, -554522, -531641, 137273, 778141, 748343, 294307, 172833, 553137, 826715, 568542, 155541, 165423, 565055, 863855, 822875, 629526, 494174, 424593, 370565, 311716, 194893, 1606, -120176, 16338, 372451, 717987, 929743, 1087908, 1268134, 1415442, 1472438, 1480727, 1478496, 1410044, 1229488, 1029087, 969429, 1092053, 1272645, 1384429, 1447861, 1539760, 1584701, 1394414, 990713, 725637, 898306, 1353085, 1668165, 1662523, 1473527, 1219844, 921113, 720780, 786638, 933776, 771833, 347853, 182624, 468782, 733817, 616722, 462003, 668152, 918233, 697344, 231637, 163809, 472112, 511497, 130914, -44235, 374777, 953320, 1162113, 1094751, 1087979, 1127668]
36482A127668o7871n0700J39779J71429n4789k43301k72378l61053n33935m65034
36472f10185n1029L38248M01955K92268K49531K33083J36895M0124J8938j3716
36462A036112r2639r1951j369l2528k53884l77283j40004K87044M89373K91156
36452A114027j02738l52697k83932l0359R9297M19o1968J34874L27740R9896m02698
36441E41861n63406j81137K36489K69005J72464L20332M90761K29402l20475n20170
36431F75126j50752K59481J66867k70931m52756j45893K36244K20090p5519j32210
36421C29747J49640K17734k87740q15302n62852L02610P61704L57816k07528j91120
36411E4709J52503J72973p6178n0852K73913L66995M7108k59144k44015j16213
$$ y = [1127668, 1059797, 1009097, 1148876, 1320305, 1265516, 1022215, 749837, 388784, -145151, -610185, -661214, -322966, 78989, 371257, 620788, 853871, 990766, 1030890, 1049828, 1036112, 943473, 851522, 850153, 817625, 563741, 186458, 46454, 333498, 822871, 1114027, 1011289, 658592, 374660, 344301, 443598, 444017, 382049, 516923, 844663, 944559, 541861, -21545, -202682, 33807, 302812, 475276, 795608, 1286369, 1515771, 1195296, 675126, 524374, 783855, 950722, 679791, 227035, 81142, 317386, 537476, 461957, 329747, 479387, 697121, 409381, -405921, -968773, -666163, 95541, 453357, 245829, 54709, 207212, 380185, 304007, 253155, 527068, 894063, 941171, 682027, 438012, 321799]
36401C21799j09713j02108L9432J38202J4917j75502j80590j7023J26865J89109
36391B45388K28701K48402K00562P7222j29953m39931p25402o90808k04570M15214
36381g75175O47696L24222j85152l70560r1029L42122N29852L71098P7578j29740
36371G40912k27105k67082k05995j1505J44590L7046k44487l14451k832L44581
36361f328K80593j40229m19267k63441P4262J97571R1138L9877J53380K43382
36351B50938J78495R2034J21060J58413N3957r4295q2636N4053Q1597q5510k98184
36340D29922m09996l79378j74040J60090L59350J94561j18932j34256J35202J77828
36330B40351j84234m10744m7318N07894N44631O5950k93472k29849o1630o5598
$$ y = [321799, 212086, 109978, 149410, 287612, 302529, 127027, -53563, -70586, 56279, 245388, 474089, 722491, 923053, 1000275, 870322, 430391, -295011, -985819, -1190389, -775175, -127479, 196743, 11591, -358969, -449998, -107876, 421976, 793074, 870652, 740912, 513807, 246725, 40730, 29225, 173815, 210861, -33626, -348077, -350909, -6328, 274265, 134036, -285231, -548672, -474410, -276839, -185701, -145824, 7556, 250938, 429433, 521467, 642527, 800940, 854897, 760602, 677966, 732019, 813616, 728106, 429922, 19926, -359452, -533492, -373402, -14052, 180509, 61577, -72679, 62523, 240351, 56117, -354627, -401945, 105949, 650580, 716530, 423058, 193209, 131579, 65981]
36320F5981r6621p405M4656o1121j43680n0763N2141q608o7530J13828L94190
36309B35068L82453j5570m30360m54900r2910K76318L15384O3973j43126p0407
36299F5923J67666K86104J72472m8405k16890k60016j52316P9815L09213L95169
36289G98735L24548J69059m4161k78607l72630j83023J61363L41295K08573p9990
36279A045162k83744k84303r9815J31942K04137M7142j41146j32839K8017J45631
36269F60184J83279K02743J17454j56958l96413l13917o6798o3473k59509j77813
36259b71221K60035N00934K19671j32688l6553K90518K82093j09071m43256m78755
36249H1707l27605o9982K94373N69744N03472K17816J05248K52989L33044J26981
$$ y = [65981, -30640, -38045, 6611, -54510, -198190, -248953, -196812, -205420, -272950, -159122, 235068, 617521, 601951, 171591, -283309, -376219, -99901, 215483, 279456, 136330, 65923, 233589, 519693, 692165, 643760, 426870, 166854, 14538, 94353, 403566, 798735, 1123283, 1292342, 1248181, 969574, 596944, 413921, 575284, 916579, 1125152, 1045162, 761418, 477115, 377300, 509242, 713379, 760521, 619375, 486536, 514553, 660184, 843463, 1046206, 1163660, 1006702, 610289, 296372, 229574, 166101, -93408, -271221, -11186, 489748, 709419, 576731, 540178, 830696, 1112789, 1003718, 560462, 81707, -245898, -315880, -21507, 548237, 1051709, 1269525, 1374773, 1627762, 1960806, 2087787]
36239B087787j77711l12105k51077j01612P0942J75199Q7398j32778k19548p0336
36229A156159L6393j73812m78339l61483K39258P04312M94846o4565j75117K96995
36219A674647O04790K79326n4963L97684J240797J267621J62428j020152j279968
36210C272210q00643l00653k987J95443J54733k04343m57596k37725R0801m110
36200A705130k98886k05334J72205K14943j03912j79423J39301L02260M8064j92474
36190A601874j28328n7888j63382j07667K47646M14848P1656l28752k82673k0915
36180A246419J9829j902K54020N09673K57050l01590m72632j27380J75753J03543
36170A662783r6948k00871k95092l26403p316N62782P54852K63383l47342l83284
$$ y = [2087787, 1910076, 1597971, 1346894, 1245282, 1316224, 1491423, 1578821, 1446043, 1226495, 1156159, 1192552, 1018740, 540401, 178918, 418176, 1122488, 1617334, 1552769, 1377652, 1674647, 2279437, 2558763, 2503800, 2901484, 4142281, 5409902, 5572330, 4552178, 3272210, 2471567, 2170914, 2167927, 2363370, 2518103, 2313760, 1856164, 1618439, 1709240, 1705130, 1406244, 1200910, 1373115, 1588058, 1484146, 1304723, 1444024, 1746284, 1794348, 1601874, 1473546, 1415658, 1252276, 1144609, 1392255, 1807103, 1878759, 1550007, 1267334, 1246419, 1266248, 1264346, 1518366, 2028039, 2285089, 1983499, 1510867, 1383487, 1559240, 1662783, 1565835, 1364964, 1069872, 743469, 736153, 1298935, 2053787, 2317170, 1969828, 1586544]
36160A586544K5976J91385j20921m47679l73906n9019J16717R5011J02233K52198
36150A368539M17706M37255K71652k4224l26746m39538k41055J05547K61535J37514
36140A968185L4636J89317L53119J19483m15603o87069m13347L1512J62885N703
36130A348821p9067L0463J24664M8039j15281k38902l02649k97402j61529R7731
36120D54888L17871L15637J04854p7174k6380J42512R6768k27122m10789r3601
36110E97464L96014L75936j81547m83500j7457O51202O46180J3912m08477k26901
36100A362826N7680p1310m04994m48725j81680J9077j4191r1172l7604R8515K10978
36089D99400K58826J96228j3333k46127k50889N3777M08159M48370Q5773m10202
$$ y = [1586544, 1612520, 1803905, 1682984, 1235305, 861399, 802380, 919097, 1014108, 1116341, 1368539, 1786245, 2223500, 2495152, 2470928, 2144182, 1704644, 1463589, 1569136, 1830671, 1968185, 2002821, 2192138, 2545257, 2664740, 2249137, 1562068, 1148721, 1180233, 1343118, 1348821, 1269754, 1300217, 1424881, 1472920, 1357639, 1118737, 816088, 518686, 357157, 454888, 772759, 1088396, 1193250, 1116076, 1089696, 1232208, 1328976, 1101854, 691065, 597464, 993478, 1369414, 1187867, 704367, 686910, 1338112, 1984292, 1998204, 1589727, 1362826, 1420506, 1349196, 944202, 495477, 313797, 332874, 318683, 227511, 189907, 288422, 499400, 758226, 954454, 941121, 694994, 444105, 497882, 906041, 1354411, 1440184, 1029982]
36079A029982o72834n37262j42743J81514J78902q5873k68640j35939J37067K09826
36069a06000O4080N02J27168J70559m6146k42645p5996L31044N73452N02081K51826
36058A549925q7999m36816n14777j53392K70636K37478j13314j69106J39565J98291
36048I20491k32973n45179k37845L01522M72606L46208K90880K18775j10818m22668
36038A000999l02715K0297J4837k25205j65187J78561K59006P141l9916K36144
36028I83962K42982k62011o08566k17964M48460N43940J4808m72546n08996k79950
36018a15881o9992N3321P6717k9746j60634j19593J27264L95573M78087L01219
36008I36335l6277k84606k24997N0535J81081l370k19490j09154K58367M87251
$$ y = [1029982, 357148, -180114, -322857, -141343, 37559, -48314, -316954, -452893, -315826, -106000, -41920, -41418, 85750, 256309, 210163, -32482, -108478, 222566, 796018, 1298099, 1549925, 1461926, 1025110, 510333, 356941, 627577, 865055, 751741, 582635, 722200, 920491, 687518, 142339, -95506, 206016, 678622, 1024830, 1315710, 1534485, 1423667, 1000999, 698284, 718581, 733418, 508213, 343026, 521587, 780593, 787734, 747818, 983962, 1226944, 964933, 356367, 138403, 586863, 1130803, 1145611, 673065, 164069, -115881, -185873, -132552, -55835, -85581, -246215, -365808, -238544, 157029, 635116, 936335, 900058, 615452, 390455, 440990, 622071, 618701, 399211, 290057, 548424, 1035675]
35998A035675L76250J07534o2688q2057k6697O6696J71561J69725n3702l79570
35988A322727m64645j38810K73363K63948j87495n21813l13772J92298M72639
35979H98440L79915J23596j31037k67077q0208L81109N61752P0134n62024m89235
35969H85365J50109L76770q9439l69602J17512O49977L36958m47767o39954p6402
35959H93527L94955K47081j22336j89655j9206M1560r2405k52562l01349k33039
35949C66571j29958q1049o6658K5729K08333L63141M69896O12852O65255L39433
35939B773545k50516n19355k28194R2850k1361k02472P8231N09112L96592j65860
35929B462572m59316l28488k93979m82302m00893N0312K81467N5687m9745L15396
$$ y = [1035675, 1411925, 1519459, 1456771, 1374714, 1348017, 1414713, 1586274, 1755999, 1702297, 1322727, 858082, 719272, 992635, 1256583, 1069088, 547275, 233503, 425801, 898440, 1278355, 1401951, 1270914, 1003837, 923629, 1304738, 1866490, 1936624, 1374600, 885365, 1035474, 1412244, 1322805, 953203, 1070715, 1720692, 2057650, 1609883, 969929, 893527, 1288482, 1535563, 1413227, 1223572, 1204366, 1245926, 1153521, 900959, 599610, 366571, 236613, 155564, 88906, 114635, 322968, 686109, 1156005, 1768857, 2434112, 2773545, 2523029, 2003674, 1775480, 1868330, 1846969, 1644497, 1722728, 2231840, 2628432, 2462572, 2003256, 1674768, 1380789, 898487, 497594, 547906, 829373, 885060, 835315, 1150711]
35919A150711N89713K62376j91886p9889L62117M20065J34147J89545O97428R25163
35909D459490L66599n59472j094371r77592n12136j35361r8182l23430m50904
35900F74641k01240K49158M38752J91274j86420l16322j61433M4208J14947N9565
35890I07130j7810q2062k01833l83655m27980j32442L35056N19162K63338m8499
35880G30405m6425R4521j1674l15511m17805j90610Q9213J90796J43619J7448
35870B83977j45963j82893L5742K87419K34456q840j1408K11752J35252l73675
35860D65819o78515k87913L66357N75975L58893K06608J59945j20868n06046m21029
35850A19226J75889N61837K60128l09034n19252l67103k10578j11047Q0133K69568
$$ y = [1150711, 1740424, 2002800, 1810914, 1731025, 2093142, 2513207, 2647354, 2836899, 3534327, 4459490, 4826089, 4266617, 3172246, 2194654, 1682518, 1547157, 1448975, 1125545, 674641, 473401, 722559, 1161311, 1352585, 1166165, 849843, 688410, 732618, 847565, 907130, 889320, 807258, 605425, 221770, -206210, -338652, -3596, 515566, 778904, 730405, 683980, 778501, 766827, 451316, 33511, -157099, -67886, 122910, 266529, 283977, 138014, -44879, -9137, 278282, 512738, 503898, 492490, 704242, 839494, 465819, -212696, -500609, -134252, 441723, 800616, 1007224, 1167169, 1046301, 540255, 119226, 295115, 856952, 1117080, 808046, 288794, -78309, -288887, -399934, -319801, -50233]
35840e0233K45631R0050M6572J07952J10660R8802J93928K33650j2315l47618
35830G17079l53985p3526K3435j81300k34271J38054N40138M76006M6342k58392
35820H39580k10499J6686J74076J27296j27618m02843m01392n4981L43160M78659
35810G82124L24708J8197l08107m38984j73054K64678K89640k21135n59124j12636
35800a33693O65951Q34445K90345j88798j85561j39116m13189o10824k65431L19100
35790A73229M81309J61986r0313M5056K99782L07959P3687j59437k37229j54174
35780I01855M3277K62792L53864K12560j05867m28488n99483n43647k62647J21481
35770d4303L45005K05602j35658k46589J3031K23203l027l37165j29600N39340
$$ y = [-50233, 195398, 285448, 332020, 439972, 550632, 649434, 843362, 1077012, 1064697, 717079, 363094, 289568, 313003, 131703, -102568, 35486, 575624, 1051630, 1097972, 839580, 629081, 645767, 819843, 947139, 819521, 416678, 15286, -39695, 303465, 782124, 1106832, 1125029, 816922, 377938, 204884, 469562, 759202, 538067, -21057, -133693, 532258, 1366703, 1657048, 1468250, 1282689, 1143573, 730384, 119560, -145871, 173229, 654538, 816524, 726211, 771267, 1071049, 1379008, 1452695, 1293258, 1056029, 901855, 945132, 1207924, 1561788, 1774348, 1668481, 1239993, 640510, 96863, -165784, -44303, 300702, 506304, 370646, 124057, 137088, 360291, 357264, 20099, -109501, 429839]
35760D29839Q03550K14672n77126p37984l42487k1469O3366K16732M36514L93283
35750H78890J29491P0425K60024K33041j83236n23203l83246J5748K29522J56976
35740H84432l3784j96044k10941k1713J77046J09707j12692q9886J91824K65280
35730I63229m6396k94877j50796L0362j87204n80547o33694l21013q018J94761
35720a034193M42926O55262N39733J46021n3103K28345O78112P43882K81694k74534
35710B354145m06880j27086N8583j12535k28384J56037O99331O81311J38615j38224
35700C074913J44302L28443o1089m90603k71961L69675P16739N76647K47851j20300
35690D514617m80668n47164j64621K54530K82063J67737L40986N47986K48930
$$ y = [429839, 1233389, 1448061, 870935, 132951, -209536, -231005, -167639, 49093, 485607, 878890, 1008381, 1078806, 1338830, 1571871, 1388635, 865432, 482186, 497934, 727456, 884432, 850648, 654604, 443663, 421950, 598996, 708703, 596011, 506125, 697949, 963229, 916833, 621956, 471160, 501522, 314318, -266229, -899923, -1220936, -1228954, -1034193, -591267, 63995, 603728, 749749, 696646, 924991, 1603103, 2346985, 2628679, 2354145, 1947265, 1820179, 1878762, 1766227, 1537843, 1693880, 2393211, 3074522, 3213137, 3074913, 3219215, 3547658, 3486569, 2995966, 2724005, 3093680, 3810419, 4387066, 4634917, 4514617, 4033949, 3486785, 3322164, 3576694, 3858757, 4026494, 4367480, 4915466, 5164396]
35681E164396l65288n85196l01171r5315k37844l80331l06335k41534k91583k39287
35671B120512l9235Q3732J20538K63992L55789R484o13233q36301m49939M22R7442
35660A113203N9339J25597J08531j04511k02068P480J99923O0648k12455k67288
35650H88399r6050R3789J68307M3704k57797m16927j23258L51917M25793J24049
35640A201926P4295M34191N86189J93718k11032j21586J79011K49777K15668K97341
35630C099498K39738j67107n36795m78799k46370j92622j02294K78931N66725
35621B460905L27174j06082j64506J5660k9575j74813k4879J92460q840l62438
35611B125066j95784L38159M01531j22793l74145J20793P18304O44337J1182n20580
$$ y = [5164396, 4799108, 4213912, 3912741, 3817426, 3579582, 3199251, 2892916, 2651382, 2359799, 2120512, 2081277, 2165009, 2285547, 2549539, 2905328, 2914812, 2301579, 1465278, 1015339, 1015761, 1113203, 1172542, 1298139, 1406670, 1302159, 1100091, 1107571, 1307494, 1368142, 1155687, 888399, 792349, 886138, 1054445, 1098149, 840352, 423425, 300167, 652084, 1077877, 1201926, 1276221, 1710412, 2296601, 2490319, 2279287, 2157701, 2336712, 2586489, 2802157, 3099498, 3339236, 3172129, 2635334, 2156535, 1910165, 1717543, 1615249, 1894180, 2460905, 2788079, 2681997, 2517491, 2533151, 2503576, 2328763, 2303884, 2496344, 2487504, 2125066, 1929282, 2267441, 2668972, 2546179, 2172034, 2292827, 3011131, 3655468, 3666650, 3146070]
35601C146070n68699k14171K20599L58604P5410k78748k79938r823J44759J14722
35591B708785O2493j22778n68970q25709l55347M26448N22287j39494n40206j63196
35581A004313K45991l0360n50759n17955J5402M44345N54181M87682K27086k26598
35571A653328n02929k98447R7774K13518N4581q2807j42049k04619j84018n8268
35561E46064o8807k64759k46109J75107N01955K87050j08530j17826J10866J12851
35551I27862K382J24601J74005l44066r78166p52809K62662Q94705N67423K0321
35541H98920j6930J40938l6339l15138k47611k3575l0177p1079K30252O23654
35531A152915N58529O7735l38780m67402m96125m12379o5248L03356K47294j43157
$$ y = [3146070, 2577371, 2363200, 2583799, 2942403, 3017813, 2739065, 2459127, 2449304, 2594063, 2708785, 2771278, 2648500, 2079530, 1253821, 898474, 1324922, 1847209, 1707715, 1167509, 1004313, 1250304, 1219944, 669185, 151230, 166632, 610977, 1165158, 1652840, 1879926, 1653328, 1150399, 851952, 949726, 1163244, 1217825, 1135018, 992969, 788350, 604332, 546064, 477257, 212498, -33611, 141496, 643451, 930501, 821971, 704145, 815011, 927862, 930244, 1054845, 1228850, 884784, -93382, -846191, -583529, 311176, 878599, 898920, 881990, 1022928, 986589, 671451, 423840, 400265, 370088, 299009, 529261, 1152915, 1711444, 1779179, 1440399, 972997, 476872, 64493, -755, 302601, 549895, 406738]
35521D06738l00784m6294J97237J63431J11036K22095K09105j38112m78991l95733
35511e0272p887K62238K75225J76929M9467q6206j02975O2630K22017K02273J22055
35500A125494J16645L0608k49590m10828j42648K39562J68042k73538m35371j01719
35490F6657K34254K13462Q2295R3966P1929q8973p9463K26466L69352K2553l70871
35479H41627k85687j0092j35587m78747l46359K65298O02280L36298Q93M4367
35469H34291J90203Q0137p6014N6743L00914K43576j20383m07859l42480K8823
35459G87951M47981N95488L22860j25164l33234k44487j93256l47333m81090m12008
35449A7708k54189q4340J97837M72760L54964j61687m95584k79843R1556J35690
$$ y = [406738, 105954, 59660, 256897, 420328, 531364, 753459, 962564, 824452, 345461, -50272, -58159, 204079, 479304, 656233, 705700, 619494, 516519, 579149, 801166, 1003439, 1125494, 1242139, 1272747, 1023157, 612329, 469681, 709243, 877285, 603747, 168376, 66657, 300911, 514373, 596668, 690634, 762563, 673590, 594127, 820593, 1189945, 1212498, 841627, 555940, 545848, 410261, -68486, -414845, -149547, 452733, 789031, 789924, 834291, 1024494, 1104631, 1028617, 1085360, 1386274, 1629850, 1509467, 1101608, 759128, 787951, 1235932, 1831420, 2154280, 2029116, 1695882, 1451395, 1258139, 910806, 429716, 17708, -236481, -320821, -122984, 349776, 704740, 543053, 47469, -232374, -140818, -5128]
35439e128J9346J05528K14523q991l28358k35496J62370K96095P1095o1169M9686
35428B79501M1938k25648l81543j74244J42151K63158K22587J45728K9542o6085
35418B77085O821J78269J96632O5191M5191J52766J13057q9111j30698K7562L111
35407H45876k89141l64394L1622M01071K35708j91600l10938j42525j00156j85151
35397f9628k8943L64640N28344K29390k13060l98091k78428n3082R3973R0810
35387B65925J7835N0349K05250K48671N0939j34410k5709K16670K23201p305j54490
35376I56926j22930j19012j96033j54954M1699J59595R8312L8408O2442r613k43685
35365E11155l86871k46258R259J37577J61111J95120J75028J6270j31510o4590
$$ y = [-5128, 14218, 119746, 334269, 325278, -3080, -238576, -76206, 219889, 290984, 229815, 279501, 321439, 95791, -285752, -459996, -317845, -54687, 167900, 313628, 343170, 277085, 283906, 462175, 658807, 723998, 769189, 921955, 1035012, 945901, 815203, 842765, 845876, 556735, 192341, 223963, 625034, 860742, 669142, 358204, 215679, 115523, -69628, -98571, 266069, 794413, 1023803, 810743, 412652, 134224, 81142, 175115, 265925, 283760, 334109, 539359, 788030, 838969, 704559, 678850, 895520, 1118721, 1111416, 956926, 833996, 714984, 518951, 363997, 405696, 565291, 663603, 702011, 764453, 754840, 511155, 124284, -121974, -112715, 24862, 185973, 381093, 556121, 572391, 440881, 376291]
35355C76291J46043K50718J79388Q3092N1875P44j37054k64312k48623j27905
35345C10257r2549k20876k92249k0750M77893O79990L19323j51321j13178L38565
35335A235105N29382J98381j84662k21607j31239j96552k14654L2961K10535o9897
35325A187753m81528l94042R6425K54839j61658n50168m07990l341J98642K36445
35315b4623L54368M12209J13160l74720n23529j67764K48233K32259j74784m83107
35305c88298l08910K30846O59045O49518L43293R4434J258j11694k89085l16065
35295E64342q3285J82375K15135M8361r7788j01583K2734K02662K88491J31147
35285A372591j86189l70389k89762j16527N206J47197K94262K02155j69416m12562
$$ y = [376291, 522334, 773052, 952440, 1035532, 1087407, 1088151, 951097, 686785, 438162, 310257, 217708, -3168, -295417, -316167, 161726, 841716, 1161039, 1009718, 896540, 1235105, 1764487, 1962868, 1778206, 1556599, 1425360, 1228808, 1014154, 1047115, 1257650, 1187753, 706225, 312183, 408608, 663447, 501789, -48379, -456369, -459710, -261068, -24623, 329745, 741954, 855114, 480394, -43135, -210899, 37334, 269593, 94809, -388298, -697208, -466362, 192683, 842201, 1185494, 1279928, 1281186, 1169492, 880407, 564342, 481057, 663432, 878567, 926928, 829140, 727557, 750291, 952953, 1241444, 1372591, 1186402, 816013, 526251, 409724, 414930, 562127, 856389, 1058544, 889128, 476566]
35275D76566k17057J24452J58089m8401j24177n5739q4404j21891J07414M14535
35265F29387L04811j65081l60757n7495K04020J8471k53324j52088J21081J21123
35255D10148o1115Q840L59239N65300L66960n8122l94427m71652l01661n0850
35245C72660R2553J45990K62681L53559J06380m28868o74656k95080K21578J96744
35235C53541k91810n86929l78785N3308L86260N15507L49984j16272n18345m07379
35225f40920J11276M61113L66515J15425Q321Q771M0742J68831L12912J96561
35215A149547k15970n68474n70794l09410L026K45952K80611M0377j57795J20437
35205A7507O66564O82805q6215q15660o64754O6744M18941R4117l26946l32138
$$ y = [476566, 259509, 383961, 542050, 493649, 369472, 313733, 229329, 107438, 214852, 629387, 934198, 769117, 408360, 350865, 554885, 573356, 320032, 167944, 289025, 410148, 349033, 357873, 717112, 1282412, 1649372, 1591250, 1196823, 725171, 423510, 372660, 465213, 611203, 873884, 1227443, 1333823, 904955, 230299, -64781, 156797, 353541, 61731, -525198, -903983, -850675, -464415, 51092, 401076, 284804, -233541, -640920, -529644, -68531, 297984, 413409, 421730, 430501, 471243, 640074, 952986, 1149547, 933577, 365103, -205691, -515101, -512075, -266123, 14488, 54865, -102930, 17507, 684071, 1366876, 1280661, 465001, -199753, -133009, 285932, 380049, 53103, -279035]
35195b79035l0014K38352L25218K41347Q0786L3836J68851K22292o9453m86485
35185D45695n59588k57363q634j8414k9961J28447K40303J48956O2592J23102
35175B75135P3333k65055n15355k31675L31474M63955r115m76922l98652J7698
35165g35179K24209R3604n5755j5725Q8618J14344J33409K48873L80791L79934
35155H57123K47817J08845J7741q2391k22805l34738l37912k40610j18747k1393
35145a27070P7405K20280L53942L20816M9199k61327k91432o882K36755J32035
35135G03721j61211k32557J5036K55124J95575q2330k99776k90706n0896L25804
35125C77784O24984N86749J81683k72303m23596k65530p2091j5231j4982L1649
$$ y = [-279035, -309049, -70697, 254521, 495868, 576654, 610490, 779341, 1001633, 932180, 445695, -113893, -371256, -379890, -398304, -428265, -299818, -59515, 89441, 152033, 275135, 348468, 83413, -431942, -663617, -332143, 131812, 122697, -354225, -752877, -735179, -510970, -417366, -473121, -488846, -400228, -285884, -152475, 96398, 477189, 857123, 1104940, 1213785, 1231526, 1149135, 926330, 591592, 253680, 13070, -105677, -127070, -49665, 170615, 524557, 845373, 894572, 633245, 341813, 334931, 571686, 703721, 542510, 309953, 324989, 580113, 775688, 693358, 393582, 102876, 51980, 377784, 1002768, 1589517, 1771200, 1498897, 1075301, 809771, 737680, 722449, 707467, 739116]
35115G39116N9146k3108j16321m8188R9630J684m23562p23971m23917K36570M88345
35104a34576P0788l67227k02027K55006K81955j24715l04909k1518K15135L4389
35094b97699k20230r0018L09045N21466L43733o1171l52476j94871L74301P01655
35084A033735J77642p50216r29733j34785M90252J29167m46396j65731N54958
35075d1107M93327l50558p36990j49003N03180L95651j05214k99277j86555r2490
35065e69036L477J88084K40869P0657K2089K60002L50375k4723m14827k53992
35055a27025K32329M01104J69156k2054q692l0167j49302j44928R611O6186m7792
35044C48426j14686k4281O0778N395j00543r8056O2429K74954K97576k4891m16674
$$ y = [739116, 798262, 775154, 658833, 610645, 710275, 711959, 288397, -435574, -859491, -622921, -134576, -63788, -431015, -633042, -378036, -96081, -220796, -525705, -547223, -332088, -297699, -517929, -607947, -298902, 222564, 566297, 505126, 152650, -42221, 332080, 1033735, 1211377, 461161, -468572, -603357, -113105, 16062, -430334, -596065, -41107, 452220, 101662, -635328, -784331, -281151, 114500, 9286, -289991, -476546, -569036, -565559, -377475, -136606, -65949, -43860, 216142, 566517, 541794, 126967, -127025, 105304, 506408, 675564, 653510, 644818, 614651, 465349, 320421, 330032, 396218, 348426, 233740, 209459, 270237, 275632, 175089, 77033, 139462, 414416, 711992, 687101, 270427]
35033B70427l32444K76800O87937L01565m71259p29445k88667K03899K59219N4801
35023B32833n8404n960J37996K70937K00944j12074k81574M6132N13971M49200
35013A394001p5303l10619n6722L1608l55336n78044j68964K82340J10321k64537
35003H745p2945M26218L57730k64729n42581j62710J94757Q0315p9726J00930
34993D6004K83502J10823j31192j00225k7461j76033k16768J83134N83275L34377
34983H89436l49963o44637l07579J10464K23184K39094L22473K28494j43102l99971
34973A67893k21238J52956L34891L28716L16701K43634O149k09663j97349j39981
34963G82709l18200n44776l64129K04747N89384M29298K2229j76402j62555k11220
$$ y = [270427, -62017, 214783, 902720, 1204285, 733026, 3581, -285086, -81187, 178032, 232833, 174429, 168469, 306465, 577402, 778346, 666272, 384698, 430830, 944801, 1394001, 1318698, 1008079, 951357, 982965, 627629, 49585, -119379, 162961, 273282, 8745, -64200, 362018, 719748, 455019, -87562, -250272, -55515, 24800, -54926, 46004, 329506, 440329, 309137, 208912, 181451, 5418, -211350, -28216, 555059, 889436, 539473, -105164, -412743, -302279, -79095, 159999, 482472, 710966, 567864, 167893, -53345, 99611, 434502, 763218, 1079919, 1323553, 1329702, 1120039, 922690, 782709, 464509, -80267, -444396, -239649, 349735, 779033, 801262, 624860, 462305, 251085]
34953B51085l18587j86204K43685N52799L31781k34638n10842j82992L22369L70523
34943F38979p0533m31718l21219L8650K45800K43821J92248R9736j04002l15120
34933B16642l80005l39353k79118j03740K36461M75528L70423J53105K01403L80918
34923I32264K38769j94842l93098j90586l9953k16065l60481j39760J71799J76745
34913a5208j2857p2050l3575r8169j65461k6237J97699K46656J59731J05652j582
34902B84599k70209m33493j94716J97911K58240K3674m9005J28974J90836J2315
34892A49126j05032k5667K1349l7687L8187K72401L25369J02505k2614J32150
34882H50087J87880j53993n55087n35695j69550J23704J91160J69646J43187J28822
$$ y = [251085, -67502, -253706, -10021, 542778, 874559, 639921, 129079, -53913, 268456, 638979, 568446, 136728, -184491, -145841, 99959, 343780, 536028, 635764, 531762, 216642, -163363, -502716, -781834, -885574, -649113, -173585, 196838, 349943, 551346, 932264, 1171033, 976191, 583093, 392507, 352554, 136489, -223992, -363752, -191953, -15208, -28065, -100115, -133690, -231859, -397320, -423557, -225858, 20798, 180529, 286181, 284599, 14390, -419103, -613819, -415908, -157668, -133994, -182999, -54025, 136811, 149126, 44094, 18427, 39776, 2089, 40276, 312677, 638046, 740551, 717937, 850087, 1037967, 883974, 328887, -206808, -376358, -252654, -61494, 108152, 251339, 380161]
34872C80161J85275K42333Q0863k41016k83530J03023L80958P2950m27465l75368
34862A18184K19611O35000M79260P5686j82633k61455j99120M2531K86887J91742
34852A405693k20353m94354l78750j35437m1314R968J71697K81645J36302j39956
34842E95141k76642k06861k1588K13342L88438L15882q082k82486k51690k3139
34832D42315J31097J14596n100j39291j42061J28537N08317N46785R8450l54085
34822A329560l04869N7529J43137j62464l79731j93903J22236J86421M3197j5654
34812H25459O3516O3083j29083l33968l16999r1390J04010J07373J3227q273L2465
34801C29420J7487k3500L4482J11391k9615l45649m38758j05017L16764L88938
$$ y = [380161, 565436, 807769, 888632, 647616, 364086, 467109, 848067, 921017, 493552, 118184, 337795, 972795, 1452055, 1527741, 1345108, 1083653, 884533, 927064, 1213951, 1405693, 1185340, 690986, 312236, 176799, 135485, 145453, 317150, 598795, 735097, 595141, 318499, 111638, 90050, 303392, 691830, 1007712, 999630, 717144, 465454, 442315, 573412, 688008, 682908, 543617, 401556, 530093, 1038410, 1585195, 1683645, 1329560, 1024691, 1082220, 1225357, 1062893, 683162, 489259, 611495, 797916, 841113, 825459, 888975, 952058, 822975, 489007, 172008, 80618, 184628, 292001, 305228, 296955, 329420, 346907, 323407, 357889, 469280, 439665, 94016, -344742, -449759, -132995, 255943]
34791B55943J33389j20611k26059k45510j74720J6228J87296J89646J12140Q9896
34781B17638L7059j20482j75261j984N8107k96933o53657l78364L15184N57390
34771d41303J31789k17592m446K90417J36921j62352r1351J72062J44228r4565
34761a36192j11268Q6764J38480K0655K0180J31659P7716j31596k12007j38264
34751b53873j36388j75581j1985K54352K30983p8011j85064J19720M21774L15683
34741E01610m2757k60965k26951o4414J17399J98652M7205k39001l25529p3456
34731c68207K38449K90908J06643r5762k01514j93435o8713P3514O5988o1081
34721b13210o2897J36799K88933K05731N2105N3132J43721J32357J2491j15263
$$ y = [255943, 389332, 268721, 42662, -202848, -377568, -361340, -174044, 15602, 127742, 217638, 254697, 134215, -41046, -43030, 15077, -281856, -935513, -1313877, -998693, -441303, -309514, -527106, -531552, -241135, -104214, -266566, -357917, -185855, -41627, -136192, -247460, -160696, -22216, -1561, 18619, 150278, 227994, 96398, -115609, -253873, -390261, -565842, -577827, -323475, -92492, -170503, -355567, -235847, 185927, 501610, 458853, 197888, -29063, -93477, 23922, 222574, 269779, 30778, -294751, -368207, -129758, 161150, 267793, 172031, -29483, -222918, -291631, -218117, -152129, -213210, -276107, -139308, 149625, 355356, 407461, 460593, 604314, 736671, 749162, 633899]
34711F33899k52117m05463m42495k66575j7372R9190O5975j2302p8544p4488R0077
34700f60215L37139L84051J18640j76915k08351q6819r2557j87398q7758K54082
34690d06101N44590N22866K30907p5723j50952L0383J75527m6428m92788n75204
34680b42923m5454N30022M65776r0393l84230j24601K15597K02886Q320k4518
34670E10482P2740P9453Q728J0098L3320q7054k81477k63823O1334M01573L88942
34659I34316J7267l28337k95929L8411K70352J40384j97219l91842k59270J07870
34649C6003M41961M52102N7247m26469n26813j86624J19629K9759j88716n9996
34639b51917L57230N32920K01835l24386n90433m51993q8261J85729J29862j56449
$$ y = [633899, 381782, -23681, -466176, -732751, -750123, -650933, -584958, -597260, -675804, -750292, -660215, -323076, 60975, 179615, 2700, -205651, -292470, -385027, -572425, -660183, -406101, 138489, 661355, 892262, 816539, 665587, 695970, 871497, 825069, 332281, -242923, -288377, 241645, 707421, 617028, 232798, 108197, 323794, 526680, 535000, 510482, 583222, 662675, 671403, 681501, 714821, 627767, 346290, 82467, 143801, 545374, 934316, 951583, 623246, 327317, 365728, 636080, 776464, 579245, 187403, -71867, 36003, 477964, 930066, 987313, 560844, 34031, -152593, -32964, -3205, -191921, -251917, 105313, 638233, 840068, 515682, -74751, -526744, -615005, -429276, -299414, -455863]
34629d55863k26063J91915P29008P72736K89212j38730j35539J7500q9040l72345
34619E82791m25212j05581K81431L42433L3592k56463j13726L60619N95624K96744
34609A592252j12855j13945J18665M6357l03479l81672n9455J67854L5643j20671
34599H68694p5350j01172l06967k65467K11426N38537K08180l31105l37066Q4862
34589D94572K59715P4941P514J52092Q4131k45278l01274J04680L93517J09671
34579A134281l42004l27072O1860K09113q0201l49773j85154K53034M91552L16418
34569A182054m3847k25114j24533L9412M6820m7009n9929j3814r6764k92025l03820
34558F1431J7508L74981L51939m9330l85826k83517J62222N12272M25169l8637
$$ y = [-455863, -681926, -490011, 238997, 1011733, 1300945, 1162215, 1026676, 1044176, 955136, 582791, 157579, 51998, 333429, 675862, 709454, 452991, 339265, 699884, 1295508, 1592252, 1479397, 1365452, 1484117, 1530474, 1226995, 845323, 785868, 953722, 989365, 868694, 793344, 692172, 385205, 119738, 331164, 869701, 1077881, 746776, 409710, 494572, 754287, 829228, 836742, 988834, 1072965, 827687, 526413, 631093, 1024610, 1134281, 792277, 465205, 527065, 736178, 655977, 306204, 121050, 374084, 865636, 1182054, 1138207, 913093, 788560, 827972, 874792, 827783, 767854, 754040, 657276, 365251, 61431, 78939, 453920, 805859, 756529, 370703, 87186, 249408, 761680, 1186849, 1148212]
34548A148212m86688n54718k49713N6192K4730k54693l59920o9795L18992L61141
34538f6260O9577j05291O2227K53882J49810k6531J04109L53332J76444l97800
34528E73499o46356j85472L99721L52024k21859n92209m28952o4000J47163K05452
34518d60989J98939J17873L8930J16429K70730K18390o1572k19249n5512J61744
34508C25713J23386n5737p4150O9303J43673J01061Q7063J01635o308j94881k21007
34497C99751o2531j3870j87003k39713J03192N13118M50410l6364l67664k80863
34487B78463j19225j49824j23817J72452L99976J74760k44461l25342r5802j1530
34477d4350j17769r625L46897M33945J8654m21196m00539o8811J63706K10566
$$ y = [1148212, 661524, 106806, -142907, -86715, -61985, -316678, -676598, -746393, -427401, -66260, 3317, -101974, -39747, 214135, 363945, 337414, 441523, 794855, 971299, 573499, -72857, -258329, 141392, 493416, 271557, -320652, -749604, -813604, -666441, -460989, -262050, -144177, -105247, 11182, 281912, 500302, 438730, 219481, 163969, 325713, 449099, 393362, 319212, 388515, 532188, 633249, 720312, 821947, 815639, 620758, 399751, 337220, 323350, 136347, -103366, -174, 512944, 963354, 926990, 559326, 278463, 159238, 9414, -114403, 58049, 458025, 632785, 388324, 62982, -32820, -44350, -162119, -171744, 175153, 609098, 627752, 206556, -193983, -262794, -99088, 111478]
34467A11478J87088Q3154r4952j71469r6907q8004k07475j74589J10156K75726
34457f5794Q8614q9642Q3213K88312R2731k32218j20838L08745M18188Q1985j65335
34446F87961l4948J29650k349k76986l98472l07548q6654J43566J69287j09781
34436h6274l96717k98995R1231L19423K42215J32307J38716J43420J60519L34986
34426G80831M88247K34360l28836o06671l60196l4461l1778j85697k02792j19121
34416c66114l4818J31994L30401K65435r6508l42817k32354n8588r4665j53162
34406f51196n2143j9040j91387k05156J82327N03563K56787j78831l9455O02281
34396B07750Q81636M08896k22157l57971j11450K7344n2573j03097l9769n0400
$$ y = [111478, 298566, 381720, 286768, 115299, 18392, -69612, -277087, -451676, -341520, -65794, 22820, -66822, 16391, 304703, 397434, 165216, 44378, 353123, 771311, 853296, 687961, 653013, 782663, 780314, 503328, 104856, -202692, -289346, -145780, 23507, -86274, -482991, -781986, -690755, -371332, -129117, 3190, 141906, 285326, 445845, 780831, 1269078, 1503438, 1174602, 567931, 207735, 173274, 141496, -44201, -246993, -366114, -400932, -268938, 61463, 326898, 230390, -112427, -344781, -403369, -498034, -651196, -703339, -722379, -913766, -1118922, -936595, -433032, -176245, -355076, -394531, 207750, 1089386, 1498282, 1276125, 918154, 806704, 834048, 781475, 678378, 638609, 588209]
34386E88209k15874l12806j12211K54176M00476J76105j27410j84297p2868o4032
34376C29468j23173L913K64448L04450N3696j52405j48676j50107k11076k1852
34366A48686M49558O59697K81921j80268j17505K39443K23065k01242m46328k55611
34356H01416O146J3400j28547k09294j71476J759K60125L49776R6526k17155j88790
34345F13886N1175L3941k17658j55454L73113P68570N21467q1483m35350m05840
34335A066367k66132j58117l1020O7130K3825q9969j07074m4611m3483q3237j8124
34324C15555J17371J03148j07200k49130r9782J84543K50929J511l01743l73950
34314a58748j93593P5292K82083L30377J81091n5010j68393j31336j48262k51283
$$ y = [588209, 372335, 59529, -52682, 201494, 601970, 778075, 650665, 466368, 393500, 329468, 206295, 210208, 474656, 779106, 832802, 680397, 531721, 381614, 170538, 148686, 598244, 1257941, 1539862, 1359594, 1242089, 1481532, 1704597, 1503355, 1057027, 801416, 807562, 820962, 692415, 483121, 311645, 313404, 573529, 923305, 1019831, 802676, 613886, 665061, 699002, 481344, 325890, 699003, 1467573, 1989040, 1907557, 1472207, 1066367, 800235, 642118, 611098, 678228, 702053, 612084, 505010, 460399, 416916, 333679, 315555, 432926, 536074, 428874, 179744, 79962, 264505, 515434, 516945, 215202, -158748, -352341, -277049, 5034, 335411, 516502, 461492, 293099, 161763, 13501, -237782]
34304b37782j17372L72956O75010K33935n47183o94573o1371M34216K08073j62651
34294A03258p80L35280J33464l98062m50345N9088L93184J97491l5181J57345
34284D94742N50120O77866M14329r2619o17160q24584m76265J55226M56516K20122
34274I58293j30547j88677n0826J2054o345K3991Q2938P2247r575j08264j74133
34263D81156j35756o454O230k31013m43388k45355K36176M59530K37177n0994
34253C07309j14028j22163k32759k45404k6689J62221J13600O1707K37664L86072
34243E27530J70616k17377l40634k10835j96117l36832k70944J31221N16761N55562
34233C28951L36194J12377m2233j49007j42899N520J44658J25947L1180K3450
$$ y = [-237782, -355154, 17802, 692812, 926747, 379564, -315009, -376380, 57836, 265909, 103258, 102478, 437758, 571222, 173160, -277185, -218097, 175087, 372578, 337397, 494742, 1044862, 1722728, 2137057, 2044438, 1427278, 602694, 126429, 281655, 738171, 958293, 827746, 639069, 588243, 600297, 593952, 617943, 700881, 773128, 763553, 655289, 481156, 345400, 338946, 345176, 114163, -329225, -574580, -338404, 121126, 358303, 307309, 193281, 71118, -161641, -407045, -433734, -271513, -157913, -96206, 141458, 527530, 698146, 480769, 140135, -70700, -266817, -603649, -874593, -743372, -226611, 328951, 665145, 777522, 735289, 586282, 443383, 448903, 593561, 719508, 750688, 774138]
34223G74138N0950p5748l28270m29484k54167l4255p853n6709O9779L06221L54247
34212C68849J65434P291J8025L6279l6997n9549J9291L480j60286j93745L9107
34201B07179K22857R5847q5134j0912Q2675j71820n18435l90169J30543L53960
34191h3409M0533k42920k2429M05706N07028K64405K6459q9845k46753m66101
34181I2674m96288j43833M02518O65314L59404k18218m48576j38110K30021J87877
34171D92783o9130p5496J35537J56894n3497j27154L5120Q8794j47732l81660
34161E4459k95674N0407L90542N33255M15124J42131l1942k0812p6372l33956
34151H27162m26738l6860M03814K16497m43555p35877l57034J30635K66505K22639
$$ y = [774138, 825088, 749340, 421070, -8414, -262581, -296836, -304689, -361398, -291619, 14602, 368849, 534283, 541574, 559599, 595878, 558881, 499332, 518623, 522103, 361817, 168072, 207179, 430036, 525883, 440749, 429837, 512512, 340692, -177743, -567912, -437369, -83409, -42876, -285796, -308225, 97481, 604509, 868914, 895373, 805528, 558775, 92674, -403614, -547447, -144929, 520385, 879789, 661571, 212995, 74885, 304906, 492783, 423653, 348157, 483694, 640588, 587091, 459937, 495057, 583851, 436119, 54459, -241215, -190808, 199734, 732989, 1148113, 1290244, 1258302, 1237490, 1161118, 827162, 400424, 363564, 767378, 983875, 540320, -195557, -552591, -421956, -155451, 67188]
34141F7188J96158K9766k76344l52140q3387J42311J04171P7551K21345K51839
34131C78458M1465o4931J24987K93394K16135J29132J50129k4467m37684n38001
34121B68617k9218N28736N04446O7754k39361l06629k99275j70013J16994K74399
34111G16450J16130p3716l1602M2996m9138q1892J07122K07603J423j80256p1398
34100G03722P014k02963l04456M0640L58990P6579m82545n93748k53034k1608
34090f71409n5539n0557P8148J57746J97984K68463J88011j08341k28789P4106
34080a50177L64880K11357n1565M4308J96372r1729m75890k84800K58504L47771
34070C69031p4238l07954j19328K4230o4617k1930K66651M29729K87471M8035
$$ y = [67188, 263346, 293112, 16768, -335372, -418759, -276448, -172277, -94726, 126619, 378458, 419923, 354992, 479979, 773373, 989508, 1118640, 1268769, 1244302, 806618, 268617, 239399, 768135, 1272581, 1340335, 1100974, 794345, 495070, 325057, 442051, 716450, 832580, 758864, 727262, 770258, 721120, 639228, 746350, 953953, 955376, 775120, 703722, 710736, 507773, 203317, 243957, 602947, 679526, 196981, -396767, -649801, -671409, -726948, -777505, -699357, -541611, -343627, -75164, 112847, 4506, -224283, -150177, 214703, 426060, 374495, 418803, 615175, 523446, 47556, -237244, 21260, 369031, 294793, -13161, -132489, -108259, -172876, -194806, 71845, 501574, 789045, 837080]
34060H37080k08474n39298o56481j99100M94026O51912J82154k09329q8654K17338
34050D81174L08119K23909J29376M0305j9985l2686j37199l66561m04555p9803
34040A42094J87735K1591j85264Q9222M92988L29036j99956k87319R7291J89946
34030H77364k19300m72345j97919J81056K78282K27976J64073m432j59380m2556
34020F32819J69029O9321k08208j88520M5338m928k77068k37724Q1867J14628
34010A96554j56423j49776J93621K61894r7713k86426J76L45071M17542L49976
34000A074496J87177j70274m07809j00353L89920K94859k58756l81515R7092L94328
33990A119165J29479k11086l03344l57659l27039J06479O13688M63758j72443
$$ y = [837080, 628606, 89308, -567173, -766273, -272247, 379665, 561819, 352490, 263836, 481174, 789293, 1013202, 1142578, 1182883, 1162898, 1130212, 993013, 626452, 221897, 142094, 329829, 351420, 166156, 255378, 748366, 1077402, 877446, 590127, 687418, 877364, 658064, 185719, -12200, 168856, 447138, 675114, 839187, 834755, 675375, 632819, 801848, 871169, 662961, 474441, 519779, 514851, 237783, 59, 81926, 196554, 40131, -109645, 83976, 345870, 248157, -38269, -38093, 306978, 724520, 1074496, 1261673, 1091399, 683590, 583237, 973157, 1268016, 1009260, 627745, 724837, 1119165, 1248644, 1037558, 734214, 376555, 49516, 155995, 769683, 1233441, 1060998]
33981A060998l69418o219J14675j75771j51544L00187L78312j01703l25256N806
33971G30067K10163M5192J11789M53416K87695m05226n82764N4560M99588K07891
33961A612371j19445l9502o0635l14214j73273K97651K18179l26301k33772M41833
33951A302892L52395n69366p05730L33567Q53379J01280l98119K47167O58422
33942B175887n9439n13989K88312R49082K92206m17784Q3992P00593J85231m95331
33932C188760j79059K76237m7223j70580O10342R41850M3720l80348P55840J586778
33922F626317O48723k65980N57294J528517R47777L38795J265204K090936J484005
33913A5221588J555342L592651M724701L290498K915452O020182Q610918P947526
$$ y = [1060998, 691580, 685361, 800036, 624265, 472721, 772908, 1151220, 1049517, 724261, 730067, 940230, 985422, 1097211, 1550627, 1838322, 1433096, 850332, 904892, 1404480, 1612371, 1492926, 1453424, 1392789, 1078575, 905302, 1202953, 1421132, 1094831, 861059, 1302892, 1655287, 1085921, 380191, 713758, 1567137, 1668417, 1270298, 1517465, 2175887, 2116448, 1602459, 1890771, 2839853, 3132059, 2714275, 2798267, 3498860, 3684091, 3188760, 3009701, 3285938, 3238715, 3068135, 3678477, 4620327, 4664047, 4283699, 5039539, 6626317, 7275040, 7009060, 7566354, 9094871, 10042648, 10381443, 11646647, 13737583, 15221588, 16776930, 20369581, 25094282, 28384780, 31300232, 37320414, 45931332, 53878858]
33905E3878858R242919J6588161K4529943L0002890M4098906P3391993R3678682
33898C45412352O7346565n680564p5704574r5709802p0720397m0411107k7332451
33891I7200022k2833392j5485184q712578p718088q131460n236049k347265l166511
33883B3569495m594092l009921p05947q71298j912061j364788n75967j321659
33875I213762j986225q82542L10789j95972r76373l81293L04244l86077j139302
33866C881011m73471L98877Q100n90305n7382N72137K720p52265l79600K05213
33856B815035k52113q50556l21013M68070J68606m88315j31834O81631O21637
33847B711148L4552L7283K92677j67815q73853p17302n325J75468r8967l6286
$$ y = [53878858, 63121777, 79709938, 104239881, 134242771, 178341677, 251733670, 345412352, 412758917, 407078353, 331373779, 235663977, 164943580, 124532473, 97200022, 74366630, 58881446, 50168868, 42450780, 34319320, 29083271, 26736006, 23569495, 18975403, 15965482, 15259535, 14388237, 12476176, 11111388, 10535421, 9213762, 7227537, 6344995, 6655784, 6459812, 5483439, 5102146, 5406390, 5020313, 3881011, 3407540, 3806417, 3814517, 3224212, 3166830, 3738967, 3741687, 2989422, 2609822, 2815035, 2562922, 1712366, 1391353, 1859423, 2028029, 1539714, 1407880, 2089511, 2711148, 2745700, 2782983, 3075660, 2907845, 2033992, 1316690, 1311365, 1486833, 1387866, 1351580]
33837A351580K05502k8460m34746l22125m558j63494m71817k52754J66488J27193
33827A72809l9256K70252O03069K39651l65333l36608O0313J2922k90603j31269
33817A95947K75935K24097o2403J20679N04179K79616l49582m67385m6325J20178
33807G94936j03354j18727J30901J14380j12752N5601N46317O11456J48287j15334
33797A951711J01021K37938R512p2577L70171R10079R26811L44242m60760j031146
33787C287002j023314m63518J48337L37017J65412n7670l03461o23464p54512
33778G11829m76356q8219K5105J2929J75317K98454L8452l28388k67930J13071
33768B14264K54123O3002o3016j0196k5876r3410O4267L47798L02347j40491m89647
$$ y = [1351580, 1557082, 1528622, 1093876, 771751, 767193, 603699, 131882, -120872, 45616, 172809, 133553, 403805, 1006874, 1246525, 881192, 544584, 604897, 617819, 327216, 195947, 471882, 695979, 633576, 754255, 1258434, 1538050, 1188468, 721083, 674758, 794936, 691582, 572855, 703756, 818136, 705384, 760985, 1307302, 1918758, 2067045, 1951711, 2052732, 2290670, 2300182, 2227605, 2597776, 3507855, 4434666, 4778908, 4318148, 3287002, 2263688, 1800170, 1948507, 2285524, 2450936, 2393266, 2089805, 1466341, 711829, 235473, 147254, 172359, 185288, 360605, 659059, 697511, 369123, 101193, 214264, 468387, 531389, 468373, 458177, 432301, 338891, 403158, 750956, 1053303, 912812, 423165]
33757D23165l74282K3949K91431K15586j07228l52585k38563J02722K31428M2667
33747B58290n7772J45616K76009K5760k81384k58370r8320j11772j00028J90921
33737a1050M32702K15233j90568k70615j27623j78324k98920m8282M64476O84812
33727F71841M56608J15101j04528j58771O3821M70746N23878m6446o01067m31374
33717I59809Q5084O2075m24442m74782J16714N59567L91252Q5669Q0630J18619
33707A560195o8962k16172j08569o0671l28865n60397l12418K39772N51568M39383
33697A134864K08020J71079L01052L32969J03814k38720m25349m46022n07647
33688F34060n53417k28898M30940P47450K80354m31924n77525j96221M6334l2359
$$ y = [423165, 48883, 72832, 364263, 579849, 472621, 120036, -118527, -15805, 215623, 258290, 200518, 346134, 622143, 647903, 366519, 108149, 9829, -101943, -201971, -11050, 421652, 636885, 446317, 175702, 48079, -130245, -429165, -477447, -12971, 671841, 1128449, 1243550, 1139022, 980251, 1044072, 1514818, 2038696, 1992250, 1391183, 959809, 1044893, 1106968, 682526, 207744, 324458, 884025, 1275277, 1360946, 1441576, 1560195, 1491233, 1275061, 1166492, 1105821, 776956, 216559, -95859, 143913, 695481, 1134864, 1342884, 1513963, 1815015, 2147984, 2251798, 2013078, 1587729, 1141707, 634060, 80643, -148255, 282685, 1030135, 1310489, 878565, 301040, 104819, 151153, 118794]
33678A18794R479L38480N33386K83469j69010m33096l95306j53100J24532K28943
33668D86571R4126p9190j06846o7947l1533J55563M58404M16475j75833p07647
33658D42143m92550K06632N62006L69590J47369J95072K82986K24976R4149j00847
33648A931526l45568l16903J98268O82395M15342m03716q13739m21068J73077
33639A099614L89984L66548L86594L03557p3434m84957n18031j64228J82790J80693
33629A669130j10716k89028q4562K21203J31105k66447l25300J35672M74281K66996
33619A822334m560J23079K34508j24036m60108j65068K93576J30800l19819j79856
33609A350850L47296K98511k85612l51793L55577Q44339M84113j53363l96552
$$ y = [118794, 128273, 466753, 1000139, 1283608, 1114598, 681502, 286196, 133096, 257628, 486571, 580697, 501507, 394661, 326714, 295181, 450744, 909148, 1325623, 1149790, 442143, -50407, 156225, 718231, 1087821, 1235190, 1430262, 1713248, 1938224, 2032373, 1931526, 1585958, 1269055, 1467323, 2149718, 2565060, 2161344, 1347605, 926537, 1099614, 1489598, 1856146, 2242740, 2546297, 2472863, 1987906, 1469875, 1305647, 1488437, 1669130, 1558414, 1269386, 1184824, 1406027, 1537132, 1270685, 945385, 1081057, 1555338, 1822334, 1817774, 1940853, 2175361, 2051325, 1591217, 1426149, 1719725, 1850525, 1530706, 1350850, 1698146, 1996657, 1711045, 1359252, 1714829, 2559168, 3043281, 2889918, 2493366]
33600B493366l34579k14729M9294L88643M29426J51244j8073N6607Q9618M4339
33590C135156J62434L21336J82616n5039Q2895M16250L72502O3444R0186L98052
33580E169832M07183J62735K20139N17704N43878M45583P11335R99262O73799
33571I851450K20599N76812J364535J511259J278641J716549K456050K310204
33563B1286099J791802K460210L923841M393041M195618N445314Q025346R682550
33555F1203821J0648026J3897900J9964953K6515087L4242436M6049405N6404970
33548B68926598M9447352J6637617k7334072n5789790n7079915m2916365l0191643
33541A21699782k3601443j8808909j3810514j0339056q488636o513943m530267
$$ y = [2493366, 2158787, 1944058, 1993352, 2381995, 2811421, 2962665, 2944592, 3001199, 3090817, 3135156, 3297590, 3618926, 3801542, 3746503, 3829398, 4245648, 4618150, 4681594, 4771780, 5169832, 5577015, 5739750, 5959889, 6477593, 7021471, 7467054, 8178389, 9177651, 9851450, 10072049, 10648861, 12013396, 13524655, 14803296, 16519845, 18975895, 21286099, 23077901, 25538111, 29461952, 33854993, 38050611, 43495925, 51521271, 61203821, 71851847, 85749747, 105714700, 132229787, 166472223, 212521628, 268926598, 318373950, 335011567, 307677495, 251887705, 194807790, 151891425, 121699782, 98098339, 79289430, 65478916, 55139860, 46651224, 40137281, 35607014]
33534C5607014l949375m214738l571164k226969j772832k190696k110892j435443
33526A4134905j241651j520143j271338n60016m13796q57529r24919n15371m85079
33517F345063r04383q70184j81461K71081J8218l51622l33677j93624k27326k51777
33507C320308j27683p0595k13511m05956n33894n71633l78016P5552M14390L01221
33497A810183j8797j21685r5041k49318m18571k21814J83150K97971R4252l9731
33487A220599l3452j32086k57645r5109J96502R5851l53738m36303J70372Q19647
33477A194638P46803O6311m75679m80609k29238j18607j32111j1557K36670K88506
33467A085127P285k67255j73594J20214J70484n0172j44509M8612K48512K41723
$$ y = [35607014, 31657639, 27442901, 23871737, 21644768, 19871936, 17681240, 15570348, 14134905, 12893254, 11373111, 10101773, 9541757, 9127961, 8270432, 7345513, 6830142, 6345063, 5440680, 4570496, 4389035, 4660116, 4678334, 4326712, 3993035, 3799411, 3572085, 3320308, 3192625, 3122030, 2908519, 2502563, 1968669, 1397036, 1019020, 1094572, 1508962, 1810183, 1791386, 1669701, 1574660, 1325342, 906771, 684957, 868107, 1166078, 1260330, 1220599, 1187147, 1055061, 797416, 702307, 898809, 994660, 640922, 204619, 374991, 1194638, 1941441, 2007752, 1532073, 1051464, 822226, 703619, 571508, 559951, 796621, 1085127, 1092412, 825157, 651563, 771777, 942261, 892089, 747580, 796192, 1044704, 1286427]
33457A286427J38157L5078j06607j58938Q7984M20202L44437r8510k85106j850
33447A661274J96689l4203k11266J01108M50545K02011m02581o00032k05555K83766
33437A441756M51133K66011j53614n68364o11317k23685J17959L2539j84228n5975
33427E12215L08278M46381K47470r2923n08931q83715p61346O1804Q87845Q26681
33417A043759N9761l71838n4455L04109M6846m92082o00613k14226J53807K26078
33407A01146K26778L62343M11122M2998n78616q25804l90137K22618L28923J6454
33397h2175n6071K64633M18546J16400k00642j88751j58440l43038l20203K03843
33387c45898O55548M03032j88459l31200n6377q304k72764l24327k9340J61856
$$ y = [1286427, 1424584, 1459662, 1353055, 1194117, 1282101, 1702303, 2046740, 1948230, 1663124, 1661274, 1857963, 1823760, 1612494, 1713602, 2164147, 2366158, 1963577, 1363545, 1157990, 1441756, 1892889, 2158900, 2005286, 1436922, 825605, 601920, 719879, 752418, 568190, 512215, 820493, 1266874, 1514344, 1421421, 912490, 28775, -732571, -670767, 217078, 1043759, 1103520, 731682, 677227, 981336, 1028182, 536100, -64513, -278739, -124932, 101146, 327924, 690267, 1101389, 1144387, 565771, -260033, -650170, -427552, -98629, -82175, -138246, 126387, 544933, 661333, 460691, 271940, 113500, -229538, -549741, -345898, 309650, 712682, 524223, 193023, 136646, 128342, -144422, -468749, -498089, -336233]
33377c36233L2169j37156j42852n2251J46676M54922N20039P4757l97222k09237
33367d6388L95264N12750k9447m75679m19228k89640l35914j41294M17580O73828
33357B61832K30679k82498j92920J57902Q8042k53475k21681J88026L78474J50690
33347E05071r7824j29041j37507k15584j54784O0768P3614k75885n67907l17217
33337a256296L19533O68532L61765k01516l39227Q5343N27171M81789J13109l4759
33327G25444K02534M32761K65107k34787o95024q12242n23505k4700L08576K14625
33317a41211j54639l77956k51891K4504J72834J52186R9236J17998J93917K14957
33307D9935Q4683q8723k0670L45507N91733K84254l78977p27447m54966L2606
$$ y = [-336233, -304064, -441220, -584072, -636323, -489647, -34725, 485314, 560071, 162849, -46388, 348876, 861626, 832179, 356500, -62728, -352368, -688282, -829576, -411996, 261832, 492511, 210013, 17093, 174995, 263037, 9562, -212119, -24093, 354381, 505071, 407247, 278206, 140699, -74885, -229669, -168901, -95287, -371172, -939079, -1256296, -936763, -268231, 93534, -107982, -447209, -361866, 165305, 647094, 760203, 725444, 927978, 1360739, 1625846, 1391059, 696035, -116207, -639712, -664412, -355836, -141211, -295850, -673806, -925697, -901193, -728359, -576173, -476937, -358939, -165022, 49935, 134618, 45895, 25225, 370732, 962465, 1246719, 867742, 140295, -314671, -282065]
33297b82065J94312j7520k40547j80707J42950M81649N77593L93498J46014K4661
33287A239838m8737k21123l77909k69665P5668L35379K93657M4141j91151k43770
33277F36328n5527K31933L23914J30299n1267L0929J47066n5408m22503m83245
33267D32519j92847K29j56207m15587m78153l30153p2949K09770L58110K61898
33257c83370J09512J70201L47494L19071O8644j39119k43953l72604m04272j01120
33247f29516L50102N00310L38650K35164K09710m3187l82373k87918J53285J91271
33237F35498l70053p52725m16391J20645J92469l3020r3114p1300k05852k33487
33227a227330J28832M95243L48037p8948j60111J47121L47104K12952m7138k39433
$$ y = [-282065, -87753, -105273, -345820, -526527, -383577, 98072, 675665, 1069163, 1215177, 1239838, 1191101, 969978, 592069, 322404, 398072, 733451, 1027108, 1071249, 880098, 636328, 580801, 812734, 1136648, 1266947, 1215680, 1246609, 1393675, 1338267, 915764, 432519, 239672, 239901, 83694, -331893, -810046, -1140199, -1213148, -1003378, -645268, -383370, -273858, -103657, 243837, 562908, 631552, 492433, 248480, -124124, -528396, -629516, -279414, 220896, 559546, 794710, 1004420, 961233, 578860, 290942, 444227, 635498, 265445, -487280, -903671, -783026, -590557, -623577, -716691, -787991, -993843, -1227330, -1098498, -603255, -255218, -334166, -494277, -347156, -52, 212900, 165762, -73671]
33217g3671k74171k8006L84356M70366Q488m61240l51360Q3410J93182l3326r5764
33206a77736P9078R7826r3661j20363Q7174J56276m0950j70908l5403J34028J13597
33195B8958j3266j04588j48045j35038m7191L1626M4302R9602K27497K09341l5186
33184A58012j88847n8472R987k55393m38672j02463L31307K06555j77778l543
33174e19307O03817O65218l3661n36358k13885L55809M27776J01126j98299m26723
33164B25513n73739l43223K37134N35905K22414j51354l5298K69472K60350J10457
33154G57631J75553J91963k04151o16947m50528J1979L5391k87231j94207L59231
33144b21316N26345l3098n55768l74824J05604J81421n5780n4530J97791K26656
$$ y = [-73671, -347842, -375848, 8508, 478874, 487362, 26122, -325238, -241828, -48646, -81972, -177736, -98658, -832, -94493, -214856, -127682, 28594, -12356, -183264, -218667, -84639, 28958, 15692, -88896, -236941, -371979, -419170, -387544, -343242, -243640, -16143, 193198, 158012, -30835, -89307, -79320, -334713, -773385, -875848, -544541, -337986, -515764, -519307, 84510, 749728, 716067, 179709, -34176, 321633, 749409, 850535, 652236, 225513, -348226, -691449, -454315, 81590, 304004, 152650, 117352, 386824, 647174, 757631, 933184, 1125147, 920996, 304049, -146479, -134500, -99109, -386340, -580547, -221316, 305029, 271931, -283837, -658661, -553057, -371636, -427416, -481946, -284155, -57499]
33134e7499n9246k09304K5070L15708K86752L2186j21524j07481j06016j80737
33124a82091k03154j17413l6163k0220K4673J26025J21298o4104j83914K1712
33114e13351L71566L97862l0368n16048o34115l73307J2189L37770N21677M94432
33104F8307K72595Q470j67693k51284k43469j09701M7994P616k20514k87862J6261
33093h59280L85188L82476O1804j35876k9260J23216J06277M1586O7708N0415
33083A94254j45660l20279j87930J26173J79492j43380l89566j38954L73573N42826
33073I0549K15656j27986q4444J30765P6032k32613l61265r0782L02260M25464
33063C43636K10842q7493k06070j34638r8965k38142l26073l7606M53897N13993
$$ y = [-57499, -116745, -326049, -300979, 14729, 301481, 333667, 212143, 104662, -1354, -182091, -385245, -502658, -538821, -559041, -534368, -408343, -287045, -351149, -535063, -513351, -141785, 256077, 225709, -290339, -924454, -1297761, -1285572, -947802, -426125, 68307, 340902, 349372, 181679, -69605, -313074, -422775, -374781, -367165, -587679, -875541, -859280, -474092, -91616, -29812, -165688, -194948, -71732, 34545, 76131, 143839, 194254, 48594, -271685, -459615, -333442, -153950, -297330, -686896, -825850, -452277, 90549, 306205, 178219, 93775, 224540, 300572, 67959, -293306, -384088, -81828, 343636, 554478, 466985, 260915, 126277, 27312, -210830, -536903, -574509, -120612, 393381]
33053C93381o8816o23483m61433J19330K90112o0037k62377j9694J83127Q734
33043e01156j51971R4246M63603M98931K47181k2676l07048n82056m92668Q1174
33033f72440N30181K55164l69109m68222O3925M99199M21700J91041J57918J27644
33023G37001j21149l55919k89624n6302N7534N4019P9238P9799p6757k91201l27875
33012e11236j50877M4409R7207L4394j1693N4008K00467K87291K16855O0844m5901
33001B75768r3388j43980j50648l3390R0349R984k13345k66932n9051J24167R3463
32990c67003Q5046L38699N93225M05743j10479l13105Q5748N34373L25907m43785
32980A134369r72631p81859k68634o1530j46403q421M84514Q12124N42348m8638
$$ y = [393381, 324565, -298918, -760351, -641021, -350909, -410946, -673323, -693017, -509890, -501156, -653127, -558881, -95278, 403653, 650834, 628158, 321110, -260946, -753614, -672440, -142259, 112905, -256204, -724426, -660501, -161302, 260398, 451439, 609357, 737001, 615852, 259933, -29691, -85993, -28459, 25560, 104798, 184597, 107840, -183361, -511236, -662113, -617704, -520497, -486103, -497796, -443788, -243321, 43970, 260825, 321669, 275768, 182380, 38400, -112248, -145638, -55289, -45305, -258650, -525582, -584633, -460466, -367003, -281957, 56742, 649967, 1055710, 945231, 632126, 717874, 1252247, 1578154, 1134369, 161738, -620121, -888755, -950285, -1096688, -1105109, -620595, 191529, 733877, 685239]
32970F85239l77697l08636j53898r3214j1205J16844J12929j5336L7816L70706
32960C63548N72106K59764k83285m26421r2691J11054j98198n68722l67376K37432
32950c92789M70326Q3506k86250j11427K19826O5861l95265m34013M0431L24174
32940d15620N8245k34117q5294J37248n5017l37866r2875M87328O38516K44422
32930C44970j9915J66415L00519P109k79084n8843L63285L41517j29668m81616
32920E54689m25776j95328k1047J16083J91254O1803k03661l00388j30345N1854
32910c00862P8370J24664L15750L91974R9777k94752k89715J18000L87891J91192
32900H22289j60705k20414k4893O7607m9176j55094j11595j0989Q1572K26416
$$ y = [685239, 307542, -1094, -154992, -248206, -259411, -142567, -29638, -44974, -7158, 363548, 935654, 1195418, 912133, 485712, 393021, 504075, 305877, -262845, -630221, -392789, 77537, 161043, -125207, -236634, -16808, 49053, -346212, -780225, -739794, -415620, -357375, -591492, -676786, -539538, -594555, -932421, -1025296, -537968, 100548, 344970, 325055, 491470, 791989, 799098, 520014, 461171, 824456, 1165973, 1036305, 554689, 128913, -66415, -87462, 28621, 219875, 281678, 78017, -222371, -352716, -300862, -222492, -97828, 217922, 609896, 709673, 414921, 125206, 243206, 631097, 822289, 661584, 441170, 416277, 483884, 434708, 279614, 168019, 157030, 238602, 465018]
32890D65018L83374L61807J14545j39340k11033j65900j29434p8659J1482J4448
32880F26308j38032k42686o8481K64703L89892J67675j31354j55433J26571L89088
32870A228251K91079j33683m61192l43035O9426L35698K86103R3318j49033m80911
32860G36021o64835k90331M56265P10103P7527o39263m84608K81443O03447J73677
32850I59446k83150k25629M1770P9919m5941j10813j13026k9316K80692O43911
32840A197863N59828o5219o30526o09326j81996J89698L60213L45366O5898l30171
32830I01628l47951J55483N54611K79295l03026m34674j05121M2581k19199m38008
32820H5619k87533N896J57481K05797K38204J79037L0588k9673N3348J14884P5392
$$ y = [465018, 848392, 1210199, 1324744, 1185404, 974371, 808471, 679037, 600378, 611860, 626308, 488276, 245590, 177109, 441812, 831704, 999379, 868025, 712592, 839163, 1228251, 1519330, 1385647, 924455, 581420, 650846, 986544, 1272647, 1365965, 1216932, 736021, 71186, -219145, 237120, 947223, 1024750, 385487, -99121, 182322, 785769, 959446, 676296, 450667, 492437, 572356, 526415, 415602, 302576, 273260, 553952, 1197863, 1757691, 1692472, 1061946, 452620, 270624, 460322, 820535, 1165901, 1231799, 901628, 553677, 709160, 1263771, 1543066, 1240040, 805366, 700245, 742826, 523627, 85619, -201914, -196018, -38537, 167260, 405464, 584501, 615089, 585416, 638764, 753648, 829040]
32809H29040M8012N4994n0731k68578l54219j81378N3074J19976L8243m0742k4950
32798B22741J16015L23202L68445N4985m30443o34486l96026j2447K38564M02956
32788B53506N20216L76676j00742n07146m17556j0165J74181Q612j02906R8522
32778B93198L47699L03154M5145j09087o9348J0442N1030J11831J79195J49746
32768A313005M9941L6194J09081O4144j47494k48430l7393K39234K08473p6143
32758A510612k47735k14573k30251l63562l47223r2421Q0438l2011j48691J6860
32748f8557K49418J93696m7924j15417P950N2788j1260J8547J14495L8618j73729
32737B58625k10631j4746J16923M5160k1928L4563L2233j25969k32373j34710
$$ y = [829040, 877052, 932046, 881315, 612737, 258518, 77140, 130214, 250190, 288433, 247691, 222741, 338756, 661958, 1030403, 1085388, 654945, 20459, -375567, -388014, -149450, 253506, 773722, 1150398, 1049656, 542510, 124954, 114789, 288970, 297582, 194676, 293198, 640897, 944051, 989196, 880109, 810761, 821203, 872233, 984064, 1163259, 1313005, 1362946, 1399140, 1508221, 1572365, 1424871, 1176441, 1139048, 1378282, 1586755, 1510612, 1262877, 1048304, 818053, 454491, 107268, 14847, 95285, 63274, -85417, -68557, 180861, 374557, 326633, 211216, 219166, 271954, 260694, 279241, 393736, 432354, 258625, 47994, 33248, 150171, 195331, 173403, 207966, 240199, 114230, -118143, -252853]
32727b52853J6939P1085J08542J89397J74873l344j85837k69570l34078l22541
32717h07387N238N49962P23614K03152n06439o92393l48459j8820M3710N3953
32707g93869J50611J88124P5430q6291k18175k79804j23533K88809N81825L34733
32697A17860k22774l62789J59307P13112O03679p6983o60882o96222k74324K29877
32687d70139M88627M06391J63028J1480k8836j33718l06677l16590j15139r483
32677c11056j85063l23469l4757M88515O38488K04450l24430l74021L5751L78696
32667A93104K59138j86755m93748l74785K102K19916N5972l15497n33482l83052
32657a557087P0497N54872P57276N49679J39573r9436l2738R7579K6318j73884
$$ y = [-252853, -235914, -164829, -56287, 133110, 307983, 304639, 118802, -150768, -484846, -807387, -802149, -252187, 471427, 674579, 168140, -524253, -872712, -891532, -847822, -793869, -643258, -455134, -379704, -465995, -684170, -963974, -1087507, -798698, -216873, 117860, -104914, -467703, -308396, 404716, 1008395, 931412, 270530, -425692, -700016, -470139, 18488, 424879, 587907, 599387, 570551, 436833, 130156, -186434, -301573, -311056, -496119, -819588, -854345, -365830, 272658, 477108, 152678, -221343, -185592, 193104, 452242, 265487, -228261, -603046, -600944, -381028, -325056, -640553, -1174035, -1557087, -1486590, -931718, -174442, 375237, 514810, 415374, 382636, 480215, 506533, 332649]
32647C32649k29490n6407J71784K85188K53186Q5662j93052m39741m46137j76344
32637d12702J67624L68182L69204K04134r3477m15381n46396l51986M0645L43539
32627c26614L74455J83915k9891q7440K8920J47939Q5499j21021k50358k08438
32617b03034j49292j81140j33802J63465N05544N22024K33798N2577J49004J85439
32607A144583j13271m57196m10762q9188O954k32232l94716k48820r7605k17638
32597a109891l59729j56562K66002M93759M58985M35426M82597L56748J8632k09379
32587F76588j49806n8715j78484l16681j79024R6506R9982k34011n02477l64306
32577a110428M7976L33970K94259J01638O1565K51389M14224K64270j14338l25378
$$ y = [332649, 103159, 46752, 218536, 503724, 756910, 842572, 649520, 209779, -236358, -412702, -245078, 123104, 492308, 696442, 602965, 187584, -358812, -710798, -670153, -326614, 47841, 231756, 201865, 114425, 143345, 291284, 376783, 255762, 5404, -203034, -352326, -533466, -667268, -503803, 1741, 523765, 757563, 810140, 959144, 1144583, 1031312, 574116, 163354, 74166, 81120, -151112, -545828, -794648, -892253, -1109891, -1469620, -1626182, -1360180, -866421, -407436, 27990, 510587, 867335, 885967, 676588, 526782, 468067, 289583, -27098, -206122, -109616, -9634, -243645, -746122, -1110428, -1062452, -728482, -434223, -332585, -271020, -19631, 394593, 658863, 544525, 219147]
32567B19147j81714K7026m7069l06944l84220j92782J3423R6645J91856L41452
32557b23180L24541L3540k52363k12379P9527L08140L73011M23667N07357M65543
32547A827404K18395p4655k28352k44015k08724j16117P0615K47117K23084k6929
32537A687823k84329l23133j53522M5869J73791K63288L19815K66526J01107m4846
32527B052389r8475j57903k84906l33354j81000j6187j28027m42273n41364j97642
32517c28742L40586O64651O08979K72637j57752m97843o25521n44917l15873L8604
32507e45191L98461M43198J4810m70614m17478R0909L32662L120l35689j72124
32497f57936J70329J62937l1901M0292K23888M1181l44428l11367J24839K71912
$$ y = [219147, 37433, 64459, 17390, -289554, -673774, -866556, -853133, -756488, -564632, -223180, 101361, 134901, -117462, -329841, -250314, 57826, 430837, 854504, 1361861, 1827404, 2045799, 1971144, 1742792, 1498777, 1290053, 1173936, 1244551, 1491668, 1714752, 1687823, 1403494, 1080361, 926839, 972708, 1146499, 1409787, 1729602, 1996128, 2097235, 2052389, 1953914, 1796011, 1511105, 1177751, 996751, 980564, 852537, 410264, -131100, -328742, 11844, 676495, 1285474, 1558111, 1400359, 902516, 276995, -267922, -583795, -545191, -146730, 296468, 311278, -159336, -576814, -485905, -153243, -150123, -485812, -657936, -487607, -324670, -356571, -316279, -92391, -51210, -395638, -707005, -582166, -310254]
32487c10254p1361k69573M6558L41710Q7485l79973m69232k39448q6705J5966
32477a334827K88814M90256K23089k66302l07648J80958N41760L41248p8133k10078
32467a30863q3999o5189k63449m42542l78657r3132K14045L38316K10997o2431
32457g56904k92395l23020r5702K79585N05726L51456l599j21487P7538J72235
32447b06567o7274k32446P5949N01937M17705n8182k12575J31656L61480Q6352
32437G98035l00361l69428l17766m37348m73360r6843L70995L63056j2792j13111
32427e88923K32514M78991K32869j86872k81700m4626J85671K34985J54473j7143
32417D00239k38239l22058j05553K53501L77498R9421l61099o61285o30865l06756
$$ y = [-310254, -381615, -651188, -604630, -262920, -175435, -555408, -1024640, -1264088, -1350793, -1334827, -1046013, -555757, -332668, -598970, -906618, -725660, -183900, 157348, 79215, -130863, -214862, -280051, -543500, -986042, -1364699, -1457831, -1243786, -905470, -694473, -756904, -1049299, -1372319, -1468021, -1188436, -682710, -331254, -334853, -456340, -378802, -206567, -273841, -506287, -430338, 71599, 489304, 431122, 218547, 350203, 711683, 798035, 497674, 128246, -189520, -626868, -1100228, -1197071, -826076, -463020, -475812, -588923, -356409, 122582, 355451, 168579, -113121, -157747, 27924, 262909, 417382, 400239, 162000, -160058, -265611, -12110, 365388, 464809, 103710, -557575, -1188440, -1495196]
32407a495196J43556M68857M65430J81905r2096j31765N561J34471J89577K01425
32397G1725J48519J6122p2878M734J30582N1968k54510n20076n11053k42811J32289
32386a045389M35557M60877J41666k23439k09575J62218L93350J87085j65993
32377A36357k72878j61030m5558Q4203K79692L20322J8788l53921l81563j05820
32367d81408R2462R1170R0288J80648K62694L04148K85156K8737m70833p32265
32357c49203l57425K26601K50750k40547m52597r0467K54975J46186q5040q0588
32347g77355m7424j66505j10109L12399O27985M03874l4349j76118j34353k50321
32337c52276l40727n7449L39429L14063n4413k16085l8467J07139L9935o7886
$$ y = [-1495196, -1351640, -882783, -417353, -235448, -327544, -459309, -453748, -319277, -129700, 71725, 220244, 236366, 163488, 168222, 298804, 350772, 96262, -423814, -934867, -1177678, -1045389, -609832, -148955, -7289, -230728, -440303, -278085, 115265, 302350, 136357, -136521, -297551, -343109, -258906, 20786, 341108, 359896, 5975, -375588, -481408, -388946, -297776, -207488, -26840, 235854, 540002, 825158, 853895, 383062, -349203, -706628, -480027, -229277, -469824, -922421, -1012888, -757913, -611727, -696767, -777355, -824779, -991284, -1101393, -788994, -161009, 242865, 208516, 32398, -101955, -352276, -693003, -750452, -411023, -96960, -151373, -367458, -405925, -298786, -258851, -326737]
32327c26737j38725k26412k03478L5468J94734j8137k78395q7835L27942L11586
32317d09989j34524l64673j87964q3074k15908j41529K71122M86651K36940K800
32307e40148J26092K02585j11558l88825j52654K75361L18837O0092n8359l6058
32297c04635j30062k03141L3162L56156L00594n9819k37198j19908k2542l0882
32287d18275Q5713L27806M11052K78442J47375M6913j67323l48633j88500J49531
32277C24101J36823k59843m43923j26579K09408J08687j41789l5048L39042M84743
32267E95622K35609j47706m26216n27422l83078k780L62161M38480K60037M7392
32257D52099j15755k32190j83971Q3943K89022J09150k82551l79481p3286J74882
$$ y = [-326737, -465462, -691874, -895352, -859884, -665150, -683287, -961682, -1049517, -721575, -409989, -544513, -909186, -1097150, -1180224, -1396132, -1537661, -1266539, -779888, -542948, -540148, -414056, -211471, -323029, -711854, -864508, -589147, -270310, -210218, -268577, -304635, -434697, -637838, -604676, -248520, 52074, -7745, -244943, -364851, -387393, -418275, -332562, -4756, 406296, 684738, 832113, 879026, 711703, 363070, 174570, 324101, 460924, 201081, -242842, -369421, -160013, -51326, -193115, -228163, 110879, 595622, 831231, 683525, 257309, -270113, -653191, -655971, -293810, 144670, 404707, 452099, 336344, 104154, -79817, 4126, 293148, 402298, 119747, -259734, -333020, -158138]
32247a58138J9906k74814k49706J18525M56952N00404L09959P8987p3450j49220
32237E79405k38094l96011m97501l30987P8991M15352M60165L46545K45726M9896
32227G13487l28633n63049k74433K91157M65085J02427k00857l5854K05936K6813
32217D02079l27227k71888J34664K65463p5815l59010j66321K09606K74005L3325
32207A18881j42372r7548L830J3773m1135p9112m6823O8222J83026J64102L4575
32196A79419K495J46696K33208M2299k56402l07168p6710J08827L8677j25971
32186a4630j44681l1598M3428M5654Q4318J65886J16222j62982m52585l92964
32176g43932N6008M73864M34728J8458l14998l15596j66507r2714l5640J25232
$$ y = [-158138, -138232, -413046, -662752, -544227, -87275, 413129, 723088, 802075, 728625, 579405, 341311, -54700, -552201, -883188, -804197, -388845, 71320, 417865, 663591, 713487, 384854, -178195, -452628, -161471, 303614, 406041, 205184, 169330, 375266, 402079, 74852, -197036, -62372, 203091, 127276, -231734, -398055, -188449, 85556, 118881, -23491, -121039, -117209, -103436, -144571, -223683, -270506, -202284, -19258, 144844, 179419, 181914, 328610, 561818, 604117, 347715, 40547, -36163, 72664, 111341, -14630, -159311, -190909, -147481, -101827, -17509, 148377, 264599, 101617, -350968, -743932, -687924, -214060, 220668, 239126, -75872, -391468, -557975, -650689, -686329, -561097]
32166e61097K67174J88684n6824k38384k79508k77211k41638p3651J81887L00819
32156g89749J82819J5320K8301J97180K88686J43074j56884l68516l14654n6062
32146h30485J62453J69553M0441l5901l666M4318N5834Q2663J34585J00550j00753
32135a80408l48551l85881q5886L63548N87913L91965k5276l03708l41060l23791
32125f51135l38156k09796J25287L57787K14246m7245M8101M28345M81885n3189
32115C56130o39268o56848k36537J3894r4109j68812O4699L68630M29494L16263
32105b46464K56235K18004K8780k33154k90074r3477P4924j1987k45974l58234
32095i01421k17398R8998L79796L92271R4330k27594k40597l0241r783k70896
$$ y = [-561097, -293923, -105239, -162063, -400447, -679955, -957166, -1198804, -1272455, -1090568, -789749, -606930, -591610, -563309, -366129, -77443, 65631, -91253, -459769, -774423, -830485, -668032, -498479, -458038, -493939, -497605, -453287, -397453, -314790, -180205, -79655, -180408, -528959, -914840, -1000726, -637178, -49265, 342700, 317424, 13716, -327344, -651135, -989291, -1199087, -1073800, -716013, -501767, -549012, -500911, -72566, 409319, 356130, -283138, -939986, -1176523, -1162629, -1256738, -1425550, -1360851, -992221, -562727, -246464, 9771, 227775, 256555, 23401, -266673, -360150, -285226, -297213, -543187, -901421, -1118819, -1019821, -640025, -247754, -153424, -381018, -621615, -651856, -661639, -932535]
32085i32535l86111r5152J92290L551l77262k78284K74607M87384o1583p86623
32075a959718q88625l42989K62097N47178N93398N59954M60002L07124K03917
32066b57662K22919L14950L45949K01605p3716k56311k02076q4782j49128k79665
32056b17917j67240R5704O1068l02573m18714J7198M81793L97769K3336k824L21171
32045B88771M49369K09557l5427r3032j52112k37530q9919K38003K47623k47208
32035E78095o93154n00868J39762N29197L63489J0619p6122P6002Q8584k04354
32025C11250m95892l90507N0442L57481K57458l2566j99768k09798j23166R8746
32015c76320L38202K58413j34962k71692J56301N51761K41325m03462m86652q413
$$ y = [-932535, -1318646, -1413798, -1221508, -1217957, -1595219, -1873503, -1598896, -1111512, -1173095, -1959718, -2848343, -3191332, -2929235, -2382057, -1788659, -1228705, -768703, -461579, -257662, -34743, 280207, 626156, 827761, 754045, 497734, 295658, 210876, 61748, -217917, -385157, -289453, -228385, -530958, -949672, -932474, -450681, -52912, -29576, -32400, 288771, 738140, 947697, 912270, 819238, 667126, 429596, 339677, 577680, 825303, 578095, -115059, -615927, -476165, 53032, 416521, 427140, 351018, 427020, 515604, 311250, -184642, -575149, -524707, -167226, 90232, 57666, -142102, -351900, -475066, -376320, -38118, 220295, 85333, -186359, -30058, 521703, 763028, 359566, -127086, -135499]
32005a35499J77051k06392m66475j72682J83517J28053n3479Q156R5682n0234
31995d92302j64641O554J82103J03322N3011K49949L02964q5197m29163k16672
31985d90072J58327N7369k51701p2976L94838K96455l90466o93328j51512M90590
31975f52476M57784P29j91270j0867J47222O7689j36730k84415k11224J47994
31965f65564N24238M53327j03516n68472m41698P4304M11669L50588J01902j10339
31955B6439k13380j57238N3151K29919J66763o2715j72708m2427J52835K16572
31945A97211J66207J16432P3559r978o0650L2003J47413r52l92347n42435j19894
31934c93431M59950M91780k1406l45054q7289K64486J59414j95520k78687r6492
$$ y = [-135499, 41552, -164840, -631315, -803997, -620480, -492427, -545906, -537750, -442068, -492302, -656943, -650389, -468286, -364964, -311953, -62004, 240960, 155763, -273400, -490072, -331745, -274376, -526077, -599053, -204215, 92240, -298226, -991554, -1143066, -652476, -194692, -193963, -385233, -396100, -248878, -181189, -317919, -602334, -813558, -665564, -141326, 312001, 208485, -359987, -801685, -727381, -315712, 34876, 136778, 26439, -186941, -344179, -291028, -61109, 105654, 42939, -129769, -172196, -19361, 197211, 363418, 479850, 553409, 543431, 482781, 514784, 662197, 661245, 268898, -273537, -393431, 66519, 558299, 536893, 191839, 104550, 369036, 528450, 332930, 54243, -42249]
31924d2249k9562j18248q3702R6023J82557J56886J84504J72412j14988n24782
31914a21149o16728l11319M1732K39486L64560L51104J457m58204m31546K07724
31904g32883Q21582Q08089K81496k68560n75643n99251l30910Q2954L13457K22015
31894B2346M1824J0058P4565J13739J49930J76073O4976j73197l12293k31459
31884f3438n3176J16604K64895K43280j15872n59372n61606p3685L48178L41730
31874a12462J59968Q6919P26j78551j78323R8182K64375R5575m2598J28385K41794
31863E63990m6353l67026k64909k7722j50398l92566k02743K32815K66255o7273
31853d55930j07017K66221M30124R8453k41571j90462O736N0454Q4220K65039
$$ y = [-42249, -71811, -190059, -273761, -177738, 4819, 161705, 346209, 518621, 403633, -121149, -737877, -1049196, -1007464, -767978, -403418, -52314, -50857, -509061, -940607, -732883, 88699, 896788, 1178284, 909724, 334081, -265170, -596080, -513126, -199669, 22346, 64170, 74228, 148793, 262532, 412462, 588535, 653511, 480314, 168021, -63438, -116614, -10, 264885, 508165, 392293, -167079, -728685, -802370, -454192, -112462, 47506, 134425, 135151, -43400, -221723, -123541, 140834, 236409, 193811, 322196, 563990, 517637, 150611, -114298, -142020, -292418, -684984, -887727, -654912, -388657, -455930, -562947, -296726, 133398, 231851, -9720, -200182, -193446, -142992, -58772, 206267]
31843B06267L74247K11881l1310r6592j8569N3391P5558l468k38045m45306l35987
31832b47933N225J67102M6749q230J62604K37733r160k88297k49520J4531K20787
31821E1591L25000M02557L85407K11579J5706p2817j27931k42892l49535l54101
31811B44564k44109j360L18109M15100N6014m19246l96834J06531M10402K15169
31801G04340K2415J95501L00935q6663n38100m16800P2259K23589o1484k39992
31791A76000n1393K00064K41153J30528k5453j79175k02530n4656K0262j36581
31781A18219k35805j8587J72246q9731m75759l36474J77440K92833r8803k62132
31771g56553J07481L72070Q0670k61376r6467K43986J59568k16740l27571j01918
$$ y = [206267, 580514, 792395, 761085, 664493, 645924, 699315, 774873, 771405, 533360, 88054, -247933, -242708, -75606, -28857, -37087, 125517, 363250, 354090, 65793, -183727, -169196, 51591, 376591, 779148, 1164555, 1376134, 1391840, 1319023, 1191092, 948200, 598665, 244564, 455, -905, 317204, 732304, 788318, 369072, -27762, 78769, 489171, 704340, 726755, 922256, 1223191, 1136528, 598428, 181628, 253887, 477476, 415992, 176000, 124607, 324671, 565824, 696352, 670899, 491724, 289194, 234538, 254800, 118219, -117586, -136173, 36073, -53658, -529417, -865891, -688451, -395618, -494421, -756553, -649072, -277002, -196332, -457708, -554175, -310189, -150621, -367361, -694932, -796850]
31761g96850J04530J79925K42794K00158o6629k57666j2140L98861L47773j96504
31751A44252n65755l23995J88375L84724J30715k32092k96841N4362N04361N31417
31741E19523O190n41996n43940j38820P9850n5907j56097O709J89938J96912J86477
31730b51161K76756K89111J11642q0357j86412l63214o05831n66864j04655L78911
31720a102074N04620M52258N28963N63606K40280k34970l69278j36489N3845N6109
31710E56870J03904K38181J77012j48141m11830l85802j95830J9653K76011M44207
31700F74235K56592j85484l63214o6613K54497J80579n3715l0586J28391K6229
31690H20911k70760l24075n8988J25433M513j80040j67848k4080R2443J69608
$$ y = [-796850, -692320, -512395, -269601, -69443, -136072, -393738, -405878, -7017, 340756, 144252, -421503, -745498, -557123, -172399, -41684, -273776, -570617, -516255, -11894, 519523, 525713, -16283, -560223, -699043, -619193, -675100, -831197, -824488, -634550, -437638, -251161, 25595, 314706, 426348, 345991, 159579, -203635, -809466, -1376330, -1480985, -1102074, -597454, -145196, 383767, 947373, 1187653, 952683, 583405, 446916, 500761, 556870, 660774, 898955, 1075967, 927826, 515996, 130194, -65636, -45983, 230028, 674235, 930827, 745343, 382129, 315516, 570013, 750592, 696877, 666291, 794682, 820911, 550151, 226076, 167088, 292521, 297034, 116994, -50854, -74934, 17509, 187117]
31680A87117J98726P5190j84456l48722k65060p7925o288n0308n9656K9296J62708
31669c39378K86551L69623L60367K16279l5682k96989m36989l69487j60933j2247
31659d18885k6813n9294N8562K16558J62585r9745k98927k77514j18227J19114
31649g42586M52002O93741N11713k6965l36560n6980L83419L42754j22490l86281
31639G11767j75785J44969K30105J81030J60641L3192l15190o22377n71184k76498
31629d99330j15052j74040j88125J3195K93956M65693M87963L62064P4610k49546
31619D71388l54116j55799J16485K23194K05767K29079K86035K57383J49434M9995
31609A478845o6533k50668l65835k47384m1213n9911k76803l21279p3715J18703
$$ y = [187117, 385843, 461033, 276577, -72145, -337205, -415130, -421418, -471726, -531382, -502086, -339378, -52827, 316796, 677163, 893442, 857760, 560771, 123782, -245705, -406638, -418885, -445698, -504992, -446430, -229872, -67287, -167032, -465959, -743473, -861700, -742586, -290584, 403157, 914870, 887905, 551345, 494365, 877784, 1220538, 1098048, 711767, 535982, 680951, 911056, 1092086, 1252727, 1285919, 970729, 348352, -222832, -499330, -614382, -788422, -976547, -963352, -669396, -203703, 284260, 646324, 720934, 471388, 117272, -38527, 77958, 301152, 506919, 735998, 1022033, 1279416, 1428850, 1478845, 1412312, 1161644, 795809, 548425, 507212, 447301, 170498, -150781, -224496, -105793]
31599a05793L229j91840k10320k18321l95855m30825J2966N44536M45811k02142
31589g48554n05832m8381M85147L44710j93281l20396R2112M10639K32509j32994
31579c84321k31354l3710K14760L59233L41801R9414k99037n47292l75482Q0378
31569g75610L61499K03906j37701j98334J09082L79240K46898j40679l56331k69238
31559e77268j26486j04651r3175J5745J26753J66588K33890L41384K69146p3543
31549A78383l50552j76865L06559N33510J85605m44370p80562n33138M7509M16116
31539f17805K84587o1968j39583P1634J33963j24151l03038p6293K67822K95801
31529b69031R6062K4566N8708p4207l07252l16805r3942Q3862J61178K54782K05539
$$ y = [-105793, -102564, -294404, -504724, -723045, -1118900, -1549725, -1536759, -992223, -546412, -748554, -1254386, -1302767, -817620, -472910, -666191, -986587, -894475, -483836, -251327, -384321, -615675, -649385, -434625, -75392, 266409, 365823, 66786, -480506, -855988, -775610, -414111, -210205, -347906, -546240, -437158, -57918, 188980, 48301, -308030, -577268, -703754, -808405, -901580, -885835, -759082, -592494, -358604, -17220, 251926, 178383, -172169, -349034, -42475, 491035, 676640, 232270, -548292, -1081430, -1033921, -617805, -333218, -395186, -534769, -463135, -329172, -453323, -756361, -832654, -564832, -269031, -172969, -148403, -89695, -163902, -471154, -787959, -881901, -798039, -636861, -382079, -176540]
31518a76540j88743n42463k22307N83979R07480L61207k80784k60594J09512J27735
31508D18482j50588j53661J83332L57362J16473k63188m74195m72908l06616m5752
31498g91259J36422J39138J23511K47859L52499K17016l8816j62162j95964l05183
31488b76939l55336j31104J59697J21835j47903j57421J84616M01297J76034k32078
31478b57302m35598l48198l9164M01407O93117M98937o1074m21904l07404o1059
31468c38242l1787p2640M0022J22904m4446k03809J6403M15567M21292p3226n31727
31457b79689m92186r9123J98074K18897J67549K91055N37159N76337K01238l30916
31447I88395n26413k64550N1737O5686q6045j06898m6748j36901k99441k22697
$$ y = [-176540, -365283, -907746, -1130053, -546074, 361406, 722613, 441829, 181235, 290747, 418482, 267894, 114233, 297565, 654927, 771400, 508212, 34017, -438891, -745507, -791259, -654837, -515699, -392188, -144329, 208170, 425186, 386370, 224208, 28244, -276939, -632275, -763379, -603682, -481847, -629750, -787171, -602555, -201258, -25224, -257302, -692900, -1041098, -1080262, -678855, 14262, 513199, 452125, 30221, -277183, -338242, -370029, -442669, -402647, -279743, -324189, -527998, -511595, -96028, 325264, 252038, -279689, -771875, -870998, -672924, -454027, -286478, 4577, 541736, 1118073, 1319311, 988395, 461982, 197432, 249169, 314855, 228810, 121912, 75164, -61737, -361178, -583875]
31437e83875J15842L62611K65392m0315k73198l06197j79705j3373M8742m0885
31427f44961j47675j12670L6945J61434K12540K10168J30997J6188M9730K74565
31417A87261L77092Q0507l66454m74894k06858M1597R1599J25552J79684N5480
31407I0566j55080n2365L36736M07704q3123m99978k42555L07506L68476o5339
31397D12548l07804n1460L09089L64678J17132k63543n70593m77914J10245O29334
31387B71712L87154m05136p81359l54837J80216J70428p0741M8297L72688L34400
31377A52822n3151k35123N01K98871L59364K41420L5600k71270n20264m18276
31367d09506l568K85704J78150q4246j32390M6827K00301J93086J03047K8404
$$ y = [-583875, -468033, -105422, 159970, 119655, -153543, -459740, -639445, -652818, -604076, -644961, -792636, -905306, -868361, -706927, -494387, -284219, -153222, -137034, -87304, 187261, 564353, 644860, 278406, -196488, -403346, -361749, -270150, -144598, 35086, 90566, -64514, -116879, 219857, 627561, 544438, 44460, -198095, 109411, 477887, 412548, 104744, 53284, 362373, 727051, 844183, 580640, 10047, -467867, -357622, 271712, 658866, 253730, -527629, -882466, -702250, -531822, -602563, -554266, -181578, 152822, 99671, -135452, -134951, 163920, 523284, 764704, 800304, 529034, 8770, -409506, -413074, -127370, 50780, -33466, -165856, -119029, 81272, 274358, 377405, 405809]
31357D05809l7317j51003l06369l83949k57562O585J56975P1485n0562K8289K31529
31346b86090L14788K43329J46435n932l28672o48407n90602j17458L54142M73907
31336d44560L01851N5316j54958k28746o8443J74980J78083p4297k30298j48290
31326f39362j10612k38122j89172J85918L92358L8793l86673j89341L67235L94554
31316c74424j97607m89100N4475P74812Q11410K64457j57296j95745j53314j94154
31306A43514j35171R1580K44880J46135o4469j61681j25211q7894j17035j50581
31296b15933j13672k9017K6470O3705J83437L60155L49461N039l92034l98189
31286a60578o913L15700K65538O0354K6359J30404J46935M6806m0109p9630j10007
$$ y = [405809, 368492, 217489, -88880, -472829, -730391, -723806, -566831, -495346, -545908, -517619, -286090, 28698, 272027, 418462, 412530, 83858, -564549, -1155151, -1272609, -918467, -444560, -142709, -87393, -242351, -471097, -539540, -364560, -186477, -260774, -491072, -639362, -749974, -988096, -1177268, -991350, -598992, -560199, -946872, -1136213, -768978, -374424, -572031, -1061131, -1006656, -231844, 579566, 844023, 686727, 490982, 337668, 143514, 8343, 99923, 344803, 490938, 426469, 264788, 139577, 51683, -65352, -215933, -329605, -358622, -332152, -268447, -85010, 275145, 624606, 629645, 237611, -160578, -167491, 148209, 413747, 474101, 500460, 630864, 777799, 824605, 784496, 704866, 594859]
31275E94859r9473l9030m7973j91984l27527l05181j79094n2576Q6646J95737
31265c65596R7000j79831k50077R4030M55882L48753p0284k46900n6595J26908
31255d6710J02940M0828J8595q3610j74094J8041L85408M53672J16300j66336
31245F65034j07005L732r8071j77210K707J91685R7015r3522q7716k6980j63853
31234B05816l13748j47146K00909L10602Q8178k41179n36433o90904m44524K16810
31224a351619P08209M95554q2120k77290n4664j1036k64017k69885J49255M40227
31214e17386K51863j9390K2992J54903P6588k6090O6823J26543o4567k37205j13772
31203b78698O8738J1714r6260j0806K3668k34470m01068m1906M66633M44638L7739
$$ y = [594859, 495386, 456356, 408383, 216399, -111128, -416309, -595403, -647979, -561333, -365596, -268596, -448427, -698504, -604474, -148592, 200161, 129877, -117023, -173618, -46710, 56230, 97058, 115653, 32043, -142051, -124010, 261398, 715070, 831370, 665034, 558029, 561761, 463690, 286480, 289187, 480872, 577887, 484365, 396649, 369669, 205816, -107932, -255078, -54169, 256433, 344611, 103432, -433001, -1123905, -1568429, -1351619, -643410, -147856, -229976, -507266, -561930, -572966, -836983, -1106868, -957613, -517386, -265523, -284913, -261921, -107018, -30430, -56520, 10303, 136846, 72279, -164926, -278698, -209960, -198246, -294506, -305312, -281644, -516114, -917182, -959088, -492455, -47817, -10078]
31192a0078k9878K79262K47225l00289n72493n3183O26400N86133q2192n55217
31182A35690l96053P9707L68280K90036J2668j64439r7348Q903j68707n71186
31172e02449p26567l51735K57007N99287N18369K18510m0695r5612P1224K60688
31162B08027K09195o4856k57934k11712r4461n3791o97J02319P2128j47073k77530
31151e16385j20032J09207J40071O5830P0829J9102k70887n44679l76692J57489
31141a266147N12619L99006J07902L4754J71590K08525k0307l12551l11750M6384
31131d29975L68898K65977p3427j07670K17802L36782k8345l70178k14863Q7537
31121E2538j1616k77270r8853L85180M33978q0966m62558k99854P008N8392M0967
$$ y = [-10078, -39956, 239306, 486531, 186242, -386251, -439434, 186966, 773099, 690907, 135690, -260363, -180656, 187624, 477660, 490328, 325889, 228541, 237444, 68737, -502449, -1229016, -1580751, -1323744, -724457, -206088, 12422, -28273, -123885, -52661, 208027, 417222, 352366, 94432, -117280, -211741, -265532, -266229, -163910, -91782, -238855, -516385, -636417, -527210, -387139, -321309, -250480, -231378, -502265, -1046944, -1423636, -1266147, -753528, -354522, -246620, -211866, -40276, 168249, 147942, -164609, -476359, -429975, -61077, 204900, 131473, 23803, 241605, 578387, 550042, 179864, -34999, 52538, 40922, -236348, -335201, 49979, 483957, 402991, -59567, -359421, -352413, -294021, -253054]
31110b53054J61922J68342j31177m12123l56098j64871j11532k9005K58047M07847
31100d61702O5147l99494k96101L58143Q08891N70549k9305l88896l17645n4175
31090a44588J15338J05968L6468N7578J41852J09116q9699k72192l08382l01081
31080e49622l29095k43397N1278L19186K75372r91j89273j34568Q5314L37569
31070c78227M61120L12255J6623n8452J59700K39089r5376m39214l25003l3105
31060a40590j44969n00845l73407L26546P97627M93622j53321m49952l11991p2153
31050e29433R4820J66412P1882j24114j33999J33702L47123K32047j4332q2037
31040A62071j1107K1178N8411J50739R4173k01469l72952j06995K64343K10642
$$ y = [-253054, -91132, 77210, -53967, -466090, -822188, -987059, -1098591, -1127596, -869549, -461702, -396555, -796049, -1092150, -734007, 74884, 645433, 616128, 227232, -90413, -144588, -29250, 76718, 113186, 170764, 312616, 421732, 332033, 59841, -248541, -549622, -878717, -1122114, -1070836, -751650, -476278, -477269, -666542, -801110, -715796, -378227, 82893, 395148, 411771, 353319, 513019, 752108, 656732, 217518, -107485, -140590, -285559, -786404, -1159811, -833265, -35638, 457984, 304663, -145289, -457280, -529433, -434613, -268201, -196319, -320433, -454432, -320730, 26393, 258440, 244108, 162071, 150964, 172142, 230553, 381292, 475465, 273996, -98956, -205951, 58392, 269034]
31030B69034j39435j96613J14527K43361n0437l04026j40575J18767J7336k87412
31020c55473l01557K6351K67728J67361o1793j16317L0384K14697L18532L15294
31010E05207K15675O9120m4700r7039j55077k97200m84045n46734l41458O9690
31000a106561M31466N34943M13754K43016R2653r7644l10486l86025k44708m6008
30990d75600Q55q6759j07464L8259K33388L23198K97973K57345K66908K93033
30980A041136K34458M255l51118n97353m88466p7586K53492K15450j4008l4370
30970A85890J92813K83611L9556j98026m9297K97655L56285Q4194r5517j4971
30960A082193n376k55029m07419j42629K20508J61416k44525m63674l09660r1640
$$ y = [269034, 129599, -67014, 47513, 290874, 240437, -63589, -204164, -85397, -68061, -355473, -657030, -630679, -362951, -195590, -257383, -373700, -343316, -128619, 189913, 505207, 720882, 790002, 745302, 648263, 493186, 195986, -288059, -834793, -1176251, -1106561, -675095, -140152, 273602, 516618, 609271, 511627, 201141, -184884, -429592, -475600, -474745, -561504, -668968, -630709, -397321, -74123, 223850, 481195, 748103, 1041136, 1275594, 1279849, 928731, 331378, -157088, -234674, 18818, 234268, 220260, 185890, 378703, 662314, 701870, 503844, 454547, 752202, 1108487, 1192681, 1097164, 1082193, 1076817, 821788, 414369, 271740, 492248, 653664, 409139, -54535, -364195, -455835]
30950d55835O316J39589L05264J91301k23430m09836j5880N12974M99200j4443
30940E35220l63762k10961Q6265Q6019j71155l42053k36073N7669L08088L08855
30930E8112N9627j80639j84839q5967j73995l74521k76385K14205O11391M74920
30920A41909K64l08876l11772k30285j74534p9406p196p2608q9193K41922P17405
$$ y = [-455835, -449519, -309930, -4666, 186635, -36795, -446631, -462511, 50463, 549663, 535220, 171458, -39503, 46762, 132781, -38374, -380427, -616500, -558831, -250743, 58112, 117739, -62900, -247739, -333706, -507701, -882222, -1158607, -944402, -333011, 141909, 142173, -166703, -478475, -708760, -883294, -962700, -969896, -1042504, -1131697, -889775, -172370]
$$ [...]
##END NTUPLES=NMR SPECTRUM
##END=
