##TITLE=31Pdec_PR189_rmK
 D2O, 24 sc
 2.3.2020
##JCAMPDX= 6.0         $$ Bruker NMR JCAMP-DX V2.0
##DATA TYPE= NMR SPECTRUM
##DATA CLASS= NTUPLES
##ORIGIN= UXNMR, Bruker Analytische Messtechnik GmbH
##OWNER= root
$$ XWIN-NMR		Version 3.5
$$ Mon Mar  2 14:43:14 2020 Russian Standard Time (UT+4h)  she@DPX200
##.OBSERVE FREQUENCY= 81.013821
##.OBSERVE NUCLEUS= ^31P
##.ACQUISITION MODE= SIMULTANEOUS
##.ACQUISITION SCHEME= undefined
##.AVERAGES= 24
##.DIGITISER RES= 17
##SPECTROMETER/DATA SYSTEM= spect
##.PULSE SEQUENCE= zgpg30
##.SOLVENT NAME= D2O
##.SHIFT REFERENCE= (INTERNAL, D2O, 0, 182.463)
##AUDIT TRAIL= $$ (NUMBER, WHEN, WHO, WHERE, WHAT)
$$ ##TITLE= Audit trail, XWIN-NMR		Version 3.5
$$ ##JCAMPDX= 5.01
$$ ##ORIGIN= Bruker BioSpin GmbH
$$ ##OWNER= she
$$ F:/spectra/data/she/nmr/P31/1/pdata/1/auditp.txt
$$ ##AUDIT TRAIL=  $$ (NUMBER, WHEN, WHO, WHERE, WHAT)
(   1,<2020-03-02 14:42:06.82 +0400>,<she>,<DPX200>,
      <created by zg, POWCHK disabled, PULCHK disabled
       configuration hash MD5:
       00 E9 B6 7A A2 85 ED C7 34 08 36 98 17 FE 4E 26
       data hash MD5: 32K
       51 56 C1 EA 99 BE 89 B7 93 BA 87 20 ED 0A A4 5E>)
(   2,<2020-03-02 14:42:09.07 +0400>,<she>,<DPX200>,
      <Start of raw data processing
       efp BC_mod = 2 LB = 1 FT_mod = 6 PKNL = 1 PHC0 = -1620.013 PHC1 = 690.4013 SI = 64K 
       data hash MD5: 64K
       6E 3C D6 49 6D 57 FB 76 28 58 1D AE 17 BD C5 0C>)
(   3,<2020-03-02 14:42:33.68 +0400>,<she>,<DPX200>,
      <pk PHC0 = 296.7285 PHC1 = -620.5997 
       data hash MD5: 64K
       24 43 3C DE 24 41 62 DE 37 11 C0 87 75 36 7B 9A>)
$$ ##END=
$$ 
$$ hash MD5
$$ 7E F1 2A 02 7C 2A 0F 9A 33 E7 45 C0 1C A6 1A A5
##$RELAX= 
##$RELAX= 
##$RELAX= 
##$RELAX= 
##$RELAX= 
##$RELAX= 
##$RELAX= 
##$RELAX= 
$$ Bruker specific parameters
$$ --------------------------
##$DU= <F:/spectra>
##$EXPNO= 1
##$NAME= <P31>
##$PROCNO= 1
##$TYPE= <nmr>
##$USER= <she>
##$AMP= (0..31)
100 100 100 100 100 100 100 100 100 100 100 100 100 100 100 100 100 100 
100 100 100 100 100 100 100 100 100 100 100 100 100 100 
##$AQSEQ= 0
##$AQ_mod= 1
##$AUNM= <au_zg>
##$AUTOPOS= <>
##$BF1= 81.014009
##$BF2= 200.13
##$BF3= 200.13
##$BF4= 200.13
##$BF5= 200.13
##$BF6= 200.13
##$BF7= 200.13
##$BF8= 200.13
##$BYTORDA= 1
##$CFDGTYP= 0
##$CFRGTYP= 5
##$CHEMSTR= <none>
##$CNST= (0..31)
1 1 145 1 1 1 1 1 1 1 1 1 1 1 1 1 1 1 1 1 1 1 1 1 1 1 1 1 1 1 1 1 
##$CPDPRG= <waltz16>
##$CPDPRG1= <>
##$CPDPRG2= <waltz16>
##$CPDPRG3= <>
##$CPDPRG4= <mlev>
##$CPDPRG5= <mlev>
##$CPDPRG6= <mlev>
##$CPDPRG7= <mlev>
##$CPDPRG8= <mlev>
##$CPDPRGB= <>
##$CPDPRGT= <>
##$D= (0..31)
0 1 0 0 0 0 0 0 0 0 0 0.03 2e-05 3e-06 0 0 0 0 0 0 0 0 0 0 0 0 0 0 0 0 
0 0 
##$DATE= 1583145726
##$DBL= (0..7)
120 120 120 11 120 120 24 19 
##$DBP= (0..7)
150 150 150 150 150 150 150 150 
##$DBP07= 0
##$DBPNAM0= <>
##$DBPNAM1= <>
##$DBPNAM2= <>
##$DBPNAM3= <>
##$DBPNAM4= <>
##$DBPNAM5= <>
##$DBPNAM6= <>
##$DBPNAM7= <>
##$DBPOAL= (0..7)
0.5 0.5 0.5 0.5 0.5 0.5 0.5 0.5 
##$DBPOFFS= (0..7)
0 0 0 0 0 0 0 0 
$$ [...]
##$SUBNAM2= <"">
##$SUBNAM3= <"">
##$SUBNAM4= <"">
##$SUBNAM5= <"">
##$SUBNAM6= <"">
##$SUBNAM7= <"">
##$SUBNAM8= <"">
##$SUBNAM9= <"">
##$SW= 369.568048894756
##$SWIBOX= (0..15)
0 1 3 0 0 0 0 0 0 0 0 0 0 0 0 0 
##$SW_h= 29940.119760479
##$TD= 32768
##$TD0= 1
##$TE= 0
##$TE2= 300
##$TE3= 300
##$TEG= 300
##$TL= (0..7)
0 120 53 12 22 120 120 120 
##$TP= (0..7)
150 150 150 150 150 150 150 150 
##$TP07= 0
##$TPNAME0= <>
##$TPNAME1= <>
##$TPNAME2= <>
##$TPNAME3= <>
##$TPNAME4= <>
##$TPNAME5= <>
##$TPNAME6= <>
##$TPNAME7= <>
##$TPOAL= (0..7)
0.5 0.5 0.5 0.5 0.5 0.5 0.5 0.5 
##$TPOFFS= (0..7)
0 0 0 0 0 0 0 0 
##$TUNHIN= 0
##$TUNHOUT= 0
##$TUNXOUT= 0
##$USERA1= <user>
##$USERA2= <user>
##$USERA3= <user>
##$USERA4= <user>
##$USERA5= <user>
##$V9= 5
##$VALIST= <valist>
##$VCLIST= <CCCCCCCCCCCCCCC>
##$VD= 0
##$VDLIST= <DDDDDDDDDDDDDDD>
##$VPLIST= <PPPPPPPPPPPPPPP>
##$VTLIST= <TTTTTTTTTTTTTTT>
##$WBST= 1024
##$WBSW= 4
##$XGAIN= (0..3)
0 0 0 0 
##$XL= 0
##$YL= 0
##$YMAX_a= 168069
##$YMIN_a= -216747
##$ZGOPTNS= <>
##$ZL1= 120
##$ZL2= 120
##$ZL3= 120
##$ZL4= 120
##$ABSF1= 0
##$ABSF2= 0
##$ABSG= 0
##$ABSL= 0
##$ALPHA= 0
##$AQORDER= 0
##$ASSFAC= 0
##$ASSFACI= 0
##$ASSFACX= 0
##$ASSWID= 0
##$AUNMP= <proc_1d>
##$AZFE= 0.1
##$AZFW= 0.5
##$BCFW= 0
##$BC_mod= 2
##$BYTORDP= 0
##$COROFFS= 0
##$CY= -3
##$DATMOD= 1
##$DC= 0
##$DFILT= <>
##$DTYPP= 0
##$F1P= 0
##$F2P= 0
##$FCOR= 1
##$FTSIZE= 65536
##$FT_mod= 6
##$GAMMA= 0
##$GB= 0
##$INTBC= 1
##$INTSCL= 5.30512e-09
##$ISEN= 30
##$LB= 1
##$LEV0= 0
##$LPBIN= 0
##$MAXI= 10000
##$MC2= 0
##$MEAN= 0
##$ME_mod= 0
##$MI= 50
##$NCOEF= 0
##$NC_proc= -3
##$NLEV= 6
##$NOISF1= 182.463
##$NOISF2= 159.3651
##$NSP= 0
##$NTH_PI= 0
##$NZP= 0
##$OFFSET= 182.463
##$PC= 4
##$PHC0= -1323.284
##$PHC1= 69.80164
##$PH_mod= 1
##$PKNL= yes
##$PPARMOD= 0
##$PSCAL= 0
##$PSIGN= 0
##$REVERSE= no
##$SF= 81.0140089999434
##$SI= 65536
##$SIGF1= 159.3651
##$SIGF2= -187.1042
##$SINO= 113.3802
##$SIOLD= 16384
##$SREGLST= <1H.CDCl3>
##$SSB= 0
##$STSI= 65536
##$STSR= 0
##$SW_p= 29940.119760479
##$SYMM= 0
##$S_DEV= 0
##$TDeff= 32768
##$TDoff= 0
##$TI= <>
##$TILT= no
##$TM1= 0
##$TM2= 0
##$TOPLEV= 0
##$USERP1= <user>
##$USERP2= <user>
##$USERP3= <user>
##$USERP4= <user>
##$USERP5= <user>
##$WDW= 1
##$XDIM= 65536
##$YMAX_p= 356034481
##$YMIN_p= -6961741
$$ End of Bruker specific parameters
$$ ---------------------------------
##NTUPLES= NMR SPECTRUM
##VAR_NAME=  FREQUENCY,     SPECTRUM/REAL,   SPECTRUM/IMAG
##SYMBOL=    X,             R,               I
##VAR_TYPE=  INDEPENDENT,   DEPENDENT,       DEPENDENT
##VAR_FORM=  AFFN,          ASDF,            ASDF
##VAR_DIM=   65536,         65536,           65536
##UNITS=     HZ,            ARBITRARY UNITS, ARBITRARY UNITS
##FACTOR=    0.456856943014862, 1,           1
##FIRST=     14782.0589164792, 0,            0
##LAST=      -15158.0608439998, 0,           0
##MIN=       -15158.0608439998, -6961741,    0
##MAX=       14782.0589164792, 356034481,    0
$$ Real data points
##PAGE= N=1
##DATA TABLE= (X++(R..R)), XYDATA
$$ [...]
39465 -522470 -699124 -571781 -241462 -81670 -200411 -303923 -166274 62573 132161 14883
39455 14883 -176626 -359354 -432378 -297975 -87761 -124258 -461029 -707451 -564623 -296573
39445 -296573 -328557 -565846 -543987 -180603 96815 31164 -117280 -84052 -42482 -227444
39435 -227444 -438691 -319091 46126 221928 65903 -109725 -66654 22321 -86246 -304565
39425 -304565 -371965 -251053 -137076 -139384 -155237 -70591 57388 71114 -100283 -363121 -546002
39414 -546002 -551248 -424176 -273335 -150803 -55353 -24269 -125767 -341194 -548651 -670107
39404 -670107 -756531 -877589 -1008040 -1085191 -1094940 -1018930 -780311 -365374 39789 164576
39394 164576 -70066 -456029 -685312 -599268 -290292 -19833 -6175 -227308 -452917 -510343
39384 -510343 -460064 -450853 -494120 -499123 -461044 -459874 -498966 -497179 -439783 -393906 -370712 -321933
39372 -321933 -282975 -346951 -456258 -406326 -148080 80151 50000 -162570 -325341 -380168
39362 -380168 -449279 -574323 -639708 -569477 -454410 -431102 -518035 -616308 -629394 -555499 -475924
39351 -475924 -451974 -440768 -359579 -235402 -203161 -315727 -454128 -499926 -500139 -557271 -642347
39340 -642347 -648645 -565329 -453829 -310733 -126665 -40463 -218722 -560796 -739652 -608311
39330 -608311 -368711 -241808 -182297 -81652 -52550 -251988 -528437 -538144 -214575 133885
39320 133885 245607 190080 136991 68084 -109164 -324636 -435473 -468534 -567021 -728523
39310 -728523 -791320 -690755 -553717 -497602 -485064 -435211 -353463 -291699 -287342 -384819 -592816
39299 -592816 -773077 -725281 -468195 -281132 -346298 -502150 -506882 -397435 -377576 -468077 -526630
39288 -526630 -552676 -685621 -893470 -949749 -792350 -644649 -661956 -689246 -528567 -258104
39278 -258104 -103634 -130757 -237873 -340912 -395272 -331405 -142895 30219 63767 33440
39268 33440 90147 219816 285608 252728 208416 199995 208070 239072 291085 279330 164118 93378
39256 93378 213985 388122 345520 117893 50358 317052 688703 897921 985803 1106474
39246 1106474 1198038 1095350 860101 755351 912222 1200753 1426793 1508336 1450147 1278582
39236 1278582 1045731 825705 679497 649081 750975 921766 1019289 962331 838209 785858
39226 785858 803066 776605 695091 705423 906079 1172690 1271512 1119631 868811 726520
39216 726520 737674 771214 698583 529932 353851 201674 42366 -112406 -186361 -136053
39206 -136053 -3157 141904 243118 248474 151616 58100 98853 242943 317483 263897 228678
39195 228678 307025 353994 211131 -1181 -23016 180798 412907 572622 755559 990689
39185 990689 1118012 1045013 936264 980167 1084304 986093 623716 233895 66132 118205
39175 118205 194460 145506 -4647 -128550 -134110 -31439 101976 196347 240866 290403 418092
39164 418092 617988 750251 656386 372560 148460 164255 289033 245333 -11297 -221342
39154 -221342 -152117 134552 403720 525586 548213 563171 585354 546621 374139 100755
39144 100755 -110111 -122043 -6330 35958 -58670 -159951 -188385 -242193 -374534 -410214 -171170
39133 -171170 204897 371927 186323 -145657 -327422 -242213 32364 334971 512572 511050
39123 511050 413217 326359 247483 121815 -6126 -28987 52875 138626 203225 311579 438611
39112 438611 447805 311679 197136 239455 357125 385245 283017 117337 -52523 -174319
39102 -174319 -186522 -109277 -67591 -126425 -191118 -169387 -129706 -180078 -291633 -380497 -462723
39091 -462723 -559678 -540872 -271414 127191 379399 412225 399972 441982 428221 296216 200432
39080 200432 286286 450146 478629 331163 144539 17975 -75735 -181252 -257508 -204638
39070 -204638 17844 285883 366100 170590 -71302 -47479 219008 374102 216200 -38437
39060 -38437 -107331 -46888 -88049 -234517 -313007 -335506 -483658 -723441 -764692 -513674 -277766
39049 -277766 -333121 -515859 -486706 -247493 -106778 -189009 -273986 -174418 -17828 -18781 -151116
39038 -151116 -223014 -177192 -133778 -167103 -201782 -141977 24504 265770 519541 640894 488742
39027 488742 144570 -90596 -36477 134375 137781 -46442 -208319 -240242 -221927 -197158 -103138
39016 -103138 33949 60581 -48743 -95058 60103 289106 421255 494405 591718 587175 320302
39005 320302 -50690 -157811 90747 374171 380222 167088 3816 4175 51698 6469 -133098
38994 -133098 -255968 -262034 -163148 -75285 -96248 -206370 -314887 -357538 -300008 -121811 107049
38983 107049 214123 134346 68417 242809 544231 627502 417726 248632 381887 615617
38973 615617 568236 203193 -152477 -245167 -140527 -37786 -18447 -33887 -28050 3071 33694
38962 33694 41566 18320 -38548 -119482 -169347 -100599 96225 287418 335692 281772 260760
38951 260760 247679 62439 -319651 -642463 -668030 -464956 -274926 -208187 -205363 -201838 -183567
38940 -183567 -148065 -138837 -254123 -503807 -730044 -786641 -714169 -619157 -493989 -317508 -217142
38929 -217142 -312526 -469930 -448096 -254855 -120023 -123939 -109777 1346 72104 19839 -10290
38918 -10290 113832 280815 309894 227171 205481 302516 393604 330771 88001 -211994 -372990
38907 -372990 -296340 -114443 -68683 -222638 -402351 -452977 -414185 -377832 -327049 -226490 -139287
38896 -139287 -121459 -104039 -13884 77417 59854 -37897 -111516 -148141 -189892 -194643 -85145
38885 -85145 100299 240481 277361 210305 12641 -289029 -510541 -475725 -265899 -115888
38875 -115888 -74048 17897 187435 227711 39398 -145729 -62042 212016 362358 243107
38865 243107 -5035 -195546 -284357 -316909 -333064 -363876 -427718 -491453 -494800 -427988 -330676
38854 -330676 -216171 -70046 65184 86466 -44485 -225246 -308351 -242315 -86639 75223
38844 75223 194437 258235 289731 341484 438893 520239 477732 285113 57322 -48237 18281
38833 18281 163241 246143 193372 42174 -90287 -99240 -4058 38279 -108453 -379524 -553696
38822 -553696 -501229 -314440 -151233 -40108 70003 143623 86352 -75636 -186727 -163950
38812 -163950 -87858 -48387 -23315 17131 4090 -118201 -262310 -309910 -293723 -327646 -397925
38801 -397925 -384687 -284387 -242273 -330577 -451370 -513954 -553616 -597515 -574486 -475031 -445133
38790 -445133 -557239 -622117 -441392 -156080 -91988 -287553 -443863 -380342 -271358 -321887
38780 -321887 -448963 -454732 -329623 -187878 -43726 133860 240347 134193 -124996 -334255
38770 -334255 -417994 -455194 -458601 -334433 -87557 117847 152289 31963 -184044 -442952
38760 -442952 -616951 -559797 -314913 -106653 -57010 -71776 -68590 -118231 -249793 -313942 -199949
38749 -199949 -30990 17538 -53662 -177397 -376831 -604122 -610260 -271190 86175 31261
38739 31261 -348816 -538261 -317907 -23812 17741 -60443 10240 168243 163854 -25265 -200403
38728 -200403 -250465 -214021 -120832 5373 56434 -34424 -134620 -84823 34529 33201 -52802
38717 -52802 -22167 116071 130656 -21485 -86795 53624 136897 -82779 -417196 -498117 -304783
38706 -304783 -146101 -178884 -238644 -177064 -101343 -161143 -282136 -269726 -92616 76051 85952
38695 85952 -14782 -55357 45990 188746 232032 199828 258183 461677 634951 602421 441332
38684 441332 363185 409123 440723 399565 361967 317805 132405 -179724 -365065 -266314 -62531
38673 -62531 11405 22004 173096 397378 407130 144195 -102581 -106509 1569 -23474 -172620
38662 -172620 -220711 -47403 221079 363503 269056 14442 -201636 -219422 -51706 159878
38652 159878 316145 420066 463043 370944 139348 -64144 -41024 220425 538980 722955
38642 722955 698536 502359 242968 67039 78140 252334 463164 595733 611707 521851
38632 521851 354920 167554 33630 -14115 -10455 3775 48343 162731 305261 365288 316255
38621 316255 285473 380707 496142 430704 198791 52992 136119 285711 302919 244604 268032
38610 268032 337613 332577 337371 518317 748732 700661 364118 134371 246024 434401 364444
38599 364444 119995 -1238 39039 66349 67768 176756 335365 300469 23492 -245535
38589 -245535 -310151 -270246 -318226 -460283 -554331 -521543 -415177 -318254 -234807 -88957 158548
38578 158548 401489 473568 368855 260669 240828 197812 72207 46991 269842 534656
38568 534656 518034 250085 52727 50232 66307 25034 106707 394547 673589 749539 721667
38557 721667 757499 810712 767259 698965 751560 897046 998833 1035208 1071860 1083739 992151
38546 992151 846169 801115 914784 1080401 1157624 1087801 906397 719328 636806 667125
38536 667125 715951 733941 786376 914618 1028566 1038459 1011840 1078227 1227573 1319075 1267578
38525 1267578 1132292 1037119 1062008 1180173 1257758 1168280 948445 771443 731287 751795
38515 751795 748367 739226 718300 583975 336488 198024 343254 613667 711368 607444 527756
38504 527756 563708 552368 390730 238510 290571 503847 679053 712274 643652 524340
38494 524340 365693 211977 156613 241229 386344 472646 477115 472575 481974 416408 235977
38483 235977 107499 259774 673239 1045248 1105335 857102 480755 135033 -88332 -163184
38473 -163184 -176470 -251997 -340414 -229005 131549 469874 517714 353142 241539 254722
38463 254722 260908 215863 232132 358837 469986 403283 122948 -229052 -388152 -179679
38453 -179679 233048 455606 339147 172302 233339 375201 317830 138555 106652 174317
38443 174317 59954 -210225 -284433 -49408 198341 238919 207146 257110 305391 273767 271513
38432 271513 358433 405929 356510 345898 413748 388073 224901 147161 246924 281648 111940
38421 111940 2447 174384 376290 276992 13945 -73436 -32471 -143799 -330248 -234652
38411 -234652 147595 403810 323448 151674 133237 194400 208553 230903 307819 342267 309847
38400 309847 359079 546884 703790 705140 654516 653396 614363 475493 390077 495821 660939
38389 660939 678901 597334 636403 849643 1063607 1131017 1087773 1056148 1097835 1172679 1198485
38378 1198485 1170506 1214853 1431550 1684028 1698309 1421235 1108528 968258 902829 745984
38368 745984 572283 559941 674170 726479 682859 681628 773154 863167 913872 985979 1052518
38357 1052518 979658 761198 595410 638610 816065 954005 977899 912006 804867 727424
38347 727424 729794 739343 634964 481609 509226 745166 870059 637688 268764 161043
38337 161043 320326 398115 257836 144459 218788 275184 107816 -130394 -186785 -110667
38327 -110667 -109480 -159922 -81520 92279 156619 125322 221999 424223 379918 -49482 -468356
38316 -468356 -429248 -36249 210152 52402 -308942 -574735 -650617 -586341 -461360 -402481
38306 -402481 -521238 -730260 -764000 -499228 -158266 -68521 -268819 -478152 -458907 -301967
38296 -301967 -283772 -493457 -708551 -676610 -437293 -267535 -336192 -529322 -634734 -585128
38286 -585128 -466648 -386707 -404981 -513722 -612028 -572086 -399640 -249786 -217209 -214084 -143915
38275 -143915 -70523 -76107 -68200 81751 280101 302839 122334 -59663 -103819 -54165 48232
38264 48232 242334 458453 467264 165945 -224818 -400542 -320464 -186195 -150677 -190515 -230541
38253 -230541 -253239 -262511 -235774 -163065 -94052 -98140 -171004 -210520 -127956 19199 72251 -21917
38241 -21917 -134550 -153227 -156645 -261281 -370188 -265185 51017 291171 223093 -62634
38231 -62634 -288872 -286352 -95093 125143 217396 131031 -46335 -196977 -295331 -350928 -294108
38220 -294108 -78316 133630 95875 -171402 -360628 -272607 -43205 106266 144391 138813
38210 138813 81884 -37312 -134084 -147338 -128164 -90212 66735 345312 544374 541050 497228
38199 497228 570647 602802 373734 25469 -102366 3617 14418 -217917 -438861 -376089
38189 -376089 -87790 179145 277789 212590 74360 9613 106224 246545 223093 45638
38179 45638 -42947 78148 224099 178358 -16933 -170231 -203720 -171750 -119558 -56980 -6415
38168 -6415 31254 106177 229724 306237 231138 24396 -178531 -236931 -104616 112784 213067
38157 213067 113571 -1747 106448 374278 470976 241685 -72946 -144130 87171 444613
38147 444613 724410 763978 505065 138197 -3167 142608 253594 116714 -7019 197687
38137 197687 526887 511175 146007 -81821 75268 309236 304620 195214 231050 322513
38127 322513 246209 90330 132175 359103 449208 248196 -3045 1570 254486 472089
38117 472089 401993 36573 -394333 -599573 -459148 -113943 202621 390742 479718 460595
38107 460595 272685 -27389 -228647 -181235 26823 177918 159335 36680 -55615 -31998
38097 -31998 109273 305635 473598 553697 523433 388584 193505 22461 -61880 -75455
38087 -75455 -54097 40786 262596 525098 637836 552206 449352 487329 571776 516236 346379
38076 346379 261787 320732 362226 284092 212994 291184 435834 461362 363412 317032 403671
38065 403671 488695 418519 235162 112371 124941 168925 120798 8617 -31643 53424 168639
38054 168639 224868 276503 410359 546637 498155 254837 61730 118431 312281 386221
38044 386221 301912 268200 415311 607655 636701 472123 241206 60428 -10733 73736
38034 73736 299155 514477 531414 336859 121257 50950 84161 73587 -10198 -53476 19625
38023 19625 143742 224432 274876 372395 517696 614021 587714 472069 353509 274256 217052
38012 217052 171963 191681 357092 665530 964170 1054792 900838 679909 575906 570492
38002 570492 524405 420351 392600 503280 624085 609013 488739 406292 420301 462662 465644
37991 465644 451098 481531 559216 596000 507584 356752 346002 580708 879230 954299 779629
37980 779629 611298 613421 662885 619894 574162 635044 658484 451399 155242 131355 462458
37969 462458 834814 972014 944552 945968 977635 922732 794105 724068 760747 820102 829139
37958 829139 811522 823593 881269 975561 1116531 1317132 1526019 1619863 1531686 1383863 1390375
37947 1390375 1582936 1752615 1749823 1707297 1817134 2014110 2095289 2065591 2103603 2226735
37937 2226735 2290170 2332678 2586287 3036015 3301016 3155129 2891790 2914179 3169487 3274068
37927 3274068 3059375 2707915 2433207 2294186 2273846 2285998 2136505 1730459 1308700 1227378
37917 1227378 1482984 1698684 1621915 1389740 1228428 1145869 1067096 1059429 1213028 1417797
37907 1417797 1462912 1311855 1117677 988563 886014 766611 691635 729713 822331 827987
37897 827987 692038 508654 381773 271432 53764 -277422 -579199 -777800 -1007227 -1423135
37887 -1423135 -1958395 -2404201 -2693833 -2955702 -3294087 -3666870 -3990952 -4218027 -4283500 -4148115
37877 -4148115 -3945936 -3920408 -4121618 -4326362 -4370013 -4380631 -4505420 -4566075 -4261984 -3663547
37867 -3663547 -3209791 -3159877 -3300244 -3314735 -3221393 -3243709 -3398666 -3465225 -3325020 -3102332
37857 -3102332 -2926988 -2752175 -2499674 -2244345 -2136151 -2218810 -2416634 -2624784 -2724898 -2602911
37847 -2602911 -2280866 -1973347 -1876787 -1938000 -1963684 -1915693 -1923937 -2015241 -2034552 -1898869 -1751000
37836 -1751000 -1753850 -1864693 -1929086 -1901085 -1861131 -1885318 -1979805 -2078582 -2055033 -1834241 -1544310
37825 -1544310 -1424166 -1511908 -1583351 -1494869 -1392744 -1427500 -1469980 -1353692 -1225403 -1335274
37815 -1335274 -1573486 -1573808 -1278168 -1045254 -1111023 -1256610 -1167604 -874134 -649698 -656214 -868927
37804 -868927 -1208099 -1562089 -1773934 -1762510 -1600237 -1377370 -1092030 -778786 -610931 -704855
37794 -704855 -908342 -964526 -843921 -740195 -752887 -759369 -648316 -524409 -571469 -784529
37784 -784529 -949133 -887684 -654326 -453630 -410021 -474875 -544723 -583463 -591498 -539085 -411954
37773 -411954 -270540 -180940 -134357 -115969 -181291 -345584 -471427 -428480 -310613 -296900 -326178
37762 -326178 -150174 260916 621569 738048 780341 991620 1305209 1434286 1235199 828874
37752 828874 441228 241088 253162 327337 274613 109159 45646 183113 338067 298650
37742 298650 96164 -105549 -245211 -339724 -363631 -322785 -332742 -455429 -562745 -522849 -408322
37731 -408322 -353758 -333795 -270569 -231587 -303675 -388025 -358703 -320080 -446393 -652110 -704080
37720 -704080 -601208 -544784 -564555 -492267 -321055 -272658 -436447 -619428 -643648 -551832 -441035
37709 -441035 -330958 -280044 -394607 -619816 -732671 -638012 -477540 -380317 -324553 -306909
37699 -306909 -391768 -502893 -437707 -208641 -97542 -233178 -401408 -437852 -493891 -689790
37689 -689790 -825639 -738904 -658440 -833918 -1053948 -958683 -656657 -557926 -685663 -660143
37679 -660143 -381835 -218613 -371443 -516104 -332891 -32050 -24555 -301873 -483801 -376536
37669 -376536 -182277 -166417 -346918 -556461 -661074 -653932 -608296 -594999 -643130 -763129 -957201
37658 -957201 -1153934 -1190845 -983370 -688733 -549680 -568708 -517626 -311632 -156892 -210543
37648 -210543 -308777 -234668 -94363 -164297 -439853 -612074 -504401 -289820 -216092 -326327
37638 -326327 -535968 -786469 -991398 -997599 -774514 -536304 -500801 -596987 -587699 -434125 -337934
37627 -337934 -418030 -549856 -589548 -576047 -596592 -595344 -470854 -280730 -185915 -215669 -229800
37616 -229800 -125845 28754 98424 28769 -133772 -305471 -422978 -485691 -550947 -644350
37606 -644350 -688064 -585788 -372533 -196844 -142277 -148337 -128740 -79809 -31109 27313 102335
37595 102335 139686 79609 -56068 -183969 -245138 -231141 -149862 -17036 116258 165656 76024
37584 76024 -103076 -223064 -172338 -26746 -287 -196927 -477375 -638582 -641179 -555670 -386287
37573 -386287 -130206 51899 -35455 -308840 -459432 -381621 -308594 -414628 -530661 -436601
37563 -436601 -223322 -124756 -143186 -108235 -16309 -34821 -195650 -341233 -394115 -450333 -554080
37552 -554080 -582673 -441436 -225219 -105771 -163344 -370315 -622918 -749318 -619268 -319150
37542 -319150 -118257 -188331 -425745 -595495 -572293 -395874 -175815 -13907 30006 -35375
37532 -35375 -141049 -205695 -174879 -50909 79523 102695 29487 27978 211434 458645 567564
37521 567564 525769 475102 462057 417718 362516 405774 517589 535312 465923 545700 874630
37510 874630 1204566 1263917 1129392 1086811 1246251 1488822 1705264 1889939 2047275 2187708
37500 2187708 2399110 2769228 3247560 3715358 4170285 4699135 5276634 5745874 6032579
37491 6032579 6254911 6567811 6982579 7384621 7667654 7817183 7908567 8043783 8250717 8431869
37481 8431869 8443239 8230257 7873492 7523399 7308152 7257349 7268789 7187278 6964843 6710384
37471 6710384 6547108 6482798 6474056 6538291 6707194 6932173 7154195 7430224 7860630 8395360
37461 8395360 8832049 9024148 8993193 8821956 8538260 8132154 7594891 6903841 6051198 5130311
37451 5130311 4321827 3745226 3371338 3102006 2864253 2596189 2236612 1810488 1460256
37442 1460256 1288606 1194330 971560 589885 279513 273524 518040 718118 661768 426888
37432 426888 253293 278141 436665 566249 549326 395076 247837 284393 532383 818979
37422 818979 971635 1021603 1102945 1205988 1201318 1099588 1082806 1220733 1357057 1382603 1428095
37411 1428095 1625192 1839902 1851854 1692541 1588014 1627232 1701874 1747330 1831147 1987764
37401 1987764 2147331 2257816 2324386 2306656 2128905 1823508 1528162 1314608 1147662 1024837
37391 1024837 1011205 1111392 1246584 1380110 1526465 1631751 1619022 1573108 1682376 1946118
37381 1946118 2148067 2197568 2268218 2464793 2577937 2377796 1987673 1727587 1682546 1660035
37371 1660035 1529397 1376929 1315041 1330001 1366650 1418508 1467190 1426462 1216308 865382
37361 865382 520124 357343 449677 680873 834221 803046 667446 538949 419561 275274
37351 275274 152507 123902 185814 299130 463058 657939 792599 814972 803587 839633
37341 839633 864546 786788 651427 563242 512675 429243 336362 283533 196684 37 -166488
37330 -166488 -90937 161007 293303 208165 128519 212822 304034 207052 3988 -88561 -22879
37319 -22879 97619 215847 317408 318059 137788 -152728 -399083 -533959 -565176 -465907 -228060
37308 -228060 22675 127557 98463 77277 96966 30866 -195841 -476495 -654196 -685822
37298 -685822 -629209 -546985 -472693 -417237 -367707 -309780 -261314 -248213 -254159 -242540 -214605 -185562
37286 -185562 -121190 19804 184456 257415 205438 99574 -20213 -188203 -373099 -417177
37276 -417177 -221794 82580 276280 325399 388339 546710 667129 597521 401842 288676
37266 288676 337790 404716 317553 88731 -114926 -159815 -49033 120662 234360 211874
37256 211874 69464 -61741 -59553 20771 -13149 -229550 -436943 -403804 -158869 43077
37246 43077 35915 -98539 -197684 -217050 -201774 -163050 -83281 4807 39492 18217 -3484 10630
37234 10630 62781 167099 331000 484427 511112 390845 251641 229229 312509 378205 347753
37223 347753 249405 139555 33590 -64237 -113991 -66118 75505 237202 323835 290517 181776
37212 181776 89885 53343 18989 -54677 -92081 9378 184653 219768 24505 -225318 -315158
37201 -315158 -261319 -219841 -216714 -163520 -99595 -171449 -323184 -260228 134946 560312 673192
37190 673192 553682 531739 647379 596624 235311 -165131 -289906 -174380 -52277 9255
37180 9255 101873 206691 177631 -5918 -168520 -176747 -112422 -145005 -325522 -559464 -704625
37169 -704625 -650345 -383030 -36415 190790 240112 269149 453887 756618 964393 925254
37159 925254 668389 324474 33411 -78349 36247 244608 303468 117858 -126717 -173264
37149 -173264 10419 229178 314147 271545 188390 108159 39062 -2377 -16172 -41127 -110511
37138 -110511 -217379 -342517 -473570 -581861 -631377 -624891 -587431 -505064 -362498 -243537
37128 -243537 -273533 -427206 -531663 -524661 -547280 -665614 -685201 -451416 -188974 -249830 -575852
37117 -575852 -732902 -519459 -228304 -185201 -321652 -404591 -439419 -564406 -703517 -640204
37107 -640204 -387376 -200074 -207506 -279742 -306435 -376784 -581776 -817905 -915985 -849924 -711100
37096 -711100 -572017 -477194 -484690 -601218 -720391 -720659 -600329 -451160 -337918 -273913 -275944
37085 -275944 -356949 -474669 -559059 -591512 -601620 -586619 -490739 -282137 -17007 189574 246810
37074 246810 149693 -21664 -166423 -242239 -281485 -330869 -393079 -431062 -406543 -311596 -192437
37063 -192437 -140820 -210220 -323996 -326482 -164768 34527 126340 137788 213930 385473 482417
37052 482417 322637 -56059 -401341 -488252 -339258 -189230 -227943 -401120 -500713 -432048
37042 -432048 -316110 -303306 -364893 -338648 -138689 151482 370419 399771 222747 -57680
37032 -57680 -265401 -292632 -206026 -159355 -212509 -307839 -409857 -558631 -754545 -892852 -879771
37021 -879771 -747643 -592940 -457495 -336754 -252756 -237362 -271034 -311154 -357870 -417804 -425063
37010 -425063 -293814 -59387 120535 136524 28386 -114920 -272113 -440267 -540961 -485445
37000 -485445 -316665 -180440 -137763 -104398 -21599 13193 -116695 -339486 -447697 -350692
36990 -350692 -160426 -12422 74255 110000 39469 -155763 -346260 -378655 -267848 -145640
36980 -145640 -60135 29718 83287 -18809 -264009 -465484 -504659 -474112 -493092 -526665 -509333
36969 -509333 -508884 -595665 -650744 -512425 -268287 -179819 -299105 -370084 -187321 115373 240614
36958 240614 69643 -277413 -621362 -839162 -863955 -706138 -477278 -311939 -254986 -259984
36948 -259984 -273050 -276032 -278346 -314637 -424168 -588583 -716566 -727936 -621970 -437755 -211453
36937 -211453 -23091 -1779 -177062 -370659 -361059 -151085 42705 75528 25156 18786 40778
36926 40778 11642 -35067 1992 91732 58337 -182629 -477690 -609863 -561615 -498020 -502578
36915 -502578 -457998 -251446 1406 60128 -137594 -392282 -477574 -362782 -174976 -40998
36905 -40998 -23638 -124153 -264247 -326855 -297221 -310112 -470597 -682081 -760631 -682631 -592100
36894 -592100 -571579 -546086 -453818 -389970 -493498 -746123 -956999 -940407 -690608 -398174
36884 -398174 -285707 -391280 -529570 -510011 -354756 -226842 -193478 -189962 -196386 -275927 -393560
36873 -393560 -372545 -144522 87046 76085 -151203 -349479 -375485 -321086 -342150 -479276
36863 -479276 -664698 -813965 -881284 -878234 -853323 -825759 -758283 -628647 -486089 -380799 -279466
36852 -279466 -125561 44787 128370 90059 10505 4052 126680 331319 470811 402698 158001
36841 158001 -55597 -97201 -61542 -99264 -165907 -120682 -4584 10848 -50555 51068 386616
36830 386616 684259 684704 485999 357487 354182 322375 194887 57936 -41505 -143819 -224408
36819 -224408 -185263 -36665 84022 126538 189118 288278 251365 -12208 -276449 -239828 67581
36808 67581 327570 364356 308544 293609 229119 14187 -217674 -278152 -231417 -282663 -410612
36797 -410612 -370332 -88604 194460 273084 245191 292527 378205 348816 203710 63601 -38759
36786 -38759 -145182 -224121 -232645 -264037 -419658 -571719 -484305 -171585 88629 123415 32256
36775 32256 -46604 -112617 -184913 -225593 -261415 -378969 -522872 -517174 -372338 -323684 -445596
36764 -445596 -496640 -320938 -131257 -159194 -278168 -265546 -218296 -362239 -615154 -718134
36754 -718134 -689032 -746777 -850808 -744557 -457517 -317695 -384835 -317679 24193 265395
36744 265395 66498 -350269 -544704 -472134 -417530 -499896 -586676 -597328 -570680 -481053 -278445
36733 -278445 -92603 -126858 -337337 -461443 -390387 -279375 -246198 -204854 -95717 -60426
36723 -60426 -231232 -496960 -644104 -634758 -589646 -566043 -523179 -485765 -562287 -746533 -841049
36712 -841049 -686927 -393805 -217590 -237109 -287321 -236064 -184627 -301493 -565522 -808901
36702 -808901 -948477 -1019813 -1018135 -886840 -676923 -536696 -494317 -424880 -299840 -273516 -401147
36691 -401147 -462937 -258722 59549 165280 -17147 -274736 -432666 -496209 -495376 -422722 -347338
36680 -347338 -374575 -442997 -360937 -111044 76424 44371 -85305 -144401 -172248 -268636 -346450
36669 -346450 -252506 -55273 19178 -72034 -127032 -22642 95585 53869 -66866 -49944 119643
36658 119643 210812 64611 -183009 -284772 -202121 -116925 -150947 -220854 -220370 -209294 -293990
36647 -293990 -397515 -319636 -34914 221726 234746 65468 -56695 -24172 70143 106443
36637 106443 84397 85079 158222 274778 355851 333218 206638 52940 -37462 -39177 175
36626 175 22885 15919 7861 31713 97061 188487 282192 361607 417812 443372 438658 426175 446436
36613 446436 526533 646548 739681 740579 649078 538259 479696 470212 458197 419923 355595 232529
36601 232529 34319 -116520 -17440 344169 687960 738908 555350 407913 388228 339168
36591 339168 180121 76636 181973 380311 440500 328523 216690 229519 313506 347610
36581 347610 279533 146967 33480 6035 54744 110118 140894 177894 206973 133384 -62936
36570 -62936 -227705 -213872 -98187 -71688 -163395 -247764 -304980 -457328 -697512 -798383 -622070
36559 -622070 -353278 -261911 -353419 -435860 -448289 -510228 -665811 -788275 -782288 -713972 -676714
36548 -676714 -670527 -689039 -792089 -988426 -1149353 -1151224 -1030954 -903365 -802374 -710063 -658133
36537 -658133 -660439 -606879 -385370 -79975 115215 171115 248102 441271 680563 916842
36527 916842 1216926 1599967 1959116 2247570 2572500 2976466 3290975 3379153 3393341 3594995
36517 3594995 4004906 4423441 4727711 4946437 5087795 5114038 5090927 5163582 5348974 5508077
36507 5508077 5542989 5477043 5346267 5185528 5122181 5275265 5519398 5556269 5298347 4991679
36497 4991679 4865761 4850634 4765595 4615755 4537880 4568405 4619480 4609648 4503266 4300429 4085472
36486 4085472 3991185 4016583 3981780 3763974 3466992 3250364 3118621 3012242 2973959 3052327
36476 3052327 3145344 3127072 3053273 3058180 3113820 3082924 2960463 2866870 2832661 2781672 2705749
36465 2705749 2659951 2594990 2401303 2136830 2010449 2096665 2243204 2299049 2255896 2127345
36455 2127345 1895809 1664042 1661672 1961961 2323266 2436894 2236109 1875177 1531176 1339686
36445 1339686 1399385 1676200 1958533 2043205 1939867 1798038 1682142 1532236 1319522 1123259
36435 1123259 1038647 1082947 1203611 1324288 1377787 1342707 1262928 1205918 1194831 1194945 1166992
36424 1166992 1123054 1118649 1176710 1231655 1196483 1093744 1047565 1111350 1198543 1252445 1360831
36413 1360831 1563504 1661333 1436035 1013454 764775 833635 1003848 1082753 1151743 1324492
36403 1324492 1509022 1582411 1589546 1570514 1386323 960748 541115 436631 586559 666179
36393 666179 565252 469689 482501 476981 391945 384700 555859 747295 773256 684526 648894
36382 648894 707435 800109 909742 1020404 1038728 930484 851294 951932 1110347 1065959
36372 1065959 805073 593864 593484 660156 618979 535038 559462 662925 718646 749744 873159
36361 873159 1040848 1070455 951863 893315 985892 1036028 864534 590670 441847 422110
36351 422110 380420 310043 335032 430670 410363 236578 130371 280518 602183 875092
36341 875092 989611 968942 870893 772661 765570 869361 1003213 1085645 1090207 988949 772306
36330 772306 570080 594541 865564 1128320 1158678 1028033 941457 936649 901114 797857 706213
36319 706213 684866 728946 817113 887665 835703 657324 523359 577604 737203 829292 833082
36308 833082 824683 784205 666345 583441 675381 836090 823079 634638 522439 609417 760410
36297 760410 880857 1059626 1308296 1431475 1320655 1147326 1079294 1014641 818059 641753
36287 641753 740148 1065467 1314048 1335340 1252457 1182882 1080236 912454 800337 867683
36277 867683 1060293 1203312 1183999 1032645 869892 798678 809340 791681 682283 569524
36267 569524 577631 675379 706140 604827 467445 383064 324611 270120 312430 529625 809927
36256 809927 936777 844102 685222 633421 700392 780435 795145 743682 667088 619606 634853
36245 634853 669756 628651 505555 448891 589812 842083 988439 948811 828728 706991
36235 706991 556748 429550 511477 851513 1195104 1277802 1169580 1117166 1138836 1043247
36225 1043247 828813 768573 1010451 1335326 1454871 1369673 1271407 1228982 1161068 1050213
36215 1050213 998484 1063100 1166168 1206770 1191783 1210560 1296064 1344382 1214819 929766 714654
36204 714654 768300 1039613 1315651 1463417 1457417 1256489 879400 575356 632536 944562
36194 944562 1050877 756428 442054 530982 875233 980634 704198 386063 323588 444913
36184 444913 563301 671328 843562 1036819 1147521 1174708 1200792 1246276 1223697 1039631
36174 1039631 728611 480203 479687 681979 820539 722807 534620 509897 655066 750932
36164 750932 685192 567334 507167 476723 444009 463976 547556 585922 511888 430278 483974
36153 483974 665290 844204 916814 854287 676580 460678 323020 318310 392049 484005 620784
36142 620784 836896 1057422 1155088 1116124 1069648 1127819 1241801 1253183 1081655 829618
36132 829618 674843 678303 751709 810857 868083 932052 927313 815198 704149 701218 721665
36121 721665 616877 452492 453342 652344 799845 695597 436077 237972 173473 196645
36111 196645 293441 457877 604112 636055 560182 447648 349392 311909 376642 481878 478903
36100 478903 344720 251071 297782 324425 167975 -28789 -12571 164299 216792 102289
36090 102289 102987 349019 559045 437092 99902 -119407 -135665 -126171 -176244 -192441 -169959
36079 -169959 -276448 -567398 -815296 -776489 -525437 -385989 -582491 -1063905 -1623351 -2077954
36069 -2077954 -2358653 -2542801 -2808914 -3267803 -3826462 -4295489 -4622973 -4919000 -5248489
36060 -5248489 -5537083 -5725753 -5875169 -6027700 -6096155 -6017049 -5908188 -5913452 -5959089 -5841228
36050 -5841228 -5530021 -5213763 -5034973 -4943021 -4831281 -4668073 -4455368 -4202208 -3982586 -3879043
36040 -3879043 -3826052 -3665335 -3414419 -3301426 -3427173 -3559458 -3410644 -2991104 -2533330 -2180760
36030 -2180760 -1927550 -1774494 -1738688 -1738425 -1650047 -1481213 -1347353 -1288693 -1250424 -1228921 -1283558
36019 -1283558 -1393385 -1442343 -1368323 -1212628 -1024397 -842057 -753533 -814494 -902781 -832258
36009 -832258 -637808 -552848 -648764 -712971 -596455 -469538 -554357 -775873 -902775 -915404
35999 -915404 -977582 -1097070 -1084805 -880689 -680399 -652523 -721162 -741856 -738821 -828701 -1010145
35988 -1010145 -1164549 -1207533 -1135186 -978612 -811841 -741673 -778103 -770850 -596362 -357015
35978 -357015 -256613 -323106 -420329 -504378 -659518 -860881 -935928 -851323 -817320 -965430 -1123354
35967 -1123354 -1094148 -972002 -940952 -919494 -713567 -428498 -370035 -535251 -569423 -321475
35957 -321475 -93957 -165164 -368856 -394673 -261902 -195496 -194619 -52924 249753 469116 422433
35946 422433 174020 -115203 -333195 -408257 -342672 -273816 -336167 -453059 -432131 -268898
35936 -268898 -162086 -200278 -239300 -158797 -45270 -16509 -35404 -28399 -46758 -155701 -261771
35925 -261771 -214270 -34294 99631 85497 3212 -28585 -14780 -59959 -213534 -376918 -389886
35914 -389886 -216023 -5531 63416 -34444 -204251 -383322 -551119 -629352 -531591 -333477
35904 -333477 -241170 -328399 -431441 -380945 -226196 -137765 -174366 -239637 -210288 -35554 229271
35893 229271 426636 406460 204651 48286 109265 305454 410775 311631 97576 -50930
35883 -50930 -15591 167483 332664 353234 284934 253493 227268 78188 -113665 -63338 282516
35872 282516 543038 356668 -122756 -431071 -386726 -214052 -135403 -126433 -96846 -59838 -43723
35861 -43723 -18891 16443 22072 28483 116808 251712 288494 189802 84881 68539 92774 103758
35849 103758 123975 138564 67298 -72498 -137027 -74066 -2183 21920 122916 351865 501544
35838 501544 380602 131729 47737 166385 287599 328882 392167 475650 402792 140491
35828 140491 -38229 121143 494032 707430 578908 292005 147554 247774 448699 553860
35818 553860 506785 408560 381696 437266 472285 379493 157935 -64686 -123800 29355 264158
35807 264158 407448 440254 479140 558892 568238 467657 421786 569078 768596 767662 565979
35796 565979 406373 417856 487399 516010 571441 693300 755636 669184 556722 561811 615234
35785 615234 575721 498207 546907 690639 708578 520066 319245 316437 482982 629630 645816
35774 645816 588681 585314 694506 844972 909573 863460 823074 870881 913619 830049 700455
35763 700455 721845 904689 1036165 982448 853196 794427 780699 716857 609726 518143 439893
35752 439893 367220 362676 465535 608807 734866 889224 1075172 1138014 975126 769400
35742 769400 792361 1010357 1116175 970967 791947 822697 1003036 1090401 987753 818727
35732 818727 732794 741493 741910 650285 501024 404216 397780 397753 341719 296317 323595 338054 264260
35719 264260 262122 558630 1055759 1356684 1248410 929580 671005 497709 357378 357317 585105
35708 585105 850065 874842 675878 519111 541054 640272 726369 840296 983127 1025606
35698 1025606 879082 630639 434035 354570 371376 454049 588090 771590 1006779 1261525
35688 1261525 1457551 1543732 1542796 1469175 1271298 954991 694474 678096 874651 1088792
35678 1088792 1218495 1309132 1381718 1392406 1372675 1418592 1493411 1424625 1176883 958154 940784
35667 940784 1015315 959233 757348 611105 665721 841320 940998 875239 774728 871654 1227626
35656 1227626 1607812 1713729 1520265 1263402 1112544 1024435 943660 944594 1076143 1234965
35646 1234965 1321927 1393983 1535682 1699432 1799760 1851280 1884206 1843541 1717884 1648571
35636 1648571 1744565 1903229 2001369 2145642 2492100 2896851 3034098 2869275 2750996 2972137
35626 2972137 3459732 3970317 4381737 4690760 4909236 5096720 5366024 5741038 6113938
35617 6113938 6428299 6780077 7237648 7686494 7976026 8123268 8252820 8424758 8638194
35608 8638194 8908309 9199691 9366840 9324539 9224885 9293544 9510489 9623602 9490090 9241488
35598 9241488 9066584 8975599 8854193 8641328 8364442 8065506 7771550 7504955 7274002 7077251
35588 7077251 6929326 6830240 6701285 6435758 6053470 5725348 5584776 5577835 5559621 5471732
35578 5471732 5347273 5196664 4982349 4682277 4309620 3906666 3585101 3504201 3694687 3950092
35568 3950092 4027879 3931564 3841970 3788312 3594417 3204445 2849006 2751411 2827726 2844155 2756083
35557 2756083 2709427 2782536 2913358 3040413 3136206 3123888 2942450 2697192 2574818 2596723
35547 2596723 2621390 2596678 2611774 2661406 2580039 2314740 2073272 2061073 2217112 2348880
35537 2348880 2395351 2405728 2379931 2306029 2270394 2353997 2472526 2478327 2376852 2292159 2261530
35526 2261530 2220196 2159219 2144228 2193710 2276140 2398382 2551461 2609579 2463760 2241448
35516 2241448 2198217 2372442 2538693 2545881 2511285 2603250 2800669 2966930 3029413 2995311 2908502
35505 2908502 2869548 2972216 3132710 3111800 2818114 2479409 2390707 2577866 2827238 2971622
35495 2971622 3019929 3051367 3103454 3162600 3199923 3221212 3285099 3407594 3460016 3300052 3033336
35484 3033336 2960397 3165351 3345564 3215559 2919370 2823016 3009159 3227599 3293364 3270988
35474 3270988 3250956 3193396 3077698 3016906 3108354 3285800 3413165 3454631 3495375 3641467
35464 3641467 3907757 4152017 4162997 3914895 3677906 3721002 3945367 4012959 3829803 3656406
35454 3656406 3683970 3766830 3717982 3633469 3704492 3872467 3924578 3849487 3850620 4019018 4207617
35443 4207617 4266881 4241517 4273945 4416466 4583474 4628931 4471178 4202660 4046038 4122020
35433 4122020 4304999 4406714 4437614 4535279 4681358 4696503 4539216 4402459 4431305 4524971
35423 4524971 4534920 4499752 4530909 4593758 4588811 4566930 4653778 4787603 4751643 4510133 4316330
35412 4316330 4386423 4617008 4758448 4757600 4764735 4857001 4937091 4920697 4860956 4819377 4745269
35401 4745269 4589694 4445111 4436581 4520128 4533258 4442106 4391673 4468950 4554252 4501129 4366287
35390 4366287 4341661 4503355 4731846 4857047 4795751 4575311 4320078 4195963 4260393 4366374
35380 4366374 4320276 4141140 4045560 4148499 4309525 4345199 4278300 4264973 4342030 4366956 4199070
35369 4199070 3862372 3529296 3383367 3470448 3641834 3680427 3533733 3384266 3432509 3647328
35359 3647328 3797620 3705913 3409053 3092023 2925801 2953261 3076375 3162299 3189868 3252297
35349 3252297 3388139 3494706 3484296 3435289 3459489 3480998 3313113 2951085 2627726 2535823
35339 2535823 2623128 2718375 2753581 2789597 2890545 3038452 3147532 3150997 3103830 3164242 3399324
35328 3399324 3653070 3718013 3597542 3454755 3337897 3152160 2908185 2768792 2778736 2766103
35318 2766103 2624157 2493161 2525980 2654257 2737305 2767396 2763007 2642931 2408491 2272956
35308 2272956 2366633 2471397 2328779 2076603 2053680 2264097 2400616 2362770 2354745 2431764
35298 2431764 2362038 2073428 1855919 1907735 2004239 1877696 1655833 1622372 1748225 1788551
35288 1788551 1712004 1698095 1764774 1717148 1484165 1241849 1148215 1165198 1201907 1255381 1341434
35277 1341434 1429888 1508684 1588601 1599721 1420822 1085840 841438 893173 1159462 1371939
35267 1371939 1388265 1324602 1377775 1576456 1746202 1714614 1514205 1341306 1323181 1388121
35257 1388121 1388257 1288446 1188629 1203672 1357868 1552597 1616906 1465081 1236151 1176453 1327513
35246 1327513 1450561 1353081 1159895 1117884 1249655 1393683 1503941 1670220 1859331 1892320
35236 1892320 1744371 1648749 1785156 2025782 2120766 2016706 1857908 1756446 1698549 1642051
35226 1642051 1591827 1579175 1633234 1765575 1939864 2076414 2123477 2101560 2050635 1968463 1835765
35215 1835765 1672521 1531141 1446194 1410815 1391947 1364441 1343502 1371246 1450032 1520455 1547684
35204 1547684 1588075 1696765 1800238 1757732 1547051 1301119 1156728 1147201 1232441 1333894
35194 1333894 1350570 1267945 1256475 1507188 1922964 2133538 1917080 1483552 1223508 1270116
35184 1270116 1433057 1494378 1431911 1370266 1418409 1562180 1665132 1601369 1429641 1375367
35174 1375367 1568253 1853902 1957779 1799764 1549749 1392719 1347077 1335094 1338472 1409472
35164 1409472 1545878 1623824 1516574 1281801 1148493 1246777 1418086 1415308 1248760 1163884
35154 1163884 1273551 1418818 1462683 1503533 1646084 1746289 1605327 1310128 1146422 1210564
35144 1210564 1319592 1308323 1224277 1188618 1215671 1230348 1174809 1070641 1032020 1179396 1453096
35133 1453096 1586166 1409164 1120345 1060332 1246990 1357599 1189004 895165 699288 614799
35123 614799 588604 704031 1035182 1432565 1660898 1681418 1627388 1562750 1444707 1298380
35113 1298380 1253573 1381542 1608086 1801631 1865390 1765378 1569305 1438980 1476999 1593333
35103 1593333 1623881 1551304 1484895 1454910 1393421 1321235 1365273 1539216 1687911 1729391 1768262
35092 1768262 1853757 1820806 1559697 1283341 1280388 1501721 1662067 1696605 1806946 2039805
35082 2039805 2159950 2060653 1984523 2127989 2286558 2164744 1849668 1673710 1727964 1822771
35072 1822771 1857313 1904343 1950841 1886414 1781671 1851941 2064067 2097431 1825009 1531501
35062 1531501 1480348 1548907 1518222 1470240 1612817 1889256 2054553 2028167 1913656 1766664
35052 1766664 1591240 1475802 1484636 1495794 1391621 1317448 1475861 1745983 1819817 1673495
35042 1673495 1575002 1633084 1682115 1647757 1672831 1790855 1811754 1662293 1529319 1516726 1467056
35031 1467056 1304615 1252084 1470250 1748549 1823983 1782122 1846462 1957963 1893010 1676719
35021 1676719 1545258 1553150 1529169 1413489 1351385 1413666 1469087 1404722 1283089 1205934 1167769
35010 1167769 1115132 1049054 1015459 1053291 1161690 1275908 1316736 1317891 1421600 1660444 1848452
34999 1848452 1820427 1679863 1644498 1730870 1784443 1761388 1766801 1835982 1885993 1885783 1878538 1828840
34987 1828840 1654251 1443576 1438641 1717233 2048623 2147711 1965676 1682543 1515992 1565797
34977 1565797 1746001 1858527 1823984 1804070 1972402 2230960 2340447 2278281 2228225 2232226
34967 2232226 2131556 1896581 1730924 1748978 1808653 1783667 1748933 1754271 1674623 1474596 1377806
34956 1377806 1536335 1737212 1702722 1514123 1444941 1496377 1416233 1129205 844030 720724
34946 720724 694193 672039 680738 745749 806317 823339 837562 869788 882899 881552 937098 1073887
34934 1073887 1217920 1276321 1194521 956552 629284 378127 314772 345719 299099 180999
34924 180999 156991 285313 434312 490421 489548 495292 493145 469548 468445 493797 456400 292412
34912 292412 68064 -81011 -66554 92866 253875 221262 -36569 -265007 -172735 191697
34902 191697 481953 488836 341407 238951 213129 252897 429171 722364 912656 846853
34892 846853 681208 659116 763331 802862 749401 743054 805059 790834 650329 528740 553741
34881 553741 674129 755484 717378 555356 340004 196126 167717 126225 -46097 -219226
34871 -219226 -155818 120413 329299 347143 360563 504441 607555 492582 316464 351278
34861 351278 556712 652455 562022 502942 614865 757899 773660 741116 832288 1041298 1197225
34850 1197225 1180454 1016006 792425 580209 416450 309416 261558 302595 457772 666282
34840 666282 800942 813532 794255 832065 890660 906397 940404 1108854 1383168 1582444 1577449
34829 1577449 1399777 1137076 842307 593370 514977 632529 776375 748388 557667 397307
34819 397307 409065 565332 767261 946244 1052746 1056140 1004384 997796 1050914 1058576 955401
34808 955401 823643 762798 734346 648647 544302 538032 619006 650566 599513 608239 768386
34797 768386 956239 1001066 919480 854021 839634 774399 613420 464162 453830 579656 721421
34786 721421 756461 659901 539498 554998 736149 902348 857301 655543 556100 687018
34776 687018 887090 949113 898173 912398 1049858 1194865 1243701 1206071 1114830 965214 798732
34765 798732 752251 931405 1257194 1503048 1499422 1284424 1052280 971318 1065243 1258535
34755 1258535 1483153 1687090 1772491 1640242 1347647 1134866 1200557 1486481 1763949 1903166
34745 1903166 1970503 2080275 2251276 2419992 2509586 2464764 2290753 2081430 1949143 1909818
34735 1909818 1891365 1856459 1845650 1892772 1979718 2094817 2256252 2452389 2636088 2801854
34725 2801854 2986542 3171270 3279249 3302225 3319214 3345885 3296919 3177743 3175150 3423555
34715 3423555 3786132 4030433 4155745 4367677 4744855 5107296 5258746 5234467 5250303 5478473
34705 5478473 5906756 6365349 6680620 6843059 7001645 7243639 7443250 7431323 7257534 7129249
34695 7129249 7102489 7011553 6758070 6514084 6530221 6823448 7144479 7217386 6974093 6604644
34685 6604644 6398289 6470173 6630025 6593374 6318107 6022889 5868820 5773030 5587382 5308666
34675 5308666 5021022 4762952 4558756 4460629 4436230 4324304 4042242 3743459 3616142 3608134
34665 3608134 3523425 3329224 3171715 3108152 3023462 2842910 2657573 2581556 2610497 2666794
34655 2666794 2676724 2575381 2350074 2105881 1973113 1932390 1863009 1775288 1814862 1981739
34645 1981739 2049753 1891726 1703073 1720461 1858188 1850139 1675406 1591709 1737945 1929342
34635 1929342 1919420 1694977 1420715 1227487 1162324 1243669 1436850 1620325 1682864 1640423
34625 1640423 1586255 1549217 1477133 1351437 1244510 1243756 1355737 1494495 1547385 1468594 1331746
34614 1331746 1261306 1278417 1260132 1115831 961369 1011562 1298208 1604663 1717963 1649623
34604 1649623 1550704 1501893 1476830 1444483 1399751 1329343 1253793 1279472 1487848 1764573 1860486
34593 1860486 1673880 1384221 1244574 1305125 1406326 1399969 1302277 1230535 1239561 1257403 1199113
34582 1199113 1123520 1198968 1466329 1722525 1749602 1595957 1477204 1438070 1319921 1083733
34572 1083733 928366 985043 1108812 1127650 1108836 1181712 1261283 1193547 1061593 1077010 1225900
34561 1225900 1292572 1212795 1133634 1116548 1062816 983822 1063416 1348193 1626553 1738761 1770509
34550 1770509 1799866 1702597 1412923 1164032 1214098 1471952 1642264 1641933 1627953 1680672 1709406
34539 1709406 1660584 1607208 1615462 1678941 1777623 1866733 1850762 1718174 1635158 1724417 1828905
34528 1828905 1728573 1530616 1550675 1807439 1962860 1844763 1702346 1779371 1930090 1901223
34518 1901223 1763647 1765838 1898208 1913956 1735542 1561464 1556477 1670136 1803773 1952670
34508 1952670 2111863 2207011 2206417 2183229 2195771 2207751 2182124 2146427 2106334 2010688 1880440
34497 1880440 1853840 1993915 2157030 2193108 2187456 2320066 2534373 2577310 2402723 2297408
34487 2297408 2480837 2783650 2923864 2945809 3103268 3368906 3395689 3049574 2680782 2668783
34477 2668783 2912295 3023260 2891385 2765220 2815898 2920843 2941691 2956981 3075891 3202103
34467 3202103 3162101 2976664 2843003 2878196 3001769 3064886 3004637 2868146 2755862 2755947 2884129
34456 2884129 3057729 3144163 3072157 2933919 2966465 3341860 3917119 4285506 4201437 3893011
34446 3893011 3789436 3975596 4134287 4050410 3910596 3973124 4176102 4297626 4351289 4554793
34436 4554793 4958667 5354845 5571471 5658394 5737219 5835414 5933809 6048450 6193130 6348231
34426 6348231 6515855 6730899 6986867 7228321 7439901 7657448 7864775 7972805 7945159 7861064
34416 7861064 7799382 7729754 7580086 7361764 7165774 7056602 7009576 6943069 6804097 6643935
34406 6643935 6596987 6734531 6944944 7024959 6898151 6672782 6465964 6253654 5948563 5570062
34396 5570062 5266937 5178686 5304768 5501830 5596566 5516873 5324878 5124943 4966154 4852103
34386 4852103 4795021 4800211 4831357 4858725 4905107 4963052 4921035 4710493 4505773 4594345 4990945
34375 4990945 5350397 5382189 5223259 5241566 5542920 5851032 5876427 5645575 5404480 5309714
34365 5309714 5317391 5333115 5357644 5443239 5569850 5648653 5653086 5670743 5780643 5938960 6056813
34354 6056813 6145408 6286043 6473524 6602865 6634814 6674699 6837439 7104620 7362361 7527316
34344 7527316 7601057 7653061 7776757 8005178 8249959 8394453 8468356 8635496 8958096 9270920
34334 9270920 9381335 9331457 9354112 9583695 9901985 10094251 10106027 10100007 10252050 10525045
34324 10525045 10713481 10732911 10766727 11030427 11471016 11847488 12059321 12211469 12373350 12500896
34314 12500896 12638890 12956497 13468737 13943081 14238923 14542307 15071538 15724784 16251222
34305 16251222 16632811 17033330 17464211 17793812 18061649 18493707 19163149 19883395 20511048
34296 20511048 21139700 21896274 22728403 23514829 24254548 25032129 25889177 26821199 27821489
34287 27821489 28851083 29840721 30798632 31852795 33107703 34499964 35871811 37182201
34279 37182201 38588297 40278821 42226186 44162407 45882384 47540870 49503401 51886755
34271 51886755 54452541 57047919 59894547 63213284 66790159 70266752 73734003 77628914
34263 77628914 82073183 86761572 91590911 96948832 103156750 110001621 117123257 124586550
34255 124586550 132738458 141703458 151372661 161767017 173057993 185262595 198213773
34248 198213773 211827224 226135066 241041571 256282855 271651300 287021013 302079708
34241 302079708 316231058 328854198 339517206 347870979 353501584 356034481 355336239 351539097
34233 351539097 344911796 335762970 324438338 311357750 297030302 281994062 266694629
34226 266694629 251424919 236393827 221806463 207842108 194608884 182172174 170581886
34219 170581886 159832827 149861645 140620974 132075932 124101275 116523110 109340601 102752398
34211 102752398 96844259 91410909 86247192 81444074 77168205 73298615 69581804 66057100
34203 66057100 62979532 60325702 57738860 55052477 52530895 50422183 48555700 46611242
34195 46611242 44582974 42726504 41168024 39797605 38484112 37192050 35909329 34627020
34187 34627020 33395926 32281723 31253124 30195848 29040945 27833750 26693503 25722306
34179 25722306 24898495 24051651 23044396 22000911 21205539 20705287 20190473 19412131 18551002
34170 18551002 17951679 17599005 17131662 16360448 15502447 14836977 14374187 13997730 13729037
34161 13729037 13633231 13564210 13241218 12601130 11909186 11459895 11278075 11174918 10996299 10720793
34151 10720793 10383942 10031234 9731214 9520182 9318454 9002751 8587481 8230363 8020888
34142 8020888 7883082 7751376 7699619 7769278 7796120 7593539 7238236 6975784 6877130 6796538
34132 6796538 6662087 6576112 6581634 6555037 6421947 6277684 6181596 6027173 5761057 5550969
34122 5550969 5553013 5652349 5630503 5482042 5365835 5326309 5267707 5147166 4993583 4779188
34112 4779188 4476609 4215811 4172694 4301938 4380999 4321975 4227220 4126887 3921003 3658363
34102 3658363 3606849 3882365 4215015 4283136 4120710 3972086 3871198 3645516 3302721 3117977
34092 3117977 3248779 3486477 3537711 3404164 3309783 3338066 3344693 3236086 3145763 3235351 3439165
34081 3439165 3544547 3477455 3365023 3312348 3265756 3161105 3075456 3103739 3163995 3089472 2904869
34070 2904869 2843615 3028783 3271448 3298768 3101923 2924714 2936032 3052811 3111466 3084501
34060 3084501 3049259 3041723 3062634 3173597 3432408 3722137 3802530 3610756 3385460 3371914
34050 3371914 3494955 3474629 3214180 2901702 2732053 2704566 2738201 2818089 2933964 3000399
34040 3000399 2952007 2840131 2746917 2679285 2628396 2643597 2739088 2798126 2691343 2452127 2231008
34029 2231008 2108400 2047951 2003516 1972377 1954158 1934488 1897237 1804299 1612963 1377819 1268907
34018 1268907 1394685 1655922 1865306 1958809 1995168 2012233 2004912 1998317 2020631 2040763 2042859
34007 2042859 2103852 2266744 2406358 2391350 2328763 2442871 2718437 2879305 2765148 2535847
33997 2535847 2426539 2465356 2530335 2555358 2570023 2610092 2668604 2701034 2667171 2623180 2735229
33986 2735229 3085749 3494751 3687330 3634761 3561082 3602871 3660382 3636517 3619997 3725526
33976 3725526 3910211 4063251 4161219 4242952 4332349 4450256 4599547 4706174 4705553 4700790 4858256
33965 4858256 5123963 5263908 5233787 5246074 5373615 5379038 5108568 4773640 4609333 4507333
33955 4507333 4269407 4004041 3937032 3986106 3881390 3621104 3461492 3490331 3529976 3454969
33945 3454969 3311409 3123300 2869728 2662734 2655622 2745568 2656827 2367904 2169275 2228966
33935 2228966 2388202 2480332 2558829 2667602 2656808 2418147 2096734 1883951 1767367 1650245
33925 1650245 1556226 1543079 1550164 1494785 1405196 1325886 1224597 1124650 1170730 1395138 1564834
33914 1564834 1456204 1169791 982797 994386 1112620 1284960 1505617 1659260 1607361 1423643
33904 1423643 1328016 1378958 1430111 1402334 1389624 1450788 1493130 1441950 1364736 1340781 1339852 1310534
33892 1310534 1269116 1224278 1132449 1013136 993267 1133117 1303756 1345736 1265759 1163627
33882 1163627 1050759 890260 764205 827001 1081214 1345055 1478437 1518095 1545031 1544810
33872 1544810 1478683 1388755 1327226 1250392 1090722 888838 752509 724567 794151 986360
33862 986360 1295961 1559306 1573955 1376922 1229474 1264918 1334670 1305011 1306467 1500136 1750185
33851 1750185 1781123 1592161 1453966 1493068 1532051 1406635 1216626 1141133 1172680 1177828 1111616
33840 1111616 1037605 1008206 1043009 1173373 1400044 1634422 1768585 1787269 1748827 1682237
33830 1682237 1570859 1428590 1331130 1348607 1458805 1541499 1488954 1343728 1285280 1430579
33820 1430579 1694599 1921033 2094335 2306938 2556347 2723433 2750846 2699353 2620174 2522638
33810 2522638 2480147 2593499 2809560 2952781 2990317 3082978 3310323 3550731 3724951 3935027
33800 3935027 4230557 4469797 4592986 4800498 5213966 5567944 5557209 5357202 5444830 5943110
33790 5943110 6484133 6749584 6831265 6963556 7167498 7310445 7342777 7331164 7350363 7423199
33780 7423199 7496451 7456870 7267906 7082755 7087515 7231387 7264401 7057203 6725173 6411966
33770 6411966 6120544 5809203 5495906 5199107 4905095 4645764 4483241 4384460 4253192 4113282
33760 4113282 4089404 4162056 4134380 3922262 3687516 3575903 3505908 3350999 3159221 3027096
33750 3027096 2901751 2697337 2500851 2464381 2553616 2582799 2465850 2277992 2096931 1934914
33740 1934914 1821153 1811636 1893472 1974945 1990248 1956133 1932871 1975803 2093864 2209314 2209346
33729 2209346 2090984 1989860 2001784 2052706 2025678 1934234 1867449 1837460 1799993 1767849 1780995
33718 1780995 1808146 1795778 1772880 1789808 1797953 1716543 1578624 1477990 1408808 1297788 1154113
33707 1154113 1026926 856691 574672 340388 429340 814102 1102330 1040584 877213 1014228
33697 1014228 1434757 1727477 1636105 1338671 1142508 1116674 1139256 1155339 1221243 1347416
33687 1347416 1449205 1467325 1432722 1383890 1306320 1195994 1105159 1062841 1016307 934630 913863
33676 913863 1057348 1264496 1279839 1008527 681740 624227 908533 1307191 1548153 1550240
33666 1550240 1427122 1326593 1288781 1248930 1160425 1071271 1043467 1048648 1025495 997627 1013343
33655 1013343 996980 830999 602792 566466 774158 944508 842435 616212 568987 737450
33645 737450 921671 1027886 1120649 1181422 1092613 888063 767885 791968 779083 612567
33635 612567 449270 482493 645587 714346 618528 503721 523531 684292 873299 954186
33625 954186 856324 651431 535377 660931 965523 1202933 1178527 952845 783448 833723
33615 833723 967595 917593 660262 489295 638082 968693 1181222 1213173 1224180 1261848
33605 1261848 1206434 1052273 975929 1045837 1098831 1018762 926204 949545 1003315 974931 967541
33594 967541 1136463 1387449 1467322 1318829 1148023 1140754 1276182 1435285 1552158 1619743
33584 1619743 1644429 1636685 1602709 1543125 1481577 1447477 1400166 1258766 1067507 1014754 1178626
33573 1178626 1369019 1373831 1260130 1240706 1325681 1349820 1315028 1422916 1705395 1886565
33563 1886565 1749411 1433297 1201548 1085267 958879 840666 875647 1065081 1243930 1339890
33553 1339890 1444330 1572389 1559482 1324024 1077258 1091193 1332217 1506491 1448659 1286383
33543 1286383 1194473 1173651 1172849 1270537 1555788 1901223 2046351 1916776 1709543 1630178 1683499
33532 1683499 1779176 1906865 2098210 2297159 2383727 2303369 2107339 1897846 1780664 1812834
33522 1812834 1927937 1966938 1864048 1756183 1815886 2009627 2129894 2065435 1937608 1937743
33512 1937743 2101982 2290633 2351221 2262877 2129108 2052649 2039037 2036583 2037024 2069882 2106455
33501 2106455 2072458 1991762 2004400 2157979 2280942 2186593 1935044 1748669 1705222 1677245
33491 1677245 1581151 1515815 1583214 1702663 1714646 1602522 1501051 1497349 1510620 1401812 1163486
33480 1163486 951871 914645 1019757 1108105 1108809 1117773 1222346 1337619 1314715 1164055 1054188
33469 1054188 1089505 1192335 1232971 1192137 1141753 1113295 1051324 910161 766701 782480 1007383
33458 1007383 1254612 1265888 1011138 717302 569010 517828 463948 466148 611358 793131
33448 793131 826711 731723 694648 765321 795022 696019 565903 498704 446857 351411 268836
33437 268836 281741 387283 536541 688122 784076 788182 787876 926251 1177495 1326309 1243889
33426 1243889 1053650 937388 901606 834663 683234 467416 221762 26893 4251 168170
33416 168170 365179 461930 504845 589533 680211 704071 736290 907796 1157246 1250927 1081154
33405 1081154 823613 753123 969530 1323768 1564827 1557525 1393065 1274548 1278203 1281647 1160796
33394 1160796 974027 871049 881728 895064 820669 686700 587507 593492 703976 855736
33384 855736 995705 1142801 1316206 1415630 1301221 1030098 869100 986757 1257933 1468221
33374 1468221 1577464 1658800 1711829 1699989 1675686 1704914 1745745 1747549 1772443 1854930 1855896 1666299
33362 1666299 1461533 1509398 1783019 2017593 2113659 2210720 2371855 2497677 2595162 2820449
33352 2820449 3150796 3311872 3195984 3092223 3290182 3667171 3913477 4010360 4210404 4618428
33342 4618428 5058688 5369952 5623704 5989350 6515024 7102305 7623897 8030988 8394381
33333 8394381 8865273 9574196 10554731 11743347 13012965 14230899 15372793 16582687 18013601
33324 18013601 19587690 21039534 22239598 23328304 24446454 25484421 26234841 26669116
33316 26669116 26886742 26871897 26504115 25800929 24967558 24161830 23337388 22366381 21215988
33307 21215988 19953136 18656711 17388498 16205181 15138648 14165159 13215218 12225442
33299 12225442 11201386 10239539 9457282 8875212 8390013 7878602 7295215 6658424 6012866
33290 6012866 5447671 5079791 4933295 4866768 4700188 4403605 4096905 3874482 3700879 3491893
33280 3491893 3241287 3028675 2913321 2845763 2708914 2457999 2188988 2027648 1979134 1953490
33270 1953490 1917159 1921015 1973402 1996351 1943438 1859885 1782608 1684989 1573414 1523441 1542912
33259 1542912 1511598 1358562 1200433 1182399 1257709 1254267 1113981 951369 904519 1012943
33249 1012943 1198514 1296116 1175709 914410 755916 809020 907655 886870 835097 878048
33239 878048 874472 623089 283276 232894 489955 639828 458328 269609 458917 886992
33229 886992 1084899 893705 612966 546176 657780 733321 694381 650555 715612 853121
33219 853121 908640 786089 570591 424542 372215 291411 147384 95417 248203 455387
33209 455387 464671 242537 -12683 -138445 -133150 -33945 145694 311231 290399 52044 -184747
33198 -184747 -184325 16627 167294 123577 -4246 -36437 52683 160261 237518 352059 566685
33187 566685 828424 1017065 1069209 1011168 885510 700694 475015 289398 239894 325830
33177 325830 424704 416293 316657 242409 245432 255366 222152 234161 399698 656700 822969
33166 822969 829252 773590 729817 654939 546217 530687 681013 869659 944499 938809 949777
33155 949777 917981 734877 499769 431645 538918 611989 563792 537865 620013 684799 639081
33144 639081 602948 705821 883323 1024253 1145399 1252517 1199418 902422 570134 485468
33134 485468 632490 755902 728578 637320 552242 456880 401868 484547 643653 699567 644221
33123 644221 663724 806280 869111 732195 572393 574498 628747 533004 347132 299128 422973
33112 422973 535758 539491 508442 474929 363628 188860 102820 159181 211624 152212 81027
33101 81027 108383 146700 71645 -34149 -5631 112993 129999 40776 64410 295073 528634
33090 528634 546767 416704 376043 522560 740253 858532 778463 508779 182360 -14597
33080 -14597 -18258 61353 128160 235434 429780 583181 552525 422978 393616 469210 481222
33069 481222 397399 372384 457596 498022 397211 264593 189670 83404 -103822 -201378 -58027
33058 -58027 177895 236310 95511 -34235 -36764 8094 18255 3801 -28751 -79621 -57055
33047 -57055 133379 374140 409940 201016 7552 17278 77414 -35839 -232092 -226655 9363
33036 9363 166910 14621 -308017 -520606 -559356 -538987 -470922 -251061 76478 274147
33026 274147 219305 75934 28869 8953 -131912 -301223 -271580 -56613 82579 26795
33016 26795 -55414 -13200 77005 109094 125419 161866 130506 22433 21625 213909 371819
33005 371819 271357 60979 37222 180158 224387 113907 51671 118711 185082 228288 390492
32994 390492 624137 625342 300216 1615 54808 269845 218343 -130759 -356490 -155197
32984 -155197 286397 556616 490509 271337 143261 143438 147316 108171 138529 315009 511405
32973 511405 545248 428231 326992 314699 332124 377328 524723 716779 747738 547736
32963 547736 306705 210293 214282 195758 165185 179213 179418 92377 5124 80672 344839 670731
32951 670731 919918 1012157 939928 807240 758170 776388 682256 441308 315326 525367
32941 525367 897056 1063941 936645 737238 629350 575436 554491 651883 860912 1010241
32931 1010241 988075 879100 796523 732897 673377 709693 905955 1145471 1250193 1211458
32921 1211458 1187877 1286605 1439535 1508824 1446970 1319084 1206177 1138285 1122801 1179517 1301863
32910 1301863 1428799 1531004 1686493 1954274 2196240 2199968 2016323 1974188 2250483 2618121
32900 2618121 2784312 2794122 2868241 2998556 3018335 3003775 3252740 3813926 4346176 4565883
32890 4565883 4586717 4669425 4845194 4973727 5035220 5171827 5492029 5959534 6438835 6779723
32880 6779723 6919526 6962981 7092324 7354378 7622052 7797194 7929040 8079101 8207218 8273614
32870 8273614 8319624 8348048 8256972 8014301 7773704 7674083 7631140 7483259 7246428 7045652
32860 7045652 6869701 6598810 6242671 5940119 5710868 5410196 4985072 4591595 4358301
32851 4358301 4176265 3855912 3408070 3036898 2884317 2887922 2886341 2774918 2542856 2240321
32841 2240321 1963762 1827912 1875826 2007094 2048355 1923212 1718401 1559922 1475558 1426405
32831 1426405 1410493 1434300 1410364 1216687 892216 659882 682727 865462 961911 830031
32821 830031 536022 264691 174476 282037 439660 476385 387243 302989 251528 92181
32811 92181 -222512 -468758 -408512 -138838 14043 -77225 -217698 -214844 -131561 -132567 -231467
32800 -231467 -312520 -315350 -280429 -251572 -225642 -184517 -118136 -31807 31412 9536 -92878
32789 -92878 -177704 -171367 -137971 -197763 -343196 -425675 -354806 -232315 -218911 -311230 -342442
32778 -342442 -209854 -14173 77331 42889 1780 23886 32752 -85668 -344776 -652681 -888939
32767 -888939 -958848 -832622 -582731 -349065 -222860 -183965 -170921 -165545 -172433 -171024 -155157
32756 -155157 -187234 -335758 -561499 -727173 -729513 -580659 -363362 -159785 -32346 -11668
32746 -11668 -57700 -63858 43060 201021 259415 163764 59919 143517 401524 589272 514599
32735 514599 268083 87749 61462 85008 75938 72328 103902 118705 96445 105457 170892 198228
32723 198228 116933 7647 -6042 83169 199677 303513 389722 436753 439305 435643 439496
32712 439496 416507 375944 376336 380345 254244 14428 -95956 61976 273928 263881 98308
32701 98308 44040 122795 109039 -59314 -179428 -129014 -26698 28116 108696 243202 285580
32690 285580 150634 -17219 -59552 -25395 -38419 -95076 -134533 -168830 -204785 -170882 -59209
32679 -59209 -1311 -54366 -55799 132236 364427 403760 271733 188286 228777 266858 228275
32668 228275 175357 128499 15075 -154030 -234572 -147052 10692 115042 163848 201894 199244
32657 199244 95942 -76704 -193735 -164136 -48310 -30680 -224793 -495529 -568420 -370493
32647 -370493 -145587 -123266 -201659 -142726 17314 13306 -205164 -355840 -235401 -7778
32637 -7778 62484 -28701 -108840 -123722 -135806 -116493 28284 231290 270777 68396 -167091
32626 -167091 -189923 -26522 66627 -72646 -318021 -414633 -291849 -159706 -272980 -634715
32616 -634715 -984415 -1072875 -892850 -630685 -456486 -400035 -384618 -329901 -233549 -173048 -211377
32605 -211377 -306462 -361161 -358503 -370975 -423216 -445422 -405278 -373207 -376604 -306244 -100116 73445
32593 73445 636 -241652 -331159 -113755 201327 325243 214616 20152 -149662 -277154
32583 -277154 -338980 -311921 -243645 -203297 -185766 -160905 -177797 -300551 -461340 -509921 -422879
32572 -422879 -343615 -381269 -475729 -508034 -453565 -371877 -320057 -330176 -408310 -504724 -541420
32561 -541420 -511098 -487152 -496798 -463197 -335254 -201972 -195388 -323908 -472171 -531748 -481255
32550 -481255 -384874 -356839 -460153 -590228 -551659 -323994 -138107 -174326 -304875 -307096 -231894
32539 -231894 -325654 -619334 -852695 -850225 -735736 -683793 -676104 -640887 -645401 -765233 -886691
32528 -886691 -829639 -600308 -366772 -248330 -279821 -503618 -889572 -1190511 -1112736 -698191
32518 -698191 -352745 -387296 -669152 -852397 -832869 -794854 -861614 -918937 -845913 -740688 -772678
32507 -772678 -912435 -981605 -931029 -881538 -878678 -815765 -678574 -653994 -837316 -1013019 -947164
32496 -947164 -760758 -745869 -903531 -979176 -924907 -967825 -1160619 -1233343 -1051109 -884650
32486 -884650 -989358 -1195555 -1207357 -1087663 -1112874 -1291209 -1376002 -1295849 -1242584 -1329496 -1443903
32475 -1443903 -1470797 -1430097 -1364578 -1297249 -1309610 -1456290 -1598413 -1533811 -1294971 -1099138
32465 -1099138 -1013986 -931326 -874337 -1013791 -1304548 -1432020 -1270575 -1100076 -1172118 -1338139
32455 -1338139 -1362083 -1358190 -1585670 -1961421 -2147523 -2086171 -2093715 -2355494 -2629109 -2609501 -2383646
32444 -2383646 -2312319 -2541314 -2824320 -2854432 -2641242 -2479009 -2599220 -2954489 -3345515 -3648509
32434 -3648509 -3850134 -3957724 -4007946 -4115955 -4357839 -4605945 -4646730 -4503376 -4479821 -4796381
32424 -4796381 -5305914 -5672779 -5745258 -5665118 -5687360 -5965882 -6435998 -6836166 -6927415 -6760761
32414 -6760761 -6641361 -6760517 -6961741 -6947869 -6610811 -6061556 -5450752 -4894016 -4487928 -4247255
32404 -4247255 -4060605 -3820790 -3559601 -3356219 -3170922 -2890073 -2501427 -2112061 -1808203
32395 -1808203 -1583142 -1381303 -1142549 -836823 -517258 -292093 -188113 -108575 14418 112984
32385 112984 103494 18256 -71759 -168138 -280037 -347655 -334888 -292722 -227584 -45273 237903
32374 237903 387856 251784 26445 -3674 120203 147386 60296 85460 274162 388676
32364 388676 272109 66748 -24064 34596 203412 472663 761518 901927 842106 717602
32354 717602 628655 501964 269946 35597 -54951 12285 162078 337721 490266 570138
32344 570138 596609 637247 687565 694072 703023 810118 939872 893436 679921 564569 677928
32333 677928 809433 736087 536178 401504 346690 308541 339473 465086 515087 355078
32323 355078 153921 152463 278602 281449 165684 173853 356231 473487 375220 206945 164673
32312 164673 264041 424177 580374 644654 546142 385087 366586 506455 581173 450546
32302 450546 246873 142861 114671 71484 59572 166525 328044 394834 330980 217786
32292 217786 121419 73887 119905 254381 361032 339230 260062 278146 411716 526793 530644
32281 530644 470975 437792 463392 533533 619915 693399 767948 909820 1111826 1186477 934150
32270 934150 456161 150961 290499 694525 949230 887678 708684 639646 655312 604164
32260 604164 484464 452507 582305 737892 727593 530973 327954 312547 496396 700224
32250 700224 743905 639743 568027 652250 810172 872840 803662 717891 702950 717971 692226
32239 692226 630296 565091 475894 328658 166946 95686 176997 376736 599367 742705
32229 742705 739761 597731 407042 287262 305879 438861 596747 692325 700767 655204 584897
32218 584897 497181 443121 526772 759125 954980 911717 685681 541448 596793 682413 631554
32207 631554 539228 582632 704631 673861 425737 165172 103059 215436 306457 231526 24763
32196 24763 -146666 -137921 39579 248183 391198 487655 554814 522587 358641 197129 217442
32185 217442 432033 698663 899735 999484 973937 827331 665757 621803 697055 781953
32175 781953 817508 820268 764219 585595 330665 169186 209484 384103 546911 611436 589001
32164 589001 569823 661838 864890 1021041 981912 804876 687661 740003 918713 1126854
32154 1126854 1241454 1114048 729959 326975 159784 181259 171510 134624 280084 603926
32144 603926 815806 771322 665891 663170 630625 429818 196083 105280 98277 76086 150113
32133 150113 428395 735861 834152 778604 778511 831862 790503 683694 675264 766057 820738 829303
32121 829303 867695 868119 722290 553297 574735 726951 777669 738317 816062 975118 958700
32110 958700 778736 740159 881964 860643 570185 407230 630385 880549 722492 327432
32100 327432 182466 362779 541509 561502 547229 533093 412643 241603 205252 270807
32090 270807 222776 60841 14031 127206 194057 168554 272373 569353 790208 759203
32080 759203 669252 713623 744721 572266 350309 348345 508776 555899 440628 367855 434907
32069 434907 527931 561547 565628 531383 407348 267381 269705 427243 612234 785678 997166
32058 997166 1151623 1050704 741378 557593 683169 902118 936649 820036 749557 763291
32048 763291 787244 848877 992770 1091903 1006540 868948 942628 1215093 1394569 1339659 1239060
32037 1239060 1288769 1419901 1469700 1441235 1441220 1473201 1431489 1246265 957212 704280 682353
32026 682353 992901 1471389 1774219 1731997 1530896 1460583 1576956 1714972 1747971 1707014
32016 1707014 1685164 1731602 1827429 1904273 1913755 1907345 1977511 2089375 2086537 1936711 1847485
32005 1847485 2022243 2398887 2749396 2938901 2952452 2777272 2449665 2157200 2093553 2222325
31995 2222325 2348978 2406842 2498697 2666692 2812744 2874748 2910640 2967086 3018449 3076692 3213923
31984 3213923 3432088 3650362 3856254 4115491 4392455 4536212 4515584 4494939 4582068 4671792
31974 4671792 4664190 4672954 4843562 5085197 5185885 5140392 5169641 5403341 5691535 5777391 5569837
31963 5569837 5202698 4870834 4645231 4450058 4208497 3959325 3770501 3584874 3275178
31954 3275178 2856261 2507813 2345435 2293387 2232165 2136022 1992818 1726711 1307530 835105
31944 835105 425758 113739 -74381 -97820 -47984 -144796 -445948 -722358 -789521 -793257 -951724
31933 -951724 -1173786 -1212148 -1088115 -1051861 -1166756 -1253576 -1252112 -1310022 -1445860 -1442241 -1210229
31922 -1210229 -989759 -1015186 -1200946 -1340114 -1419075 -1526950 -1610847 -1557384 -1425542 -1374665
31912 -1374665 -1405505 -1374047 -1251668 -1192339 -1316077 -1558625 -1764193 -1828786 -1739210 -1564254
31902 -1564254 -1425908 -1403474 -1450642 -1462056 -1409662 -1344375 -1285631 -1212107 -1168906 -1268435 -1526641
31891 -1526641 -1780755 -1848761 -1725333 -1545635 -1395390 -1261876 -1168053 -1215130 -1408838 -1552986
31881 -1552986 -1465086 -1247488 -1160614 -1224627 -1173816 -898571 -692322 -845692 -1173880 -1244510
31871 -1244510 -994044 -791925 -885173 -1109158 -1237782 -1301606 -1385257 -1385750 -1216665 -1051928
31861 -1051928 -1096941 -1250343 -1259460 -1117831 -1035266 -1068413 -1069339 -1007907 -1066287 -1336474 -1646964
31850 -1646964 -1789583 -1744573 -1591251 -1365602 -1123851 -1005095 -1083238 -1231904 -1257204 -1124128
31840 -1124128 -969448 -931005 -1029105 -1176795 -1254493 -1211082 -1124461 -1115269 -1183247 -1202649 -1104643
31829 -1104643 -969857 -892166 -849409 -780461 -699703 -648922 -618794 -616108 -724896 -970272 -1180893
31818 -1180893 -1142986 -880480 -637840 -572544 -605211 -608795 -596597 -632810 -672900 -623852 -512552
31807 -512552 -472712 -570359 -733298 -857816 -908226 -900662 -859694 -809938 -749633 -622544 -397805
31796 -397805 -203699 -270297 -644746 -1041935 -1114298 -850646 -574939 -538884 -655468 -688609
31786 -688609 -568894 -412433 -325831 -333057 -444395 -645939 -822158 -831250 -697206 -610772 -680088
31775 -680088 -781676 -746767 -619337 -606167 -785064 -982335 -989050 -822373 -689644 -717012
31765 -717012 -807094 -798890 -688781 -605835 -605362 -604448 -542840 -496739 -569457 -751706 -960004 -1134571
31753 -1134571 -1218729 -1132089 -886522 -660884 -617754 -692672 -716230 -693211 -757998 -870100 -809114
31742 -809114 -542770 -352527 -449630 -676805 -779231 -787928 -886347 -1022619 -954005 -656372
31732 -656372 -410821 -426984 -603710 -744537 -816024 -883199 -949060 -989781 -1036298 -1097862 -1095806
31721 -1095806 -992708 -907653 -972960 -1130077 -1196330 -1101695 -937043 -791071 -672610 -598831
31711 -598831 -625282 -743234 -851946 -887700 -893623 -905821 -864619 -730572 -615264 -667440 -845619
31700 -845619 -931523 -802250 -585630 -483431 -520900 -561364 -521692 -460456 -445618 -441415 -389811
31689 -389811 -341006 -408562 -590629 -714628 -621526 -383788 -262857 -406916 -644383 -670398
31679 -670398 -435834 -233657 -333153 -631473 -793455 -677865 -464548 -363377 -372251 -384886
31669 -384886 -383911 -411498 -446480 -430594 -363291 -282427 -206503 -166336 -212278 -308450 -326150 -255465
31657 -255465 -298698 -580949 -876693 -857570 -558224 -336931 -375794 -493056 -499104 -451442 -439273
31646 -439273 -388148 -262271 -229387 -398521 -578966 -548981 -413425 -419628 -534419 -517427 -360483
31635 -360483 -320817 -490892 -648402 -622236 -530138 -524275 -547788 -512505 -508611 -628125 -730144
31624 -730144 -612112 -339475 -193703 -309842 -532792 -639167 -570609 -429122 -337058 -323119
31614 -323119 -297481 -153738 68975 182664 68693 -172074 -368292 -492236 -604547 -663200
31604 -663200 -561878 -341339 -186189 -176944 -195561 -136596 -81371 -172900 -405672 -630618 -720195
31593 -720195 -663418 -541688 -469453 -521541 -662487 -769924 -767005 -704829 -679192 -699708 -689252
31582 -689252 -594856 -452454 -341208 -304710 -325250 -360830 -395402 -444620 -512162 -561130 -548118
31571 -548118 -472538 -373293 -291590 -252862 -258216 -269974 -238716 -173415 -143830 -180436 -228270 -246029
31559 -246029 -280162 -375644 -497986 -631785 -847777 -1131376 -1258897 -1060358 -732643 -621583
31549 -621583 -708398 -625067 -242692 89630 56196 -179547 -282663 -246627 -280674 -380762
31539 -380762 -359430 -213549 -129459 -151477 -149611 -112044 -172547 -324340 -397958 -372340 -420860
31528 -420860 -574906 -631905 -506205 -383780 -380496 -329682 -110242 73868 -1083 -200533
31518 -200533 -247434 -167295 -210704 -416411 -562055 -539865 -503388 -593100 -733966 -773205 -665847
31507 -665847 -479764 -337193 -357091 -530283 -665620 -597471 -420362 -358897 -436161 -467136
31497 -467136 -374091 -285885 -284706 -271890 -164036 -34348 25894 15996 -73980 -279036 -489580
31486 -489580 -483367 -260559 -136214 -322526 -608634 -664033 -490724 -332447 -280085 -250121
31476 -250121 -255351 -382551 -534796 -508777 -345916 -305901 -441452 -506981 -388293 -310112 -442687
31465 -442687 -584057 -476087 -217036 -81206 -89748 -67063 -22617 -141135 -402612 -532043
31455 -532043 -400306 -209998 -172367 -224733 -211392 -159772 -200370 -333662 -450044 -508575 -541235
31444 -541235 -526695 -407099 -219724 -94728 -114742 -252961 -437365 -603056 -698945 -715906
31434 -715906 -697526 -671370 -605356 -490231 -406939 -422439 -469073 -436398 -346218 -315101 -363514
31423 -363514 -391791 -346508 -286678 -271811 -297869 -354133 -431086 -472147 -443153 -438572 -559512
31412 -559512 -694613 -634639 -436238 -412336 -651922 -821692 -649686 -368045 -384728 -676149
31402 -676149 -845382 -717391 -527944 -494997 -525689 -457558 -331483 -274391 -293410 -327751 -367128
31391 -367128 -400705 -371890 -287281 -249147 -285126 -281518 -193651 -171332 -324313 -499288 -485843
31380 -485843 -352242 -352649 -529253 -632198 -479501 -211744 -97947 -215023 -424021 -582955
31370 -582955 -668100 -709152 -709020 -663276 -603581 -566675 -536078 -476017 -433797 -527220 -767673 -971234
31358 -971234 -961316 -816219 -766307 -856407 -896045 -789244 -706347 -800894 -931834 -855859 -584330
31347 -584330 -349710 -286689 -346292 -477507 -667208 -796435 -694321 -415566 -269243 -441872
31337 -441872 -723031 -748505 -444680 -99905 -19416 -217548 -462689 -547492 -468167 -362549
31327 -362549 -327265 -336801 -326293 -285978 -246115 -228366 -251526 -321473 -370334 -293140 -119932
31316 -119932 -50811 -201317 -404760 -424557 -290845 -234766 -330895 -427674 -435694 -441871 -470013
31305 -470013 -359965 -18873 378260 584258 555523 413418 250277 100777 2942 -43128
31295 -43128 -102003 -186805 -203791 -107979 -8648 -10001 -57225 -66099 -90859 -211045 -351764 -385407
31283 -385407 -332149 -291161 -254800 -181245 -178156 -387328 -712968 -889474 -827266 -683231 -574528
31272 -574528 -446493 -274112 -171046 -198084 -243571 -203515 -129960 -97820 -71758 -23351 -48372
31261 -48372 -231375 -489046 -670703 -734075 -715936 -620965 -462353 -331329 -290404 -256579 -127634
31250 -127634 18168 -5482 -225190 -438371 -435601 -208654 78154 255495 271568 194392
31240 194392 109529 17925 -125832 -277753 -309114 -196799 -92613 -103116 -113283 18188
31230 18188 175395 103293 -208514 -471850 -476227 -333720 -264391 -300168 -326849 -300050 -268555
31219 -268555 -245108 -196877 -147318 -170465 -276970 -394319 -471186 -527482 -587365 -632328 -648072
31208 -648072 -661596 -692888 -705912 -651170 -545618 -475289 -509532 -625224 -723693 -720850 -618594
31197 -618594 -492780 -425473 -455808 -573197 -721440 -813665 -794581 -712987 -686713 -749175 -768317
31186 -768317 -592357 -266051 -9477 49522 26304 80996 147325 10288 -342492 -613906
31176 -613906 -544953 -262493 -133587 -315554 -607580 -756419 -740998 -676220 -582823 -409401
31166 -409401 -220374 -190308 -380384 -631418 -730769 -620776 -402470 -193252 -41506 43519
31156 43519 42385 -63131 -238667 -387651 -429521 -393703 -396206 -498149 -625005 -659778 -575689
31145 -575689 -433460 -295881 -208604 -215771 -303295 -359680 -298764 -202026 -218472 -326887 -338658
31134 -338658 -167908 41570 116643 50185 -73903 -210416 -304865 -252578 -49295 124624
31124 124624 129989 86073 176499 312875 227202 -105408 -378004 -357429 -180314 -129541 -257375
31113 -257375 -358374 -236774 95661 437196 562775 436829 274815 294367 409877 340808
31103 340808 51556 -143348 -24933 211276 274893 210921 238837 317893 220862 -11384
31093 -11384 -61184 160690 342115 242966 45452 21833 87937 -37684 -358667 -562528
31083 -562528 -430139 -66062 289533 502713 563398 496789 324912 71920 -204015 -377300
31073 -377300 -333061 -140287 -42776 -162416 -310809 -251054 -50719 40618 2786 56830 250057
31062 250057 336885 196176 82201 236748 466781 401193 52627 -190978 -117939 62642
31052 62642 88851 -12768 -95992 -194309 -444535 -814932 -1106144 -1198009 -1152016 -1080644 -1038884
31041 -1038884 -1043229 -1081281 -1087155 -1009418 -924598 -986763 -1234581 -1537242 -1760594 -1889383 -1947806
31030 -1947806 -1918338 -1818647 -1751480 -1769389 -1776894 -1687895 -1592101 -1605224 -1626004 -1456992 -1153822
31019 -1153822 -1012676 -1148758 -1321391 -1302845 -1202896 -1231939 -1318961 -1232576 -995292 -887290
31009 -887290 -1026945 -1209621 -1240464 -1201904 -1257391 -1361120 -1338862 -1170153 -1025179 -1041781
30999 -1041781 -1183900 -1321480 -1366269 -1319487 -1241603 -1189509 -1167095 -1150884 -1164769 -1272256 -1461567
30988 -1461567 -1597828 -1552973 -1355467 -1158210 -1077427 -1107604 -1174321 -1218425 -1225750 -1205521 -1152557
30977 -1152557 -1041733 -882517 -760717 -764335 -862326 -933560 -944783 -1012071 -1218796 -1446485
30967 -1446485 -1489542 -1312745 -1099495 -1038079 -1134266 -1255236 -1297089 -1265089 -1216909 -1182907 -1166905
30956 -1166905 -1192467 -1282156 -1376767 -1356790 -1208188 -1087692 -1112996 -1159015 -1032645 -816263
30946 -816263 -810969 -1094173 -1372806 -1397443 -1298951 -1324618 -1428309 -1375942 -1142902 -936169 -870337
30935 -870337 -874924 -904116 -986851 -1056619 -981848 -814134 -771392 -903717 -1003712 -943225 -873573
30924 -873573 -956749 -1099562 -1120166 -1013280 -875981 -714386 -514244 -387088 -441413 -582519
30914 -582519 -631030 -583140 -567094 -588966 -524177 -354538 -225375 -243674 -373546 -547314 -727458
30903 -727458 -840737 -814104 -716639 -709029 -798349 -802122 -631009 -441440 -388094 -376648 -236433
30892 -236433 -36212 -15789 -228456 -460288 -548509 -594192 -750727 -941320 -951640 -748040
30882 -748040 -536857 -494698 -584224 -691099 -808249 -969198 -1089921 -1039937 -860620 -762445
30872 -762445 -861571 -1036117 -1105661 -1049746 -960728 -864327 -708578 -500119 -336364 -286583 -314790
30861 -314790 -341449 -337887 -349792 -451429 -662533 -886025 -965786 -852745 -676208 -592634 -604084
30850 -604084 -601536 -547038 -504575 -500643 -476075 -409759 -388239 -494781 -698383 -901749 -1034829
30839 -1034829 -1052497 -915710 -660451 -442454 -415730 -562746 -714219 -750991 -729841 -784370
30829 -784370 -948176 -1124595 -1218810 -1246672 -1280429 -1312951 -1240210 -1010299 -741123 -614867
30819 -614867 -656969 -699246 -599658 -429961 -374397 -488120 -656512 -785516 -909503 -1058101
30809 -1058101 -1131573 -1030553 -852099 -809219 -955268 -1130604 -1211722 -1253834 -1304632 -1243024
30799 -1243024 -968562 -641412 -528021 -649307 -782872 -805623 -823530 -927486 -1030632 -1032348
30789 -1032348 -968633 -906474 -848323 -830053 -936946 -1109729 -1123760 -914297 -738475 -818556
30779 -818556 -991033 -948483 -698443 -513845 -513289 -566423 -568156 -535925 -462786 -344274 -329372
30768 -329372 -553932 -829850 -824079 -579381 -504111 -755798 -1007846 -995051 -923504 -1079649
30758 -1079649 -1343955 -1414949 -1286102 -1166527 -1103141 -1017705 -979921 -1094195 -1212959 -1120223
30748 -1120223 -938138 -977667 -1205194 -1257225 -1036050 -882077 -1010187 -1153811 -1003611 -692241
30738 -692241 -552460 -619425 -691758 -736168 -888508 -1106817 -1155968 -983159 -836921 -911558
30728 -911558 -1080100 -1105637 -961993 -805226 -739807 -762685 -863983 -1019451 -1110780 -1021200
30718 -1021200 -835055 -786569 -938019 -1043379 -849943 -440021 -128343 -78954 -188604 -323395
30708 -323395 -472017 -623247 -690987 -676418 -749456 -1015626 -1308782 -1383487 -1248341 -1137898
30698 -1137898 -1184548 -1286828 -1306190 -1236832 -1147638 -1090700 -1114461 -1248261 -1410647 -1433141 -1257939
30687 -1257939 -1050948 -1038306 -1252267 -1492579 -1535931 -1356380 -1133901 -1050041 -1093600 -1105203
30677 -1105203 -1002523 -875499 -828345 -836303 -841638 -888604 -1037951 -1226241 -1353764 -1447264 -1575016
30666 -1575016 -1663192 -1596711 -1466397 -1479084 -1608700 -1589427 -1324167 -1049027 -970006 -975679 -895053
30655 -895053 -839455 -1042368 -1471950 -1844621 -1980509 -1944675 -1862570 -1789844 -1773952 -1869996 -2043120
30644 -2043120 -2166327 -2154260 -2029258 -1860386 -1721843 -1696343 -1814527 -1984647 -2073387 -2060699
30634 -2060699 -2028356 -2002431 -1919865 -1775348 -1691498 -1780541 -2004497 -2232682 -2390385 -2488408
30624 -2488408 -2532815 -2484193 -2341121 -2222152 -2286820 -2543369 -2797296 -2865463 -2800463 -2799844 -2921623
30613 -2921623 -3038207 -3083114 -3157494 -3313486 -3420890 -3396366 -3403102 -3618769 -3917708 -4022708
30603 -4022708 -3921548 -3886012 -4069827 -4320508 -4443619 -4446001 -4428134 -4406949 -4353819 -4281209 -4193956
30592 -4193956 -4055619 -3875395 -3721546 -3587147 -3371187 -3067561 -2822108 -2686397 -2467358
30583 -2467358 -1997363 -1443457 -1130578 -1096452 -1041961 -753152 -376952 -186856 -216185 -250119
30573 -250119 -112189 159645 404324 510755 485065 412873 396704 504564 733631 1004936
30563 1004936 1205173 1257088 1167247 1013144 884746 830566 841472 869711 863465 794307 663663
30552 663663 501275 373115 369270 530235 767511 903688 830464 608150 393363 304036
30542 304036 364373 509957 604604 535004 368039 339807 579256 901692 1012456 878803
30532 878803 737548 736141 751856 627857 419795 292645 289409 331793 379376 462239 585155
30521 585155 699928 766962 782272 758380 722160 704193 695445 655602 594657 583348 638466
30510 638466 673090 628539 582293 630667 717620 690640 508824 296236 184577 181498 206349
30499 206349 193891 144099 106575 125799 186423 226864 219929 206021 226460 268168 299130 305103
30487 305103 265273 165605 79455 145012 383869 616111 648973 494555 314096 210612
30477 210612 179808 203697 261462 276609 180141 22620 -73897 -60705 23621 137064 226237
30466 226237 195101 25644 -113827 -46251 153696 255225 211058 190205 256498 260200 133788
30455 133788 53544 150498 259623 160988 -67793 -163618 -65610 30902 -9051 -89494 -66334
30444 -66334 51280 148106 158198 110659 64935 43905 28381 14701 56893 195219 345710
30433 345710 358482 220618 89887 65759 57045 -20843 -59649 61489 218611 183756 -25523
30422 -25523 -166626 -141729 -114269 -204081 -290288 -228752 -82381 10129 59489 161849 299424
30411 299424 361129 316844 238243 170673 99221 32921 24832 100266 225753 340260 372406
30400 372406 265704 52766 -130963 -181610 -147517 -144578 -184765 -175395 -68484 79594 191651
30389 191651 231814 191357 96981 33007 71059 168746 212124 162103 86357 53456 79120
30378 79120 163329 275285 312303 207479 86732 159538 410868 576149 506050 372021
30368 372021 368923 391198 224303 -58086 -157189 9832 184493 134867 -57549 -163861
30358 -163861 -95806 71198 231877 301530 229294 60344 -80979 -137287 -173107 -230748 -232980
30347 -232980 -110339 68887 191608 240093 238358 143928 -72054 -285350 -303154 -93448
30337 -93448 169165 294792 247351 133627 89651 166704 278451 282997 153664 16832 -21390
30326 -21390 -5026 -20276 -57519 -79804 -126664 -215903 -232142 -73630 158925 287498 303096
30315 303096 303625 264060 106174 -52902 -6791 180512 224166 80582 36843 222382 364882
30304 364882 233875 19311 -10629 30836 -119641 -367172 -380264 -149528 -32490 -213807
30294 -213807 -467052 -542372 -494626 -494176 -551638 -585369 -580184 -528541 -361887 -90381 107092
30283 107092 84202 -63487 -131646 -94388 -121939 -327407 -609131 -766590 -709663 -526351
30273 -526351 -363870 -263243 -137118 78064 307763 444324 512337 613331 724274 689582
30263 689582 443795 126631 -64505 -43101 159618 431071 588296 493605 224580 6250
30253 6250 -82092 -185524 -385419 -515732 -415243 -207923 -130212 -178766 -151939 4505 120491
30242 120491 81346 -23052 -85582 -142608 -254415 -355178 -337834 -223490 -150617 -214498 -366793
30231 -366793 -461336 -383511 -159823 54976 123952 46978 -93722 -253957 -415800 -504114
30221 -504114 -443325 -300047 -242403 -324393 -422696 -425202 -360948 -285038 -167816 -3538 82216
30210 82216 -21675 -219956 -311351 -255611 -201851 -254466 -351872 -405735 -424521 -431987 -374963
30199 -374963 -211951 -28870 32941 -61148 -219923 -341244 -376182 -307632 -153927 4215
30189 4215 73892 37264 -65603 -222902 -429473 -584554 -543830 -331414 -178378 -242685 -378430
30178 -378430 -322321 -65770 112132 -6419 -327786 -583838 -610750 -440805 -211522 -55183
30168 -55183 -20109 -39947 -12252 73331 142910 180164 256264 377048 422861 330446 222078
30157 222078 220483 222166 31239 -311322 -522962 -443531 -242758 -180869 -284078 -369851 -319139
30146 -319139 -195206 -103259 -37090 94466 330800 583729 699260 600983 380835 229874
30136 229874 252795 357513 360021 206247 54224 99537 337891 563815 623550 596051 654798
30125 654798 808123 896262 840640 761114 794790 913825 1003065 1021690 989550 898213 759050
30114 759050 679264 750667 890024 924461 825641 727157 708452 702089 642041 566960 522773
30103 522773 481560 423434 396862 426065 451132 438895 465130 586523 699296 648856 459104
30092 459104 334362 405458 559627 584120 439735 309144 343916 433873 333453 10907
30082 10907 -273110 -312363 -237992 -295469 -441935 -396894 -76940 263682 382761 317916 207549
30071 207549 57466 -157859 -328542 -329133 -197272 -32204 176747 448569 644364 613711
30061 613711 445180 355607 359756 272600 50103 -96804 721 238491 404291 444629 462554
30050 462554 529311 590521 535207 324763 70658 -42002 40260 164041 186281 188489 323207
30039 323207 515946 543716 400214 320318 378888 345000 89243 -122668 6153 323934
30029 323934 414591 181296 -58312 -61728 45229 48250 -34819 -71004 -70293 -125672 -185429 -91958
30017 -91958 153086 333890 293484 145927 118911 244211 322961 208310 11948 -50591
30007 -50591 43606 107218 26805 -67267 5321 206943 335604 305677 228618 196763 133701
29996 133701 -55786 -293014 -407382 -366900 -306814 -334291 -411486 -447286 -405479 -292304 -136123
29985 -136123 -26302 -65952 -207315 -237604 -45609 185634 207719 65494 29651 188191
29975 188191 337809 333715 301257 365643 398764 249488 53030 43180 163761 166521 51255
29964 51255 73833 266071 285522 -87490 -569153 -723432 -518570 -281400 -205360 -174785
29954 -174785 -59076 71849 98401 45667 28617 97588 212427 308335 333088 267391 154661
29943 154661 77675 71925 89176 73389 45740 79146 195933 323149 366480 315562 244791
29932 244791 199568 123340 -55226 -288578 -434688 -417886 -297362 -164654 -50061 41052
29922 41052 81606 70292 66574 117013 186333 209977 175550 110103 31912 -39763 -70006 -47189
29910 -47189 1018 57968 131820 197942 203688 163101 157192 196803 188818 95265 5661 -26397
29898 -26397 -80827 -194347 -232968 -96037 91278 184809 291168 578826 909492 960547
29888 960547 700844 440483 369273 349088 246624 156583 138256 26768 -262097 -480154
29878 -480154 -378696 -116610 -34564 -136827 -119911 125167 359419 378144 265717 189833
29868 189833 183277 236185 389885 599117 676932 537810 363187 362519 478814 508039 428145
29857 428145 407346 514304 621772 621488 552539 458329 289533 61573 -28674 191878 605123
29846 605123 892476 891633 738797 634961 589717 468081 220516 -26699 -110239 -6782
29836 -6782 150787 220141 186841 135773 107876 52055 -57788 -138072 -99892 19599 116575
29825 116575 158042 157284 76502 -93965 -205189 -99841 108109 134783 -46931 -142726 -8834
29814 -8834 94243 -73215 -311660 -292755 -98307 -79406 -272946 -356526 -191775 -26879
29804 -26879 -60629 -145005 -81917 63378 138214 174152 279366 413908 456714 391903 294850
29793 294850 232760 264407 399858 484145 305340 -77708 -321265 -244493 -73927 -76432 -184048
29782 -184048 -202685 -160021 -164669 -124393 64667 214652 102911 -93643 -36028 176003 106594
29771 106594 -287445 -514369 -280581 74778 119620 -65952 -133461 -34563 8333 -63088
29761 -63088 -76939 58575 242690 355775 346886 182600 -114784 -409183 -579610 -660834
29751 -660834 -721829 -690766 -482700 -233588 -189276 -370797 -547876 -560187 -482438 -439864 -436573
29740 -436573 -426587 -403428 -344605 -190368 46844 249725 329926 295758 144001 -176570 -598683
29729 -598683 -864264 -776074 -464671 -254642 -280987 -378211 -365360 -299611 -366190 -600560 -823655
29718 -823655 -840293 -633015 -351313 -157893 -110030 -163325 -244228 -292078 -250113 -83073 140666
29707 140666 222990 2140 -413580 -672487 -536142 -160506 85690 50324 -90196 -143042
29697 -143042 -141215 -194284 -265402 -253679 -190199 -166472 -129188 43477 266413 274234 -1578
29686 -1578 -273877 -248717 3713 180305 157485 100992 188842 382780 512087 481471 342029
29675 342029 205908 128131 57322 -95624 -322001 -480077 -446955 -280007 -150655 -123159
29665 -123159 -96843 -2484 50309 -73262 -287305 -339029 -138175 95825 106754 -70466
29655 -70466 -190030 -158668 -146926 -304519 -525897 -599001 -477027 -285730 -134739 -36486
29645 -36486 42716 159057 362908 583337 610559 340312 -17196 -148237 -35255 43479
29635 43479 -73147 -219698 -179525 6425 122436 55989 -114790 -240525 -229862 -111775
29625 -111775 -10200 -5117 -20737 64610 221029 307716 290677 253822 201763 60271 -104167
29614 -104167 -108461 32136 67212 -95902 -222394 -134008 -677 -28378 -99883 -10137 135146
29603 135146 81871 -139352 -273648 -260299 -265404 -330308 -309508 -178366 -111224 -196848 -316462
29592 -316462 -355862 -325270 -231908 -44600 174154 295773 315143 329556 328088 209802 10530
29581 10530 -116438 -149783 -188986 -198868 -51818 152983 138479 -103614 -244819 -121895 23360
29570 23360 -21908 -94896 13669 165368 103577 -125103 -271201 -260994 -210022 -175674 -142793
29559 -142793 -156447 -238936 -264215 -131991 20138 -9350 -180359 -283432 -237632 -117210
29549 -117210 33153 199193 288520 233446 141482 147795 190534 130322 4798 -55950 -82105
29538 -82105 -193702 -353665 -440578 -492731 -605552 -653036 -426888 -31826 181935 101133
29528 101133 -43680 -80000 -75998 -67192 50118 235713 249815 49345 -57850 145040 446034
29517 446034 522390 368094 179967 24873 -131214 -228417 -204480 -167420 -248437 -377363
29507 -377363 -406966 -357143 -329275 -284023 -134741 17235 -21019 -243953 -466538 -592234
29497 -592234 -651432 -616334 -419243 -160493 -69150 -209762 -407944 -498862 -476376 -372121
29487 -372121 -179412 43831 165859 143486 54482 -70703 -281095 -513403 -558130 -327367
29477 -327367 -2925 197631 259341 254098 149139 -84608 -291986 -286757 -140885 -107082 -251473
29466 -251473 -366829 -295015 -143109 -82057 -90444 -43486 46118 47469 -59322 -131883 -70727
29455 -70727 46685 91953 53860 6042 -31894 -110612 -245778 -374450 -430060 -413285 -374194
29444 -374194 -355944 -365057 -371224 -330435 -229810 -111490 -33015 -5357 15601 86524 236107
29433 236107 436159 587941 580035 410193 216830 133961 150793 179338 208269 283336 368764
29422 368764 364570 268001 185796 163817 139459 97276 120809 224139 282800 228627 175235
29411 175235 235092 341670 383258 381525 377243 269212 -18610 -296046 -278588 19724 291823
29400 291823 341245 258502 171206 62552 -74187 -123834 -35665 44371 -16288 -119102 -86474
29389 -86474 59863 139821 89189 36783 105103 251745 337386 282464 130619 -13492 -98271
29378 -98271 -171088 -285501 -386052 -361966 -215597 -78322 -35283 -43766 -64927 -144979 -284046
29367 -284046 -351512 -256546 -111562 -89698 -180591 -220874 -126325 32033 153819 194252 148261
29356 148261 61459 36117 121630 221700 207583 87657 -33960 -106757 -119054 -17847 175203
29345 175203 236457 -24545 -406395 -463845 -85292 336171 431637 307049 277849 373069
29335 373069 370917 202272 33144 -25260 -44408 -99521 -162503 -208120 -261757 -305566 -282137
29324 -282137 -220113 -212725 -245248 -199725 -70150 -1952 -49841 -76235 -206 31828 -106305
29313 -106305 -250936 -159251 86002 148521 -63686 -227815 -53490 293954 406426 168435
29303 168435 -129501 -203604 -106609 -64827 -128887 -137241 14721 220444 321062 316457 333407
29292 333407 432210 541480 585113 586305 604930 630084 594552 471853 303850 138278 -8871
29281 -8871 -119337 -151752 -89139 22279 122467 209202 312986 410434 437884 419865 495439
29270 495439 722826 915426 822314 486962 264433 390191 667236 730823 530881 354803
29260 354803 397875 529765 545560 455654 400205 405327 375374 269676 163165 151795 270689
29249 270689 465756 588218 490624 213987 7428 58303 268432 412661 448716 519999
29239 519999 697377 891929 1021735 1104291 1166387 1207578 1265697 1366662 1401784 1239897
29229 1239897 991893 944459 1144782 1277500 1103493 812226 728369 837746 867816 732399
29219 732399 598466 536260 407617 171850 40108 180002 442014 536448 376703 115236
29209 115236 -80020 -157222 -143426 -103153 -123458 -242782 -381467 -405823 -281151 -128379
29199 -128379 -108762 -254156 -422227 -449760 -362458 -370331 -589022 -827921 -783881 -435601 -102466
29188 -102466 -76530 -328550 -633290 -844715 -946630 -948709 -870217 -770673 -690121 -605588 -522610
29177 -522610 -526200 -639491 -724817 -661464 -543733 -546370 -658557 -727507 -711459 -682930 -614725
29166 -614725 -412667 -184562 -209328 -539705 -869034 -921840 -761936 -568815 -347816 -85028
29156 -85028 25363 -179291 -484823 -527569 -325737 -254572 -469798 -684554 -622493 -398905
29146 -398905 -281007 -299438 -304366 -249839 -213640 -226748 -258543 -308178 -370160 -373189 -278197 -168128
29134 -168128 -124117 -96254 -20754 34002 -10591 -71600 -32030 41166 3065 -112666 -160509
29123 -160509 -152336 -210335 -277911 -168872 59582 90941 -179131 -436415 -384203 -143963 -12748
29112 -12748 -29888 -36648 -10168 -55304 -150665 -180775 -187245 -323243 -550068 -630831 -478994
29101 -478994 -290882 -251932 -310740 -348711 -386771 -469757 -486891 -304801 -25145 77734 -98545
29090 -98545 -334961 -347137 -110943 139569 195487 64204 -127315 -316716 -506395 -634804
29080 -634804 -586551 -364205 -141267 -79183 -167610 -297787 -399354 -433126 -358279 -221626
29070 -221626 -188836 -350336 -566140 -644878 -606024 -600266 -638892 -609704 -523761 -505249 -524479
29059 -524479 -398216 -127829 12249 -144282 -397990 -474233 -396749 -374741 -444662 -444171 -291868
29048 -291868 -104196 -34850 -124551 -305493 -465566 -527339 -521518 -530592 -522844 -363014 -69624
29037 -69624 94036 -57335 -347627 -477681 -445922 -493577 -687838 -829251 -787773 -670765
29027 -670765 -587834 -485912 -333116 -263183 -380517 -563348 -615331 -513528 -371338 -247392
29017 -247392 -135620 -80157 -155539 -357635 -615110 -863920 -1013094 -914015 -520863 -50185
29007 -50185 187796 131674 -2090 -43569 -45176 -75976 -41820 134259 302146 274030 150584
28996 150584 206183 436751 489540 166409 -232116 -286538 -41911 60339 -201563 -559974
28986 -559974 -669416 -546480 -453330 -511270 -610086 -610577 -471754 -226995 19409 103922 -46327
28975 -46327 -282294 -374906 -288401 -197425 -229676 -317907 -341259 -300503 -288625 -357728 -473671
28964 -473671 -562932 -568421 -490424 -393222 -345052 -347589 -352913 -338517 -325483 -335427 -370226 -415292
$$ [...]
##END NTUPLES=NMR SPECTRUM
##END=
