##TITLE=31Pdec_PR185_8_2
 S2O, 48 sc
 22.11.2019
##JCAMPDX= 6.0         $$ Bruker NMR JCAMP-DX V2.0
##DATA TYPE= NMR SPECTRUM
##DATA CLASS= NTUPLES
##ORIGIN= UXNMR, Bruker Analytische Messtechnik GmbH
##OWNER= root
$$ XWIN-NMR		Version 3.5
$$ Fri Nov 22 14:20:17 2019 Russian Standard Time (UT+4h)  she@DPX200
##.OBSERVE FREQUENCY= 81.013821
##.OBSERVE NUCLEUS= ^31P
##.ACQUISITION MODE= SIMULTANEOUS
##.ACQUISITION SCHEME= undefined
##.AVERAGES= 48
##.DIGITISER RES= 17
##SPECTROMETER/DATA SYSTEM= spect
##.PULSE SEQUENCE= zgpg30
##.SOLVENT NAME= CDCl3
##.SHIFT REFERENCE= (INTERNAL, CDCl3, 0, 182.463)
##AUDIT TRAIL= $$ (NUMBER, WHEN, WHO, WHERE, WHAT)
$$ ##TITLE= Audit trail, XWIN-NMR		Version 3.5
$$ ##JCAMPDX= 5.01
$$ ##ORIGIN= Bruker BioSpin GmbH
$$ ##OWNER= she
$$ F:/spectra/data/she/nmr/P31/1/pdata/1/auditp.txt
$$ ##AUDIT TRAIL=  $$ (NUMBER, WHEN, WHO, WHERE, WHAT)
(   1,<2019-11-22 14:19:08.34 +0400>,<she>,<DPX200>,
      <continue with go, POWCHK disabled, PULCHK disabled
       configuration hash MD5:
       00 E9 B6 7A A2 85 ED C7 34 08 36 98 17 FE 4E 26
       data hash MD5: 32K
       26 5F 8C B2 61 CA F8 D0 23 67 4E 63 6D 18 92 70>)
(   2,<2019-11-22 14:19:11.17 +0400>,<she>,<DPX200>,
      <Start of raw data processing
       efp BC_mod = 2 LB = 1 FT_mod = 6 PKNL = 1 PHC0 = -1307.025 PHC1 = 15.60095 SI = 64K 
       data hash MD5: 64K
       34 9B 4F 36 AC 32 A0 5F 38 A5 90 13 D3 A8 A0 CA>)
$$ ##END=
$$ 
$$ hash MD5
$$ F7 C0 73 7C B8 42 96 8F A6 F3 2D DC 7F 9A EB E2
##$RELAX= 
##$RELAX= 
##$RELAX= 
##$RELAX= 
##$RELAX= 
##$RELAX= 
##$RELAX= 
##$RELAX= 
$$ Bruker specific parameters
$$ --------------------------
##$DU= <F:/spectra>
##$EXPNO= 1
##$NAME= <P31>
##$PROCNO= 1
##$TYPE= <nmr>
##$USER= <she>
##$AMP= (0..31)
100 100 100 100 100 100 100 100 100 100 100 100 100 100 100 100 100 100 
100 100 100 100 100 100 100 100 100 100 100 100 100 100 
##$AQSEQ= 0
##$AQ_mod= 1
##$AUNM= <au_zg>
##$AUTOPOS= <>
##$BF1= 81.014009
##$BF2= 200.13
##$BF3= 200.13
##$BF4= 200.13
##$BF5= 200.13
##$BF6= 200.13
##$BF7= 200.13
##$BF8= 200.13
##$BYTORDA= 1
##$CFDGTYP= 0
##$CFRGTYP= 5
##$CHEMSTR= <none>
##$CNST= (0..31)
1 1 145 1 1 1 1 1 1 1 1 1 1 1 1 1 1 1 1 1 1 1 1 1 1 1 1 1 1 1 1 1 
##$CPDPRG= <waltz16>
##$CPDPRG1= <>
##$CPDPRG2= <waltz16>
##$CPDPRG3= <>
##$CPDPRG4= <mlev>
##$CPDPRG5= <mlev>
##$CPDPRG6= <mlev>
##$CPDPRG7= <mlev>
##$CPDPRG8= <mlev>
##$CPDPRGB= <>
##$CPDPRGT= <>
##$D= (0..31)
0 1 0 0 0 0 0 0 0 0 0 0.03 2e-05 3e-06 0 0 0 0 0 0 0 0 0 0 0 0 0 0 0 0 
0 0 
##$DATE= 1574417848
##$DBL= (0..7)
120 120 120 11 120 120 24 19 
##$DBP= (0..7)
150 150 150 150 150 150 150 150 
##$DBP07= 0
##$DBPNAM0= <>
##$DBPNAM1= <>
##$DBPNAM2= <>
##$DBPNAM3= <>
##$DBPNAM4= <>
##$DBPNAM5= <>
##$DBPNAM6= <>
##$DBPNAM7= <>
##$DBPOAL= (0..7)
0.5 0.5 0.5 0.5 0.5 0.5 0.5 0.5 
##$DBPOFFS= (0..7)
0 0 0 0 0 0 0 0 
##$DE= 6
##$DECBNUC= <off>
##$DECIM= 4
##$DECNUC= <off>
##$DECSTAT= 4
##$DIGMOD= 1
##$DIGTYP= 9
##$DL= (0..7)
0 0 52 120 120 21 21 25 
##$DP= (0..7)
$$ [...]
##$SUBNAM2= <"">
##$SUBNAM3= <"">
##$SUBNAM4= <"">
##$SUBNAM5= <"">
##$SUBNAM6= <"">
##$SUBNAM7= <"">
##$SUBNAM8= <"">
##$SUBNAM9= <"">
##$SW= 369.568048894756
##$SWIBOX= (0..15)
0 1 3 0 0 0 0 0 0 0 0 0 0 0 0 0 
##$SW_h= 29940.119760479
##$TD= 32768
##$TD0= 1
##$TE= 0
##$TE2= 300
##$TE3= 300
##$TEG= 300
##$TL= (0..7)
0 120 53 12 22 120 120 120 
##$TP= (0..7)
150 150 150 150 150 150 150 150 
##$TP07= 0
##$TPNAME0= <>
##$TPNAME1= <>
##$TPNAME2= <>
##$TPNAME3= <>
##$TPNAME4= <>
##$TPNAME5= <>
##$TPNAME6= <>
##$TPNAME7= <>
##$TPOAL= (0..7)
0.5 0.5 0.5 0.5 0.5 0.5 0.5 0.5 
##$TPOFFS= (0..7)
0 0 0 0 0 0 0 0 
##$TUNHIN= 0
##$TUNHOUT= 0
##$TUNXOUT= 0
##$USERA1= <user>
##$USERA2= <user>
##$USERA3= <user>
##$USERA4= <user>
##$USERA5= <user>
##$V9= 5
##$VALIST= <valist>
##$VCLIST= <CCCCCCCCCCCCCCC>
##$VD= 0
##$VDLIST= <DDDDDDDDDDDDDDD>
##$VPLIST= <PPPPPPPPPPPPPPP>
##$VTLIST= <TTTTTTTTTTTTTTT>
##$WBST= 1024
##$WBSW= 4
##$XGAIN= (0..3)
0 0 0 0 
##$XL= 0
##$YL= 0
##$YMAX_a= 21309
##$YMIN_a= -18578
##$ZGOPTNS= <>
##$ZL1= 120
##$ZL2= 120
##$ZL3= 120
##$ZL4= 120
##$ABSF1= 0
##$ABSF2= 0
##$ABSG= 0
##$ABSL= 0
##$ALPHA= 0
##$AQORDER= 0
##$ASSFAC= 0
##$ASSFACI= 0
##$ASSFACX= 0
##$ASSWID= 0
##$AUNMP= <proc_1d>
##$AZFE= 0.1
##$AZFW= 0.5
##$BCFW= 0
##$BC_mod= 2
##$BYTORDP= 0
##$COROFFS= 0
##$CY= -3
##$DATMOD= 1
##$DC= 0
##$DFILT= <>
##$DTYPP= 0
##$F1P= 0
##$F2P= 0
##$FCOR= 1
##$FTSIZE= 65536
##$FT_mod= 6
##$GAMMA= 0
##$GB= 0
##$INTBC= 1
##$INTSCL= 5.30512e-09
##$ISEN= 30
##$LB= 1
##$LEV0= 0
##$LPBIN= 0
##$MAXI= 10000
##$MC2= 0
##$MEAN= 0
##$ME_mod= 0
##$MI= 50
##$NCOEF= 0
##$NC_proc= -5
##$NLEV= 6
##$NOISF1= 182.463
##$NOISF2= 159.3651
##$NSP= 0
##$NTH_PI= 0
##$NZP= 0
##$OFFSET= 182.463
##$PC= 4
##$PHC0= -1307.025
##$PHC1= 15.60095
##$PH_mod= 1
##$PKNL= yes
##$PPARMOD= 0
##$PSCAL= 0
##$PSIGN= 0
##$REVERSE= no
##$SF= 81.0140089999434
##$SI= 65536
##$SIGF1= 159.3651
##$SIGF2= -187.1042
##$SINO= 113.3802
##$SIOLD= 16384
##$SREGLST= <1H.CDCl3>
##$SSB= 0
##$STSI= 65536
##$STSR= 0
##$SW_p= 29940.119760479
##$SYMM= 0
##$S_DEV= 0
##$TDeff= 32768
##$TDoff= 0
##$TI= <>
##$TILT= no
##$TM1= 0
##$TM2= 0
##$TOPLEV= 0
##$USERP1= <user>
##$USERP2= <user>
##$USERP3= <user>
##$USERP4= <user>
##$USERP5= <user>
##$WDW= 1
##$XDIM= 65536
##$YMAX_p= 454742676
##$YMIN_p= -9369767
$$ End of Bruker specific parameters
$$ ---------------------------------
##NTUPLES= NMR SPECTRUM
##VAR_NAME=  FREQUENCY,     SPECTRUM/REAL,   SPECTRUM/IMAG
##SYMBOL=    X,             R,               I
##VAR_TYPE=  INDEPENDENT,   DEPENDENT,       DEPENDENT
##VAR_FORM=  AFFN,          ASDF,            ASDF
##VAR_DIM=   65536,         65536,           65536
##UNITS=     HZ,            ARBITRARY UNITS, ARBITRARY UNITS
##FACTOR=    0.456856943014862, 1,           1
##FIRST=     14782.0589164792, 0,            0
##LAST=      -15158.0608439998, 0,           0
##MIN=       -15158.0608439998, -9369767,    0
##MAX=       14782.0589164792, 454742676,    0
$$ Real data points
##PAGE= N=1
##DATA TABLE= (X++(R..R)), XYDATA
$$ [...]
$$ plain form
43552 2142983 2122760 693827 -359423 377974 1826546 1962875 552464 -823694 -957921
43543 -957921 -206794 325121 84579 -392967 42316 1834361 3735469 3819671 1835299
43534 1835299 -260220 -707126 -56989 -23051 -958667 -1653190 -1252164 -163332 864957
43525 864957 1458387 1359103 526374 -295129 -124232 768397 864671 -553679 -2182590 -2282590
43515 -2282590 -930333 163857 -174814 -1408064 -2262955 -2173797 -1496486 -751517 -66728
43506 -66728 686628 1447027 1826621 1523012 801324 309276 303057 320733 -134027 -811723
43496 -811723 -1005606 -541455 -38032 -58500 -363400 -266871 465189 1336491 1652547 1141084
43486 1141084 135391 -664765 -709423 -110966 423980 419446 273852 673001 1377451 1184170
$$ packed form
43552B142983k0223j428933j053250P37397J448572J36329j410411j376158j34227
43543i57921P51127N31915k40542m77546M35283J792045J901108Q4202j984372
43534A835299k095519m46906O50137L3938r35616o94523M01026J088832J028289
43525H64957N93430r9284q32729q21503J70897Q92629R6274j418350j628911j00000
43515b282590J352257J094190l38671j233250q54891Q9158O77311P44969O84789
43506f6728P53356P60399L79594l03609p21688m92048o219J7676m54760o77696
43496h11723j93883M64151N03423k0468l04900R6529P32060Q71302L16056n11463
43486A141084j005693q00156m4658N98457N34946m534j45594L99149P04450j93281
$$ plain form
43476 1184170 -584406 -3009003 -4464845 -4294881 -3112457 -1737695 -528423 335527
43468 335527 723147 917087 1407768 1997415 1779822 500498 -692376 -588128 408160
43459 408160 794249 990 -999192 -1211915 -868982 -740191 -862218 -589389 371096
43450 371096 1526568 2157450 1981530 1313190 798339 912436 1518328 2011885 2045179 1881904
43440 1881904 1799525 1467694 459051 -752614 -1021019 -6037 1155846 1138792 16278
43431 16278 -1004702 -1207637 -999858 -870794 -509099 546372 1870913 2451017 1905193
43422 1905193 874211 217320 302917 1084259 2271899 3220090 3199104 2181692 982856
43413 982856 237168 -371313 -1369464 -2379871 -2501634 -1690761 -946618 -944776 -1179462 -794851
$$ packed form
43476A184170j768576k424597j455842J69964J182424J374762J209272Q63950
43468C35527L87620J93940M90681N89647k17593j279324j192874J04248R96288
43459D08160L86089p93259j000182k12723L42933J28791j22027K72829R60485
43450C71096J155472O30882j75920o68340n14851J14097O05892M93557L3294j63275
43440A881904q2379l31831j008643j211665k68405J014982J161883j7054j122514
43431A6278j020980k02935K07779J29064L61695J055471J324541N80104n45824
43422A905193j030982o56891Q5597P81342J187640R48191k0986j017412j198836
43413I82856p45688o08481r98151j010407j21763Q10873P44143J842k34686L84611
$$ plain form
43403 -794851 306699 1578580 2514449 2723510 1850100 171328 -1021781 -541923 1135342
43394 1135342 2227018 1806062 881833 871006 1638963 1833569 878311 -248243 -392077
43385 -392077 279995 597205 -119269 -1316100 -1901231 -1366924 -185128 710271 759556
43376 759556 218838 -151505 122018 735443 954017 407115 -585816 -1457329 -1939123 -2072308
43366 -2072308 -1914522 -1514486 -1087090 -906509 -982691 -1066137 -989499 -756467 -308641 387888
43356 387888 899339 481044 -902944 -2083670 -1796606 -163414 1468657 2106889 1962922
43347 1962922 1697417 1469588 1025764 261071 -643590 -1334065 -1322137 -302592 1298820
43338 1298820 2473228 2639396 2184762 1749835 1409713 917538 296637 -286601 -842112
$$ packed form
43403g94851J101550J271881R35869K09061q73410j678772j193109M79858J677265
43394A135342J091676m20956r24229j0827P67957J94606r55258j126554j43834
43385c92077O72072L17210p16474j196831n85131N34307J181796Q95399M9285
43376G59556n40718l70343K73523O13425K18574n46902r92931q71513m81794j33185
43366b072308J57786M00036M27396J80581p6182q3446P6638K33032M47826O96529
43356C87888N11451m18295j383988j180726K87064J633192J632071O38232j43967
43347A962922k65505k27829m43824p64693r04661o90475J1928J019545J601412
43338A298820J174408J66168m54634m34927l40122m92175o20901n83238n55511
$$ plain form
43329 -842112 -1263144 -1155676 -531668 -189530 -679427 -1370245 -1454446 -1410588 -2229696 -3424514
43319 -3424514 -3326832 -1600305 34950 190535 -435599 -570621 -386604 -757194 -1412440
43310 -1412440 -1342400 -615844 -326309 -783656 -1089575 -697064 -179023 -15361 335322 1455794
43300 1455794 2772138 3132030 2274137 1088061 531682 779766 1406552 1953937 2172446
43291 2172446 2018888 1711834 1686873 2150613 2582003 2047094 348528 -1433797 -2082502
43282 -2082502 -1725163 -1446407 -1493901 -917177 646701 1928826 1639766 353253 -278161
43273 -278161 276315 1087628 1354857 1218779 1020280 763638 461090 202195 -214013 -977061
43263 -977061 -1600555 -1387033 -586462 -215817 -638904 -1213622 -1439412 -1477147 -1384277 -934717
$$ packed form
43329h42112m21032J07468O24008L42138m89897o90818q4201M3858q19108j194818
43319c424514R7682J726527J635255J55585o26134j35022J84017l70590o55246
43310a412440P0040P26556K89535m57347l05919L92511N18041J63662L50683J120472
43300A455794J316344L59892q57893j186076n56379K48084O26786N47385K18509
43291B172446j53558l07054k4961M63740M31390n34909j698566j782325o48705
43282b082502L57339K78756m7494N76724J563878J282125k89060j286513o31414
43273b78161N54476Q11313K67229j36078j98499k56642l02548k58895m16208p63048
43263i77061o23494K13522Q00571L70645m23087n74718k25790l7735R2870M49560
$$ plain form
43253 -934717 -499852 -940016 -2103790 -2567294 -1571633 -196104 206085 -212874 -491870
43244 -491870 -431007 -374892 -168180 467898 1043993 980227 750705 1133338 1689425 1380447
43234 1380447 537385 654832 1953191 2632266 1281071 -1079803 -2289535 -1680124 -487677
43225 -487677 4289 -153846 -90338 578265 1218325 887420 -443804 -1488858 -826192
43216 -826192 1372735 3182288 2876588 860465 -796350 -744598 236309 510351 -196517
43207 -196517 -613383 37278 787962 376328 -793270 -1275604 -845261 -717181 -1346470
43198 -1346470 -1553422 -600447 268046 -332880 -1555943 -1435482 111558 1146698 604470
43189 604470 -342854 -326827 236413 149969 -520145 -548329 614382 2043486 2494093 1807096
$$ packed form
43253i34717M34865m40164j163774m63504R95661J375529M02189m18959k78996
43244d91870O0863N6115K06712O36078N76095o3766k29522L82633N56087l08978
43234A380447q43062J17447J298359O79075j351195k360874j209732O09411J192447
43225d87677M91966j58135O3508O68603O40060l30905j331224j045054O62666
43216h26192K198927J809553l05700k016123j656815N1752R80907K74042p06868
43207a96517m16866O50661P50684m11634j169598m82334M30343J28080o29289
43198a346470k06952R52975Q68493o00926j223063J20461J547040J035140n42228
43189F04470r47324J6027N63240q6444o70114k8184J162711J429104M50607o86997
$$ plain form
43179 1807096 905406 596161 691780 472022 -221195 -856676 -1203207 -1721523 -2573765 -2978924
43169 -2978924 -2287399 -1106210 -431160 -117632 701271 1981867 2783321 2819716 2724140
43160 2724140 2673274 2058956 832441 -99173 -296500 -417526 -864266 -1004290 -485351
43151 -485351 -159898 -713809 -1356312 -1000025 31462 650439 727353 907163 1147071 794235
43141 794235 4752 -203102 489511 1123538 790894 -215441 -931917 -866400 -310646 131612
43131 131612 131619 -54453 119049 705786 1032899 597716 -115600 -258664 172593 405628
43121 405628 83136 -286419 -153585 372813 832649 998664 971605 967140 1104422 1221179
43111 1221179 948585 190931 -594634 -877783 -676996 -404605 -263141 -146552 20298
$$ packed form
43179A807096r01690l09245R5619k19758o93217o35481l46531n18316q52242m05159
43169b978924O91525J181189O75050L13528Q18903J280596Q01454L6395r5576
43160B724140n0866o14318j226515r31614j97327j21026m46740j40024N18939
43151d85351L25453n53911o42503L56287J031487O18977P6914J79810K39908l52836
43141G94235p89483k07854O92613O34027l32644j006335p16476O5517N55754M42258
43131A31612Pj86072J73502N86737L27113m35183p13316j43064M31257K33035
43121D05628l22492l69555J32834N26398M59836J66015k7059m465J37282J16757
43111A221179k72594p57654p85565k83149K00787K72391J41464J16589J66850
$$ plain form
43102 20298 232321 581447 1138086 1774219 2379732 3023122 3587816 3590613 2814033 1807267
43092 1807267 1251497 1122517 988916 735786 338810 -606942 -2183460 -3290162 -2658186
43083 -2658186 -739108 580660 418424 -43281 577198 1906574 2476251 1684821 306463
43074 306463 -628721 -785505 -476662 -183183 -191176 -489184 -924661 -1319599 -1306442 -401152
43064 -401152 1256789 2506142 2266583 986492 166899 378035 675409 223359 -529028
43055 -529028 -839259 -906112 -1283820 -1703386 -1403647 -338748 719976 1146497 937263
43046 937263 379578 -208739 -481997 -262601 236585 585214 455566 -232736 -1150040 -1529773
43036 -1529773 -859752 275689 709130 244980 -102827 263053 663182 501170 401925
$$ packed form
43102B0298K12023L49126N56639O36133O05513O43390N64694K797p76580j006766
43092A807267n55770j28980j33601k53130l96976r45752j576518j106702O31976
43083b658186J919078J319768j62236m61705O20479J329376N69677p91430j378358
43074C06463r35184j56784L08843K93479p993k98008m35477l94938J3157R05290
43064d01152J657941J249353k39559j280091q19593K11136K97374m52050p52387
43055e29028l10231o6853l77708m19566K99739J064899J058724M26521k09234
43046I37263n57685n88317k73258K19396M99186L48629j29648o88302r17304l79733
43036a529773O70021J135441M33441m64150l47807L65880M00129j62012r9245
$$ plain form
43027 401925 1022959 1687242 1469326 908986 1162825 1914458 1757031 526544 -395664
43018 -395664 -297775 -83040 -542710 -1122229 -1119660 -909048 -1117968 -1515706 -1559756 -1327740
43008 -1327740 -1186056 -1193238 -1430722 -2150223 -2939508 -2634915 -954067 599345 528736 -633525
42998 -633525 -1280128 -1122286 -1205956 -1823343 -1981267 -1131127 -9894 716773 1426980 2471381
42988 2471381 3144754 2642825 1418559 695101 968939 1731771 2397156 2742796 2562830
42979 2562830 1677939 463625 -234245 -54286 340529 17643 -1070969 -1982908 -1833744
42970 -1833744 -726871 452370 969206 720446 -109244 -1413398 -2934092 -4010731 -4048784
42961 -4048784 -3197514 -2162946 -1327601 -443194 722054 1828040 2271154 1820223 818155
$$ packed form
43027D01925O21034O64283k17916n60340K53839P51633j57427j230487r22208
43018c95664R7889K14735m59670n79519K569K10612k08920l97738m4050K32016
43008a327740J41684p182k37484p19501p89285L04593J680848J553412p0609j162261
42998f33525o46603J57842q3670o17387j57924Q50140J121233P26667P10207J044401
42988B471381O73373n01929j224266p23458K73838P62832O65385L45640j79966
42979B562830q84891j214314o97870J79959L94815l22886j088612r11939J49164
42970a833744J106873J179241N16836k48760q29690j304154j520694j076639l8053
42961d048784Q51270J034568Q35345Q84407J165248J105986M43114m50931j002068
$$ plain form
42952 818155 -45623 -156855 465903 955384 385651 -1010925 -1863512 -1222677 302520
42943 302520 1354835 1373600 819243 232869 -189993 -232918 289417 920864 730420 -470679
42933 -470679 -1564946 -1326342 56324 1196889 1218707 719676 810438 1584850 2049903
42924 2049903 1553648 747806 758648 1695022 2513673 2302316 1117326 -525299 -2269534
42915 -2269534 -3638003 -3819895 -2509868 -650531 403118 337495 -111631 -379413 -498473
42906 -498473 -415483 127856 815739 791312 -78071 -745668 -374706 451355 577126 -148011
42896 -148011 -870296 -1011129 -827691 -799768 -1053192 -1394745 -1500193 -1107436 -354784 184203
42886 184203 112427 -308403 -572681 -555661 -365888 69304 728264 1080173 602890 -385031
$$ packed form
42952H18155q63778j11232O22758M89481n69733j396576q52587O40835J525197
42943C02520J052315J8765n54357n86374m22862m2925N22335O31447j90444j201099
42933d70679j094267K38604J382666J140565K1818m99031R0762P74412M65053
42924B049903m96255q05842J0842R36374Q18651k11357j184990j642625j744235
42915b269534j368469j81892J310027J859337J053649o5623m49126k67782j19060
42906d98473Q2990N43339O87883k4427q69383o67597L70962Q26061J25771p25137
42896a48011p22285j40833J83438K7923k53424l41553j05448L92757P52652N38987
42886A84203p1776m20830k64278J7020J89773M35192O58960L51909m77283r87921
$$ plain form
42876 -385031 -1006596 -888795 -404058 45920 370118 474077 291929 175639 579235 1261222
42866 1261222 1482928 1126923 857912 917423 572946 -735476 -2378794 -3300398 -3286526
42857 -3286526 -2796088 -1922325 -368857 1589049 2890675 2765327 1682273 919019 1208494
42848 1208494 1937921 1801553 302761 -1568191 -2377765 -1764853 -496840 774390 2052337
42839 2052337 3210375 3576775 2839102 1717997 1112911 1066626 1196676 1614271 2536277
42830 2536277 3309557 2859368 1181271 -465372 -1073746 -906608 -724843 -650636 -299691
42821 -299691 308617 536612 -84196 -1061225 -1175027 250217 2324986 3292747 2508763
42812 2508763 1235556 1005963 1735846 2226851 2071645 1937802 2111475 2044000 1559690
$$ packed form
42876c85031o21565J17801M84737M49978L24198J03959j82148j16290M03596O81987
42866A261222K21706l56005k69011N9511l44477j308422j643318r21604J3872
42857c286526M90438Q73763J553468J957906J301626j25348j083054p63254K89475
42848A208494P29427j36368j498792j870952q09574O12912J268013J271230J277947
42839B052337J158038L66400p37673j121105o05086m6285J30050M17595R22006
42830B536277P73280m50189j678097j646643o08374J67138J81765P4207L50945
42821b99691O08308K27995o20808r77029j13802J425244K074769R67761p83984
42812B508763j273207k29593P29883M91005j55206j33843J73673o7475m84310
$$ plain form
42803 1559690 1235189 1071098 42852 -2163595 -4036417 -3986247 -2453198 -1108402 -601819
42794 -601819 -417432 -441962 -1049594 -1723799 -1302802 20099 474394 -822735 -2490732
42785 -2490732 -2836503 -2014996 -1184954 -545021 411135 1350194 1350282 525794 41202 417131
42775 417131 978207 1144642 1163958 1253993 1051234 396960 -152374 -111229 279186 570387
42765 570387 643817 420228 -205711 -768123 -440051 623947 1071057 216467 -767913 -499946
42755 -499946 586823 1092541 913821 1168999 2076998 2460909 1619918 379862 -234190
42746 -234190 -364369 -779813 -1697782 -2647413 -2994188 -2332785 -910115 228608 227966 -361184
42736 -361184 -263411 484429 390023 -1092896 -2306140 -1537187 543747 1818019 1445806
$$ packed form
42803A559690l24501j64091j028246k206447j872822N0170J533049J344796N06583
42794f01819J84387k4530o07632o74205M20997J322901M54295j297129j667997
42785b490732l45771Q21507Q30042O39933R56156R39059Q8q24488m84592L75929
42775D17131N61076J66435J9316R0035k02759o54274n49334M1145L90415K91201
42765E70387P3430k23589o25939n62412L28072J063998M47110q54590r84380K67967
42755d99946J086769N05718j78720K55178R07999L83911q40991j240056o14052
42746b34190j30179m15444r17969r49631l46775O61403J422670J138723o42n89150
42736c61184R7773P47840r4406j482919j213244P68953K080934J274272l72213
$$ plain form
42727 1445806 378470 -452120 -1058602 -1501360 -1371475 -625785 -65091 -414737 -1373477
42718 -1373477 -1967867 -1606571 -590368 220766 160601 -659251 -1511818 -1862280 -1785459 -1453907
42708 -1453907 -687856 529036 1478605 1311014 84542 -1320316 -2162716 -2226184 -1552212
42699 -1552212 -531217 -98926 -972983 -2576901 -3454536 -2940109 -1774238 -890755 -308757
42690 -308757 405506 1196996 1615114 1576486 1572829 2150012 3356175 4641155 5274630 4996624
42680 4996624 4215193 3425318 2642442 1712055 909967 699443 991251 1180000 894837
42671 894837 254324 -519307 -1222034 -1571544 -1615451 -2019296 -3123064 -3903506 -2999220 -832360
42661 -832360 580308 339637 -123017 686698 2049935 2175700 750856 -957214 -1993920
$$ packed form
42727A445806j067336q30590o06482m42758J29885P45690N60694l49646r58740
42718a373477n94390L61296J016203Q11134o0165q19852q52567l50462P6821L31552
42708a453907P66051J216892R49569j67591j226472j404858q42400o3468O73972
42699a552212J020995M32291q74057j603918q77635N14427J165871Q83483N81998
42690c08757P14263P91490M18118l8628l657N77183J206163J284980O33475k78006
42680D996624p81431p89875p82876r30387q02088k10524K91808J88749k85163
42671H94837o40513p73631p02727l49510m3907m03845j103768p80442R04286K166860
42661h32360J412668k40671m62654Q09715J363237J25765j424844j708070j036706
$$ plain form
42652 -1993920 -2355216 -2043781 -955306 201919 249384 -753553 -1267693 -356699 934278
42643 934278 1087842 259309 -135010 380244 710220 -52336 -1188066 -1269023 -26287
42634 -26287 1357151 1676480 871705 -246480 -908805 -834298 -214412 383462 336542 -457261
42624 -457261 -1415358 -1870504 -1658290 -980973 -75214 679382 771589 195014 -307731 -249845
42614 -249845 -240422 -982200 -1778909 -1217414 642378 2004728 1646195 377457 -364333
42605 -364333 -346185 -181696 -50043 198983 239153 -370545 -1280868 -1701693 -1517771 -1323905
42595 -1323905 -1485419 -1835039 -2181205 -2480882 -2583068 -2351231 -1972611 -1733597 -1693056 -1944980
42585 -1944980 -2747007 -3790620 -3871283 -2225285 69067 1039785 169044 -1089265 -1198569
$$ packed form
42652a993920l61296L11435J088475J157225M7465j002937n14140R10994J290977
42643I34278J53564q28533l94319N15254L29976p62556j135730q0957J242736
42634b6287J383438L19329q04775j118185o62325P4507O19886N97874m6920p93803
42624d57261r58097m55146K12214O77317R05759P54596R2207n76575n02745N7886
42614b49845R423p41778p96709N61495J859792J362350l58533j268738p41790
42605c64333J8148J64489J31653K49026M0170o09698r10323m20825J83922J93866
42595a323905j61514l49620l46166k99677j02186K31837L78620K39014M0541k51924
42585a944980q02027j043613q0663J645998K294352R70718q70741j258309j09304
$$ plain form
42576 -1198569 -119890 1095531 1487022 784090 -450281 -1106152 -621744 133145 -166368
42567 -166368 -1378676 -1914914 -940142 484610 986696 624932 271640 91326 -322614
42558 -322614 -799040 -714493 -161321 3198 -565059 -1135879 -904158 -1167 804381 1027888
42548 1027888 779855 420879 229889 303193 510296 556330 301336 76164 475814 1631235
42538 1631235 2780079 2877522 1738555 311879 -347461 -105417 469130 960974 1254804
42529 1254804 1118205 401777 -300654 29455 1492683 2829240 2800046 1588845 315410
42520 315410 -452310 -964992 -1241181 -701853 739464 1902301 1437201 -446427 -2075886
42511 -2075886 -2314727 -1837673 -1975389 -2823618 -3290006 -2829098 -2175494 -2107445 -2337109 -2173728
$$ packed form
42576a198569J078679J215421L91491p02932j234371o55871M84408P54889k99513
42567a66368j212308n36238R74772J424752N02086l61764l53292j80314m13940
42558c22614m76426Q4547N53172J64519n68257n70820K31721R02991Q05548K23507
42548A027888k48033l58976j90990P3304K07103M6034k54994k25172L99650J155421
42538A631235J148844R7443j138967j426676o59340K42044N74547M91844K93830
42529A254804j36599p16428p02431L30109J463228J336557k9194j211201j273435
42520C15410p67720n12682k76189N39328J441317J162837m65100j883628j629459
42511b075886k38841M77054j37716q48229m66388M60908O53604O8049k29664J63381
$$ plain form
42501 -2173728 -1620954 -1092372 -512112 450346 1475339 1773419 1172720 324555 -218720
42492 -218720 -485480 -584922 -390521 88422 558147 855172 1077216 1206101 1060672 695789
42482 695789 363269 19060 -610101 -1405874 -1845442 -1672745 -1051057 -88657 1099076
42473 1099076 1901593 1696718 943740 794303 1359254 1494101 769663 354762 1029206
42464 1029206 1541285 352538 -1791639 -2699418 -1840057 -923441 -1176420 -1601576 -675427
42455 -675427 1329983 2696199 2381146 950180 -388158 -987544 -981563 -772804 -532071
42446 -532071 -130047 509992 1092742 1149778 570638 -225367 -683589 -548778 80570 919580
42436 919580 1628515 1923907 1699965 1055639 223255 -481440 -707107 -243759 740380 1694265
$$ packed form
42501b173728N52774N28582N80260R62458J024993K98080o00699q48165n43275
42492b18720k66760r9442J94401M78943M69725K97025K22044J28885j45429l64883
42482F95789l32520l44209o29161p95773m39568J72697O21688R62400J187733
42473A099076Q02517k04875p52978j49437N64951J34847p24438m14901O74444
42464A029206N12079j188747k144177r07779Q59361R16616k52979m25156R26149
42455f75427K005410J366216l15053j430966j338338n99386N981K08759K40733
42446e32071M02024O40039N82750N7036n79140p96005m58222J34811O29348Q39010
42436I19580P08935K95392k23942o44326q32384p04695k25667M63348R84139R53885
$$ plain form
42426 1694265 2062711 1769352 1264419 966012 737495 194041 -508453 -693196 -195258
42417 -195258 191225 -181222 -743103 -502821 406356 906516 610973 282032 528210 1030539
42407 1030539 1370802 1693968 2096536 2194148 1819353 1414036 1237032 921947 291765 -226736
42397 -226736 -527487 -1175633 -2108908 -2071670 -429348 1384505 1581624 523734 81662
42388 81662 930486 1986610 2344602 2253452 2095535 1836829 1782862 2566870 3902369 4454186
42378 4454186 3535603 2068622 1308814 1353625 1464097 1257168 995295 1039912 1440973 1898001
42368 1898001 1971949 1491158 675667 -317861 -1598876 -2892083 -3259239 -2254307 -886954
42359 -886954 -465136 -850231 -930469 -435659 35073 503424 1541782 2709025 2732008 1559683
$$ packed form
42426A694265L68446k93359n04933k98407k28517n43454p02494j84743M97938
42417a95258L86483l72447n61881K40282R09177N00160k95543l28941K46178N02329
42407A030539L40263L23166M02568R7612l74795m05317j77004l15085o30182n18501
42397b26736l00751o48146r33275L7238J642322J813853J97119j057890m42072
42388H1662Q48824J056124L57992r1150j57917k58706n3967P84008J335499N51817
42378D454186r18583j466981p59808M4811J10472k06929k61873M4617M01061M57028
42368A898001P3948m80791q15491r93528j281015j293207l67156J004932J367353
42359h86954M21818l85095q0238M94810M70732M68351J038358J167243K2983j172325
$$ plain form
42349 1559683 650218 780619 1146403 1141578 1313502 1787314 1515982 213417 -609171 81434
42339 81434 974710 396546 -1068346 -1640033 -1042140 -354826 67077 688859 1307492 1264890
42329 1264890 875012 974542 1244351 601115 -841597 -1796520 -1774973 -1494748 -1298716 -763148
42319 -763148 -31726 85057 -325700 -184113 649522 887062 -78892 -1007577 -616994 621942
42309 621942 1398945 1283210 657535 -181522 -960417 -1186437 -812893 -568177 -931016 -1376244
42299 -1376244 -1260775 -782778 -397956 -1857 532950 677713 -16788 -1032976 -1583730
42290 -1583730 -1726991 -1950352 -2105426 -1668698 -727416 162841 795157 1140315 739364
42281 739364 -692094 -2262680 -2632705 -1790187 -1100226 -1459042 -2355016 -2945631 -3051494
$$ packed form
42349A559683r09465J30401L65784m825J71924M73812k71332j302565q22588O90605
42339H1434Q93276n78164j464892n71687N97893O87314M21903O21782O18633m2602
42329A264890l89878R9530K69809o43236j442712r54923K1547K80225J96032N35568
42319g63148P31422J16783m10757J41587Q33635K37540r65954r28685L90583J238936
42309F21942P77003j15735o25675q39057p78895k26020L73544K44716l62839m45228
42299a376244J15469M77997L84822L96099N34807J44763o94501j016188n50754
42290a583730j43261k23361j55074M36728R41282Q90257O32316L45158m00951
42281G39364j431458j570586l70025Q42518O89961l58816q95974n90615j05863
$$ plain form
42272 -3051494 -2700198 -1683041 -246868 540251 -18376 -1107027 -1289910 -384687 332387
42263 332387 -124771 -1160087 -1405565 -474822 527708 259754 -1359568 -3068755 -3592474
42254 -3592474 -2821274 -1607361 -694126 -217951 -157377 -699327 -1822646 -2852270 -2959511
42245 -2959511 -2140915 -1298796 -1166091 -1445470 -1307486 -568297 16353 -332433 -1506729
42236 -1506729 -2624938 -2853336 -2084285 -1064606 -858621 -1764552 -2677637 -2131781 -274488
42227 -274488 939796 196923 -1248017 -1183442 475128 1668951 1261233 478464 685319
42218 685319 1236529 726136 -668893 -1508441 -1221515 -607090 -449001 -786728 -1433113
42209 -1433113 -2135555 -2273771 -1434687 -305560 -13277 -565241 -964288 -881102 -1042713
$$ packed form
42272c051494L51296J017157J436173P87119n58627j088651j82883R05223P17074
42263C32387m57158j035316k45478R30743J002530k67954j619322j709187n23719
42254c592474P71200J213913R13235M76175O0574n41950j123319j029624j07241
42245b959511Q18596Q42119J32705k79379J37984P39189N84650l48786j174296
42236a506729j118209k28398P69051J019679K05985r05931r13085N45856J857293
42227b74488J214284p42873j444940O4575J658570J193823m07718p82769K06855
42218F85319N51210n10393j395029q39548K86926O14425J58089l37727o46385
42209a433113p02442j38216Q39084J129127K92283n51964l99047Q3186j61611
$$ plain form
42200 -1042713 -1794450 -2514069 -2793145 -2937293 -2811575 -1563759 694770 2246653 1941786
42191 1941786 935416 970216 1855579 2159413 1689405 1532503 1936403 1959572 1350055 1122937
42181 1122937 1860053 2845003 3390505 3745084 4112075 4000142 3249637 2568056 2261887
42172 2261887 1534280 -39252 -1392151 -1440009 -769765 -617370 -944271 -942028 -815182 -1393230
42162 -1393230 -2244067 -1953708 -469411 477447 -193039 -1452581 -1854402 -1501567 -1459545
42153 -1459545 -2099264 -2935248 -3505983 -3625131 -3219947 -2565924 -2255494 -2421616 -2493038 -2157546
42143 -2157546 -1869975 -1840095 -1363927 -29102 1197778 1224827 587679 632730 1306977 1255247
42133 1255247 142130 -628124 39322 1410279 2113209 1869754 1294839 760751 301703
$$ packed form
42200a042713p51737p19619k79076j44148J25718J247816K258529J551883l04867
42191A941786j006370L4800Q85363L03834m70008j56902M03900K3169o09517k27118
42181A122937P37116R84950N45502L54579L66991j11933p50505o81581l06169
42172B261887p27607j573532j352899m7858O70244J52395l26901K243J26846n78048
42162a393230q50837K90359J484297R46858o70486j259542m01821L52835M2022
42153a459545o39719q35984n70735j19148M05184O54023L10430j66122p1422L35492
42143b157546K87571K9880M76168J334825J226880K7049o37148M5051O74247n1730
42133A255247j113117p70254O67446J370957P02930k43455n74915n34088m59048
$$ plain form
42124 301703 122344 369269 668198 576439 334355 577796 1365679 1977136 1731011 752262
42114 752262 -83398 102249 1325307 2573028 2794100 2101672 1552279 1635903 1635835 853333
42104 853333 -188933 -429852 261550 1038983 1305610 1290826 1427902 1736272 1892876 1529985
42094 1529985 493941 -851694 -1741320 -1852990 -1828469 -2385027 -3100000 -2844366 -1444308
42085 -1444308 -88053 193199 -265898 -478645 -110318 465904 940864 1263241 1333285
42076 1333285 1125284 999753 1324305 1813010 1807960 1303029 1113810 1738814 2510439 2346401
42066 2346401 1120720 -202482 -749721 -571919 -209502 67368 234907 101771 -512376
42057 -512376 -1231483 -1290203 -450943 572270 839492 155340 -830863 -1315802 -1007773 -281037
$$ packed form
42124C01703j79359K46925K98929r1759k42084K43441P87883O11457k46125r78749
42114G52262q35660J85647J223058J247721K21072o92428n49393Q3624o8p82502
42104H53333j042266k40919O91402P77433K66627j4784J37076L08370J56604l62891
42094A529985j036044j345635q89626j11670K4521n56558p14973K55634J400058
42085a444308J356255K81252m59097k12747L68327N76222M74960L22377P0044
42076A333285k08001j25531L24552M88705n050n04931j89219O25004P71625j64038
42066B346401j225681j323202n47239J77802L62417K76870J67539j33136o14147
42057e12376p19107n8720Q39260J023213K67222o84152r86203m84939L08029P26736
$$ plain form
42047 -281037 208818 187845 49684 283763 726776 812833 526682 467372 804578 917075
42037 917075 469661 92965 346883 687454 320396 -446878 -677779 -230517 320383 812171
42027 812171 1327356 1180196 -429342 -2691462 -3689197 -2978114 -2112467 -2089361 -2010229 -1213882
42017 -1213882 -916933 -2139845 -3462714 -2881233 -985562 -128918 -894247 -1583013 -1147511
42008 -1147511 -430881 -132722 384079 1519650 2470569 2737295 2984169 3397864 2794151
41999 2794151 683437 -1185803 -984485 505299 1045051 66890 -1054065 -1345887 -1091604
41990 -1091604 -570197 269727 810721 161133 -1106877 -1210015 282892 1601050 1282623
41981 1282623 246490 312704 1644736 2854209 3025817 2445106 1595113 539794 -593116
$$ packed form
42047b81037M89855k0973j38161K34079M43013Q6057k86151n9310L37206J12497
42037I17075m47414l76696K53918L40571l67058p67274k30901M47262N50900M91788
42027H12171N15185j47160j609538k262120r97735P11083Q65647K3106P9132P96347
42017a213882K96949j222912j322869N81481J895671Q56644p65329o88766M35502
42008a147511P16630K98159N16801J135571R50919K66726K46874M13695o03713
41999B794151k110714j869240K01318J489784N39752r78161j120955k91822K54283
41990a091604N21407Q39924N40994o49588j268010j03138J492907J318158l18427
41981A282623j036133O6214J332032J209473J71608n80711q49993j055319j132910
$$ plain form
41972 -593116 -1298358 -1161094 -337839 529302 777786 226026 -701673 -1527989 -2316251 -3261145
41962 -3261145 -3789793 -2929180 -853164 835346 975836 258145 20417 321860 174197
41953 174197 -767634 -1820046 -2413406 -2651472 -2730028 -2615772 -2341228 -1926961 -1069192 355500
41943 355500 1573324 1598383 681204 135117 523466 968013 623514 -102573 -422807 -484467
41933 -484467 -958927 -1730919 -1876110 -949625 316259 805361 233140 -613215 -789011
41924 -789011 -184518 567406 1072380 1551183 2002176 1658690 17555 -2027862 -3048807
41915 -3048807 -2903345 -2690656 -2948174 -3059053 -2636965 -2267882 -2381645 -2488434 -2175678
41906 -2175678 -1862371 -1837388 -1512759 -493210 498755 735241 706413 1151883 1626785 1319318
$$ packed form
41972e93116p05242J37264Q23255Q67141K48484n51760r27699q26316p88262r44894
41962c261145n28648Q60613K076016J688510J40490p17691k37728L01443j47663
41953A74197r41831j052412n93360k38066p8556J14256K74544M14267Q57769J424692
41943C55500J217824K5059r17179n46087L88349M44547l44499p26087l20234o1660
41933d84467m74460p71992j45191R26485J265884M89102n72221q46355j75796
41924g89011O04493P51924N04974M78803M50993l43486j641135k045417j020945
41915c048807J45462K12689k57518j10879M22088L69083j13763j06789L12756
41906b175678L13307K4983L24629J019549R91965K36486k8828M45470M74902l07467
$$ plain form
41896 1319318 732983 1098334 2328895 2972414 2269073 1055849 443591 605718 1046720
41887 1046720 1175596 518595 -757282 -1520752 -857339 406611 495755 -834282 -1851216
41878 -1851216 -1305480 -117623 122140 -661137 -1275785 -1039229 -357644 163578 410007
41869 410007 586450 783156 758790 160624 -837392 -1359160 -868037 -141655 -288863 -911964
41859 -911964 -506807 1095550 2146809 1518306 418932 488645 1378828 1686948 1444796
41850 1444796 1928290 3254793 3849099 2586183 230013 -1662197 -2339220 -1981684 -1041790
41841 -1041790 12738 751809 1017576 966540 789058 560667 307413 17351 -248333
41832 -248333 -100281 894725 2328796 2899672 1849029 1049 -1298162 -1771491 -1919937
$$ packed form
41896A319318n86335L65351J230561O43519p03341j213224o12258J62127M41002
41887A046720J28876o57001j275877p63470O63413J263950Q9144j330037j016934
41878a851216N45736J187857K39763p83277o14648K36556O81585N21222K46429
41869D10007J76443J96706k4366n98166r98016n21768M91123P26382j47208o23101
41859i11964M05157J602357J051259o28503j099374O9713Q90183L08120k42152
41850A444796M83494J326503N94306j262916k356170j892210o77023L57536R39894
41841a041790J054528P39071K65767n1036j77482k28391k53254k90062k65684
41832b48333J48052R95006J434071N70876j050643j847980j299211m73329j48446
$$ plain form
41823 -1919937 -1708146 -740482 498792 874252 149401 -796913 -1373653 -1749519 -1815441
41814 -1815441 -1005036 433556 1241741 857354 234732 283884 542303 216908 -416886
41805 -416886 -614775 -361694 10840 671045 1672459 2132745 1261644 -171789 -610482
41796 -610482 255626 1353126 1954493 2329074 2649274 2499076 1801346 1185680 967311
41787 967311 587274 -464447 -1850514 -2915815 -3366730 -3041441 -1718437 285508 1905835
41778 1905835 2369081 2082399 1948405 2143267 2148696 1723154 1216523 1012041 1167138 1564254
41768 1564254 1974997 1998019 1362607 366445 -299065 -240267 297850 736129 610598 -158274
41758 -158274 -1143210 -1632709 -1322174 -769750 -798715 -1396097 -1604510 -704708 813909 1755212
$$ packed form
41823a919937K11791R67664J239274L75460p24851r46314n76740l75866o5922
41814a815441Q10405J438592Q08185l84387o22622M9152K58419l25395o33794
41805d16886j97889K53081L72534O60205J001414M60286q71101j433433m38693
41796f10482Q66108J097500O01367L74581L20200j50198o97730o15666k18369
41787I67311l80037j051721j386067j065301m50915L25289J323004K003945J620327
41778A905835M63246k86682j33994J94862N429m25542n06631k04482J55097L97116
41768A564254M10743K3022o35412r96162o65510N8798N38117M38279j25531p68872
41758a58274r84936m89499L10535N52424k8965n97382k08413Q99802J518617R41303
$$ plain form
41748 1755212 1507585 542074 -277332 -549195 -457830 -353750 -443530 -764013 -1187255 -1416311
41738 -1416311 -1199000 -657521 -224206 -109488 -48340 195892 352151 132048 10495 756329
41728 756329 2005127 2126013 158216 -2641364 -4001461 -3178437 -1530454 -658896 -820099
41719 -820099 -1276948 -1354974 -791019 244820 1012839 692782 -513669 -1366347 -1216951
41710 -1216951 -995253 -1779363 -2971820 -3013911 -1686069 -513886 -756282 -2026154 -3184512
41701 -3184512 -3629322 -3279856 -2237984 -1127332 -980848 -1966716 -2784766 -2185205 -680478
41692 -680478 140390 -282273 -1018538 -1197914 -1002950 -896523 -729482 -96750 939235
41683 939235 1901635 2354665 2066369 1090847 -48647 -596698 -266879 524734 1253405
$$ packed form
41748A755212k47627r65511q19406k71863R1365J04080q9780l20483m23242k29056
41738a416311K17311N41479M33315J14718O1148K44232J56259k20103j21553P45834
41728G56329J248798J20886j967797k799580j360097Q23024J647983Q71558j61203
41719h20099m56849p8026N63955J035839P68019l20057j206451q52678J49396
41710a216951K21698p84110j192457m2091J327842J172183k42396j269872j158358
41701c184512m44810L49466J041872J110652J46484r85868q18050N99561J504727
41692f80478Q20868m22663p36265j79376J94964J06427J67041O32732J035985
41683I39235R62400M53030k88296r75522j139494n48051L29819P91613P28671
$$ plain form
41674 1253405 1747765 1906721 1475442 509741 -331527 -469899 -150078 -14503 -135295
41665 -135295 -42940 344268 452968 -102526 -914008 -1333566 -1300167 -1252012 -1405700 -1502303
41655 -1502303 -1236759 -608949 234097 1240828 2348827 3270282 3610187 3218059 2301830
41646 2301830 1199537 185828 -478228 -527493 70242 917792 1422460 1302301 817718
41637 817718 479782 536376 747057 714403 473875 581096 1354966 2157045 1913713 485056
41627 485056 -997631 -1476688 -1159687 -895795 -864582 -648290 -298774 -361309 -811431 -915405
41617 -915405 -404682 79337 109695 203261 833333 1459753 1350790 833038 779708 1118485
41607 1118485 819923 -566489 -2147236 -2684145 -1850310 -329164 921237 1366711 1189017
$$ packed form
41674A253405M94360J58956m31279r65701q41268j38372L19821J35575j20792
41665a35295R2355L87208J08700n55494q11482m19558L3399M8155j53688r6603
41655a502303K65544O27810Q43046J006731J107999R21455L39905l92128r16229
41646B301830j102293j013709o64056m9265N97735Q47550N04668j20159m84583
41637H17718l37936N6594K10681l2654k40528J07221P73870Q02079k43332j428657
41627D85056j482687m79057L17001K63892L1213K16292L49516o2535m50122j03974
41617i15405N10723M84019L0358R3566O30072O26420j08963n17752n3330L38777
41607A118485k98562j386412j580747n36909Q33835J521146J250401M45474j77694
$$ plain form
41598 1189017 970418 890321 409267 -850990 -2138956 -2173189 -764980 824252 1379959
41589 1379959 1022880 692678 869017 1272448 1483534 1305497 612396 -659750 -2202903
41580 -2202903 -3264641 -3145945 -1859472 -227486 828587 1125356 1166582 1263893 1154817
41571 1154817 753376 717505 1592857 2739354 3007715 2414189 2159614 2782371 3289563
41562 3289563 2630280 1170889 -15408 -653228 -1193970 -1684806 -1651591 -988948 -201651
41553 -201651 215177 41163 -874355 -2363581 -3553761 -3548507 -2641819 -2091114 -2396622 -2535875
41543 -2535875 -1414795 473389 1514142 880007 -617818 -1584978 -1501129 -979201 -829859
41534 -829859 -1090857 -1036097 -154261 980775 1081264 -444789 -2632109 -3811877 -3351783
$$ packed form
41598A189017k18599q0097m81054j260257j287966l4233J408209J589232N55707
41589A379959l57079l30202J76339M03431K11086j78037o93101j272146j543153
41580b202903j061738J18696J286473J631986J056073K96769M1226R7311j09076
41571A154817m01441l5871Q75352J146497K68361n93526k54575O22757N07192
41562C289563o59283j459391j186297o37820n40742m90836L3215O62643P87297
41553b01651M16828j74014r15518j489226j190180N254R06688N50705l05508j39253
41543b535875J121080J888184J040753o34135j497825r67160Q3849N21928J49342
41534h29859k60998N4760Q81836J135036J00489j526053k187320j179768M60094
$$ plain form
41525 -3351783 -2272516 -1966561 -2544713 -2861852 -2177789 -1220478 -1158512 -1926148 -2357030
41516 -2357030 -1929527 -1429726 -1504970 -1497104 -565491 689461 906643 57546 -400311 307892
41506 307892 1114595 735250 -445382 -989192 -394716 445817 620898 230989 -67396
41497 -67396 12426 170265 -4618 -497833 -815641 -564706 -35724 168106 153307 745939
41487 745939 2062359 2773588 1684667 -373689 -1399402 -937492 -646180 -1691767 -2847444
41478 -2847444 -2256374 -255466 987263 442082 -594990 -567391 367989 1137659 1487661
41469 1487661 1864061 2230622 2266442 2419889 3341200 4198770 3141029 90610 -2374929
41460 -2374929 -2111226 -247490 576797 -42055 -258442 617948 1025677 -5184 -1069262
$$ packed form
41525c351783J079267L05955n78152l17139O84063R57311O1966p67636m30882
41516b357030M27503M99801p5244P866R31613J254952K17182q49097m57857P08203
41506C07892Q06703l79345j180632n43810N94476Q40533J75081l89909k98385
41497f7396P9822J57839j74883m93215l17808K50935N28982K03830j4799N92632
41487G45939J316420P11229j088921k058356j025713M61910K91312j045587j155677
41478b847444N91070K000908J242729n45181j037072K7599R35380P69670L50002
41469A487661L76400L66561L5820J53447R21311Q57570j057741l050419k465539
41460b374929K63703J863736Q24287o18852k16387Q76390M07729j030861j064078
$$ plain form
41451 -1069262 -663957 463761 807680 563279 737169 842236 -282700 -1830810 -1617171
41442 -1617171 491344 2002073 1356971 32335 -21345 768058 855601 324103 481937
41433 481937 1438956 1946536 1486173 914793 885683 952507 565911 -86907 -603643 -901478
41423 -901478 -919351 -507358 115912 467389 596284 1078618 1933523 2280980 1539673 363719
41413 363719 -159996 172937 684145 810927 613724 473130 677933 1209583 1703985 1808295
41403 1808295 1731373 2095522 2969135 3440693 2620898 822966 -761659 -1436879 -1535850
41394 -1535850 -1606640 -1624308 -1238003 -421414 446152 986024 1066618 768645 371327 318038
41384 318038 861560 1633196 1885386 1438760 1115811 1757468 2941491 3348719 2547394
$$ packed form
41451a069262M05305J127718L43919k44401J73890J05067j124936j548110K13639
41442a617171K108515J510729o45102j324636n3680P89403Q7543n31498J57834
41433D81937R57019N07580m60363n71380k9110O6824l86596o52818n16736k97835
41423i01478j7873M11993O23270L51477J28895M82334Q54905L47457p41307j175954
41413C63719n23715L32933N11208J26782j97203j40594K04803N31650M94402J04310
41403A808295p6922L64149Q73613M71558q19795j797932j584625o75220r8971
41394a535850p0790j7668L86305Q16589Q67566N39872Q0594k97973l97318n3289
41384C18038N43522P71636K52190m46626l22949O41657J184023M07228q01325
$$ plain form
41375 2547394 1678891 1907717 2841100 3222996 2739774 2227067 2297553 2727585 3199501 3690009
41365 3690009 3962127 3614641 2942081 2846704 3489334 3918899 3569821 3221862 3737006 4663356
41355 4663356 5031120 4906687 5127584 5947486 7012953 8358868 10271562 12298199 13616916
41346 13616916 14555594 16591289 20341642 24367355 26534722 26097244 24052539 21843473
41338 21843473 20048079 18147534 15469700 12436570 10476917 10188511 10114181 8413558
41330 8413558 5539608 3902291 4659197 6230765 6578767 5622292 4480437 3536696 2544443
41321 2544443 1771270 1576570 1399580 644546 184782 1328010 3351312 3859632 2019821
41312 2019821 -237165 -1010705 -840096 -1104492 -1387892 -260033 1965176 3201780 2392286
$$ packed form
41375B547394q68503K28826R33383L81896m83222n12707P0486M30032M71916M90508
41365C690009K72118l47486o72560r5377O42630M29565l49078l47959N15144R26350
41355D663356L67764j24433K20897Q19902J065467J345915J912694K026637J318717
41346A3616916R38678K035695L750353M025713K167367m37478k044705k209066
41338B1843473j795394j900545k677834l033130j959653k88406p4330j700623
41330H413558k873950j637317P56906J571568L48002r56475j141855r43741r92253
41321B544443p73173j94700j76990p55034m59764J143228K023302N08320j839811
41312B019821k256986p73540J70609k64396k83400J127859K225209J236604q09494
$$ plain form
41303 2392286 682065 -575377 -1420595 -2130858 -1911245 -125232 1999622 2483270 1237250
41294 1237250 192690 596665 1443219 1154465 -168971 -1009922 -396268 1191333 2627031
41285 2627031 3219778 3059802 2707827 2523965 2209376 1331041 360060 471498 1876417
41276 1876417 3118007 2812868 1463497 527307 199418 -528455 -1744804 -2081719 -725741
41267 -725741 1291341 2493500 2685440 2544821 2332088 1900254 1428867 1246885 1194763
41258 1194763 862489 276944 -160744 -197318 193601 887681 1393366 1079128 112018 -406254
41248 -406254 132467 882457 805608 285515 404577 1020183 872049 -385177 -1500426
41239 -1500426 -1323132 -212563 693781 869532 603250 396739 586403 1146452 1574241
$$ packed form
41303B392286j710221j257442q45218p10263K19613J786013K124854M83648j246020
41294A237250j044560M03975Q46554k88754j323436q40951O13654J587601J435698
41285B627031N92747j59976l51975j83862l14589q78335r70981J11438J404919
41276A876417J241590l05139j349371r36190l27889p27873j216349l36915J355978
41267g25741K017082J202159J91940j40619k12733m31834m71387j81982n2122
41258A194763l32274n85545m37688l6574L90919O94080N05685l14238r67110n18272
41248d06254N38721P49990p6849n20093J19062O15606j48134j257226j115249
41239a500426J77294J110569R06344J75751k66282k06511J89664N60049M27789
$$ plain form
41230 1574241 1341301 617603 122521 180253 477167 841342 1525369 2415597 2712047 1959192
41220 1959192 863848 456387 762243 908948 394055 -294641 -346318 439363 1486207
41211 1486207 2089947 2182141 2352598 2988237 3611931 3474544 2637488 1839660 1282239 350093
41201 350093 -1111068 -2002645 -1197257 776606 2022673 1330066 -501880 -1596516 -1102867
41192 -1102867 -119790 -312289 -1718539 -2540547 -1458401 588358 1822345 2237646 3357866
41183 3357866 5487986 6897971 6291139 4570829 3263015 2542930 1977232 1951082 2799547
41174 2799547 3440002 2628907 1051348 403691 724413 511837 -550258 -1001592 -155449
41165 -155449 684525 403851 -198904 -14203 439712 73540 -796574 -1043579 -658644 -562923
$$ packed form
41230A574241k32940p23698m95082N7732K96914L64175O84027Q90228K96450p52855
41220A959192j095344m07461L05856J46705n14893o88696n1677P85681J046844
41211A486207O03740R2194J70457O35639O23694j37387q37056p97828n57421r32146
41201C50093j461161q91577Q05388J973863J246067o92607j831946j094636M93649
41192a102867R83077j92499j406250q22008J082146K046759J233987M15301J120220
41183C357866K130120J409985o06832j720310j307814p20085n65698k6150Q48465
41174B799547O40455q11095j577559o47657L20722k12576j062095m51334Q46143
41165a55449Q39974k80674o02755J84701M53915l66172q70114k47005L84935R5721
$$ plain form
41155 -562923 -805216 -459771 605585 1224553 628181 -383977 -559277 220969 1067987
41146 1067987 1316802 1005820 379117 -439119 -1187907 -1383220 -876272 -365845 -884579
41137 -884579 -2490858 -3741750 -3003813 -381516 2131906 2727963 1689143 870907 1520879
41128 1520879 3068078 4028162 3655982 2504580 1584103 1263533 1100922 645760 128356
41119 128356 140164 804248 1635533 2191156 2427697 2350058 1833826 1081486 803444 1491491
41109 1491491 2730386 3588740 3532724 2721826 1703631 1149013 1553743 2695463 3553545
41100 3553545 3257352 2059291 992321 676272 864212 1044476 1006757 820800 683403
41091 683403 822359 1219410 1475688 1314531 1126981 1562324 2603242 3513636 3712031
$$ packed form
41155e62923k42293L45445J065356O18968n96372j012158j75300P80246Q47018
41146A067987K48815l10982o26703q18236p48788j95313N06948N10427n18734
41137h84579j606279j250892P37937K622297K513422N96057j038820q18236O49972
41128A520879J547199R60084l72180j151402r20477l20570j62611m55162n17404
41119A28356J1808O64084Q31285N55623K36541p7639n16232p52340k78042O88047
41109A491491J238895Q58354n6016q10898j018195n54618M04730J141720Q58082
41100C553545k96193j198061j066970l16049J87940J80264l7719j85957j37397
41091F83403J38956L97051K56278j61157j87550M35343J040918R10394J98395
$$ plain form
41082 3712031 3235749 2365993 1378758 744257 896512 1494106 1475135 295712 -1251486
41073 -1251486 -1866503 -1128171 280714 1445705 1925182 1808962 1539848 1643439 2264162
41064 2264162 2882610 2703572 1445497 -268582 -1319603 -990339 373790 1628753 1941525
41055 1941525 1580770 1376007 1551949 1571958 1109638 551143 297877 123676 -380129 -1117457
41045 -1117457 -1643009 -1686048 -1157293 19215 1622907 2937070 3326665 2941956 2538271
41036 2538271 2733757 3669608 5097433 6426455 6936201 6360900 5119476 3720340 2282645
41027 2282645 971342 382894 854575 1745594 2133159 1999477 1999501 2253935 2225201 1756899
41017 1756899 1383912 1487924 1878427 2328087 2815822 3150626 3116581 3079258 3560386 4040978
$$ packed form
41082C712031m76282q69756r87235o34501J52255N97594j8971j179423j547198
41073a251486o15017P38332J408885J164991M79477j16220k69114J03591O20723
41064B264162O18448j79038j258075j714079j051021L29264J364129J254963L12772
41055A941525l60755k04763J75942K0009m62320n58495k53266j74201n03805p37328
41045a117457n25552m3039N28755J176508J603692J314163L89595l84709m03685
41036B538271J95486R35851J427825J329022N09746n75301j241424j399136j437695
41027B282645j311303n88448M71681Q91019L87565j33682K4K54434k8734m68302
41017A756899l72987J04012L90503M49660M87735L34804l4045l7323M81128M80592
$$ plain form
41007 4040978 3258030 1156187 -523341 -386146 758956 1170039 641815 521499 1521766
40998 1521766 2715682 2917140 2177348 1469069 1369841 1508015 1192776 303994 -585972
40989 -585972 -953049 -896378 -670612 22460 1514250 3005379 3008478 1432086 235110
40980 235110 1151656 3476842 5088652 5117936 4478957 4081289 3778535 3162744 2316551
40971 2316551 1491167 850427 772347 1651093 3119741 4138450 4174732 3765192 3663734
40962 3663734 3961452 4318158 4590986 4913660 5431524 6127981 6738608 6944536 6952555 7598721
40952 7598721 9368564 11724407 14239937 17951077 24103617 31344925 35705799 34365340
40944 34365340 28610456 22232108 17715244 14908451 12748884 10895753 9500803 8358488
$$ packed form
41007D040978p82948k101843j679528J37195J145102M11083n28224j20316J000267
40998A521766J193916K01458p39792p08279r9228J38174l15239q88782q89966
40989e85972l67077N6671K25766O93072J491790J491129L099j576392j196976
40980B35110R16546K325186J611810K9284o38979l97668l02754o15791q46193
40971B316551q25384o40740p8080Q78746J468648J018709L6282m09540j01458
40962C663734K97718L56706K72828L22674N17864O96457O10627K05928Q019O46166
40952G598721J769843K355843K515530L711140O152540P241308M360874j340459
40944C4365340n754884o378348m516864k806793k159567j853131j394950j142315
$$ plain form
40936 8358488 6930752 5063651 3364501 2688209 3174399 3974009 4174327 3767366 3291532
40927 3291532 2831004 2109695 1395727 1331246 1776088 1840107 1338624 1196737 1977375 2981400
40917 2981400 3336967 3069063 2573138 2023976 1874887 2773885 4178384 4297795 2550285
40908 2550285 923696 1460400 3343787 4149942 3304324 2451051 2716100 3486483 3976339
40899 3976339 4280731 4522060 4403699 4064243 4174927 4785200 5126412 4843371 4353130
40890 4353130 3783265 2801556 1856057 2239906 4214304 6164099 6467850 5422127 4540550
40881 4540550 4573889 4964354 4851413 4020672 3046203 2725797 3137027 3361159 2680581 1830771
40871 1830771 2169672 3664820 4768331 4443461 3272955 2327708 1991630 2214739 2885006
$$ packed form
40936H358488j427736j867101j699150o76292M86190P99610K00318m06961m75834
40927C291532m60528p21309p13968o4481M44842O4019n01483j41887P80638J004025
40917B981400L55567k67904m95925n49162j49089Q98998J404499J19411j747510
40908B550285j626589N36704J883387Q06155q45618q53273K65049P70383M89856
40899C976339L04392K41329j18361l39456J10684O10273L41212k83041m90241
40890D353130n69865r81709r45499L83849J974398J949795L03751j045723q81577
40881D540550L3339L90465j12941q30741r74469l20406M11230K24132o80578q49810
40871A830771L38901J495148J103511l24870j170506r45247l36078K23109O70267
$$ plain form
40862 2885006 3559735 3744715 3690417 3973083 4281299 3909912 3475411 4414467 6410143
40853 6410143 7224518 5845544 3916695 3077782 2887398 2683455 3361144 5349142 6672344
40844 6672344 5491075 3304535 3091222 5136442 7234491 8351610 9347565 10338935 10223417
40835 10223417 9151988 8824328 9607311 9729656 8318896 7096506 7766629 9473652 10288562
40826 10288562 9862632 9161145 8621621 8063221 7745525 8101731 8712358 8746394 8421267
40817 8421267 9054956 11342261 14131032 15438104 14707157 13634792 14291718 16700901 19196016
40808 19196016 21135511 23744637 27629110 31241314 33343431 35501130 40082986 46922531
40800 46922531 54277347 62127341 71886709 83722125 97310802 114683283 138832129
$$ packed form
40862B885006O74729J84980n4298K82666L08216l71387m34501R39056J995676
40853F410143Q14375j378974j928849q38913j90384k03943O77689J987998J323202
40844F672344j181269k186540k13313K045220K098049J117119R95955R91370j15518
40835A0223417j071429l27660P82983J22345j410760j222390O70123J707023Q14910
40826A0288562m25930p01487n39524n58400l17696L56206O10627L4036l25127
40817H421267O33689K287305K788771J307072p30947j072365O56926K409183K495115
40808A9196016J939495K609126L884473L612204K102117K157699M581856O839545
40800D6922531P354816P849994R759368J1835416J3588677J7372481K4148846
$$ plain form
40793 138832129 170241292 209385080 261663975 331314071 406007026 454742676 450515460
40786 450515460 395269974 317541507 246376947 192348107 151832964 120314872 96709664
40779 96709664 79911863 67556147 58030470 50741705 44707563 38878508 33453248 29330487
40771 29330487 26594709 24608571 23012541 21604365 19848089 17533536 15402396 14192875
40763 14192875 13562386 12805787 12068527 11873263 11915344 11436004 10609206 10497903 11517996
40754 11517996 12805834 13431789 13641785 14453308 16354698 18951111 21901750 25591872
40746 25591872 30357235 35479211 40056426 45072132 53209814 65361193 77929546 84988570
40738 84988570 83191859 73862415 60847970 47733312 36889195 29282309 24229333 20176103
$$ packed form
40793A38832129L1409163L9143788N2278895O9650096P4692955M8735650m227216
40786D50515460n5245486p7728467p1164560n4028840m0515143l1518092k3605208
40779I6709664j6797801j2355716r525677p288765o034142n829055n425260m122761
40771B9330487k735778j986138j596030j408176j756276k314553k131140j209521
40763A4192875o30489p56599p37260j95264M2081m79340q26798j11303J020093
40754A1517996J287838O25955K09996Q11523J901390K596413K950639L690122
40746B5591872M765363N121976M577215N015706Q137682J2151379J2568353P059024
40738H4988570j796711r329444j3014445j3114658j0844117p606886n052976m053230
$$ plain form
40730 20176103 16315808 12932689 10204959 7754495 5594742 4374267 4256045 4554104
40722 4554104 4833046 5299170 5735084 5256990 3710881 2202525 1619355 1634960 1651212
40713 1651212 1533342 921796 -724108 -2667594 -3071026 -1635794 -415880 -709981 -912700
40704 -912700 714156 2773299 2694636 896811 219315 1557170 2788038 2308654 1177710
40695 1177710 1003875 1705574 2311574 2478829 2375329 2254918 2714220 4149331 5534066
40686 5534066 5169227 3217802 1970287 2743013 3958235 3432595 1381044 -145989 7163
40677 7163 1149151 1971483 1730101 624002 -267735 64056 1112886 1142892 -420801
40668 -420801 -1880810 -1520827 -4123 770117 439789 255429 762749 1026601 269023
$$ packed form
40730B0176103l860295l383119k727730k450464k159753j220475j18222K98059
40722D554104K78942M66124M35914m78094j546109j508356n83170J5605J6252
40713A651212j17870o11546j645904j943486m03432J435232J219914k94101k02719
40704i12700J626856K059143p8663j797825o77496J337855J230868m79384j130944
40695A177710j73835P01699O06000J67255j03500j20411M59302J435111J384735
40686E534066l64839j951425j247515P72726J215222n25640k051551j527033J53152
40677G163J141988Q22332k41382j106099q91737L31791J048830L0006j563693
40668d20801j460009L59983J516704P74240l30328j84360N07320K63852p57578
$$ plain form
40659 269023 -1044257 -2041182 -2354143 -1966520 -1059303 -241864 -128050 -472560 -435533 217319
40649 217319 962576 1577906 2354503 3070217 2879855 1747698 984346 1605871 2932157
40640 2932157 3621683 3428365 2990017 2402742 1180037 -483849 -1523517 -1311133 -324850
40631 -324850 751432 1797046 2724607 2975667 2267149 1340917 1155497 1584500 1725202
40622 1725202 1355672 1150853 1369768 1364319 817133 481307 943265 1487706 1205129 580145
40612 580145 711366 1338295 1167318 225754 313065 2523314 5629988 7785833 8798900
40603 8798900 9750626 11145278 12471049 13084278 12641940 11101370 9051282 7517838 6695819
40594 6695819 5536003 3449198 1587687 1228971 1658403 1225001 -5560 -456470 268575
$$ packed form
40659B69023j313280r96925l12961L87623R07217Q17439J13814l44510L7027O52852
40649B17319P45257O15330P76597P15714j90362j132157p63352O21525J326286
40640B932157O89526j93318m38348n87275j222705j663886j039668K12384R86283
40631c24850J076282J045614R27561K51060p08518r26232j85420M29003J40702
40622A725202l69530k04819K18915n449n47186l35826M61958N44441k82577o24984
40612E80145J31221O26929j70977r41564Q7311K210249L106674K155845J013067
40603H798900R51726J394652J325771O13229m42338j540570k050088j533444q22019
40594F695819j159816k086805j861511l58716M29432m33402j230561m50910P25045
$$ plain form
40585 268575 828474 523833 331656 925174 1394083 892109 106302 -10652 241315 195542
40575 195542 141484 526926 752275 94275 -849189 -970530 -418533 -262264 -723384 -980207
40565 -980207 -557445 196805 902149 1434576 1598134 1461093 1769108 2965428 4034199
40556 4034199 3532476 1695821 237162 -47047 -144536 -954237 -1813436 -1592409 -383970
40547 -383970 620191 455649 -815811 -2178445 -2363056 -1061384 469657 729967 -61058
40538 -61058 -246756 909262 2297471 2768542 2633042 2648661 2646575 2187638 1740948 2059047
40528 2059047 2869892 3198744 2645329 1507625 66246 -1357275 -2040342 -1571463 -683935
40519 -683935 -412889 -603183 -236605 878013 1802084 1915211 1644751 1526865 1469420 1301457
$$ packed form
40585B68575N59899l04641j92177N93518M68909n01974p85807j16954K51967m5773
40575A95542n4058L85442K25349o58000r43464j21341N51997J56269m61120k56823
40565i80207M22762P54250P05344N32427J63558j37041L08015J196320J068771
40556D034199n01723j836655j458659k84209r7489q09701q59199K21027J208439
40547c83970J004161j64542j271460j362634j84611J301672J531041K60310p91025
40538f1058j85698J156018J388209M71071j35500J5619k086m58937m46690L18099
40528B059047Q10845L28852n53415j137704j441379j423521o83067M68879Q87528
40519f83935K71046j90294L66578J114618R24071J13127k70460j17886n7445j67963
$$ plain form
40509 1301457 1256810 1485430 1740707 1975826 2655078 3991180 5366368 6055638 6213398
40500 6213398 6629593 7643381 8692006 8924203 8074131 6767643 5998558 6156496 6596278
40491 6596278 6405498 5522351 4694743 4348800 4054279 3309594 2320068 1611503 1265426
40482 1265426 994935 721332 588789 518636 219332 -314764 -686575 -622620 -364450 -324236
40472 -324236 -458103 -221754 771503 2201260 3329194 3772385 3730694 3437924 2794421
40463 2794421 1803650 1004361 975306 1547111 1981305 1888196 1517268 1176611 908819 827678
40453 827678 1193826 1876336 2203102 1714809 758495 10722 -299609 -340065 -111013 580748
40443 580748 1594480 2280100 2021151 906487 -187764 -282944 753470 1951999 2180362
$$ packed form
40509A301457m4647K28620K55277K35119O79252J336102J375188O89270J57760
40500F213398M16195J013788J048625K32197q50072j306488p69085J57938M39782
40491F596278j90780q83147q27608l45943k94521p44685r89526p08565l46077
40482A265426k70491k73603j32543p0153k99304n34096l71811O3955K58170M0214
40472c24236j33867K36349R93257J429757J127934M43191m1691k92770o43503
40463B794421r90771p99289k9055N71805M34194r3109l70928l40657k67792q1141
40453H27678L66148O82510L26766m88293r56314p47773l10331m0456K29052O91761
40443E80748J013732O85620k58949j114664j094251r5180J036414J198529K28363
$$ plain form
40434 2180362 1391424 667965 967124 2183185 3591409 4719692 5354034 5084483 3569608
40425 3569608 1272355 -665552 -1514180 -1532693 -1270167 -765637 127275 1010808 1270841
40416 1270841 1084650 1274482 1864132 1654425 -9464 -1763621 -1743501 -292568 335561
40407 335561 -792680 -1963766 -1536016 -462919 -625628 -1727763 -1777891 -263726 1127047
40398 1127047 1133275 509363 453222 934277 1325237 1475943 1358878 693033 -255155 -430878
40388 -430878 587579 1736210 1872352 1270320 877260 880527 1009624 1551644 2882827
40379 2882827 4379058 4885375 4132219 2913378 2070837 1888268 2086994 1886529 686189
40370 686189 -756119 -756831 868815 1976844 958113 -737757 -718038 678129 1100475
$$ packed form
40434B180362p88938p23459K99159J216061J408224J128283O34342k69551j514875
40425C569608k297253j937907q48628j8513K62526N04530Q92912Q83533K60033
40416A270841j86191J89832N89650k09707j663889j754157K0120J450933O28129
40407C35561j128241j171086M27750J073097j62709j102135n0128J514165J390773
40398A127047O228o23912n6141M81055L90960J50706j17065o65845r48188j75723
40388d30878J018457J148631J36142o02032l93060L267J29097N42020J331183
40379B882827J496231N06317p53156j218841q42541j82569J98726k00465j200340
40370F86189j442308p12J625646J108029j018731j695870J9719J396167M22346
$$ plain form
40361 1100475 92166 -355604 629135 1304626 313155 -1100334 -1253484 -616899 -636295
40352 -636295 -1284956 -1437783 -809087 -31539 562785 941793 727518 -196976 -893410 -365971
40342 -365971 992666 1985771 2220162 2062211 1457092 88255 -1477027 -2082513 -1515028
40333 -1515028 -731122 -477898 -576372 -602743 -423890 -43382 283576 -106004 -1414541 -2534918
40323 -2534918 -2220928 -1069540 -991765 -2475286 -3796974 -3499660 -2238924 -1310676 -705416
40314 -705416 108440 610302 115854 -447737 450039 2313952 2915780 1537552 62154
40305 62154 36909 422366 -363647 -1642797 -1679076 -794570 -939012 -2268324 -2600379 -973519
40295 -973519 523361 -87059 -1510015 -1207232 595211 1306280 -19993 -1462515 -1342393
$$ packed form
40361A100475j008309m47770R84739O75491r91471j413489j53150O36585j9396
40352f36295o48661j52827O28696P77548N94324L79008k14275r24494o96434N27439
40342c65971J358637R93105K34391j57951o05119j368837j565282o05486N67485
40333a515028P83906K53224r8474k6371J78853L80508L26958l89580j308537j120377
40323b534918L13990J151388P7775j483521j321688K97314J260736R28248O05260
40314g05416Q13856N01862m94448n63591Q97776J863913O01828j378228j475398
40305F2154k5245L85457p86013j279150l6279Q84506j44442j329312l32055J626860
40295i73519J496880o10420j422956L02783J802443P11069j326273j442522J20122
$$ plain form
40286 -1342393 -428554 -179504 -494161 -408224 178702 732340 1239621 1975968 2651820 2793161
40276 2793161 2564267 2356724 1992416 1219758 630446 1111664 2496568 3562041 3399882
40267 3399882 2286431 1275659 1270753 2230743 3028136 2597000 1508301 1568059 3279909
40258 3279909 4733445 4039112 1950252 697459 921480 1399342 1395704 1414624 1583688
40249 1583688 1178439 244310 28338 1044003 2108760 2142815 1642004 1410394 1078646
40240 1078646 169248 -321094 1030318 3798676 5876984 5964224 4863793 4159902 4429902
40231 4429902 5055266 5264185 5014797 4971277 5691835 6914833 7919212 8560778 9406796
40222 9406796 10714207 12022862 13177386 14954905 17916159 21216134 23437561 24208235
$$ packed form
40286a342393R13839K49050l14657Q5937N86926N53638N07281P36347O75852J41341
40276B793161k28894k07543l64308p72658n89312M81218J384904J065473j62159
40267C399882j113451j010772m906R59990P97393m31136j088699N9758J711850
40258C279909J453536o94333k088860j252793K24021M77862l638J8920J69064
40249A583688m05249r34129k15972J015665J064757L4055n00811k31610l31748
40240A078646r09398m90342J351412K768358K078308Q7240j100431p03891K70000
40231D429902O25364K08919k49388m3520P20558J222998J004379O41566Q46018
40222I406796J307411J308655J154524J777519K961254L299975K221427P70674
$$ plain form
40214 24208235 24102697 23300718 21416973 18556480 15467263 12545616 9680076 7255968
40206 7255968 6239223 6777827 7614873 7537875 6750990 6185941 6070245 5922718 5488408
40197 5488408 4848613 3912996 2666382 1763579 1969439 2945947 3450186 2956822 2284339
40188 2284339 2252704 2504756 2265427 1644004 1362227 1509480 1424697 804044 214946 345478
40178 345478 1226256 2321739 3000241 2854967 1970898 965618 435295 357202 359723 400273
40168 400273 624705 726335 242846 -483118 -526314 216866 721726 280617 -604638 -1196388
40158 -1196388 -1464744 -1474039 -762714 850666 2604058 3752913 4473677 5022199 4865680
40149 4865680 3654238 2204348 1380773 874332 349772 722504 2522192 3956156 2920043
$$ packed form
40214B4208235j05538q01979j883745k860493l089217k921647k865540k424108
40206G255968j016745N38604Q37046p6998p86885n65049j15696j47527m34310
40197E488408o39795r35617j246614r02803K05860R76508N04239m93364o72483
40188B284339l1635K52052k39329o21423k81777J47253q4783o20653n89098J30532
40178C45478Q80778J095483O78502j45274q84069j005280n30323p8093K521M0550
40168D00273K24432J01630m83489p25964m3196P43180N04860m41109q85255n91750
40158a196388k68356r295P11325J613380J753392J148855P20764N48522j56519
40149D865680j211442j449890q23575n06441n24560L72732J799688J433964j036113
$$ plain form
40140 2920043 433904 -477648 784905 1871942 1710102 2150966 4244315 5864270 5068283
40131 5068283 3391527 3310558 4275711 4038431 2643039 2098357 2658415 2432565 862752
40122 862752 -112115 855212 2380061 2356153 647156 -1191950 -1838216 -1106475 206012
40113 206012 809988 5483 -1349127 -1707092 -886955 -310730 -912105 -1899735 -2124662
40104 -2124662 -1628111 -1083673 -603772 -48909 109157 -700532 -2000126 -2546420 -1832832
40095 -1832832 -688114 -251915 -794467 -1704026 -2304887 -2420964 -2249141 -1969343 -1628894
40086 -1628894 -1267213 -902719 -441659 93740 284614 -253887 -1064151 -1081705 325
40077 325 1196384 1511914 1191604 1141085 1684203 2551041 3490064 4057433 3396752 1332680
$$ packed form
40140B920043k486139r11552J262553J087037j61840M40864K093349J619955p95987
40131E068283j676756q0969R65153k37280j395392n44682N60058k25850j569813
40122H62752r74867R67327J524849k3908j708997j839106o46266P31741J312487
40113B06012O03976q04505j354610l57965Q20137N76225o01375r87630k24927
40104b124662M96551N44438M79901N54863J58066q09689j299594n46294P13588
40095a832832J144718M36199n42552r09559o00861j16077J71823K79798L40449
40086a628894L61681L64494M61060N35399J90874n38501q10264j7554J082030
40077C25J196059L15530l20310n0519N43118Q66838R39023N67369o60681k064072
$$ plain form
40067 1332680 -681406 -887131 641373 2236704 2820457 2662629 2121624 1105783 42956
40058 42956 -43280 966768 1846192 1737737 1340341 1701849 2739030 3779744 4839449
40049 4839449 6404366 8331894 9812229 10338038 10201265 10104700 10569098 11563804 12519913
40040 12519913 12854686 12502362 11691460 10364849 8328072 5895359 3811676 2549625
40032 2549625 2185556 2746184 3935146 4734421 4251145 2935979 2024536 1845132 1741190
40023 1741190 1556435 1836157 2443355 2471110 1904994 1881219 2735996 3285591 2780325 2109149
40013 2109149 2133980 2214743 1497647 439466 -127229 -343225 -566040 -348690 578166 1312082
40003 1312082 1046646 392751 210118 184714 -77227 280286 1905969 3473451 3268488
$$ packed form
40067A332680k014086k05725J528504J595331N83753j57828n41005j015841j062827
40058D2956q6236J010048Q79424j08455l97396L61508J037181J040714J059705
40049D839449J564917J927528J480335N25809j36773r6565M64398R94706R56109
40040A2519913L34773l52324q10902j326611k036777k432713k083683j262051
40032B549625l64069N60628J188962P99275m83276j315166r11443j79404j03942
40023A741190j84755K79722O07198K7755n66116k3775Q54777N49595n05266o71176
40013B109149K4831Q0763p17096j058181n66695k15996k22815K17350R26856P33916
40003A312082k65436o53895j82633k5404k61941L57513J625683J567482k04963
$$ plain form
39994 3268488 1781035 823229 776746 734776 720982 1468117 2362512 2043289 1003592 1167406
39984 1167406 2700176 3720513 3607180 3972294 5438073 6007424 4153404 1449055 364430
39975 364430 1050646 2061016 2873475 3758693 4154769 3249480 1769068 1363935 2242752
39966 2242752 2886011 2240881 979047 274793 269057 213443 -343356 -930629 -712990 371784
39956 371784 1230421 763880 -681433 -1609424 -1159761 86238 1150779 1661491 1608678
39947 1608678 1041717 399314 301033 641247 732675 586236 930087 1633029 1556302 661744
39937 661744 659689 2337140 3704020 2520637 -321663 -1819476 -703950 1526848 3085874
39928 3085874 3554332 3052367 1582277 -269793 -1312473 -1048855 -158956 565038 891491
$$ packed form
39994C268488j487453r57806m6483m1970j3794P47135Q94395l19223j039697J63814
39984A167406J532770J020337j13333L65114J465779N69351j854020k704349j084625
39975C64430O86216J010370Q12459Q85218L96076r05289j480412m05133Q78817
39966B242752O43259o45130j261834p04254n736n5614n56799n87273K17639J084774
39956C71784Q58637m66541j445313r27991M49663J245999J064541N10712n2813
39947A608678n66961o42403r8281L40214R1428j46439L43851P02942p6727q94558
39937F61744k055J677451J366880j183383k842300j497813J115526K230798J559026
39928C085874M68458n01965j470090j852070j042680K63618Q89899P23994L26453
$$ plain form
39919 891491 671593 -213753 -1148010 -1084796 -5046 825793 493624 -496508 -1207768 -1467753
39909 -1467753 -1524974 -1296457 -680002 -77554 104998 139469 526135 1075621 1023482 60840
39899 60840 -1126160 -1455068 -516045 938194 1652787 1190698 441108 485624 1136274 1160315
39889 1160315 -19298 -1443269 -1680217 -390188 1372800 2138862 1223963 -715537 -2232087
39880 -2232087 -2431344 -1727641 -1030633 -525761 109962 560699 -28125 -1609662 -2868720
39871 -2868720 -2834021 -2157726 -2154843 -3047535 -3812626 -3511138 -2216720 -744698 138121 292282
39861 292282 214257 362479 449224 -237779 -1712256 -2996746 -3226041 -2564383 -1694004 -924846
39851 -924846 -306929 -119625 -518453 -943743 -629040 317495 958760 719338 -7984 -560652
$$ packed form
39919H91491k19898q85346r34257O3214J079750Q30839l32169r90132p11260k59985
39909a467753n7221K28517O16455O02448J82552L4471L86666N49486n2139r62642
39899F0840j187000l28908R39023J454239P14593m62089p49590M4516O50650K4041
39889A160315j179613j423971k36948J290029J762988P66062r14899j939500j516550
39880b232087j99257P03703O97008N04872O35723M50737n88824j581537j259058
39871b868720L4699O76295K883q92692p65091L01488J294418J472022Q82819J54161
39861B92282p8025J48222Q6745o87003j474477j284490k29295O61658Q70379P69158
39851i24846O17917J87304l98828m25290L14703R46535O41265k39422p27322n52668
$$ plain form
39841 -560652 -793571 -915620 -943697 -710273 -277956 -23636 -252400 -858351 -1424912 -1607887
39831 -1607887 -1359732 -801133 -15851 890607 1601092 1682435 977635 -163498 -1089978
39822 -1089978 -1300651 -819784 -226639 -168012 -699131 -1284874 -1583722 -1863286 -2327597 -2536715
39812 -2536715 -2156685 -1864375 -2510809 -3536535 -3419364 -1923165 -704584 -1144554 -2646240
39803 -2646240 -3779260 -4068033 -3734147 -2677385 -973613 332927 317784 -403249 -690043
39794 -690043 -844634 -1923962 -3325675 -3045887 -748330 1292483 1210277 -29838 -368529
39785 -368529 456027 1131372 985519 489732 27182 -444004 -667322 -248120 419543 353049
39775 353049 -782015 -2315824 -3379110 -3446092 -2378619 -749753 167055 -319388 -1290813
$$ packed form
39841e60652k32919j22049k8077K33424M32317K54320k28764o05951n66561j82975
39831a607887K48155N58599P85282R06458P10485Q1343p04800j141133r26480
39822a089978k10673M80867N93145N8627n31119n85743k98848k79564m64311k09118
39812b536715L80030K92310o46434j025726J17171J496199J218581m39970j501686
39803b646240j133020k88773L33886J056762J703772J306540j5143p21033k86794
39794f90043j54591j079328j401713K79788K297557K040813q2206j240115l38691
39785c68529Q24556O75345j45853m95787m62550m71186k23318M19202O67663o6494
39775C53049j135064j533809j063286o6982J067473J628866R16808m86443r71425
$$ plain form
39766 -1290813 -1489185 -1268128 -1910884 -3196361 -3426818 -2214619 -1370852 -2125316 -3172927
39757 -3172927 -2843356 -1781163 -1689987 -2378910 -2097016 -459865 912232 799126 -253424
39748 -253424 -1260621 -1918067 -1925226 -750149 1091268 1839638 671457 -910266 -1039191
39739 -1039191 -69081 137889 -960173 -1961531 -1773271 -1079401 -971067 -1143645 -435571
39730 -435571 1260276 2645668 2736533 2140352 2030602 2303510 1701588 -124415 -1704970
39721 -1704970 -1619720 -513893 -122046 -661399 -584815 970382 2911456 3907123 4090887
39712 4090887 4187218 4040450 3173414 2031942 1419322 1203998 812799 570428 1173055
39703 1173055 2060665 1825553 367603 -792245 -712972 -187389 -101952 56848 1080852
$$ packed form
39766a290813j98372K21057o42756j285477k30457J212199Q43767p54464j047611
39757c172927L29571J062193R1176o88923K81894J637151J372097j13106j052550
39748b53424j007197o57446p159J175077J841417P48370j168181j581723j28925
39739a039191R70110K06970j098062j001358J88260O93870J08334j72578P08074
39730d35571J695847J385392R0865n96181j09750K72908o01922j826003j580555
39721a704970Q5250J105827L91847n39353P6584J555197J941074R95667J83764
39712D090887R6331j46768q67036j141472o12620k15324l91199k42371O02627
39703A173055Q87610k35112j457950j159848P9273N25583Q5437J58800J024004
$$ plain form
39694 1080852 2382197 2649074 1720707 777635 798592 1591369 2287600 2190571 1173627
39685 1173627 -252662 -1257116 -1421280 -1119413 -944609 -969682 -896967 -702997 -685302 -948528
39675 -948528 -1224125 -1198432 -774950 -68526 659835 1161456 1459949 1794332 2153245 2132950
39665 2132950 1511854 698358 262431 206252 33175 -606943 -1628185 -2662796 -3189563
39656 -3189563 -2762430 -1554157 -503466 -441849 -1164674 -1824232 -2115170 -2464541 -3038748
39647 -3038748 -3279253 -2748771 -1900512 -1536856 -1806667 -2180255 -2225550 -1964987 -1552101 -1063739
39637 -1063739 -691546 -726741 -1132292 -1435052 -1350214 -1286257 -1791280 -2568920 -2599794 -1452221
39627 -1452221 20397 708676 593875 480676 639554 538695 28361 -59186 987103
$$ packed form
39694A080852J301345K66877r28367r43072K0957P92777O96231r7029j016944
39685A173627j426289j004454j64164L01867J74804k5073P2715J93970J7695k63226
39675i48528k75597K5693M23482P06424P28361N01621K98493L34383L58913k0295
39665B132950o21096q13496m35927n6179j73077o40118j021242j034611n26767
39656c189563M27133J208273J050691O1617p22825o59558k90938l49371n74207
39647c038748k40505N30482Q48259L63656k69811l73588m5295K60563M12886M88362
39637a063739L72193l5195m05551l02760Q4838O3957n05023p77640l0874J147573
39627a452221J472618O88279j14801j13199J58878j00859n10334q7547J046289
$$ plain form
39618 987103 2586971 3416861 2869339 1463698 45296 -855409 -1018128 -554534 -20355
39609 -20355 55011 -76928 383691 1540157 2331776 1828986 617626 149759 771323 1233497
39599 1233497 522837 -578752 -555955 641951 1539691 1313234 878488 1283082 2058029
39590 2058029 2142802 1691403 1675961 2084960 1969503 1281354 1154328 1966950 2573582 2172327
39580 2172327 1565034 1516991 1131071 -647049 -2783291 -3196513 -1716232 -264386 -46111
39571 -46111 -248108 59857 332560 -267674 -1299072 -1731995 -1465089 -1147263 -985318 -659435
39561 -659435 -116852 381915 815321 1266920 1406074 847179 -30225 -343369 147097 792945
39551 792945 1053652 1057610 936547 309741 -1009309 -2234566 -2251986 -1003528 323546
$$ packed form
39618I87103J599868Q29890n47522j405641j418402r00705j62719M63594N34179
39609b0355P5366j31939M60619J156466P91619n02790j211360m67867O21564M62174
39599A233497p10660j101589K2797J197906Q97740k26457m34746M04594P74947
39590B058029Q4773m51399j5442M08999j15457o88149j27026Q12622O06632m01255
39580B172327o07293m8043l85920j778120k136242m13222J480281J451846K18275
39571d6111k01997L07965K72703o00234j031398m32923K66906L17826J61945L25883
39561f59435N42583M98767M33406M51599J39154n58895q77404l13144M90466O45848
39551G92945K60707L958j21063o26806j319050j225257j7420J248458J327074
$$ plain form
39542 323546 631192 57105 -413495 -206192 277604 304439 -214012 -523608 140527 1530080
39532 1530080 2385950 1743358 169543 -737698 -225598 732188 791074 -13836 -512479
39523 -512479 -71433 817443 1526675 1908898 1741641 588932 -1198251 -2168220 -1282145
39514 -1282145 727905 2230720 2511496 2027078 1337575 700406 419913 592332 605670
39505 605670 -129798 -983372 -698481 667459 1512931 826716 -454797 -847184 -206838
39496 -206838 569830 1031863 1373421 1529421 1095478 148137 -663926 -1004260 -1214936 -1602283
39486 -1602283 -1869469 -1557756 -693860 344889 1377102 2398822 3043250 2566396 763757
39477 763757 -1341186 -2338273 -2087040 -1917218 -2771250 -3770466 -3457203 -2103348 -1621563
$$ packed form
39542C23546L07646n74087m70600K07303M83796K6835n18451l09596O64135J389553
39532A530080Q55870o42592j573815r07241N12100R57786N8886q04910m98643
39523e12479M41046Q88876P09232L82223j67257j152709j787183r69969Q86075
39514a282145K010050J502815K80776m84418o89503o37169k80493J72419J3338
39505F05670p35468q53574K84891J365940Q45472o86215j281513l92387O40346
39496b06838P76668M62033L41558J56000m33943r47341q12063l40334k10676l87347
39486a602283k67186L11713Q63896J038749J032213J021720O44428m76854j802639
39477G63757k104943r97087K51233J69822q54032r99216L13263J353855M81785
$$ plain form
39468 -1621563 -2983990 -4803961 -5108560 -3766849 -2363536 -2100688 -2651338 -2964751 -2497483
39459 -2497483 -1526812 -675247 -289200 -161637 98392 431003 403748 49243 82438 862551
39449 862551 1655738 1611203 1114476 1302676 2327985 3035814 2577644 1489414 716214
39440 716214 295988 -284974 -924577 -1019259 -668442 -836596 -1935188 -2919567 -2486428 -891672
39430 -891672 204079 -173761 -1070671 -926613 305522 1099973 394163 -1032155 -1593254
39421 -1593254 -874974 -6111 -128413 -1043797 -1658699 -1449346 -984198 -945477 -1145040 -946048
39411 -946048 -372757 -127248 -464006 -783856 -699965 -810208 -1725024 -2805692 -2772589 -1450012
39401 -1450012 -60374 318683 -112965 -447096 -146068 650107 1363606 1353680 547499 -206262
$$ packed form
39468a621563j362427j819971l04599J341711J403313K62848n50650l13413M67268
39459b497483R70671Q51565L86047J27563K60029L32611k7255l54505L3195P80113
39449H62551P93187m4535m96727J88200J025309P07829m58170j088230p73200
39440G16214m20226n80962o39603r4682L50817j68154j098592r84379M33139J594756
39430h91672J095751l77840q96910J44058J232135P94451p05810j426318n61099
39421a593254P18280Q68863j22302r15384o14902K09353M65148L8721j99563J98992
39411i46048N73291K45509l36758l19850Q3891j10243r14816j080668L3103J322577
39401a450012J389638L79057m31648l34131L01028P96175P13499r926q06181p53761
$$ plain form
39391 -206262 17816 942518 1347373 766929 110681 226454 681376 592750 4715 -326754
39381 -326754 -113665 213188 208878 -179296 -705888 -901995 -348530 675369 1123046 266165
39371 266165 -1348490 -2439029 -2298290 -1285644 -342604 -333379 -1465628 -2965285 -3663633
39362 -3663633 -3226259 -2409403 -1904797 -1611041 -1389811 -1635377 -2380765 -2660250 -1711787
39353 -1711787 -196085 747890 1071105 1367789 1425004 516783 -1142282 -2502256 -3086930
39344 -3086930 -3136204 -2589711 -1299581 -147025 -393976 -1707866 -2325276 -1588418 -862862
39335 -862862 -1316911 -2189819 -2177960 -1391321 -854407 -879386 -995756 -961627 -922246 -914763 -924184
39324 -924184 -1110407 -1443194 -1494771 -1041796 -420462 84175 598335 1016948 771824 -172932
$$ packed form
39391b06262K24078R24702M04855n80444o56248J15773M54922q8626n88035l31469
39381c26754K13089L26853m310l88174n26592j96107N53465J023899M47677q56881
39371B66165j614655j090539J40739J012646R43040R225j132249j499657o98348
39362c663633M37374Q16856N04606K93756K21230k45566p45388k79485R48463
39353a711787J515702R43975L23215K96684N7215r08221j659065j359974n84674
39344c086930m9274N46493J290130J152556k46951j313890o17410P36858P25556
39335h62862m54049q72908J1859P86639N36914k4979j16370L4129L9381P483r421
39324i24184j86223l32787n1577M52975O21334N04637N14160M18613k45124r44756
$$ plain form
39314 -172932 -852692 -554529 137797 307425 27885 -129399 -220061 -520534 -559821 280222
39304 280222 1563091 2332293 2529180 2680016 2482513 1195593 -547568 -942466 461847
39295 461847 1862467 1642461 535534 308734 1191802 1901745 1749929 1366092 1295707
39286 1295707 1061166 68228 -1347395 -2375146 -2783816 -2928501 -2929125 -2487191 -1624057 -1046432
39276 -1046432 -1332169 -1972671 -1766383 -293116 1416436 1994880 1268011 268684 -159725
39267 -159725 -257689 -694296 -1469256 -1887729 -1469164 -469886 510959 1087210 1148519 739463
39257 739463 150520 -136564 36521 203196 -109460 -587845 -489446 225895 787053 813064
39247 813064 878971 1420374 1771692 1063528 -372332 -1368369 -1455631 -1149555 -827513 -321917
$$ packed form
39314a72932o79760K98163O92326J69628k79540j57284r0662l00473l9287Q40043
39304B80222J282869P69202J96887J50836j97503j286920j743161l94898J404313
39295D61847J400620k20006j106927k26800Q83068P09943j51816l83837p0385
39286A295707k34541r92938j415623j027751m08670j44685o24M41934Q63134N77625
39276a046432k85737o40502K06288J473267J709552N78444p26869r99327m28409
39267a59725r7964m36607p74960m18473M18565R99278R80845N76251O1309m09056
39257G39463n88943k87084J73085J66675l12656m78385R8399P15341N61158K6011
39247H13064O5907N41403L51318p08164j435860r96037q7262L06076L22042N05596
$$ plain form
39237 -321917 225076 102434 -879010 -1747982 -1443254 -157195 877898 759871 -232804
39228 -232804 -1028275 -839766 41938 551708 67899 -918770 -1628655 -2018240 -2341680 -2151329
39218 -2151329 -803240 1138696 2144559 1573951 324571 -557388 -889850 -752087 -44980
39209 -44980 858190 1076686 398184 -431675 -990136 -1636740 -2287038 -2134675 -1288061 -1158146
39199 -1158146 -2210217 -2881010 -2041909 -967422 -1143781 -1610948 -692921 799308 729706
39190 729706 -632537 -874595 611110 1760734 1411061 1015907 1746129 2317100 1271627
39181 1271627 -481209 -1197212 -982235 -1136823 -1779985 -1923006 -1410118 -1174532 -1678032
39172 -1678032 -2332663 -2492214 -2134495 -1607341 -1381846 -1897861 -3040839 -3978632 -4032902
$$ packed form
39237c21917N46993j22642r81444q68972L04728J286059J035093j18027r92675
39228b32804p95471J88509Q81704N09770m83809r86669p09885l89585l23440J90351
39218b151329J348089J941936J005863n70608j249380q81959l32462J37763P07107
39209d4980R03170K18496o78502q29859n58461o46604o50298J52363Q46614J29915
39199a158146j052071o70793Q39101J074487j76359m67167R18027J492229o9602
39190G29706j362243k42058J485705J149624l49673l95154P30222N70971j045473
39181A271627j752836p16003K14977j54588o43162j43021N12888K35586n03500
39172a678032o54631j59551L57719N27154K25495n16015j142978r37793n4270
$$ plain form
39163 -4032902 -3381106 -2409026 -943588 1069872 2609606 2384010 551746 -1289385 -1988585
39154 -1988585 -1978743 -2283198 -3014226 -3326738 -2627557 -1424936 -848752 -1392362 -2311886 -2467545
39144 -2467545 -1641281 -651916 -186541 -40383 296714 827899 1216353 1380552 1439173 1257983
39134 1257983 543197 -559336 -1272746 -834839 598298 1802994 1549144 -53720 -1605505
39125 -1605505 -2019934 -1585942 -1055345 -415668 561684 1191025 599082 -653029 -1059379
39116 -1059379 -314325 393539 358412 142695 76907 -410207 -1351724 -1733142 -1271542 -1135250
39106 -1135250 -1821525 -1897112 -271078 1694918 2046446 1054259 347165 211369 -208239
39097 -208239 -723029 -342398 584230 634299 -252638 -641124 -93465 210773 -226878 -267610
$$ packed form
39163d032902O51796R72080J465438K013460J539734k25596j832264j841131o99200
39154a988585R842l04455p31028l12512O99181J202621N76184n43610r19524j55659
39144b467545Q26264R89365M65375J46158L37097N31185L88454J64199N8621j81190
39134A257983p14786j102533p13410M37907J433137J204696k53850j602864j551785
39125a605505m14429M33992N30597O39677R77352O29341n91943j252111m06350
39116a059379P45054P07864l5127k15717o5788m87114r41517l81418M61600J36292
39106a135250o86275p5587J626034J965996L51528r92187p07094j35796m19608
39097b08239n14790L80631R26628N0069q86937l88486N47659L04238m37651m0732
$$ plain form
39087 -267610 772453 1797725 1658601 806371 264004 117000 -60367 -304037 -622257
39078 -622257 -1297952 -2062478 -1943505 -728299 378053 365398 -262843 -603402 -742732
39069 -742732 -1036842 -1036336 -378547 92915 -506655 -1436819 -1282630 -157743 550279 464044
39059 464044 692357 1826302 2859163 2635418 1340755 -51901 -1062217 -1816876 -2379190
39050 -2379190 -2536842 -2109535 -1212813 -273564 303043 684355 1539797 2984113 3970114
39041 3970114 3499378 2179056 1537788 1794422 1551671 144375 -968590 -160494 1878578
39032 1878578 2921915 2143393 951617 764139 1185261 1016419 177936 -336889 -59240
39023 -59240 363629 249864 -205220 -439862 -439443 -671744 -1341664 -2119406 -2519076 -2240193
$$ packed form
39087b67610J040063J025272j39124q52230n42367j47004j77367k43670l18220
39078f22257o75695p64526J18973J215206J106352j2655o28241l40559j39330
39069g42732k94110N06O57789M71462n99570r30164J54189J124887P08022q6235
39059D64044K28313J133945J032861k23745j294663j392656j010316p54659n62314
39050b379190j57652M27307Q96722R39249N76607L81312Q55442J444316R86001
39041C970114m70736j320322o41268K56634k42751j407296j112965Q08096K039072
39032A878578J043337p78522j191776j87478M21122j68842q38483n14825K77649
39023e9240M22869j13765m55084k34642M19k32301o69920p77742l99670K78883
$$ plain form
39013 -2240193 -1245270 133906 1181792 1258156 401410 -705170 -1385885 -1425848 -981736
39004 -981736 -358412 157871 561218 1164947 2012825 2385727 1502289 -256787 -1531945
38995 -1531945 -1609567 -1142970 -918977 -755466 -287999 -49231 -700342 -1635079 -1561196 -413291
38985 -413291 452552 151723 -691456 -1149224 -1237961 -1392346 -1559460 -1583066 -1825312 -2516050
38975 -2516050 -2942511 -2282639 -1058048 -737162 -1748962 -2753502 -2259994 -371441 1491991
38966 1491991 2191729 1791943 1166023 1085018 1616164 2181057 2202689 1705672 1163112 860546
38956 860546 744297 846703 1358809 2152490 2740773 2940907 3047481 3042229 2277494 530550
38946 530550 -1176522 -1613503 -874115 -46801 388830 863626 1508333 1771040 1495352
$$ packed form
39013b240193R94923J379176J047886P6364q56746j106580o80715l9963M44112
39004i81736O23324N16283M03347O03729Q47878L72902q83438j759076j275158
38995a531945p7622M66597K23993J63511M67467K38768o51111r34737P3883J147905
38985d13291Q65843l00829q43179m57768q8737j54385j67114k3606k42246o90738
38975b516050m26461O59872J224591L20886j011800j004540M93508J888553J863432
38966A491991O99738l99786o25920q1005N31146N64893K1632m97017n42560l02566
38956H60546j16249J02406N12106P93681N88283K00134J06574n252p64735j746944
38946E30550j707072m36981P39388Q27314M35631M74796O44707K62707k75688
$$ plain form
38937 1495352 1325287 1546375 1460106 583800 -329029 -314377 329988 500784 -140255 -921534
38927 -921534 -1267662 -1203579 -834225 -132320 646619 964729 582237 -258192 -1233198 -2147998
38917 -2147998 -2818884 -3124890 -3062471 -2461997 -1026769 863081 1887330 1144378 -531882
38908 -531882 -1476942 -1156514 -308891 501941 1210174 1330545 316669 -950906 -725006
38899 -725006 948729 1813841 657160 -625086 283792 2668535 3923364 3329976 2570408
38890 2570408 2714193 2851572 2106632 1113438 649178 267288 -667937 -1667103 -1940333
38881 -1940333 -1777810 -2006000 -2545012 -2563326 -1842348 -1036143 -605403 -304114 181753 770323
38871 770323 1339473 1966610 2521447 2444722 1326773 -440698 -1879033 -2313442 -1958485
$$ packed form
38937A495352j70065K21088q6269q76306r12829J4652O44365J70796o41039p81279
38927i21534l46128O4083L69354P01905P78939L18110l82492q40429r75006r14800
38917b147998o70886l06006O2419O00474J435228J889850J024249p42952j676260
38908e31882r45060L20428Q47623Q10832P08233J20371j013876j267575K25900
38899g25006J673735Q65112j156681j282246R08878K384743J254829n93388p59568
38890B570408J43785J37379p44940r93194m64260l81890r35225r99166k73230
38881a940333J62523k28190n39012j8314P20978Q06205M30740L01289M85867N88570
38871G70323N69150O27137N54837p6725j117949j767471j438335m34409L54957
$$ plain form
38862 -1958485 -1597282 -1696361 -1918042 -1651889 -950544 -538416 -723645 -793901 605 1223368
38852 1223368 1763739 1450411 1239398 1601071 1713156 878715 -100462 39057 1107790
38843 1107790 1737231 1424584 1118813 1583792 2311373 2547042 2405978 2256585 1799044
38834 1799044 656508 -640477 -1180814 -897265 -463189 -211103 43988 289670 275790
38825 275790 146927 323812 715669 763888 310058 -271204 -823097 -1526538 -2164139 -2052373
38815 -2052373 -989439 324888 1042291 865884 -10588 -1037323 -1407672 -803882 -82357
38806 -82357 -340631 -1220467 -1180953 282668 1826107 2160437 1684582 1521359 1909921 2422956
38796 2422956 2962937 3559432 3750426 3115734 2076910 1425849 1386452 1707948 2234458
$$ packed form
38862a958485L61203r9079k21681K66153P01345M12128j85229p0256P94506J222763
38852A223368N40371l13328k11013L61673J12085q34441r79177J39519J068733
38843A107790O29441l12647l05771M64979P27581K35669j41064j49393m57541
38834A799044j142536j296985n40337K83549M34076K52086K55091K45682j3880
38825B75790j28863J76885L91857M8219m53830n81262n51893p03441o37601J11766
38815b052373J062934J314327P17403j76407q76472j026735l70349O03790P21525
38806h2357k58274q79836L9514J463621J543439L34330m75855j63223L88562N13035
38796B422956N39981N96495J90994o34692j038824o51061l9397L21496N26510
$$ plain form
38787 2234458 2819812 3146788 3109362 2845566 2107836 492655 -1334228 -1897455 -1090588
38778 -1090588 -648577 -1383060 -1568733 259541 2449121 2503949 1120487 1106071 2658254
38769 2658254 2838318 305831 -2294374 -2034583 385349 2100077 1944241 1147954 1062461
38760 1062461 1713271 2281886 2034400 937927 -226504 -743851 -1001059 -1827696 -2824753
38751 -2824753 -2642660 -1183255 -12305 4024 -110184 511345 959024 255292 -756829
38742 -756829 -801983 -276862 -232363 -213625 909219 2528928 2804364 1495291 384943
38733 384943 641394 1468509 1833434 1977332 2473398 3026836 3105472 2918806 2951442 3120234
38723 3120234 3100038 3019802 3180333 3413113 3320984 2946305 2652673 2452488 1999401 1314912
$$ packed form
38787B234458N85354L26976l7426k63796p37730j615181j826883n63227Q06867
38778a090588M42011p34483j85673J828274K189580N4828j383462j4416J552183
38769B658254J80064k532487k600205K59791K419932J714728j55836p96287q5493
38760A062461O50810N68615k47486j096473j164431n17347k57208q26637r97057
38751b824753J82093J459405J170950J6329j14208O21529M47679p03732j012121
38742g56829m5154N25121M4499J8738J122844J619709K75436j309073j110348
38733C84943K56451Q27115L64925J43898M96066N53438P8636j86666L2636J68792
38723C120234k0196q0236J60531K32780r2129l74679k93632k00185m53087o84489
$$ plain form
38713 1314912 998799 1374376 1768130 1227933 -65441 -804760 -300099 502409 452165
38704 452165 6879 469332 1731178 2223224 1275197 65862 -295282 -236818 -480671
38695 -480671 -641560 -156562 481196 633323 732467 1317417 1721544 1137030 221661 85731
38685 85731 323647 -214262 -1168721 -1134078 -216209 -91772 -1259404 -2158909 -1609875 -415445
38675 -415445 239859 496512 1021377 1758319 2417057 3172948 3992125 4178428 3443235 2594718
38665 2594718 2368318 2405321 2217615 2317551 3381711 4923273 5809922 5682958 4986640
38656 4986640 3978040 2598786 1110089 72905 -244910 37967 698537 1360561 1486998
38647 1486998 915508 174041 -98663 223052 936528 1860395 2697736 3052867 2925698
$$ packed form
38713A314912l16113L75577L93754n40197j293374p39319N04661Q02508n0244
38704D52165m45286M62453J261846M92046r48027j209335l61144N8464k43853
38695d80671j60889M84998O37758J52127R9144N84950M04127n84514r15369j35930
38685H5731K37916n37909r54459L4643R17869J24437j167632q99505N49034J194430
38675d15445O55304K56653N24865P36942O58738P55891Q19177J86303p35193q48517
38665B594718k26400L7003j87706R9936J064160J541562Q86649j26964o96318
38656D986640j008600j379254j488697j037184l17815K82877O60570O62024J26437
38647A486998n71490p41467k72704L21715P13476R23867Q37341L55131j27169
$$ plain form
38638 2925698 2710067 2476115 1914672 1226972 1153842 1662783 1629689 553516 -435085 -280107
38628 -280107 212673 -401672 -1836857 -2392781 -1401883 11876 648554 520336 253892
38619 253892 216550 514277 1083560 1522496 1382145 740686 60880 -414614 -670134 -620139
38609 -620139 -398375 -543372 -1137132 -1216529 -34084 1497871 1846207 1115724 898498
38600 898498 1851101 2843025 2788643 1964913 1060414 204906 -465040 -485228 -18546 -24477
38590 -24477 -724624 -1010496 -264621 356755 -378621 -1764353 -2233016 -1760506 -1649519 -2242678
38580 -2242678 -2430702 -1539100 -335783 208894 100710 -153354 -314879 -266401 163114
38571 163114 756760 894464 417756 -29589 24258 76964 -600893 -1757861 -2331149 -1741858
$$ packed form
38638B925698k15631k33952n61443o87700p3130N08941l3094j076173r88601J54978
38628b80107M92780o14345j435185n55924R90898J413759O36678j28218k66444
38619B53892l7342K97727N69283M38936j40351o41459o79806m75494k55520M9995
38609f20139K21764j44997n93760p9397J182445J531955L48336p30483k17226
38600H98498R52603R91924n4382q23730r04499q55508o69946k0188M66682n931
38590b4477p00147k85872P45875O21376p35376j385732m68663M72510J10987n93159
38580b242678j88024Q91602J203317N44677j08184k54064j61525M8478M29515
38571A63114N93646J37704m76708m47345N3847N2706o77857j156968n73288N89291
$$ plain form
38561 -1741858 -528950 342536 441199 50574 -331360 -494276 -600808 -895191 -1370394
38552 -1370394 -1736395 -1708853 -1307339 -886057 -875331 -1389039 -1990838 -1958737 -989573 349904
38542 349904 1047785 593423 -570300 -1520815 -1660956 -1075865 -281092 284957 599171
38533 599171 957967 1538294 2108906 2277244 1967261 1472945 1027105 537550 -112190 -664524
38523 -664524 -655073 -32169 576661 412364 -605162 -1777706 -2403282 -2472868 -2445435 -2544448
38513 -2544448 -2619114 -2577166 -2440002 -1908219 -512103 1436893 2627157 2128826 634511
38504 634511 -422150 -733746 -1171185 -2005173 -2235438 -1180327 257749 764908 393104
38495 393104 190835 471093 548174 113400 -241654 -140313 -111663 -671353 -1417821 -1629179
$$ packed form
38561a741858J212908Q71486R8663l90625l81934j62916j06532k94383m75203
38552a370394l66001K7542M01514M21282J0726n13708o01799L2101R69164J339477
38542C49904O97881m54362j163723r50515j40141N85091P94773N66049L14214
38533E99171L58796N80327N70612J68338l09983m94316m45840m89555o49740n52334
38523f64524R451O22904O08830j64297j017526j172544o25576o9586K7433r9013
38513b544448p4666M1948J37164N31783J396116J948996J190264m98331j494315
38504F34511j056661l11596m37439q33988k30265J055111J438076N07159l71804
38495C93104k02269K80258P7081m34774l55054J01341K8650n59690p46468k11358
$$ plain form
38485 -1629179 -1279353 -905261 -810254 -884764 -910224 -609468 244007 1293977 1608714 857406
38475 857406 87485 515029 1820378 2622912 2512433 2397077 2637748 2219612 571738
38466 571738 -939560 -611663 1107391 2111491 1472157 458020 481244 1218866 1402801
38457 1402801 616919 -490880 -1267285 -1530838 -1287125 -739972 -488762 -988949 -1735353
38448 -1735353 -1619149 -316098 1193523 1763201 1306090 584564 207921 271663 648577
38439 648577 1079234 1134613 629209 -1594 -241747 -304391 -762474 -1401970 -1259892 -20850
38429 -20850 1449664 2341739 2792060 2969648 2285463 566620 -808078 -420810 925879
38420 925879 1082172 -319851 -1299471 -477238 1098527 1889045 2053139 2443924 2712834
$$ packed form
38485a629179L49826L74092R5007p4510k5460L00756Q53475J049970L14737p51308
38475H57406p69921M27544J305349Q02534j10479j15356K40671m18136j647874
38466E71738j511298L27897J719054J004100o39334j014137K3224P37622J83935
38457A402801p85882j107799p76405k63553K43713N47153K51210n00187p46404
38448a735353J16204J303051J509621N69678m57111p21526l76643O3742L76914
38439F48577M30657N5379n05404o30803k40153o2644m58083o39496J42078J239042
38429b0850J470514Q92075M50321J77588o84185j718843j374698L87268J346689
38420I25879J56293j402023r79620Q22233J575765P90518J64094L90785K68910
$$ plain form
38411 2712834 2053687 1038811 955650 1631442 1583808 354202 -839423 -1051904 -840241
38402 -840241 -1041834 -1462575 -1444201 -915718 -242375 393383 950358 1305817 1412629 1303085
38392 1303085 842132 10196 -584334 -272764 487721 430131 -734444 -1804641 -1789883
38383 -1789883 -1157479 -821431 -863466 -1008759 -1454292 -2266401 -2687919 -2084628 -1032161
38374 -1032161 -467594 -302895 28877 168555 -679418 -2073674 -2581097 -1862330 -1251659
38365 -1251659 -1845262 -3043826 -3549756 -3040533 -2257421 -1926307 -2086805 -2225944 -1826260
38356 -1826260 -998317 -542373 -972944 -1592441 -1190373 294658 1528849 1385614 127527
38347 127527 -1237802 -2077312 -2242347 -1724795 -776593 -2544 155421 -147544 -477642
$$ packed form
38411B712834o59147j014876q3161O75792m7634j229606j193625k12481K11663
38402h40241k01593m20741J8374N28483O73343O35758N56975L55459J06812j09544
38392A303085m60953q31936n94530L11570P60485n7590j164575j070197J4758
38383a789883O32404L36048m2035j45293m45533q12109m21518O03291J052467
38374a032161N64567J64699L31772J39678q47973j394256n07423P18767O10671
38365a251659n93603j198564n05930N09223P83112L31114j60498j39139L99684
38356a826260Q27943M55944m30571o19497M02068J485031J234191j43235j258087
38347A27527j365329q39510j65035N17552R48202P74049J57965l02965l30098
$$ plain form
38338 -477642 -615862 -562753 -373706 -174616 -71594 25710 185623 133990 -373165 -967474
38328 -967474 -1107499 -995257 -1203792 -1451307 -900581 134374 177775 -1086937 -1891172
38319 -1891172 -854443 829824 1126101 182870 -80620 1026802 2153604 2125653 1384997
38310 1384997 836349 549744 138834 -520914 -1385324 -2270530 -2532537 -1549016 244729
38301 244729 1640372 2148217 2274842 2196602 1377019 -101586 -1102496 -1002724 -549203
38292 -549203 -418270 -146659 542691 630471 -596654 -1861640 -1472019 109887 1030340
38283 1030340 920813 1057462 1734453 1603089 161875 -1029291 -657367 328232 267591
38274 267591 -754657 -1371891 -1100948 -630289 -308269 297341 1279761 1929058 1717094
$$ packed form
38338d77642j38220N3109J89047J99090J03022R7304J59913n1633n07155n94309
38328i67474j40025J12242k08535k47515N50726J034955M3401j264712q04235
38319a891172J036729J684267K96277r43231k63490J107422J126802k7951p40656
38310A384997n48648k86605m10910o59748q64410q85206k62007R83521J793745
38301B44729J395643N07845J26625p8240q19583j478605j000910R9772M53521
38292e49203J30933K71611O89350Q7780j227125j264986L89621J581906R20453
38283A030340j09527J36649O76991j31364j441214j191166L71924R85599o0641
38274B67591j022248o17234K70943M70659L22020O05610R82420O49297k11964
$$ plain form
38265 1717094 1067914 813022 1218660 1719757 1469890 226732 -1186601 -1582361 -778652
38256 -778652 133845 205076 -220011 -260810 153926 458300 518150 598555 537525 -23337
38246 -23337 -675996 -587613 96526 253471 -550458 -1410026 -1479958 -1020160 -527394 154779
38236 154779 1092125 1534561 943829 112796 192613 1017290 1453071 1137399 769380 750430
38226 750430 623257 9473 -831799 -1612186 -2364804 -2948386 -2980969 -2549322 -2243967 -2201145
38216 -2201145 -1895058 -1238719 -1015277 -1631127 -2256335 -1999641 -1276488 -1066741 -1291235
38207 -1291235 -1002685 -8568 732209 388964 -913328 -2598458 -4122043 -4848962 -4366648
38198 -4366648 -3203696 -2387294 -1959292 -877424 1089851 2430338 1833954 279158 -113859
$$ packed form
38265A717094o49180k54892M05638N01097k49867j243158j413333l95760Q03709
38256g78652R12497P1231m25087m0799M14736L04374N9850Q0405o1030n60862
38246b3337o52659Q8383O84139J56945q03929q59568o9932M59798M92766O82173
38236A54779R37346M42436n90732q31033P9817Q24677M35781l15672l68019j8950
38226G50430j27173o13784q41272p80387p52618n83582l2583M31647L05355M2822
38216b201145L06087O56339K23442o15850o25208K56694P23153K09747k24494
38207a291235K88550R94117P40777l43245j302292j685130j523585p26919M82314
38198d366648J162952Q16402M28002J081868J967275J340487n96384j554796l93017
$$ plain form
38189 -113859 1061363 2149620 1907961 924665 191805 -413133 -1373498 -2228414 -2131641
38180 -2131641 -1241521 -523267 -373721 -376749 -347627 -639606 -1198857 -1198096 -155503 1089762
38170 1089762 1113416 -505695 -2687592 -3942769 -3820653 -3237184 -3297096 -3824489 -3484884
38161 -3484884 -1676025 268118 582211 -541975 -1209672 -500692 436405 448874 148804
38152 148804 557429 1107550 524658 -901728 -1585394 -1046468 -447107 -539642 -643531 -209548
38142 -209548 44099 -526147 -1162533 -866671 -102271 -128607 -1079433 -1850160 -1698498 -939131
38132 -939131 -124341 508709 719992 290091 -415325 -611039 -81986 525842 564531 11558
38122 11558 -858216 -1783384 -2271350 -1719527 -253414 1021768 1146257 442904 57917
$$ packed form
38189a13859J175222J088257k41659r83296p32860o04938r60365q54916R6773
38180b131641Q90120P18254J49546l028K9122k91979n59251P61J042593J245265
38170A089762K3654j619111k181897j255177J22116N83469n9912n27393L39605
38161c484884J808859J944143L14093j124186o67697P08980R37097J2469l00070
38152A48804M08625N50121n82892j426386o83666N38926N99361r2535j03889M33983
38142b09548K53647n70246o36386K95862P64400k6336r50826p70727J51662P59367
38132i39131Q14790O33050K11283m29901p05416j95714N29053O07828L8689n52973
38122A1558q69774r25168m87966N51823J466113J275182J24489p03353l84987
$$ plain form
38113 57917 468548 866596 126432 -1797068 -3576341 -3720335 -2140810 -336027 201863
38104 201863 -461766 -1122512 -1120435 -866974 -723976 -320717 571843 1295710 1160552 505437
38094 505437 107850 -84391 -701048 -1566388 -1580210 -247351 1455840 2203419 1820804
38085 1820804 1234351 1270388 1935892 2686774 2994915 2675503 1919694 1048436 178482 -758090
38075 -758090 -1602858 -1813315 -974501 571438 1797631 1783179 491887 -1134522 -1907127
38066 -1907127 -1437226 -515877 -257515 -844434 -1429088 -1370085 -1097278 -1362939 -2008399 -2133204
38056 -2133204 -1444848 -765088 -929266 -1683916 -2090995 -1698111 -816809 171486 1169595
38047 1169595 1932085 1875761 766656 -681241 -1398526 -1146221 -712128 -832456 -1294544
$$ packed form
38113E7917M10631L98048p40164j923500j779273j43994J579525J804783N37890
38104B01863o63629o60746K077K53461J42998M03259Q92560P23867j35158o55115
38094E05437l97587j92241o16657q65340j3822J332859J703191P47579l82615
38085A820804n86453L6037O65504P50882L08141l19412p55809q71258q69954r36572
38075g58090q44768k10457Q38814J545939J226193j4452j291292j626409p72605
38066a907127M69901R21349K58362n86919n84654N9003K72807k65661o45460j24805
38056b133204O88356O79760j64178p54650m07079L92884Q81302R88295R98109
38047A169595P62490n6324j109105j447897p17285K52305M34093j20328m62088
$$ plain form
38038 -1294544 -1369088 -883633 -495795 -901923 -2005381 -2929128 -2793921 -1576146 -281616
38029 -281616 -58312 -917453 -1588217 -1033163 141231 436949 -453967 -1229212 -956711
38020 -956711 -502963 -1139541 -2424390 -2697461 -1475110 -41371 558631 820319 1429612
38011 1429612 1768484 913559 -551590 -1055722 -206886 784659 969081 772477 836137
$$ packed form
38038a294544p4544M85455L87838m06128j103458r23747J35207J217775J294530
38029b81616K23304q59141o70764N55054J174394K95718q90916p75245K72501
38020i56711M53748o36578j284849k73071J222351J433739O00002K61688O09293
38011A429612L38872q54925j465149n04132Q48836R91545J84422j96604O3660
$$ [...]
##END NTUPLES=NMR SPECTRUM
##END=
