##TITLE=31Pdec_PR184_K
 D2O, 124 sc
 3.09.2021
##JCAMPDX= 6.0         $$ Bruker NMR JCAMP-DX V2.0
##DATA TYPE= NMR SPECTRUM
##DATA CLASS= NTUPLES
##ORIGIN= UXNMR, Bruker Analytische Messtechnik GmbH
##OWNER= root
$$ XWIN-NMR		Version 3.5
$$ Fri Sep  3 12:53:12 2021 Russian Standard Time (UT+4h)  she@DPX200
##.OBSERVE FREQUENCY= 81.013821
##.OBSERVE NUCLEUS= ^31P
##.ACQUISITION MODE= SIMULTANEOUS
##.ACQUISITION SCHEME= undefined
##.AVERAGES= 124
##.DIGITISER RES= 16
##SPECTROMETER/DATA SYSTEM= spect
##.PULSE SEQUENCE= zgpg30
##.SOLVENT NAME= CDCl3
##.SHIFT REFERENCE= (INTERNAL, CDCl3, 0, 248.564)
##AUDIT TRAIL= $$ (NUMBER, WHEN, WHO, WHERE, WHAT)
$$ ##TITLE= Audit trail, XWIN-NMR		Version 3.5
$$ ##JCAMPDX= 5.01
$$ ##ORIGIN= Bruker BioSpin GmbH
$$ ##OWNER= she
$$ F:/spectra/data/she/nmr/P31/1/pdata/1/auditp.txt
$$ ##AUDIT TRAIL=  $$ (NUMBER, WHEN, WHO, WHERE, WHAT)
(   1,<2021-09-03 12:52:26.15 +0400>,<she>,<DPX200>,
      <continue with go, POWCHK disabled, PULCHK disabled
       configuration hash MD5:
       00 E9 B6 7A A2 85 ED C7 34 08 36 98 17 FE 4E 26
       data hash MD5: 32K
       8A 31 D6 23 99 B6 27 CD 5D B4 8E 13 3D DB BA 2B>)
(   2,<2021-09-03 12:52:27.70 +0400>,<she>,<DPX200>,
      <Start of raw data processing
       efp BC_mod = 2 LB = 1 FT_mod = 6 PKNL = 1 PHC0 = -7862.854 PHC1 = 318.4701 SI = 64K 
       data hash MD5: 64K
       64 C6 A4 A1 61 AE 92 B2 D1 D2 B0 C7 94 74 23 18>)
(   3,<2021-09-03 12:52:47.68 +0400>,<she>,<DPX200>,
      <pk PHC0 = 3.266504 PHC1 = -1.6 
       data hash MD5: 64K
       D2 24 CB EF 40 F1 0D 55 70 D8 53 33 70 11 E1 17>)
$$ ##END=
$$ 
$$ hash MD5
$$ 69 41 84 20 16 42 0B 6D 6E C6 DF FF 3B 9E C3 A2
##$RELAX= 
##$RELAX= 
##$RELAX= 
##$RELAX= 
##$RELAX= 
##$RELAX= 
##$RELAX= 
##$RELAX= 
$$ Bruker specific parameters
$$ --------------------------
##$DU= <F:/spectra>
##$EXPNO= 1
##$NAME= <P31>
##$PROCNO= 1
##$TYPE= <nmr>
##$USER= <she>
##$AMP= (0..31)
100 100 100 100 100 100 100 100 100 100 100 100 100 100 100 100 100 100 
100 100 100 100 100 100 100 100 100 100 100 100 100 100 
##$AQSEQ= 0
##$AQ_mod= 1
##$AUNM= <au_zg>
##$AUTOPOS= <>
##$BF1= 81.014009
##$BF2= 200.13
##$BF3= 200.13
##$BF4= 200.13
##$BF5= 200.13
##$BF6= 200.13
##$BF7= 200.13
##$BF8= 200.13
##$BYTORDA= 1
##$CFDGTYP= 0
##$CFRGTYP= 5
##$CHEMSTR= <none>
##$CNST= (0..31)
1 1 145 1 1 1 1 1 1 1 1 1 1 1 1 1 1 1 1 1 1 1 1 1 1 1 1 1 1 1 1 1 
##$CPDPRG= <waltz16>
##$CPDPRG1= <>
##$CPDPRG2= <waltz16>
##$CPDPRG3= <>
##$CPDPRG4= <mlev>
##$CPDPRG5= <mlev>
##$CPDPRG6= <mlev>
##$CPDPRG7= <mlev>
##$CPDPRG8= <mlev>
##$CPDPRGB= <>
##$CPDPRGT= <>
##$D= (0..31)
0 1 0 0 0 0 0 0 0 0 0 0.03 2e-05 3e-06 0 0 0 0 0 0 0 0 0 0 0 0 0 0 0 0 
0 0 
##$DATE= 1630658981
##$DBL= (0..7)
120 120 120 11 120 120 24 19 
##$DBP= (0..7)
150 150 150 150 150 150 150 150 
##$DBP07= 0
##$DBPNAM0= <>
##$DBPNAM1= <>
##$DBPNAM2= <>
##$DBPNAM3= <>
##$DBPNAM4= <>
##$DBPNAM5= <>
##$DBPNAM6= <>
##$DBPNAM7= <>
##$DBPOAL= (0..7)
0.5 0.5 0.5 0.5 0.5 0.5 0.5 0.5 
##$DBPOFFS= (0..7)
$$ [...]
##$SUBNAM2= <"">
##$SUBNAM3= <"">
##$SUBNAM4= <"">
##$SUBNAM5= <"">
##$SUBNAM6= <"">
##$SUBNAM7= <"">
##$SUBNAM8= <"">
##$SUBNAM9= <"">
##$SW= 501.771253377433
##$SWIBOX= (0..15)
0 1 3 0 0 0 0 0 0 0 0 0 0 0 0 0 
##$SW_h= 40650.406504065
##$TD= 32768
##$TD0= 1
##$TE= 0
##$TE2= 300
##$TE3= 300
##$TEG= 300
##$TL= (0..7)
0 120 53 12 22 120 120 120 
##$TP= (0..7)
150 150 150 150 150 150 150 150 
##$TP07= 0
##$TPNAME0= <>
##$TPNAME1= <>
##$TPNAME2= <>
##$TPNAME3= <>
##$TPNAME4= <>
##$TPNAME5= <>
##$TPNAME6= <>
##$TPNAME7= <>
##$TPOAL= (0..7)
0.5 0.5 0.5 0.5 0.5 0.5 0.5 0.5 
##$TPOFFS= (0..7)
0 0 0 0 0 0 0 0 
##$TUNHIN= 0
##$TUNHOUT= 0
##$TUNXOUT= 0
##$USERA1= <user>
##$USERA2= <user>
##$USERA3= <user>
##$USERA4= <user>
##$USERA5= <user>
##$V9= 5
##$VALIST= <valist>
##$VCLIST= <CCCCCCCCCCCCCCC>
##$VD= 0
##$VDLIST= <DDDDDDDDDDDDDDD>
##$VPLIST= <PPPPPPPPPPPPPPP>
##$VTLIST= <TTTTTTTTTTTTTTT>
##$WBST= 1024
##$WBSW= 4
##$XGAIN= (0..3)
0 0 0 0 
##$XL= 0
##$YL= 0
##$YMAX_a= 7111
##$YMIN_a= -3445
##$ZGOPTNS= <>
##$ZL1= 120
##$ZL2= 120
##$ZL3= 120
##$ZL4= 120
##$ABSF1= 0
##$ABSF2= 0
##$ABSG= 0
##$ABSL= 0
##$ALPHA= 0
##$AQORDER= 0
##$ASSFAC= 0
##$ASSFACI= 0
##$ASSFACX= 0
##$ASSWID= 0
##$AUNMP= <proc_1d>
##$AZFE= 0.1
##$AZFW= 0.5
##$BCFW= 0
##$BC_mod= 2
##$BYTORDP= 0
##$COROFFS= 0
##$CY= -3
##$DATMOD= 1
##$DC= 0
##$DFILT= <>
##$DTYPP= 0
##$F1P= 0
##$F2P= 0
##$FCOR= 1
##$FTSIZE= 65536
##$FT_mod= 6
##$GAMMA= 0
##$GB= 0
##$INTBC= 1
##$INTSCL= 5.30512e-09
##$ISEN= 30
##$LB= 1
##$LEV0= 0
##$LPBIN= 0
##$MAXI= 10000
##$MC2= 0
##$MEAN= 0
##$ME_mod= 0
##$MI= 50
##$NCOEF= 0
##$NC_proc= -6
##$NLEV= 6
##$NOISF1= 182.463
##$NOISF2= 159.3651
##$NSP= 0
##$NTH_PI= 0
##$NZP= 0
##$OFFSET= 248.5645
##$PC= 4
##$PHC0= -7859.587
##$PHC1= 316.8701
##$PH_mod= 1
##$PKNL= yes
##$PPARMOD= 0
##$PSCAL= 0
##$PSIGN= 0
##$REVERSE= no
##$SF= 81.014009
##$SI= 65536
##$SIGF1= 159.3651
##$SIGF2= -187.1042
##$SINO= 113.3802
##$SIOLD= 16384
##$SREGLST= <1H.CDCl3>
##$SSB= 0
##$STSI= 65536
##$STSR= 0
##$SW_p= 40650.406504065
##$SYMM= 0
##$S_DEV= 0
##$TDeff= 32768
##$TDoff= 0
##$TI= <>
##$TILT= no
##$TM1= 0
##$TM2= 0
##$TOPLEV= 0
##$USERP1= <user>
##$USERP2= <user>
##$USERP3= <user>
##$USERP4= <user>
##$USERP5= <user>
##$WDW= 1
##$XDIM= 65536
##$YMAX_p= 391656743
##$YMIN_p= -34563117
$$ End of Bruker specific parameters
$$ ---------------------------------
##NTUPLES= NMR SPECTRUM
##VAR_NAME=  FREQUENCY,     SPECTRUM/REAL,   SPECTRUM/IMAG
##SYMBOL=    X,             R,               I
##VAR_TYPE=  INDEPENDENT,   DEPENDENT,       DEPENDENT
##VAR_FORM=  AFFN,          ASDF,            ASDF
##VAR_DIM=   65536,         65536,           65536
##UNITS=     HZ,            ARBITRARY UNITS, ARBITRARY UNITS
##FACTOR=    0.620285442955139, 1,           1
##FIRST=     20137.2065510759, 0,            0
##LAST=      -20513.1999529892, 0,           0
##MIN=       -20513.1999529892, -34563117,   0
##MAX=       20137.2065510759, 391656743,    0
$$ Real data points
##PAGE= N=1
##DATA TABLE= (X++(R..R)), XYDATA
$$ [...]
##PAGE= N=2
##DATA TABLE= (X++(I..I)), XYDATA
13111A159036k419386o63929J947607K733135P78174j641328j713567p0366J56391
$$ 1159036 -1260350 -1924279 23328 2756463 3534637 1893309 179742 109376 265767
13102B65767j485765j696020J125410L686237K615698l56551j406248o62547j173509
$$ 265767 -1219998 -2916018 -1790608 1895629 4511327 4154776 2748528 2085981 912472
13093I12472k941521k549064Q42841L305545J685069j810553k921395j075921
$$ 912472 -2029049 -4578113 -3735272 -429727 1255342 -555211 -3476606 -4552527
13085d552527Q40966J166695R37921Q90753O153j833164k243670L43184L313275
$$ -4552527 -3711561 -2544866 -1606945 -716192 -710039 -2543203 -4786873 -4443689 -1130414
13076a130414K788603n64309k044349J24612K024418K68164k502886j872569J225594
$$ -1130414 1658189 1093880 -950469 -825857 1198561 1466725 -1036161 -2908730 -1683136
13067a683136K223164L40591q20876R9818L34194j280633j852045J62800J760802
$$ -1683136 540028 880619 59743 159561 493755 -786878 -2638923 -2476123 -715321
13058g15321N08088j192510l55114J567162J690711O91106O47376N35169j482890
$$ -715321 -207233 -1399743 -1754857 -187695 1503016 2194122 2841498 3376667 1893777
13049A893777l303831j596847J834779J844911j880181l791141q30010L043237
$$ 1893777 -1410054 -3006901 -1172122 672789 -1207392 -4998533 -5828543 -2785306
13041b785306L005228J39346j110006L20851J440597L05402j342406j043656P86064
$$ -2785306 219922 359268 -750738 -429887 1010710 1316112 -26294 -1069950 -283886
13032b83886J577417K95435j123792p23364L53353l78479k370660k290618O46008
$$ -283886 1293531 1588966 465174 -258190 95163 -283316 -2653976 -4944594 -4298586
13023d298586K750114J186703j688149k127831o02448m5018m91681K71591J833284
$$ -4298586 -1548472 -361769 -2049918 -4177749 -4780197 -4825215 -5316896 -5045305 -3212021
13014c212021J490843o77503j432041L66098K026166J479267m6411q29011r05251
$$ -3212021 -1721178 -2398681 -3830722 -3464624 -1438458 40809 -5602 -834613 -1739864
13005a739864m90580P77423K020651J548394k6251k40152Q80099N41577j674465
$$ -1739864 -2230444 -1453021 567630 2116024 2089773 1849621 2729720 3271297 1596832
12996A596832k435816k23930J760232P53306j238375j255468j72737k79625r77838
$$ 1596832 -838984 -1062914 697318 1450624 212249 -1043219 -1215956 -1495581 -2473419
12987b473419n46407J93651l07358q58743M15589K264580K244066R55759O45170
$$ -2473419 -3019826 -2826175 -3133533 -3992276 -3576687 -1312107 931959 1887718 2532888
12978B532888R67844P2663j249921o77291J093209J109205q25705k036406j757343
$$ 2532888 3500732 3573395 2323474 1646183 2739392 3848597 3022892 986486 -770857
12969g70857j747659j929663k2591L485797M539819J522734j896271k147727n12134
$$ -770857 -2518516 -4448179 -4470770 -984973 3554846 5077580 3181309 1033582 521448
12960E21448n437o61548q23186o04591r59523j113215J15318J723993J885888
$$ 521448 516011 -145537 -968723 -1573314 -2532837 -3646052 -3530734 -1806741 79147
12951G9147Q02775j40724q81328j904646k163817n28550J532514J602182J30029
$$ 79147 881922 741198 -140130 -2044776 -4208593 -4737143 -3204629 -1602447 -1472418
12942a472418l70155L39809J2503j595333j602237J168184L419112J882152j662641
$$ -1472418 -1842573 -1502764 -1490261 -3085594 -4687831 -3519647 -100535 1781617 118976
12933A18976k754600l69662K256613K443629Q60987p28982j855611k465019j854857
$$ 118976 -2635624 -3005286 -748673 1694956 2555943 1826961 -28650 -2493669 -4348526
12924d348526n7520J189397N34924r02196j138884j78740N07219O75081J330537
$$ -4348526 -4406046 -3216649 -2681725 -3583921 -4722805 -4901545 -4394326 -3719245 -2388708
12915b388708K239053J791993j34010j419542q13308J76544j68403j121877j077912
$$ -2388708 -149655 1642338 1508328 88786 -724522 -547978 -716381 -1838258 -2916170
12906b916170k62295N8488r5862M5430N4191r07899j961431j412610N46554K156605
$$ -2916170 -3178465 -3119977 -3215839 -3170409 -3116218 -4024117 -5985548 -7398158 -6851604 -4694999
12896d694999K761598K956769K494624O81045j279758j288724M0420q4169j884877
$$ -4694999 -1933401 1023368 3517992 4199037 2919279 1630555 1670975 1586806 -298071
12887b98071k289315k08105J183146l19056j913360k03460L143493L951866J812911
$$ -298071 -2587386 -2795491 -1612345 -1931401 -3844761 -4048221 -904728 3047138 4860049
12878D860049k21096r69839j921804l136498k597326j84823J426177Q82209J6386
$$ 4860049 4638953 3669114 1747310 -1389188 -3986514 -4171337 -2745160 -1862951 -1846565
12869a846565M10593R43161K10893j043427j478403j120718l78401J051035K878940
$$ -1846565 -1435972 -492811 -281918 -1325345 -2803748 -3924466 -4302867 -3251832 -372892
12860c72892L502289J986283n53091k534870l446412l123128j409625O14571J205046
$$ -372892 3129397 5115680 4562589 2027719 -1418693 -4541821 -5951446 -5336875 -4131829
12851d131829P10963J325975K964534K460999j166087l919896k304417J246648
$$ -4131829 -3420866 -2094891 869643 3330642 2164555 -1755341 -4059758 -2813110
12843b813110K148967N36656k1394J013175R59338m73715n75811R96772J244999
$$ -2813110 -664143 -127487 -148881 864294 1823632 1349917 774106 1770878 3015877
12834C015877o39980j542369j8692R76113m79081j442518Q13544L577724K784597
$$ 3015877 2375897 833528 814836 1790949 1311868 -130650 682894 4260618 7045215
12825G045215m14141j781209q36561o72023j853849j621316N53952J494286k22188
$$ 7045215 6631074 4849865 4013304 3341281 1487432 -133884 420068 1914354 1692166
12816A692166j642224m92225Q61738m29131k435409j218586K599166M136822J226456
$$ 1692166 49942 -442283 419455 -9676 -2445085 -3663671 -1064505 3072317 4298773
12807D298773k491055k713198l8797J619878N50680j181920j187259L59322J669208
$$ 4298773 1807718 -905480 -944277 675601 1226281 44361 -1142898 -783576 885632
12798H85632J628408L75865j301674k244820j412306Q25567K394034J663238l81701
$$ 885632 2514040 2889905 1588231 -656589 -2068895 -1243328 1150706 2813944 2432243
12789B432243j337357o40058j32381r90799j720890m57413J866581K494990P88289
$$ 2432243 1094886 454828 322447 -668352 -2389242 -2846655 -980074 1514916 2303205
12780B303205p22025N2899J685804J392010n97590j154532Q78110K418227N62935
$$ 2303205 1581180 1634079 3319883 4711893 4114303 2959771 3837881 6256108 6819043
12771F819043k621643k707076M97939K575248J168685q21373m28362P29984n953
$$ 6819043 4197400 1490324 1988263 4563511 5732196 4910823 4482461 5212445 5206492
12762E206492j327208n99801P53059n84582l419472l148303O30470K912728R50226
$$ 5206492 3879284 3279483 4032542 3447960 28488 -3119815 -2489345 423383 1373609
12753A373609j793205j475083O43697J275669J10797j160999j916432j953734
$$ 1373609 -419596 -1894679 -1250982 24687 135484 -1025515 -2941947 -4895681
12745d895681m24079K050836K829335J217986P2016R48594J137476j277263l109575
$$ -4895681 -5319760 -3268924 -439589 778397 850413 1799007 2936483 1659220 -1450355
12736a450355j105313J993471J537033j362003j805829Q83449K812266K258704
$$ -1450355 -2555668 -562197 974836 -387167 -2192996 -1309547 1502719 3761423
12728C761423J191275M62839j000164k186784o44946K386767K741018q6120k222388
$$ 3761423 4952698 5415537 4415373 2228589 1583643 3970410 6711428 6625308 4402920
12719D402920j974652j660007j950755l69379K780123L084797n89044l127355
$$ 4402920 2428268 768261 -1182494 -1551873 1228250 4313047 3724003 596648
12711E96648j077425J809409J028567j594059j988074p41590p32730j356406m94977
$$ 596648 -480777 1328632 2357199 763140 -1224934 -1966524 -2699254 -4055660 -4550637
12702d550637N64735m08301j590500j17571J907770M21364k862445k162779K925345
$$ -4550637 -3985902 -4394203 -5984703 -6102274 -4194504 -3773140 -6635585 -8798364 -5873019
12693e873019O027222L347650j165025k294107n48199L01133p60719j735284j398476
$$ -5873019 154203 3501853 2336828 42721 -505478 -204345 -965064 -2700348 -4098824
12684d098824m86405N0168R4142J12887P85680K233355L224427K191046o00690
$$ -4098824 -4585229 -4535061 -4440919 -4328032 -3542352 -1308997 1915430 4106476 3505786
12675C505786l023069l516243k388796o14377J157676K103373J418823k49872
$$ 3505786 482717 -3033526 -5422322 -6036699 -4879023 -2775650 -1356827 -1606699
12667a606699r39085K38562J922300K444633J832635R92955k7082j628958l040054
$$ -1606699 -2545784 -2307222 -384922 2059711 3892346 4885301 4858219 3229261 189207
12658A89207k639837k44865K073802K316783J033118K82519M54160q0496j689761
$$ 189207 -2450630 -2695495 -621693 1695090 2728208 3010727 3464887 3384391 1694630
12649A694630k105054j385K097223J261286j001774j000325Q53831N52872k353245
$$ 1694630 -410424 -411809 1685414 2946700 1944926 944601 1798432 2351304 -1941
12640a941l206594J97669L345139J667593k484318l697795j309076J189324K300122
$$ -1941 -3208535 -3010866 334273 2001866 -482452 -4180247 -5489323 -4299999 -1999877
12631a999877L166172L379109J187984k268962l444914j590221L00962L06788
$$ -1999877 1166295 4545404 5733388 3464426 19512 -1570709 -1269747 -962959
12623i62959j81446J89424M58583l34052j222637j037637j10085P21605J232436
$$ -962959 -1144405 -954981 -496398 -830450 -2053087 -3090724 -3200809 -2479204 -1246768
12614a246768J343100R34854M34458L92544O05181P22561R79880J080506k17591
$$ -1246768 96332 1031186 1465644 1858188 2463369 3185930 4165810 5246316 5028725
12605E028725k554172k853484M79831L959197L131593r28827l166518j811330
$$ 5028725 2474553 -378931 100900 4060097 7191690 6262863 3096345 1285015
12597A285015J39447M64603K96322O55630N93494k23999o87931q26914j756425
$$ 1285015 1424462 1889065 2185387 2841017 3434511 3210512 2522581 1695667 -60758
12588f0758k536055r05974K210722L096231J040396o14394l75475p03119k398121
$$ -60758 -2596813 -3502787 -1292065 1804166 2844562 2230168 1854693 1151574 -1246547
12579a246547k089256J638143M381109K217414j969287k905369o99154M52904
$$ -1246547 -3335803 -1697660 2683449 4900863 2931576 26207 -672947 -220043
12571b20043p57942j762603j048550J54951Q54480J455470J857305J196288k45534
$$ -220043 -977985 -2740588 -3789138 -3634187 -2779707 -1324237 533068 1729356 1483822
12562A483822r88172m24630N08229O50258l43542j757342j965834O3851K775165
$$ 1483822 495650 71020 579249 1229507 885965 -871377 -2837211 -2773360 1805
12553A805L111449M75250k209029k423420j050008k32628m10235r48954j577054
$$ 1805 3113254 3588504 1379475 -1043945 -2093953 -2326581 -2736816 -3685770 -5262824
12544e262824j594317J83020L024874M067184K210516r5154o78068n49056r58015
$$ -5262824 -6857141 -6674121 -3649247 417937 2628453 2533299 1855231 1306175 348160
12535C48160o37523J226267K227794M42418j536625j63562L189436L904873O84276
$$ 348160 -289363 936904 3164698 3607116 2070491 1906929 5096365 9001238 9685514
12526I685514l150379m371118k839867l06498J214564M80144j492757k021777
$$ 9685514 6535135 2164017 -675850 -982348 232216 712360 -780397 -2802174
12518b802174n29054K93386q85131j161099J648185M184555K154929k438962l751471
$$ -2802174 -3331228 -3037842 -3922973 -5084072 -3435887 748668 2903597 464635 -3286836
12509c286836n68456K728874L151040K109804J345189M90743n95552r59779p01300
$$ -3286836 -3855292 -1126418 2024622 4134426 5479615 5970358 5374806 4415027 3713727
12500C713727p98852p59324L19591Q70891j098168l588657k656751J219066L464156
$$ 3713727 2914875 2155551 2475142 3346033 2247865 -1340792 -3997543 -2778477 685679
12491F85679K343013P36007M30308j89122j525318j108077J403233K412778J29566
$$ 685679 3028692 3764699 4195007 4005885 2480567 1372490 2775723 5188501 5318067
12482E318067k273286j993896r18974j476106k083837m62055J724609J535480
$$ 5318067 3044781 1050885 131911 -1344195 -3428032 -3890087 -2165478 -629998
12474f29998k84123q66410l5151P2918r46289j404576o22482L17365O11730M94197
$$ -629998 -914121 -1780531 -1815682 -1742764 -2689053 -4093629 -4716111 -4398746 -3787016 -3292819
12464c292819K87102K05800O34337J531995K231911K396910K077380O98474k053678
$$ -3292819 -3005717 -2799917 -2165580 -633585 1598326 3995236 6072616 6771090 4717412
12455D717412m128978k710015J203549K939211M64081k551382k103356P04434
$$ 4717412 588434 -2121581 -918032 2021179 2485260 -66122 -2169478 -1465044
12447a465044K250735J734720Q00444Q915r51611j120394L48913J748234Q36942
$$ -1465044 785691 2520411 3320855 3329770 2378159 1257765 1606678 3354912 4191854
12438D191854j500137k407024j164419M34428J088097Q43536l29222k223668l186130
$$ 4191854 2691717 284693 -879726 -445298 642799 1486335 1157113 -1066555 -4252685
12429d252685j749442Q39960K007465J388105P65781R23470R32731M02089J23831
$$ -4252685 -6002127 -5162167 -3154702 -1766597 -1000816 -77346 855385 1257474 1381305
12420A381305L58466M05297r183m89683r28099j223631o08106J038309J934322
$$ 1381305 1739771 2145068 2135885 1646202 718103 -505528 -1113634 -75325 1858997
12411A858997N73578j461088j331964O74226J343544n46560k239974j083030J579510
$$ 1858997 2432575 971487 -360477 313749 1657293 1110733 -1129241 -2212271 -632761
12402f32761K312945K17552k078784j875033L54151J703498M89385j666188k004109
$$ -632761 1680184 1897736 -181048 -2056081 -1701930 1568 490953 -1175235 -3179344
12393c179344k21421J474545J679055J245019J069382O30158k66938m92838J68379
$$ -3179344 -3400765 -1926220 -247165 997854 2067236 2697394 2430456 1937618 2105997
12384B105997n4639j843492k734014n95092K581542L170385R08134j422310k209945
$$ 2105997 2051358 207866 -2526148 -3121240 -539698 2630687 3538821 2116511 -93434
12375i3434j948420q66251J085209K297551R39752j535124j527970J497146L912216
$$ -93434 -2041854 -2908105 -1822896 474655 1414407 -120717 -1648687 -151541 3760675
12366C760675K971048K84028j096494q85117j096282k568322l620297k206532
$$ 3760675 6731723 7015751 5919257 5034140 3937858 1369536 -2250761 -4457293
12358d457293J168422L206597J324217k655989m073038j342321K018702K659961
$$ -4457293 -3288871 -82274 1241943 -1414046 -5487084 -6829405 -4810703 -2150742
12350b150742J798228J823402J613158p03083k737011q54648K977403L086447
$$ -2150742 -352514 1470888 3084046 2380963 -356048 -1210696 1766707 4853154
12342D853154j078357l727366j506993J952063K386756Q55562L65709O48085j86603
$$ 4853154 3774797 47431 -1459562 492501 2879257 3734819 4100528 4748613 4562010
12333D562010j709517k220383j675870r28488Q5854J234935J255740q4847r41188
$$ 4562010 2852493 632110 -1043760 -1972248 -1886394 -651459 604281 519434 -421754
12324d21754k76748M54180J75590J04329R74064J313738O27173R84122K764257
$$ -421754 -698502 -244322 -68732 35597 1009661 2323399 2950572 3934694 6698951
12315F698951K404074j962372n944753m567438N7811J856509j20950j250406O49639
$$ 6698951 9103025 7140653 1195900 -3371538 -3313727 -1457218 -1578168 -2828574 -2178935
12306b178935K419881J381746p91761j583111j210735r17845n69316L31902J277067
$$ -2178935 240946 1622692 830931 -752180 -1962915 -2880760 -3450076 -3118174 -1841107
12297a841107J632066J356096L80034j093746j699119l43007J572401J650158
$$ -1841107 -209041 1147055 1527089 433343 -1265776 -1608783 -36382 1613776
12289A613776J18522n66776L03944R11830K91438m47025p38917j415789k234984
$$ 1613776 1732298 1165522 1469466 2381296 2672734 2225709 1486792 71003 -2163981
12280b163981j589495L53071J244722M68362L58754J985083K866076J036650j435102
$$ -2163981 -3753476 -3400405 -2155683 -1687321 -1328567 656516 3522592 4559242 3124140
12271C124140j617923j40771L58236n10154j023380n99191k40186l53702l71310
$$ 3124140 1506217 1365446 1723682 1213528 190148 -409043 -649229 -1002931 -1374241
12262a374241j88197k55777n90572q98414j038772n46756J041144K554502J818043
$$ -1374241 -1562438 -1818215 -2408787 -3307201 -4345973 -4892729 -3851585 -1297083 520960
12253E20960q26164k007653k07005J553376O03658o49130J121318L616384J821327
$$ 520960 -305204 -2312857 -2519862 -966486 -362828 -1011958 109360 3725744 5547071
12244E547071l438296n645638k059926K398845K712215M07410k88123J021337
$$ 5547071 2108775 -3536863 -5596789 -3197944 -485729 -78319 -366442 654895
12236F54895J819769J279937K68069j198813k978008k961296J21597L232515K229862
$$ 654895 2474664 3754601 4022670 2823857 -154151 -3115447 -2993850 238665 2468527
12227B468527j845978l479992j35523M300578M622672L83006m332274n461830
$$ 2468527 622549 -2857443 -2992966 1307612 5930284 6313290 1981016 -3480814
12219c480814k409607J745592L024720O64772j761405q18715K006803K508048
$$ -3480814 -5890421 -4144829 -1120109 -455337 -2216742 -3035457 -1028654 1479394
12211A479394J49294j259879L11997K164102J536267l31929j076041j010572j317362
$$ 1479394 1628688 368809 680806 2844908 4381175 4049246 2973205 1962633 645271
12202F45271j178621J33917O89003j051268k621028r54709K135706K289940m67163
$$ 645271 -533350 -399433 289570 -761698 -3382726 -4337435 -2201729 88211 -378952
12193c78952j851002l19269R46890o941p32458Q42928K557066J694971n81692
$$ -378952 -2229954 -2549223 -1602333 -1609274 -2341732 -1498804 1058262 2753233 2171541
12184B171541j434959o98012j84934l26281j26123O46550J386183J854936J822220
$$ 2171541 736582 38570 -146364 -472645 -598768 47782 1433965 3288901 5111121
12175E111121O40162j333153k238662j198557J11705m5290r09461q74984j75118
$$ 5111121 5751283 4418130 2179468 980911 1092616 1047326 137865 -737119 -912237
12166i12237K1650j39990J56481O22993N39156J42319j80554q02197j581585j368843
$$ -912237 -890587 -1030577 -874096 -251103 288053 430372 249818 -552379 -2133964 -3502807
12156c502807k12582P0773q28296n53591J628622K555606K89525j758655J1275
$$ -3502807 -3715389 -3644616 -4472912 -5026503 -3397881 -842275 -552750 -2311405 -2300130
12147b300130L070403K726767P738m48391J156675K61927l318872m233892m91136
$$ -2300130 770273 3497040 3504778 3056387 4213062 4474989 1156117 -3077775 -3568911
12138c568911L066954K544996L71918n9659J80477r66659k190066j727347q93420
$$ -3568911 -501957 2043039 2414957 2355298 2535775 1569116 -620950 -2348297 -3241717
12129c241717j075614o46012J557904L000303J467482p51512o44380M14689m35851
$$ -3241717 -4317331 -4963343 -3405439 -405136 1062346 310834 -333546 81143 -354708
12120c54708k034416j200967J475207K412595O32346j453281k126154j643322
$$ -354708 -2389124 -3590091 -2114884 297711 930057 -523224 -2649378 -4292700
12112d292700j87908J999992L096151J582513q93734j543664n74808l35044j188289
$$ -4292700 -4480608 -2480616 615535 2198048 1304314 -239350 -814158 -1149202 -2337491
12103b337491j376741l26169Q80928J667867J925179Q96273j132146j540881J020419
$$ -2337491 -3714232 -4040401 -3159473 -1491606 433573 1329846 197700 -1343181 -322762
12094c22762L444228K278142p43958j574191m92630p36695j854552m92249K532203
$$ -322762 3121466 5399608 4655650 3081459 2588829 1852134 -2418 -494667 2037536
12085B037536K460139j221329l191292p77047J918030R91011j582591k417071
$$ 2037536 4497675 3276346 85054 -691993 1226037 2217048 634457 -1782614
12077a782614j989079j886359j114613J021839K130749P20397m54663R87931K391483
$$ -1782614 -3771693 -5658052 -6772665 -5750826 -3620077 -2899680 -3354343 -2366412 25071
12068B5071M02557k935832l281739r38513L68232O4658P88999K625200K612683
$$ 25071 427628 -2508204 -5789943 -6728456 -6360224 -6295566 -5506567 -2881367 -268684
12059b68684L21325r91609J19767R95657k51571j437921k88335J375693N06110
$$ -268684 52641 -938968 -819201 176456 -75115 -1513036 -1801371 -425678 80432
12050H0432j997718k309823O23370L422994L041908Q14072k3385O37894l715k435951
$$ 80432 -1917286 -4227109 -3603739 -180745 2861163 3675235 3651850 4289744 4286029 1850078
12040A850078l117147R1643L525753K254881k486433m717295k273720P86204J219739
$$ 1850078 -1267069 -1175426 2350327 4605208 2118775 -2598520 -4872240 -4086036 -2866297
12031b866297R75311K164835K525206j42415k832598j548615J897664K504605
$$ -2866297 -1890986 273849 2799055 2656640 -175958 -1724573 173091 2677696
12023B677696n7092j565577n71444o0466j328272j593131N79937K208360Q44290
$$ 2677696 2620604 1055027 483583 423117 -905155 -2498286 -1918349 290011 1134301
12014A134301j208110p14176J352211J816374L88032o66835o47549q17173j229313
$$ 1134301 -73809 -787985 564226 2380600 2768632 2101797 1454248 637075 -592238
12005e92238m80725J104268J120188j009080k362359n75851K309492K392751o67360
$$ -592238 -1072963 31305 1151493 142413 -2219946 -2795797 -486305 1906446 1239086
11996A239086l281136k814226l76182J752109K978233L417015K359015j66988
$$ 1239086 -2042050 -4856276 -5232458 -3480349 -502116 2914899 5273914 5106926
11988E106926j959417j219533N77864Q65520p7710k69082n9687j297909k869494
$$ 5106926 3147509 1927976 2505840 3371360 3293650 3024568 2964881 1666972 -1202522
11979a202522j503502K286370L683863P94134k006468p12487K250367K232920
$$ -1202522 -2706024 -419654 3264209 4058343 2051875 1339388 3589755 5822675
11971E822675n36697k259259j771306j102861j110350o78481K58271M98052J74799
$$ 5822675 5285978 3026719 1255413 152552 -957798 -1636279 -1378008 -879956 -705157
11962g05157N56030J487781J683934J059561K65079j208732l656729m932228k871381
$$ -705157 -149127 1338654 3022588 4082149 4347228 3138496 -518233 -5450461 -8321842
11953h321842Q09585K472663J833668J669101K682601K671694R58396l94426m77085
$$ -8321842 -7512257 -5039594 -3205926 -1536825 1145776 3817470 4775866 4381440 3904355
11944C904355q18617j796019j463906O40911J936485P44894j126876j468846p19437
$$ 3904355 3085738 1289719 -174187 466724 2403209 3148103 2021227 552381 -167056
11935a67056k77442j47150J17088K10167J60663N92674R47802j66943j930062
$$ -167056 -444498 -591648 -474560 -264393 -103730 488944 1436746 1269803 -660259
11926f60259j477858J497960L334088J505355j650069k597072j429553m27447
$$ -660259 -2138117 -640157 2693931 4199286 2549217 -47855 -1477408 -1904855
11918a904855q6808L85933L58362j154345k636731j468676J953669M136130K926351
$$ -1904855 -1991663 -1605730 -1247368 -2401713 -5038444 -6507120 -4553451 -417321 2509030
11909B509030J09740j047375L47485K044771J363319j604302l839112k946824
$$ 2509030 2618770 1571395 1918880 3963651 5326970 3722668 -116444 -3063268
11901c063268k53953R59239j80563j536362j530813p82864J24779J593344K796729
$$ -3063268 -3317221 -2357982 -2538545 -4074907 -5605720 -6388584 -6263805 -4670461 -1873732
11892a873732J614660j574269k976429n19606K664842K538287k26326j798452
$$ -1873732 -259072 -1833341 -4809770 -5329376 -2664534 -126247 -352573 -2151025
11884b151025o40579J515051K753054K213150m22735l748559m276775n76765L362098
$$ -2151025 -2791604 -1276553 1476501 3689651 3266916 -481643 -4758418 -5335183 -1973085
11875a973085K704075j010551j651917K254417M933289J839561l629580n167548
$$ -1973085 730990 -279561 -1931478 322939 5256228 7095789 3466209 -1701339
11867a701339k187472O61899R23149P53447J867364K336028K79039k324661k326052
$$ -1701339 -3888811 -3226912 -2303763 -1550316 317048 2653076 2932115 607454 -1718598
11858a718598k07574Q30126j49952r09013j98756M48456Q9296K58427J607286
$$ -1718598 -1926172 -1096046 -1245998 -2155011 -2353767 -1905311 -1816015 -1557588 49698
11849D9698J805433l84477j813470M59540L617292K884978o53347j635660O44494
$$ 49698 1855131 1470654 -342816 116724 3734016 6618994 5965647 4329987 4974481
11840D974481J184736j819722l547874p97787K324137J134130k164073k741150
$$ 4974481 6159217 4339495 791621 -6166 2317971 3452101 1288028 -1453122
11832a453122r15260j46050l08274J040432K685389J321132j754369j699216J891855
$$ -1453122 -2368382 -2514432 -2822706 -1782274 903115 2224247 469878 -1229338 662517
11823F62517L899581J659798j362977j700019p40861q86110j114946K70982J686994
$$ 662517 4562098 6221896 4858919 3158900 2418039 1531929 416983 687965 2374959
11814B374959O98004j607942k065244r4540J939698K286694J260556l04044j730006
$$ 2374959 3072963 1465021 -600223 -694763 1244935 3531629 4792185 4488141 2758135
11805B758135j914167k60685J730648J776214O345j011909k7325J035101J97611
$$ 2758135 843968 583283 2313931 4090145 4096490 3084581 3057256 4092357 4289968
11796D289968j281736q40011J106636J549680k41845j224523N04493K033589j66829
$$ 4289968 3008232 2168221 3274857 4824537 4582692 3358169 3862662 5896251 5729422
11787E729422m161599m630023o72432K701942J888349n77649p96529N54442L96465
$$ 5729422 1567823 -3062200 -3734632 -1032690 855659 278010 -518519 35923 432388
11778D32388j153016j334955K76552J212646L72264n44482l55626k29017j148834
$$ 432388 -720628 -2055583 -1779031 -566385 -194121 -738603 -1094229 -1323246 -2472080
11769b472080j841497p09959J525426K563589J421198m02968p95358L37764Q88113
$$ -2472080 -4313577 -5023536 -3498110 -934521 486677 83709 -711649 -373885 514228
11760E14228n59296k366022j833634P25904K129127J011593k19372N07949J498181
$$ 514228 -45068 -2411090 -4244724 -3518820 -1389693 -378100 -597472 -89523 1408658
11751A408658K91514k033412k510781q83760N08477O53266O30408P45988r5201
$$ 1408658 1700172 -333240 -2844021 -3727781 -3219304 -2566038 -1935630 -1189642 -1284843
11742a284843j765553k223011l39006K313806L348420K196471L67085l09171M19401
$$ -1284843 -3050396 -5273407 -5612413 -3298607 49813 2246284 2613369 2304198 2723599
11733B723599Q94263l65663k275889k266830j7894J853828J542303K02856o56859
$$ 2723599 3617862 3252199 976310 -1290520 -1308414 545414 2087717 2290573 1633714
11724A633714j246361j518504k11227K087671K199624o70851k626734r68382J218301
$$ 1633714 387353 -1131151 -1342378 745293 2944917 2274066 -352668 -1321050 -102749
11715a02749L86593j284031j56382J830170O68227j814864p16504K842020L017361
$$ -102749 283844 -1000187 -1156569 673601 1341828 -473036 -1189540 1652480 4669841
11706D669841p71065k902119j158479M24484l09242l45873J384708J191181j808033
$$ 4669841 3898776 996657 -161822 262662 -46580 -392453 992255 2183436 375403
11697C75403k515086J522355M917119K841165j277633k009629o45108j395618
$$ 375403 -2139683 -617328 4299791 7140956 5863323 3853694 3208586 1812968
11689A812968l083744j492429K573127M126279J691975j349556k413495k063857
$$ 1812968 -1270776 -2763205 -190078 3936201 5628176 4278620 1865125 -198732
11681a98732j273958l44591r5564q45281r55410P76532K541621K137519N38571
$$ -198732 -1472690 -1817281 -1912845 -2758126 -3713536 -2937004 -395383 1742136 2280707
11672B280707r0744j09565r24773j648068o76355R93480J383200Q90405Q47350
$$ 2280707 2189963 2080398 1155625 -492443 -1168798 -175318 1207882 2098287 2945637
11663B945637N95819o54229j130958O36897K339848J233341j087970j471463o53905
$$ 2945637 3541456 2887227 1756269 2393166 4733014 5966355 4878385 3406922 2753017
11654B753017j271978k414874j325116J048884J586611P40693J135594J691824
$$ 2753017 1481039 -933835 -2258951 -1210067 376544 1117237 2252831 3944655
11646C944655n87442l716334k498880K545577M954954K145083j222222j367114
$$ 3944655 3357213 -359121 -2858001 -312424 4642530 6787613 5565391 4198277
11638D198277l13848l84019j71718R70696M09107k305969l010100J72423K751851
$$ 4198277 3884429 3500410 3328692 4299388 4708495 2402526 -607574 -435151 2316700
11629B316700J000660j793563j107322J204135O30433k081390k544910l7353K173861
$$ 2316700 3317360 1523797 416475 1620610 2251043 169653 -2375257 -2412610 -238749
11620b38749K340461J425794O4290j526562j874994k64398J053390J70375r09799
$$ -238749 2101712 3527506 3591796 2065234 190240 -74158 979232 1149607 239808
11611B39808K33081J735780O72831j353224r78728N57134m01962k798854k247839
$$ 239808 472889 2208669 2881500 1528276 549548 1106682 704720 -2094134 -4341973
11602d341973J033806K255744K73381q49449N06044J009502n90396o25520K336134
$$ -4341973 -3308167 -1052423 -779042 -1628491 -1122447 -112945 -703341 -1328861 1007273
11593A007273L791778P51782k677995j884503Q63169R38405o69809J39994K790028
$$ 1007273 4799051 5550833 2872838 988335 1851504 2789909 2120100 2260094 5050122
11584E050122K858157n39539l679317m091538k778062q34252J727152L692804
$$ 5050122 7908279 7368740 3689423 -402115 -3180177 -4014429 -2287277 1405527
11576A405527L222914J077480j54298j31023p05586j926168j807205k93167L30109
$$ 1405527 4628441 5705921 5551623 5420600 4715014 2788846 981641 688474 1018583
11567A018583m93691q37305l10159r34642k803642k769974N72105L947575L763009
$$ 1018583 524892 -312413 -622572 -1557214 -4360856 -7130830 -6558725 -2611150 1151859
11558A151859P85302j690604k074056r34957O08752J121607m36547k533932j845384
$$ 1151859 1937161 246557 -1827499 -2762456 -2153704 -1032097 -1468644 -4002576 -5847960
11549e847960K032545N047479L898546L80824j755503j901473j851543k074771
$$ -5847960 -3815415 1232064 5130610 5511434 3755931 1854458 2915 -2071856
11541b071856j738389r53072k50387Q38108K280922K338941M31522p66691Q84668
$$ -2071856 -3810245 -4763317 -5013704 -4175596 -1894674 444267 875789 109098 993766
11532I93766L109788K620327M38198l15559k16888k123424m887008m092439N15718
$$ 993766 4103554 6723881 7162079 6846520 6629632 4506208 -380800 -4473239 -3957521
11523c957521L748855K537321n4724l60014P35065P16130k25719o86530q95193
$$ -3957521 -208666 2328655 2273931 1913917 2648982 3365112 3139393 2452863 1557670
11514A557670j269365o93161J089334J786969M3795j667690o81779J315701Q02432
$$ 1557670 288305 -404856 684478 2471447 2515242 847552 165773 1481474 2283906
11505B283906j893826l066044j284406Q58982R66895j20972m21658K27388N85729
$$ 2283906 390080 -2675964 -3960370 -3101388 -2134493 -2255465 -2677123 -2449735 -1864006
11496a864006J80245j51299L88715J289278J081167q36720k930403k874345l37078
$$ -1864006 -1683761 -1835060 -1446345 -157067 924100 87380 -2843023 -5717368 -6054446
11487f054446K429267L118111J687146j13960o53768L71912J746501J692568j6523
$$ -6054446 -3625179 -507068 1180078 1066118 412350 784262 2530763 4223331 4206808
11478D206808j265538l60228J056117J69888k301944k750604l96381J265095P5952
$$ 4206808 2941270 2581042 3637159 3807047 1505103 -1245501 -1641882 -376787 -300835
11469c00835j395535l26028J857631K342793J369990N18650p35504k905634l359085
$$ -300835 -1696370 -2022398 -164767 2178026 3548016 4066666 3331162 425528 -2933557
11460b933557O1352L938097L015163j582712l319744N6849L250107J676928j951413
$$ -2933557 -2872205 1065892 4081055 2498343 -821401 -764552 2485555 4162483 2211070
11451B211070k467739P8503J538573L14849j067654m69646R67398R42560q63440
$$ 2211070 -256669 -178166 1360407 1675256 607602 137956 1105354 2047914 1184474
11442A184474k495577j954392M59749K126994J111397j036190j008704J543435
$$ 1184474 -1311103 -3265495 -2805746 -678752 432645 -603545 -1612249 -68814
11434f8814L154310J368048j792098k935939j944669j095238j016626m90304L96398
$$ -68814 3085496 4453544 2661446 -274493 -2219162 -3314400 -4331026 -4821330 -4424932
11425d424932J08247j143498j134462O13839J688865P77578J9018J238409K323645
$$ -4424932 -4316685 -5460183 -6594645 -5980806 -4291941 -3514363 -3495345 -2256936 66709
11416F6709M34702k836491l233729k51304K042465J131783o47130m13486R09200
$$ 66709 501411 -2335080 -5568809 -5820113 -3777648 -2645865 -3292995 -3706481 -2797281
11407b797281R16535r4268j42556Q00677J086483M52330K03046P75736J359550
$$ -2797281 -1880746 -1975014 -2117570 -1316893 -230410 221920 424966 1200702 2560252
11398B560252J540152J341561K97493j412588j828753J94902K153012Q35015k431401
$$ 2560252 4100404 5441965 5739458 4326870 2498117 2693019 4846031 5681046 3249645
11389C249645l202338o44590J265653J57224j353479n45009J102647J184562N54677
$$ 3249645 47307 -597283 668370 825594 -527885 -1072894 29753 1214315 1768992
11380A768992R17104R75464j172965l625909k722916J208660L825769K570763
$$ 1768992 2686096 3661560 2488595 -1137314 -3860230 -2651570 1174199 3744962
11372C744962m62962j847602o51368J493666K343375P88385j909162k729864k19492
$$ 3744962 3282000 1434398 783030 2276696 4620071 5408456 3499294 769430 549938
11363E49938L105960L360889R6003l262212l756449j903379j00434L18834j88912
$$ 549938 3655898 7016787 7112790 3850578 94129 -1809250 -1909684 -1590850 -1779762
11354a779762m65775J64899J266610J668020Q27570m71130j201484j197329n63087
$$ -1779762 -2245537 -2080638 -814028 853992 1681562 1210432 8948 -1188381 -1751468
11345a751468R63572K890682L236120O72561l031000m480131k580067M53910K023013
$$ -1751468 -787896 2102786 5338906 6011467 2980467 -1499664 -4079731 -3625821 -1602808
11336a602808J643648L70254p73899j158404m46504R58584J804681J046604r12563
$$ -1602808 40840 411094 -362805 -1521209 -1967713 -1009129 795552 1842156 929593
11327I29593k302496j580699Q81359K929937K810985R36563j032807k244523k689119
$$ 929593 -1372903 -2953602 -2072243 857694 3668679 4605242 3572435 1327912 -1361207
11318a361207j875854N22588K757827K203295p24828k251861l35259K134842J388128
$$ -1361207 -3237061 -2714473 43354 2246649 1521821 -730040 -1065299 1069543 2457671
11309B457671j697245k888405o29612K097173K189937K72073r49029n63322j09058
$$ 2457671 760426 -2127979 -2757591 -660418 1529519 1801592 852563 289241 180183
11300A80183p49911j314501l5497K375000K963397M45991k572572k726218j90266
$$ 180183 -569728 -1884229 -1919726 455274 3418671 3864662 1292090 -1434128 -1624394
11291a624394J958681J909063N40390p38928j212995k75235J857188L084598J690303
$$ -1624394 334287 2243350 2783740 2044812 831817 556582 2413770 5498368 7188671
11282G188671p07383j380696r83318k020215l417890j646096K364613L199615
$$ 7188671 6481288 5100592 4117274 2097059 -1320831 -2966927 -602314 2597301
11274B597301m50439l057628r84274J803299P93218j605542q85351J581805J376864
$$ 2597301 2146862 -910766 -1895040 -91741 701477 -904065 -1789416 -207611 1169253
11265A169253j138410j873967o0097J362948J263118J142878J200179J53313j465391
$$ 1169253 30843 -1843124 -1903221 -540273 722845 1865723 3065902 3219215 1753824
11256A753824j757898o55451N31042J532745K129945Q66056j876480k337825R18274
$$ 1753824 -4074 -659525 -128483 1404262 3534207 4400263 2523783 185958 1104232
11247A104232K987944m24659n215742m525817L97813K508089N20513k03359J879861
$$ 1104232 4092176 3667517 -1548225 -6074042 -5676229 -3168140 -2647627 -2850986 -971125
11238i71125J970256j525730l310465k87114K900782J590925j589852j776755
$$ -971125 999131 -526599 -3837064 -4124178 -1223396 367529 -1222323 -2999078
11230b999078M72368J395883N46751M47187J683752K217002P96308j428137k380123
$$ -2999078 -2526710 -1130827 -584076 -136889 1546863 3763865 4560173 3132036 751913
11221G51913j175741P02626P31210r93808j048656J967500L862038Q64675l241694
$$ 751913 -423828 278798 1010008 16200 -1032456 935044 4797082 5661757 2420063
11212B420063k148706K345501K431895k830557n286754o51158M617581L635924
$$ 2420063 271357 2616858 5048753 2218196 -3068558 -3719716 897865 4533789
11204D533789r82258k985271k244327k356391l000511j307276J908502L231304
$$ 4533789 3551531 566260 -1678067 -4034458 -7034969 -8342245 -6433743 -3202439
11196c202439K253428J208595N63053o40172j529728o79723O03653J09978j293995
$$ -3202439 -949011 259584 822637 182465 -1347263 -2026986 -1423333 -1313355 -2607350
11187b607350j117104L99488R44177L42076O15788K153503K894080J494923r44682
$$ -2607350 -3724454 -3324966 -2380789 -2038713 -1422925 730578 3624658 5119581 4174899
11178D174899k464080k056779j83371J423833J086228q56624k275065j882014
$$ 4174899 1710819 -345960 -529331 894502 1980730 1124106 -1150959 -3032973
11170c032973l02390J630025L565050M307197K423643r96504k784254j822375
$$ -3032973 -3335363 -1705338 1859712 6166909 8590552 7594048 4809794 2987419
11162B987419k05440L82529M81385L52090q83377k513273k204697J4869J345816
$$ 2987419 2781979 3164508 3645893 3997983 3114606 601333 -1603364 -1588495 -242679
11153b42679R91701J304019K742838K295575r23191l114139j618762R40039J268062
$$ -242679 749022 2053041 4795879 7091454 6168263 3054124 1435362 2375401 3643463
11144C643463R9306o11380j080763j353783J20113K525499J948260k037832m072389
$$ 3643463 3742769 3131389 2050626 696843 816956 3342455 5290715 3252883 -819506
11135h19506j203068J929411P69839j737078j098155N83846p81306k966170j331897
$$ -819506 -2022574 -93163 676676 -1060402 -2158557 -1574711 -2356017 -5322187 -6654084
11126f654084K303398K562377p8939n90420J481510J886929j81662j243592n23196
$$ -6654084 -4350686 -1788309 -1867248 -2457668 -976158 910771 729109 -514483 -1037679
11117a037679p10097j705022m78560K427434K869264K68079j454754q27142m89047
$$ -1037679 -1747776 -3452798 -3931358 -1503924 1365340 1633419 178665 -648477 -1137524
11108a137524j077131J24012L029343L559183N83866j758991r02104M77824j9042
$$ -1137524 -2214655 -2090643 938700 4497883 5081749 3322758 2420654 2898478 2879436
11099B879436o34765J99293N95135p04658j427491l5346J168686K77874o73074
$$ 2879436 2244671 2443964 3039099 2334441 906950 871604 2040290 2318164 1645090
11090A645090M04299J716566R18181o66142o16369L07301p1214j239191j008418
$$ 1645090 2049389 3765955 4684136 4017994 3401625 3708926 3637712 2398521 1390103
11081A390103N73764J225790k10238k429074l300881j787719J035882K445041
$$ 1390103 1963867 3189657 2979419 550345 -2750536 -4538255 -3502373 -1057332
11073a057332Q63333j659231j674376Q80434K630163J764546R4261n54463o78787
$$ -1057332 -193999 -1853230 -3527606 -2647172 -17009 1747537 1841798 1287335 608548
11064F08548o78678M14852K061119J517761j650971l597346j559158J644004J745283
$$ 608548 -70130 344722 2405841 3923602 2272631 -1324715 -2883873 -1239869 505414
11055E05414p23724j950945q25366M69096P88899J078766J414181O67784o27753
$$ 505414 -218310 -2169255 -2994621 -2525525 -1736626 -657860 756321 1424105 796352
11046G96352m79737Q66029P09167j481561k461527j98371K391667J581069j345159
$$ 796352 316615 1182644 1891811 410250 -2051277 -2249648 142019 1723088 377929
11037C77929j988123L97360J984554M95061j686587j923371j201129j187251o75255
$$ 377929 -1610194 -1212834 771720 1266781 -419806 -2343177 -3544306 -4731557 -5406812
11028e406812J613682L263956J452328j694251j775312P48299J299680r82717
$$ -5406812 -3793130 -529174 923154 -771097 -2546409 -1798110 -498430 -1481147
11020a481147j833973N78465K444739J060705n98770N06701K051513P76678j538788
$$ -1481147 -3315120 -2736655 -291916 768789 170019 676720 2728233 3504911 1966123
11011A966123j232051J084014K191322J746859J526961J157004q23668l093555
$$ 1966123 734072 1818086 4009408 5756267 7283228 8440232 7616564 4523009
11003D523009l122305j509243p52177q11653J66368J774287J919835O29094l45697
$$ 4523009 1400704 -108539 -860716 -1672369 -1506001 268286 2188121 2817215 2471518
10994B471518p53632j261416r84992P78548J892476L76466j553775p20379J364562
$$ 2471518 1717886 456470 -528522 250026 2142502 2518968 965193 244814 1609376
10985A609376Q74422j625059k072083J97889J722572R27973j22014j35825j04760
$$ 1609376 2483798 858739 -1213344 -1015455 707117 1635090 1513076 1377251 1272491
10976A272491j98798N28343J301924O08471l60602N24884J923760J065954q07047
$$ 1272491 1073693 1602036 2903960 3512431 3151829 3676713 5600473 6666427 5859380
10967E859380l73537J351638N54196k060214k144992K02554M67040j570134q88804
$$ 5859380 5485843 6837481 7391677 5331463 3186471 3389025 3856065 2285931 1397127
10958A397127L302587N021131J360323k520310k069811j79228q28815k107889
$$ 1397127 4699714 9720845 11081168 8560858 6491047 6311819 5483004 3375115
10950C375115q02228J253836Q97735m90185j32709O90670n40233k369952j947038
$$ 3375115 2572887 3826723 4724458 4234273 4101564 4792234 4252001 1882049 -64989
10941f4989k92425k84327j514389j560075n18882j23028k0838J068341J974973
$$ -64989 -357414 -641741 -2156130 -3716205 -4235087 -4358115 -4378953 -3310612 -1335639
10932a335639P56085j369886j404429Q72415K885147L134896K287757J039117
$$ -1335639 -579554 -1949440 -3353869 -2481454 403693 3538589 5826346 6865463
10924F865463m94427j608966j384609j09069R49333P94845p80683k815542l144139
$$ 6865463 6371036 4762070 3377461 3268392 4217725 5012570 4231887 1416345 -1727794
10915a727794o60582K221262J994922p16249j701115K90847J546078l54845k431933
$$ -1727794 -2388376 -167114 1827808 1111559 -589556 -298709 1247369 892524 -1539409
10906a539409j256771J574946K341294Q46234k79131N7838Q44636J226726Q29707
$$ -1539409 -2796180 -1221234 1120060 1966294 1687163 1745001 2589637 3816363 4646070
10897D646070o35919k084724j323465J443633K701837M47854k467771k359970
$$ 4646070 4010151 1925427 601962 2045595 4747432 5195286 2727515 367545
10889C67545J41429J686708J061323k76039r98765p92653L18051J519797J337116
$$ 367545 508974 2195682 3257005 2980966 1982201 1189548 1507599 3027396 4364512
10880D364512k67182j433026j185456o72986o15986j01843Q57865N62343j015718
$$ 4364512 4097330 2664304 1478848 805862 189876 88033 945898 1508241 492523
10871D92523j282570O59294J991244O56898j388600j803326j450070j692180j340407
$$ 492523 -790047 -130753 1860491 2517389 1128789 -674537 -2124607 -3816787 -5157194
10862e157194O85370K561879K445367J450076R96533J51925j513385j631483J076163
$$ -5157194 -4471824 -1909945 535422 1985498 2982031 3133956 1620571 -10912 1065251
10853A065251L625348K966475N56849o66355r51529j749939k014037m54425J113638
$$ 1065251 4690599 7657074 8213923 7547568 6596039 4846100 2832063 2377638 3491276
10844C491276O41229l86668J29130Q37862k21246j423503n10227Q27608j61932
$$ 3491276 4132505 3745837 3874967 4712829 4491583 3068080 2557853 3385461 3223529
10835C223529k154238k050389k11157J050497J789012K666223J683379k122980
$$ 3223529 1069291 -981098 -1192255 -141758 1647254 4313477 5996856 3873876
10827C873876m595133k045223J735213Q67123k494558j390742L727840M888198
$$ 3873876 -721257 -2766480 -1031267 -164144 -2658702 -4049444 -321604 4566594
10819D566594m61436n100465l359201R03088J714281J6430K18803K321414K855974
$$ 4566594 4105158 -995307 -4354508 -3451420 -1737139 -1720709 -1501906 819508 3675482
10810C675482J070035n33962o09478l02461o56810j220310j168959l97955M30685
$$ 3675482 4745517 4211555 3602077 3299616 2642806 1422496 253537 -144418 286267
10801B86267M91261j15930j37973J023788J995954J438435M11425O27823J345651
$$ 286267 777528 661598 523625 1547413 3543367 4981802 5393227 6021050 7366701
10792G366701P13925o24295n28410N16503o6784k229574k972525j400938k37470
$$ 7366701 8080626 7456331 6927921 7444424 7377640 5148066 2175541 774603 537133
10783E37133j014504j504288P5933J628085N84815j749823k174408l00501J490518
$$ 537133 -477371 -1981659 -1905726 -277641 307174 -1442649 -3617057 -3917558 -2427040
10774b427040J894607J879109K200995K002570N31521j210975j629936q15035
$$ -2427040 -532433 1346676 3547671 5550241 6081762 4870787 3240851 2425816
10766B425816n48987j752210k838823j634684J516515L956248L987380K392481
$$ 2425816 1876829 124619 -2714204 -4348888 -2832373 1123875 5111255 7503736
10758G503736N41368j073380j886864j099467M43720M24147j486586k572577j165677
$$ 7503736 8045104 6971724 5084860 3985393 4429113 4853260 3366674 794097 -371580
10749c71580O13508L89598o19364j21156J015732M68914j103318j017419Q40057
$$ -371580 241928 631526 12162 -108994 906738 1375652 272334 -745085 94972
10740I4972J949621J407431Q47361R90855M94915j082863j933387p55114J074835
$$ 94972 2044593 3452024 4299385 5290240 5785155 4702292 2768905 2013791 3088626
10731C088626J297949k98909j625540p18839J746122K741404N59726k346649k302004
$$ 3088626 4386575 4087666 2462126 1743287 3489409 6230813 6790539 4443890 2141886
10722B141886N8045N31452j723251k380306P40164L249233J059185k466499j692175
$$ 2141886 2199931 2731383 1008132 -1372174 -632010 2617223 3676408 1209909 -482266
10713d82266J984380K489071q16629k376947N5638K025598L05078j846276m96724
$$ -482266 1502114 3991185 3174556 797609 853247 2878845 3183923 1337647 840923
10704H40923K638684L513275J976243O76314K884j740341m034627l909755n44851
$$ 840923 3479607 6992882 8969125 9645439 9648323 7907982 3873355 -36400 -581251
10695e81251K757898K574475l38946k362330j822572n99247p16020j287833l50060
$$ -581251 2176647 4751122 4412176 2049846 227274 -371973 -1087993 -2375826 -2725886
10686b725886J558358J912579L7986j798542j464760P17373K990118L694198J810284
$$ -2725886 -1167528 745051 783037 -1015505 -2480265 -1762892 1227226 4921424 6731708
10677F731708j810804l813756j663928K287559L258125Q00095q15674K70817P88793
$$ 6731708 4920904 1107148 -556780 1730779 4988904 5788999 4973325 5244142 6032935
10668F032935j245364k426624J02648K892305J153088l372772m620983r06205
$$ 6032935 4787571 2360947 2463595 5355900 6508988 3136216 -1484767 -2390972
10660b390972L225153L551796Q46139j366116j101407O08510J311921J25661r02441
$$ -2390972 834181 4385977 5232116 3866000 2764593 3373103 4685024 4810685 3908244
10651C908244L21321K144790J066818k482696m019777j633228J318306J739226
$$ 3908244 4229565 6374355 7441173 4958477 938700 -694528 623778 2363004
10643B363004Q65210P00000N61802k67461m16306M16087Q1777j727311k044228
$$ 2363004 3228214 3928214 4490016 4222555 3806249 4222336 4304113 2576802 532574
10634E32574o0679P14609j295125k393535p6555K330062J608064J07495P14185
$$ 532574 471895 1186504 -108621 -2502156 -2578711 -248649 1359415 1466910 2181095
10625B181095J380891l24282k001107r76579N15514m9182m26663J404949K206429
$$ 2181095 3561986 3237704 1236597 260018 775532 726350 299687 1704636 3911065
10616C911065n97988l005586j018095J759318K61724k875571k001063J735576
$$ 3911065 3313077 307491 -710604 1048714 1310438 -1565133 -3566196 -1830620
10608a830620L197675K371912K622172K960227K48718l404713l436845q93495
$$ -1830620 1367055 3738967 6361139 9321366 9570084 6165371 2728526 1835031
10600A835031j97135j066486o8548K005276J738085o110R6696J249808N86338
$$ 1835031 1637896 571410 502862 2508138 4246223 4240113 4336809 5586617 6172955
10591F172955p09211j7068R49347l08354j311069O62713K248387j26066k697822
$$ 6172955 5463744 5446676 6396023 6087669 4776600 5439313 7687700 7561634 4863812
10582D863812q65866J826498K23942k238649L5725L416976J308209l001653j887871
$$ 4863812 3997946 5824444 6048386 3809737 3845462 7262438 8570647 5568994 3681123
10573C681123K397838J940165j943178j523955K383497K257601j339778j106606
$$ 3681123 6078961 8019126 6075948 4551993 6935490 9193091 7853313 6746707
10565F746707K150167O77972m609452m570909J461053M112140N68549j637768
$$ 6746707 8896874 9574846 4965394 394485 1855538 5967678 6536227 4898459
10557D898459M61186P40829k746590l600506K21350K156273p05378k683051k84400
$$ 4898459 5359645 6100474 3353884 -246622 -25272 2131001 1425623 -1257428 -1541828
10548a541828K738256L715653M254466L658409m43481m398237k372546K423987
$$ -1541828 1196428 4912081 9166547 12824956 12381475 7983238 5610692 8034679
10540H034679K032772j828866o81476M482081M248531k195441n758411l368119
$$ 8034679 10067451 8238585 7557109 12039190 16287721 14092280 8333869 4965750
10532D965750p95267K08725K967321M965413J115803l586625o02864N462260L855222
$$ 4965750 4170483 4379208 7346529 12311942 13427745 9841120 9238256 14700516 18555738
10523A8555738k234742j710725K585273l07501o140132k198343O508675M544857
$$ 18555738 16320996 14610271 17195544 16888043 10747911 8549568 15058243 19603100
10515A9603100l797775j093214Q988561O577478o258801p649725K996852M113087
$$ 19603100 15805325 14712111 23700672 30278150 24019349 16369624 19366476 23479563
10507B3479563n316721l391248R663118Q699065o678257p602663Q736659J1232527
$$ 23479563 18162842 14771594 24434712 33133777 26455520 18852857 27589516 38822043
10499C8822043m527785n072259J4177752J4908447p804394p387414K3403640K6221969
$$ 38822043 34294258 29221999 43399751 58308198 50503804 43116390 66520030 92741999
10491I2741999j0031620m513600O9894614R2190577l7019147k03262846k04389428
$$ 92741999 82710379 78196779 148091393 240281970 203262823 -23 -204389451
10484b04389451l7855920R4257570P2154750n292694j1467663K7695983K5369307
$$ -204389451 -242245371 -147987801 -75833051 -81125745 -92593408 -64897425 -39528118
10477c9528118r596726j2487655J3754728J7033631m043306p716158Q926414J1707236
$$ -39528118 -49124844 -61612499 -47857771 -30824140 -34867446 -42583604 -33657190 -21949954
10469b1949954k769933o433803L644570M583809m308157k814170P540911O957704
$$ -21949954 -24719887 -31153690 -27509120 -22925311 -27233468 -30047638 -22506727 -15549023
10461a5549023k659192k261317N984314L665449o455359n297169N294147O031030
$$ -15549023 -18208215 -20469532 -14485218 -10819769 -17275128 -22572297 -17278150 -11247120
10453a1247120l141677m344555L427820M122807k882001k294565O066401O562724
$$ -11247120 -14388797 -18733352 -15305532 -11182725 -14064726 -16359291 -10292890 -3730166
10445c730166j985063m575360J033179J758449l787819l126160M078455M549815
$$ -3730166 -5715229 -10290589 -9257410 -7498961 -11286780 -14412940 -10334485 -5784670
10437e784670k339276k941732L847372M021867m208430o160104J773209N230335
$$ -5784670 -8123946 -11065678 -7218306 -3196439 -7404869 -13564973 -11791764 -6561429
10429f561429j482301n566927J28142N146442J847759k173076n50232J044298
$$ -6561429 -8043730 -13610657 -13482515 -8336073 -6488314 -8661390 -9211622 -8167324
10421h167324j354466k038819J224089J733282j910902j516942M585680O539414
$$ -8167324 -9521790 -11560609 -10336520 -8603238 -10514140 -12031082 -7445402 -905988
10413i05988L89518m576392k422628K69003j430880j954527K106101M223843N35837
$$ -905988 -516470 -5092862 -7515490 -7246487 -8677367 -10631894 -8525793 -4301950 -3766113
10404c766113k429342j29566J866790n90931k204248Q94204L252905N27379k446538
$$ -3766113 -6195455 -6325021 -4458231 -5049162 -7253410 -6359206 -3106301 -2578922 -5025460
10395e025460j143603P60198k78677q46307J412221K094586j279892l706026j860732
$$ -5025460 -6169063 -5408865 -5687542 -6533849 -5121628 -3027042 -4306934 -8012960 -9873692
10386i873692j05430j464535j496837K626446N538390K696429j847280k845752
$$ -9873692 -9979122 -11443657 -12940494 -10314048 -4775658 -2079229 -3926509 -6772261
10378f772261j572036n70157J550917M496417L453440k137536m841252n91465
$$ -6772261 -8344297 -8914454 -7363537 -2867120 586320 -1551216 -6392468 -6983933
10370f983933L882610J824676k680661k216989J877465L010600K82619j685583
$$ -6983933 -3101323 -1276647 -3957308 -6174297 -4296832 -1286232 -1003613 -2689196
10362b689196p77477J038449J883217J155867j105802k981259j865065J015763
$$ -2689196 -3466673 -2428224 -545007 610860 -494942 -3476201 -5341266 -4325503
10354d325503J432682q64310j353810J212731K291673k95065k306852o02846J663616
$$ -4325503 -2892821 -3757131 -5110941 -3898210 -1606537 -1901602 -4208454 -4811300 -3147684
10345c147684J170757k48894k40084j36284q70933l63687J544982J384181j407263
$$ -3147684 -1976927 -2225821 -2465905 -2602189 -3473122 -3836809 -2291827 -907646 -2314909
10336b314909k410337m2509J212295r00976j954405Q68588L091706Q19229k274663
$$ -2314909 -4725246 -4767755 -3555460 -4456436 -6410841 -5542253 -2450547 -1631318 -3905981
10327c905981j520616J141295J870422J638544K457286K250306n65567k341811
$$ -3905981 -5426597 -4285302 -2414880 -776336 1680950 3931256 3365689 1023878
10319A023878j7925K863088J770532j474425k598672j904261j815249j508470
$$ 1023878 1005953 3869041 5639573 4165148 1566476 -337785 -2153034 -3661504
10311c661504L75186J486107k88672k248212j342880N59878P40616P05614K073726
$$ -3661504 -3286318 -1800211 -2088883 -4337095 -5679975 -5120097 -4379481 -3673867 -1600141
10302a600141J984708j594740m413929k124235K056700K436224j6693m37436J237222
$$ -1600141 384567 -1210173 -5624102 -7748337 -5691637 -3255413 -3272106 -3709542 -2472320
10293b472320J417667J50639J91591P50618r29537l230962k157523J271019K108205
$$ -2472320 -1054653 -904014 -712423 38195 -891342 -4122304 -6279827 -5008808 -2900603
10284b900603m16176j880863J34465L081835L954895K415479n65389l443748l973309
$$ -2900603 -3316779 -5197642 -5063177 -1981342 1973553 4389032 3823643 379895 -3593414
10275c593414j712542L70463r6887j155496j67810J376159Q92029j54797R19811
$$ -3593414 -5305956 -4935493 -5032380 -6187876 -6355686 -4979527 -4087498 -4242295 -3322484
10266c322484K467858J271771j144372q36136J398290J290859j289771k166191
$$ -3322484 -854626 417145 -727227 -1563363 -165073 1125786 -163985 -2330176
10258b330176j59168J351217O02295l15140j46481k69789q38418M8957K130370
$$ -2330176 -2489344 -1138127 -535832 -850972 -997453 -1267242 -2105660 -2056703 73667
10249G3667K416261K19675j366230n07139O81117J63844p52137j82184J066358
$$ 73667 2489928 2709603 1343373 836234 1517351 1681195 929058 746874 1813232
10240A813232J022662n10579k111691k579614j742337m07610K80749K93366R29351
$$ 1813232 2835894 2325315 213624 -2365990 -4108327 -4515937 -4235188 -3941822 -3012471
10231c012471K432966K671855J30208l051692l551190j489331Q4214k32252q13022
$$ -3012471 -579505 2092350 2222558 -829134 -4380324 -5869655 -5785441 -6017693 -6830715
10222f830715o7862J452188K193103J315054n69022j523315j73556J888640J596529
$$ -6830715 -6898577 -5446389 -3253286 -1938232 -2507254 -4030569 -4204125 -2315485 -718956
10213g18956q19693j585378N03057J621385n61738k154658P11410M656214L853104
$$ -718956 -1538649 -3124027 -2620970 -999585 -1561323 -3715981 -3004571 1651643 5504747
10204E504747n84544k497526m80435J020691Q3624j60125J582135J885327j024214
$$ 5504747 4920203 2422677 1942242 2962933 3046557 2886432 4468567 6353894 5329680
10195E329680l533722k381492J86129L20757j634115k581846j634911n10801k15038
$$ 5329680 1795958 -585534 -399405 -78648 -1712763 -4294609 -5929520 -6440321 -6655359
10186f655359P7664J146001K355922K389931R27376n61208l07286J230363J678373
$$ -6655359 -6577695 -5431694 -3075772 -685841 241535 -319673 -626959 603404 2281777
10177B281777K85130q57125m40651k17241j447150j945989M9908J784783n17l124273
$$ 2281777 2566907 1709782 1269131 1051890 -395260 -2341249 -2291341 -506558 -507075 -3631348
10167c631348k935773K64054K014940J016414J90321P22152O16511m50468k68165
$$ -3631348 -6567121 -6303067 -4288127 -3271713 -3081392 -2359240 -1742729 -2193197 -2461362
10158b461362J146616J130464l80364m24243J118125P71074j886324k568929M03419
$$ -2461362 -1314746 -184282 -564646 -988889 129236 900310 -986014 -3554943 -3151524
10149c151524K729391J109502j517627j286646O00808J087125N42344Q05736J173709
$$ -3151524 -422133 687369 -830258 -2116904 -1516096 -428971 113373 919109 2092818
10140B092818K02794j119510j318863j034599r68678j88783J009124J78934k495321
$$ 2092818 2295612 1176102 -142761 -1177360 -2146038 -2334821 -1325697 -1146763 -3642084
10131c642084k729058R51970L395811O28862k982470j392143L020566L197033
$$ -3642084 -6371142 -5419172 -2023361 -1394499 -4376969 -5769112 -2748546 448487
10123D48487j080277l218324p21366J664597O89540o22255O93675K366803J344815
$$ 448487 -631790 -3850114 -4571480 -2906883 -2217343 -2839598 -2145923 220880 1565695
10114A565695r67100j336900M06322J973802J953710M56669j659238k709036j339685
$$ 1565695 598595 -738305 -331983 1641819 3595529 4052198 2392960 -316076 -1655761
10105a655761J043007J253962j105470k556707o75303K368376L053802J168044
$$ -1655761 -612754 641208 -464262 -3020969 -3696272 -1327896 1725906 2893950
10097B893950q24205j403539r59101k85185J45787J43025J03408N22471P42061
$$ 2893950 2069745 666206 -292895 -578080 -432293 -289268 -185860 336611 1078672
10088A078672l34457j870827j571617O60244K011247J031423k4339R02745K046708
$$ 1078672 744215 -1126612 -2698229 -2037985 -26738 1004685 980346 1883091 3929799
10079C929799Q39442j581766k186303r00889j31131l37603J69766J233549N31723
$$ 3929799 4769241 3187475 1001172 100283 -30848 -368451 -198685 1034864 1566587
10070A566587j998980k996180n60623K479736K276970r32125l459756k770078
$$ 1566587 -432393 -3428573 -3989196 -1509460 767510 -164615 -3624371 -6394449
10062f394449K32860K803559K968338J027266p93119p34734K43280k11938k083021
$$ -6394449 -6161589 -3358030 -389692 637574 -155545 -890279 -646999 -858937 -2941958
10053b941958k480008J32894L200429L300588O35857j672120j736846l29900J104413
$$ -2941958 -5421966 -5289072 -2088643 1211945 1847802 175682 -1561164 -1891064 -786651
10044g86651J753320J122512n70529j748486r76025Q81809J571697M38396j056048
$$ -786651 966669 2089181 1518652 -229834 -1205859 -324050 1247647 1686043 629995
10035F29995j597196j083672L31383K214269K890053Q40536k498237l631974j463271
$$ 629995 -967201 -2050873 -1719490 494779 3384832 4225368 1727131 -1904843 -3368114
10026c368114J330196K257853J994068K019290J639636m45743l163189m016849
$$ -3368114 -2037918 219935 2214003 4233293 5872929 5427186 2263997 -1752852
10018a752852k358623O2100J336727R22937l78657r04853M92395K583962K579610
$$ -1752852 -4111475 -4049375 -2712648 -1789711 -2168368 -3073221 -2580826 3136 2582746
10009B582746p2389k368492j788690J80118O75820j70487k68061M27602K22056
$$ 2582746 2510357 141865 -1646825 -1466707 -790887 -961374 -1229435 -801833 -579777
10000e79777p38776o21719M80692M35072j086327j829506p32670N26769P10984
$$ -579777 -1318553 -1940272 -1459580 -1024508 -2110835 -3940341 -4673011 -4146242 -3435258
9991c435258Q33869J501924J207556r40360k988098k541571J49941K958092M253829
$$ -3435258 -2601389 -1099465 108091 -832269 -3820367 -6361938 -6211997 -3253905 999924
9982I99924L431065P95032j898629k533075j347266p13961j326346j086266R01498
$$ 999924 4430989 5226021 3327392 794317 -552949 -1266910 -2593256 -3679522 -2778024
9973b778024K142356P22869j240030r01416Q32480J226277K20055l23699l48701
$$ -2778024 -635668 87201 -1152829 -2054245 -1221765 4512 224567 -99132 -447833
9964d47833j069008j847269j163948J76361L94769M45609K385951M596429L195072
$$ -447833 -1516841 -3364110 -4528058 -4351697 -3956928 -3511319 -1125368 3471061 6666133
9955F666133j460649m294559k656584L66507J363437J086439J294968J116746
$$ 6666133 5205484 910925 -1745659 -1379152 -15715 1070724 2365692 3482438
9947C482438m06582j450283n02612L45652j147144k805757r80035L230112M835031
$$ 3482438 3075856 1625573 1122961 1468613 321469 -2484288 -3464323 -234211 4600820
9938D600820J823220k429589l988525k602699m81216O64097M87391k21111J8912
$$ 4600820 6424040 3994451 5926 -2596773 -3077989 -2413892 -1926501 -2147612 -2128700
9929b128700J679399K815901J159345k206482l477086j200550J487300J159844
$$ -2128700 -449301 2366600 3525945 1319463 -2157623 -3358173 -1870873 -711029
9921g11029j183903j811862L42849K436515J939426j53874j331695j029727m19195
$$ -711029 -1894932 -3706794 -3363945 -927430 1011996 858122 -473573 -1503300 -1922495
9912a922495J29502J161893K094443J552325R8816l8518J067893L73907k928155
$$ -1922495 -1792993 -631100 1463343 3015668 3114484 3075966 4143859 4517766 1589611
9903A589611m746600j893869K232537K195062j214069k465153j3284K235124K083328
$$ 1589611 -3156989 -5050858 -2818321 -623259 -1837328 -4302481 -4315765 -2080641 2687
9894B687J583173J622301K46493k022157j575882J342716J683947j655799l214198
$$ 2687 1585860 3208161 3454654 1432497 -143385 1199331 2883278 1227479 -1986719
9885a986719o20079R69377j175779j585425K675059M595800n77607m818792m82410
$$ -1986719 -2606798 -1637421 -2813200 -4398625 -1723566 2872234 2294627 -2524165 -3006575
9876c006575M797514J296555k328233Q598768K5369804K2112500m936609k7155459
$$ -3006575 1790939 3087494 759261 9358029 34727833 56840333 51903724 24748265
9868B4748265k2301531l549711M112251p60372k566090K069932K773683k640215
$$ 24748265 2446734 -1102977 3009274 2248902 -317188 1752744 4526427 1886212
9860A886212m956163j487772J05159k593848k499431K737610N715760K616336
$$ 1886212 -3069951 -4557723 -4452564 -7046412 -9545843 -6808233 -1092473 1523863
9852A523863l18545J440350K992777k09838l965344l062893q69M26723p98634
$$ 1523863 1205318 2645668 5638445 5428607 1463263 -1599630 -1600499 -1173776 -1972410
9843a972410m24296N43647k19865r97030P16999K851157J902100j101484k434081
$$ -1972410 -2396706 -1853059 -2072924 -3069954 -2352955 498202 2400302 1298818 -1135263
9834a135263j338652K15900J386300K275542J852237l30838k081973j525841k80102
$$ -1135263 -2473915 -2258015 -871715 1403827 3256064 2925226 843253 -682588 -962690
9825i62690n07302r34539N23964K171364R03380k022867k246984P75755K566186
$$ -962690 -1469992 -2404531 -1880567 290797 1194177 -828690 -3075674 -2299919 266267
9816B66267K98076l135342l553529j099520R35780J058009P10672J130461J549353
$$ 266267 564343 -2570999 -6124528 -7224048 -6288268 -5230259 -4519587 -3389126 -1839773
9807a839773J022040K02838J56091N39484L43503k89714n05559m35140o76423
$$ -1839773 -817733 -614895 -458804 80680 424183 134469 -371090 -806230 -1482653
9798a482653n96307N77278J407074J5698j935981r88009J908478J883546j546271
$$ -1482653 -2078960 -1501682 -94608 -78910 -2014891 -3002900 -1094422 789124 -757147
9789g57147k549737J328115L889957K02164m198436j779266M005546L822857k139647
$$ -757147 -3306884 -1978769 1911188 2113352 -2085084 -3864350 141196 3964053 1824406
9780A824406m579667n17012K622834K59956k457874q59751J537027O90844o87746
$$ 1824406 -2755261 -3272273 -649439 -389483 -2847357 -3707108 -2170081 -1479237 -2166983
9771b166983N47915J340609j487052m373399k849933O60085J381261K08095O60345
$$ -2166983 -1619068 -278459 -1765511 -6138910 -8988843 -8328758 -6947497 -6739402 -6079057
9762f079057J703096M18182j326085J95047L308458L315344L78447j301791p43753
$$ -6079057 -4375961 -3957779 -5283864 -5088817 -1780359 1534985 1913432 611641 -132112
9753a32112m43549o07627O62167K237286J191232j209274q07084K089578K633419
$$ -132112 -575661 -1183288 -521121 1716165 2907397 1698123 891039 2980617 5614036
9744E614036o49223l575511l109233j199572k66135L49613J448792J641416K00016
$$ 5614036 4964813 1389302 -1719931 -2919503 -3185638 -2836025 -1387233 254183 454199
9735D54199r76982k80775J213101J727164R96349m21152j928685k442220j294399
$$ 454199 -522783 -803558 409543 2136707 3133056 2711904 783219 -1659001 -2953400
9726b953400J88233K15328n07425J18782J807077K159786O65915o35969o30380
$$ -2953400 -2765167 -2549839 -3057264 -2938482 -1131405 1028381 1694296 1058327 427947
9717D27947k69025j05261L04432M32173o74176j796070q11380J295188J278003
$$ 427947 158922 53661 358093 790266 116090 -1679980 -2491360 -1196172 81831
9708H1831j094835k367996p91296J361310J972348J870714J972892J191154r41925
$$ 81831 -1013004 -3381000 -4172296 -2810986 -838638 1032076 3004968 4196122 3254197
9699C254197k651385k739822k202464j523759M29059L042971L040051m99622l450216
$$ 3254197 602812 -2137010 -4339474 -5863233 -5434174 -2391203 648848 149226 -3300990
9690c300990k194031Q50431R75448j543044k123801R42422M070107L674827P27140
$$ -3300990 -5495021 -4644590 -3669142 -5212186 -7335987 -6393565 -2323458 1351369 2078509
9681B078509j267586q15362N22676P19355l38882j145781p07047K56050N80455
$$ 2078509 810923 -4439 518237 1237592 898710 -247071 -954118 -698068 -117613
9672a17613M42879P29085J029283K7491j887037k400153o09500J242350Q90411
$$ -117613 325266 1054351 2083634 2111125 224088 -2176065 -2785565 -1543215 -652804
9663f52804n25322j59474K129388L274344J177593k366672l891378k402698q8500
$$ -652804 -1178126 -1337600 791788 4066132 5243725 2877053 -1014325 -3417023 -3505523
9654c505523Q18435N32103N35014J073331J195883P79449P41517J053044L98586
$$ -3505523 -2687088 -2154985 -1619971 -546640 649243 1428692 2170209 3223253 3621839
9645C621839j415079k459245j284635R68815K349134K470274J682831l63610l259242
$$ 3621839 2206760 -252485 -1537120 -568305 1780829 4251103 5933934 5570324 2311082
9636B311082m496276k256353J343988K458785N33793j357257r53326Q32740K020886
$$ 2311082 -2185194 -4441547 -3097559 -638774 -104981 -1462238 -2415564 -1582824 438062
9627D38062J845680P00182m99545q40848n30234q47004j772076j222965J369358
$$ 438062 2283742 2983924 2484379 1643531 1113297 266293 -1505783 -2728748 -1359390
9618a359390K759533L04610l100050k609098J142654K902009Q01593j543442j523765
$$ -1359390 1400143 1704753 -1395297 -4004395 -2861741 40268 841861 -701581 -2225346
9609b225346r31661j307341q88649J270933K517443J000258q50248n09426L13157
$$ -2225346 -3157007 -4464348 -5352997 -4082064 -1564621 -564363 -1414611 -1924037 -1610880
9600a610880q93738k604681j825478P22068K006826J600515J199131N96366j601532
$$ -1610880 -2504618 -5109299 -6934777 -6212709 -4205883 -2605368 -1406237 -809871 -2411403
9591b411403l914043k996525J020078M054930L677060J752814N52985l54760j658137
$$ -2411403 -6325446 -9321971 -8301893 -4246963 -569903 1182911 1735896 1381136 -277001
9582b77001j836548K75696K502899J801072j221350k982254j963276m77878p18037
$$ -277001 -2113549 -1837853 665046 2466118 1244768 -1737486 -3700762 -4178640 -4896677
9573d896677j367237M2769K776533L387626N92697k640120k950231q30990O37056
$$ -4896677 -6263914 -6221145 -3444612 -56986 535711 -2104409 -5054640 -5885630 -5248574
9564e248574J90051n41022J0562J397940K454423K746211K157248N85061j210093
$$ -5248574 -5058523 -5599545 -5588983 -4191043 -1736620 1009591 3166839 3751900 2541807
9555B541807j860521j329752j204401k035002j911444O55887L633377L567263
$$ 2541807 681286 -648466 -1852867 -3887869 -5799313 -5143426 -1510049 2057214
9547B057214N16473j562926q1572K660888K784537J50631j879198j411557j30252
$$ 2057214 2573687 1010761 929189 3590077 6374614 6525245 4646047 3234490 3104238
9538C104238M6243j84688M15070Q44924l70726k017509j741391j33190k9923j658265
$$ 3104238 3150481 2965793 3380863 4225787 3855061 1837552 96161 -37029 -66952 -1725217
9528a725217j939372M03782K446617J619546k83871j74710J490375J782219j53372
$$ -1725217 -3664589 -3260807 -814190 805356 521485 346775 1837150 3619369 3465997
9519C465997k253148k514888q26483J488082K455223P91738k215069l470165j934340
$$ 3465997 1212849 -1302039 -2128522 -640440 1814783 2606521 391452 -3078713 -5013053
9510e013053J281K76488j7241O31636J188159L18918p35912k91564R15854J668390
$$ -5013053 -5011772 -4735284 -4752525 -4120889 -2932730 -2613812 -3349724 -3641288 -2725434 -1057044
9500a057044K635628L889757K928964j151668m400393l272841m17391k60518j553242
$$ -1057044 1578584 5468341 8397305 7245637 2845244 -427597 -844988 -1105506 -2658748
9491b658748k80882K285983J537265j649818j713936J817614L162570K49973j837273
$$ -2658748 -2939630 -653647 883618 -766200 -2480136 -662522 2500048 2750021 912748
9482I12748K1330J692006n77702l605172l054996o02270k33522j376573q35506
$$ 912748 934078 2626084 2048382 -1556790 -4611786 -5214056 -5447578 -6824151 -7659657
9473g659657J260584K190840J422429O59457N37571M80096N09046O22194j13362
$$ -7659657 -6399073 -4208233 -2785804 -2126347 -1588776 -1108680 -599634 22560 -90802
9464i0802j679712k162961p20860O11109J51848o53895Q7022J540847K009653
$$ -90802 -1770514 -3933475 -4654335 -4043226 -3891378 -4545273 -4458251 -2917404 -907751
9455i07751J812724J882162J498852p3431j450137j068410J43198J95490j024945
$$ -907751 904973 2787135 4285987 4212556 2762419 1694009 1837207 2032697 1007752
9446A007752j967718j513187K70319K249616K570477N19783j847826k078004r34879
$$ 1007752 -959966 -2473153 -2202834 46782 2617259 3137042 1289216 -788788 -1723667
9437a723667p09100o76111J441725L886457K387477k039566l179892N79515L189486
$$ -1723667 -2432767 -3108878 -1667153 2219304 4606781 2567215 -612677 -33162 3156324
9428C156324P83580k160253r55219J385073J34848k715037k594062n06387j38807
$$ 3156324 3939904 1779651 824432 2209505 2344353 -370684 -2964746 -3471133 -3609940
9419c609940m37062J661167L862252J547310l399018m333804n2555L667664L072753
$$ -3609940 -4047002 -2385835 1476417 3023727 -375291 -4709095 -4761650 -1093986 1978767
9410A978767P22659j18572J57464J04008l05671j006138k069967k140961j0101
$$ 1978767 2701426 2582854 2740318 2844326 2538655 1532517 -537450 -2678411 -2688512
9401b688512K378769K081998r5930q64183O8706K6124j433467j875640o85483
$$ -2688512 -309743 1772255 1676325 812142 880848 906972 -526495 -2402135 -3087618
9392c087618O1539j44145N16910K007001J766560o53130k213839j030513R99548
$$ -3087618 -3026079 -3170224 -2653314 -646313 1120247 467117 -1746722 -2777235 -1777687
9383a777687J560238R26226L44272O235k36420k58291m30324j126854j406536
$$ -1777687 -217449 708777 1053049 1059284 822864 564573 134249 -992605 -2399141
9374b399141k21593J366765J444496K16597o55020r12767j284948j183908K33078
$$ -2399141 -2620734 -1253969 190527 407124 -247896 -1160663 -2445611 -3629519 -3396441
9365c396441J698652J618697J052976J631842K014638K73662j830725j480388
$$ -3396441 -1697789 -79092 973884 2605726 4620364 4894026 3063301 1582913
9357A582913j30763r63893k385304l08433L662042L398406j646252m694734k089284
$$ 1582913 1452150 488257 -1897047 -2205480 1456562 4854968 3208716 -1486018 -3575302
9348c575302J343728N77436k124739k169962J3728J266542J397419J872652J760907
$$ -3575302 -2231574 -1654138 -3778877 -5948839 -5935111 -4668569 -3271150 -1398498 362409
9339C62409m26038k843330k405685M58911K536808K370065J256187M96425O8743
$$ 362409 -63629 -2906959 -5312644 -4853733 -2316925 53140 1309327 1805752 1874495
9330A874495l78313q88691j225306q39826K96910P56457o90745k446854j643312
$$ 1874495 1496182 607491 -617815 -1457641 -1160731 -404274 -1095019 -3541873 -5185185
9321e185185J301455K690014R78983j017882p62909L81144J32534r63480j103242
$$ -5185185 -3883730 -1193716 -214733 -1232615 -1995524 -1614380 -1481846 -2445326 -3548568
9312c548568k77357M89448J120996J775969J800248J007084L81654K24534n69205
$$ -3548568 -3825925 -3336477 -2215481 -439512 1360736 2367820 2749474 2974008 2404803
9303B404803k183443k865680j536132N16912J685732J834428J180630l28653j629159
$$ 2404803 221360 -2644320 -4180452 -3663540 -1977808 -143380 1037250 708597 -920562
9294i20562j021473R63873J719514M77483o72005m94961k17402m70197j14844
$$ -920562 -1942035 -978162 741352 1218835 546830 51869 -165533 -635730 -750574
9285g50574O74241r0323k127122k284945J67020J863587J095780O41560K090310
$$ -750574 -76333 -166656 -2293778 -4578723 -4411703 -2548116 -1452336 -810776 1279534
9276A279534K260887r14206l638100k127631Q78838Q47842q78237j21007K230177
$$ 1279534 3540421 2626215 -1011885 -3139516 -2260678 -1412836 -2291073 -2412080 -181903
9267a81903J901983q47206j608439M49300J473570k33164j997186k079212j901262
$$ -181903 1720080 872874 -735565 -286265 1187305 954141 -1043045 -3122257 -5023519
9258e023519j964610n57198K023969K568824R2158k129342j510251M49935J484197
$$ -5023519 -6988129 -7545327 -5521358 -2952534 -2860376 -4989718 -6499969 -6050034 -4565837
9249d565837J764506J871909R17215j082332j893943m37164J120679Q10004j47958
$$ -4565837 -2801331 -929422 -12207 -1094539 -2988482 -3425646 -2304967 -1494963 -1642921
9240a642921n6197J60430p24007j213745L88434K303647J697155m32607n91301
$$ -1642921 -1699118 -1538688 -2262695 -3476440 -3088006 -784359 912796 480189 -111112
9231a11112J431960K046762l58798k819728k447805n68154k1433p23477o29343
$$ -111112 1320848 3367610 3008812 189084 -2258721 -2826875 -2848308 -3571785 -4201128
9222d201128M00750O88942Q0355K51785J513759K024946R48223r6272N5161Q0550
$$ -4201128 -3800378 -3111436 -3031081 -2779296 -1265537 759409 1707632 1611360 1666521 1747071
9212A747071j158065j986411m19860K132691K492009L52502j513716j499191p63453
$$ 1747071 589006 -1397405 -1817265 315426 2807435 3159937 1646221 147030 -616423
9203f16423l16350N85002K111695K522476P70456j437163j905465r05027k21408
$$ -616423 -932773 -347771 1763924 4286400 5056856 3619693 1714228 809201 587793
9194E87793l54647m05345j12579k69145j079357j410125j99286J948405L144073
$$ 587793 233146 -172199 -284778 -553923 -1633280 -3043405 -3242691 -1294286 1849787
9185A849787K301832M60715n74566o67135j161399k093464j581445Q13104K250037
$$ 1849787 4151619 4612334 4037768 3370633 2209234 115770 -1465675 -652571 1597466
9176A597466L89258k653562k951814k12794K480701L428125L332375K216300o13231
$$ 1597466 1986724 -666838 -3618652 -3831446 -1350745 2077380 5409755 7626055 7012824
9167G012824l403776k970193K59820K137604Q70428o98727l29237J60613j164586
$$ 7012824 3609048 638855 898675 3036279 3906707 3207980 2878743 3039356 1874770
9158A874770k670553k098688k09136J091046J629885J691214N37668j512341k207182
$$ 1874770 -795783 -2894471 -3103607 -2012561 -382676 1308538 1846206 333865 -1873317
9149a873317p79076N07339K87379L66533J718585J860805p02440k970802k006548
$$ -1873317 -2652393 -2145054 -1857675 -1491142 227443 2088248 1385808 -1584994 -3591542
9140c591542K73312P51645L33802J179889J815405m3453k418884k131237o81093
$$ -3591542 -3318230 -2566585 -2232783 -1052894 762511 719058 -1699826 -3831063 -4512156
9131d512156j421707k771808n52048L978137N090514J665089j130881j85126J540245
$$ -4512156 -5933863 -8705671 -9257719 -5279582 -189068 1476021 345140 160014 1700259
9122A700259R66178n83981j034377j071266j622953j686036p89801k41954k92931
$$ 1700259 2666437 2082456 1048079 -23187 -1646140 -3332176 -4121977 -4363931 -4656862
9113d656862M84688J655126O45824k404419l612544j182504J722514K196198J646076
$$ -4656862 -4172174 -2517048 -1871224 -4275643 -7888187 -9070691 -7348177 -5151979 -3505903
9104c505903K001615J952022K80016p99128N28669J768816K16181j914247j078009
$$ -3505903 -1504288 447734 727750 -71378 457291 2226107 2442288 528041 -549968
9095e49968J207251O92887k298936l243743p22582J755408J717460P39662L27861
$$ -549968 657283 1350170 -948766 -4192509 -4915091 -3159683 -1442223 -702561 -374700
9086c74700p18226k773931l108075k2806L499359L424986K08371k242185k002289
$$ -374700 -1092926 -3866857 -6974932 -6997738 -3498379 -73393 134978 -2107207 -4109496
9077d109496o45180J53062O43857J327089J675968J448357J483432K102381K074817
$$ -4109496 -4754676 -4601614 -3957757 -2630668 -954700 493657 1977089 4079470 6154287
9068F154287M16610j736211k370045j201749J32917K36456p18246j634045j533462
$$ 6154287 6570897 4834686 2464641 1262892 1395809 1632265 914019 -720026 -2253488
9059b253488j07965J835102K573312J101922j384857k521217j354147Q05658J970142
$$ -2253488 -2361453 -526351 2046961 3148883 1764026 -757191 -2111338 -1305680 664462
9050F64462J165193j047895k743184j931200R19101K384058J05461l278826k942813
$$ 664462 1829655 781760 -1961424 -3892624 -2973523 -589465 -484004 -3762830 -6705643
9041f705643J387199M710525L638488O70054k40246O85597O42150p57331j384218
$$ -6705643 -5318444 -607919 3030569 3700623 3460377 4145974 4788124 4030793 2646575
9032B646575n04066K00869n60052j935481k157381m45695K031719K716004L55189
$$ 2646575 2142509 2343378 1783326 -152155 -2309536 -2755231 -723512 1992492 2347681
9023B347681k556692k133135J437823L594233J892554n39036k75321J208119Q80360
$$ 2347681 -209011 -2342146 -904323 2689910 4582464 4043428 3768107 4976226 5856586
9014E856586n89570j029308j337077l073434l927242j108411K512639J816863
$$ 5856586 5267016 4237708 2900631 -172803 -4100045 -5208456 -2695817 -878954
9006h78954j922491k432267J394956L621690R72445k286330j857249K36129M42481
$$ -878954 -2801445 -5233712 -3838756 -217066 755379 -1530951 -3388200 -3152071 -2709590
8997b709590k95897M40203J558279Q83934m64060k23303R37050J144757Q04848
$$ -2709590 -3005487 -2565284 -1007005 -123071 -587131 -810434 126616 1271373 2076221
8988B076221R16303L61884j493100j985107R20002M034782K923162j050389k575662
$$ 2076221 2992524 3354408 1861308 -123799 796203 4830985 7754147 6703758 4128096
8979D128096n09046J006996l38363j916816j393267l81297o76594p80085Q50284
$$ 4128096 3619050 4626046 4287683 2370867 977600 596303 -80291 -860376 -10092
8970a0092K070114J32200l247083l616162j42446L116049K840499M66435q15500
$$ -10092 2060022 2192222 -1054861 -4671023 -4813469 -1697420 1143079 1609514 794014
8961G94014o70742q65073j395501n56359J264118J282947r17240j558926J778206
$$ 794014 123272 -741801 -2137302 -2693661 -1429543 -146596 -1063836 -2622762 -844556
8952h44556N357322L853409j669604m788372k644279P00504R16128r54803j745554
$$ -844556 4512766 8366175 6696571 1908199 -736080 -35576 880552 -74251 -1819805
8943a819805j286155j139486r89470K45337J498792J054398k45527k59904R20320
$$ -1819805 -3105960 -4245446 -5234916 -4989579 -3490787 -2436389 -2681916 -2941820 -2021500
8934b021500J429327P50416k09038j214873k191530j686229J019675L146425J421924
$$ -2021500 -592173 158243 -50795 -1265668 -3457198 -5143427 -4123752 -977327 444597
8925D44597k455218l330661k2588K814323J572281j398418j972234r6479J425540
$$ 444597 -2010621 -5341282 -5363870 -2549547 -977266 -2375684 -4347918 -4444397 -3018857
8916c018857J570420J271907N44475j181611k554504j419954J431358K573347
$$ -3018857 -1448437 -176530 367945 -813666 -3368170 -4788124 -3356766 -783419
8908g83419P38154j261960p15267J006925O35937k045946l730708j999734J639167
$$ -783419 -45265 -1307225 -2022492 -1015567 -379630 -2425576 -6156284 -8156018 -6516851
8899f516851L799995L128230J199121N4118q5318l98936j410877k126613j483366
$$ -6516851 -2716856 411374 1610495 1664613 1579295 1180359 -230518 -2357131 -3840497
8890c840497j17393K55293o41156r13318P76908K774655K447310K00869p93705
$$ -3840497 -3957890 -3702597 -4343753 -5257071 -4480163 -1705508 741802 942671 148966
8881A48966P07642K092158R99581r92947j080064K30767L29712q32160q41049
$$ 148966 856608 2948766 3948347 2955400 1875336 2106103 2435815 1603655 762606
8872G62606N53735O55125j411467k630289o35184K543264L579523K412191J132075
$$ 762606 1316341 1971466 559999 -2070290 -2705474 -162210 3417313 5829504 6961579
8863F961579J98953j264045k622480k312744q21582k36340r06016j197050o53701
$$ 6961579 7160532 5896487 3274007 961263 139681 -96659 -1002675 -2199725 -2853426
8854b853426o47908j373524r64754J257743L092630K544569O08812p00014j274162
$$ -2853426 -3501334 -4874858 -5839612 -4581869 -1489239 1055330 1664142 964128 -310034
8845c10034j870170j755409M2564K072196J833925l50740j502421l52404J022479
$$ -310034 -2180204 -3935613 -3893049 -1820853 13072 -337668 -1840089 -2192493 -1170014
8836a170014P77870K1400M26348J228267O95687q42521j683032j513515j259240
$$ -1170014 -392144 -370744 55604 1283871 1979558 1137037 -545995 -2059510 -3318750
8827c318750q75064L06297J416261Q32276q60657j331914k55208K01853o58439
$$ -3318750 -4193814 -3887517 -2471256 -1638980 -2499637 -3831551 -4086759 -3884906 -4543345
8818d543345o79727J151279K393463J096190o26242R3651K051591J880808m49887
$$ -4543345 -5223072 -4071793 -1678330 -582140 -1208382 -1114731 936860 2817668 2367781
8809B367781j615077p9770J955178K037706K96072j635745k472516j819569n40253
$$ 2367781 752704 672934 2628112 4665818 4961890 3326145 853629 -965940 -1506193
8800a506193l83637j662607k163407m23754J243733N1382k127213j017188K996067
$$ -1506193 -1889830 -3552437 -5715844 -6139598 -4895865 -4844483 -6971696 -7988884 -4992817
8791d992817M744978K029766j190518j186058L41031J88180r88990p67897L60070
$$ -4992817 -247839 1781927 591409 -594649 -253618 -65438 -1054428 -1822325 -1462255
8782a462255J77598j089513j265436P3385J283337J388429P97571m0552p48237
$$ -1462255 -1284657 -2374170 -3639606 -3566221 -2282884 -894455 -96884 -137436 -885673
8773h85673o06861K75598M88811m04314o59847P20331J685692J93982k115551
$$ -885673 -1492534 -1216936 -728125 -1132439 -1792286 -1071955 613737 807719 -1307832
8764a307832k207874l42682O18359k31671j070965o84523L28030J390055K258640
$$ -1307832 -3515706 -3858388 -3240029 -3471700 -4542665 -5227188 -4899158 -3509103 -1250463
8755a250463J844379m39084k432871j403510J561124K523505L98680j582501r03584
$$ -1250463 593916 154832 -2278039 -3681549 -2120425 403080 801760 -780741 -1684325
8746a684325R44738J536118J013572P62777Q57191O78184L74051J00581p08349
$$ -1684325 -739587 796531 1810103 2572880 3430071 4108255 4482306 4582887 3874538
8737C874538j945094k194399q25848P29093J084113Q01847Q80437R58395N94508
$$ 3874538 1929444 -264955 -1090803 -361710 722403 1524250 2404687 3363082 3957590
8728C957590O81007J610370J561133q89376l530938k871910N71310K458975P02446
$$ 3957590 4638597 6248967 7810100 6920724 3389786 517876 1089186 3548161 4250607
8719D250607j646537j154023R02382Q21825j607863k722434n38309K307492K430480
$$ 4250607 2604070 1450047 2352429 3174254 1566391 -1156043 -1694352 613140 3043620
8710C043620K34475j373082j253273o30098k26521N20432J372095J027404m14845
$$ 3043620 3278095 1905013 651740 21642 -204879 315553 1687648 2715052 2300207
8701B300207j130950o59032q67800k433631k900118m67103K514433K723682Q65885
$$ 2300207 1169257 510225 -357575 -2791206 -5691324 -6158427 -3643994 -920312 -54427
8692e4427J47443Q88555N08084j351356j753966N58283K721624J962834n57726
$$ -54427 93016 981571 1489655 138299 -1615667 -1057384 1664240 3627074 3069348
8683C069348j980830j563208m24041N70176Q79373P298j181755o81355J434455
$$ 3069348 1088518 -474690 -898731 -328555 550818 558116 -623639 -1304994 129461
8674A29461K126152j38122k312692j137483J451182J168386j561913k015739J213465
$$ 129461 2255613 2117491 -195201 -1332684 118498 1286884 -275029 -2290768 -1077303
8665a077303L700499J881769j787063k930458j329573K14383P09473J127564J230883
$$ -1077303 2623196 4504965 2717902 -212556 -1542129 -1327746 -618273 509291 1740174
8656A740174o888j377985m92878J960143K443280j70481k783660k783947j466739
$$ 1740174 1733286 355301 -137577 1822566 4265846 4095365 1311705 -1472242 -2938981
8647b938981q87875k74095J658613L168322J758480j359602k654552j492038m09023
$$ -2938981 -3826856 -4100951 -2442338 725984 2484464 1124862 -1529690 -3021728 -3430751
8638c430751l83433K98884J878522J872933l35893j376966R90733L650559K405933
$$ -3430751 -3814184 -3515300 -1636778 236155 -99738 -1476704 -485971 3164588 5570521
8629E570521j588607l444847j562305P30965N16324j139483j709176o18320R71120
$$ 5570521 3981914 537067 -1025238 -294273 222051 -917432 -2626608 -3244928 -2273808
8620b273808J858154J344988l48275j538901n42090J690526K117460l32043k941492
$$ -2273808 -415654 929334 581059 -957842 -1499932 190594 2308054 1976011 -965481
8611i65481k659168Q7970K447684K809334J785970L76420j005947j862235j603404
$$ -965481 -3624649 -3536679 -1088995 1720339 3506309 3882729 2876782 1014547 -588857
8602e88857n29183K98072M74269O59009J257270J593484R89469j7728l97344k75943
$$ -588857 -1118040 -819968 -345699 313310 1570580 3164064 4153533 4135805 3738461 3462518
8592C462518q43905k335177l032149j218145K202467M130824K629415q95390l282757
$$ 3462518 2618613 283436 -2748713 -3966858 -1764391 2366433 4995848 4100458 817701
8583H17701k799846l23427K007343K649575J573404K0683p11679n02372j79711
$$ 817701 -1982145 -2305572 -298229 2351346 3924750 3945433 3233754 2731382 2551671
8574B551671j35911K594J77321l63896j474363j613542j03437J351335R46173
$$ 2551671 2415760 2418354 2595675 2231779 757416 -856126 -959563 391772 1337945
8565A337945m46871o68038L01450M94271p04205j627302j009776L93561J364711
$$ 1337945 891074 223036 524486 1018757 314552 -1312750 -2322526 -1928965 -564254
8556e64254J664362J407378O07142j70368k45007k56309j400964k883018k294268
$$ -564254 1100108 2507486 3114628 2944260 2699253 2442944 1041980 -1841038 -4135306
8547d135306O16411K766050J711125j056226k333337j156214J018985K604181
$$ -4135306 -3518895 -752845 958280 -97946 -2431283 -3587497 -2568512 35669
8539C5669K724397J121718j135990k053149j257757p04646j399849j462156M53501
$$ 35669 2760066 3881784 2745794 692645 -565112 -1269758 -2669607 -4131763 -3678262
8530c678262K077865R72157q65043J75210L004746K963618p57511l550246k351310
$$ -3678262 -1600397 -628240 -1493283 -1318073 1686673 4650291 3892780 342534 -2008776
8521b008776K41585P72077j31218k96427j23433r01833j566264n55570R43132
$$ -2008776 -1767191 -995114 -1126332 -1422759 -1546192 -2448025 -4014289 -4569859 -3626727
8512c626727R13665J27384N03236J225805J87269j605756j062654J742466L315102
$$ -3626727 -2713062 -2585678 -2082442 -856637 -669368 -2275124 -3337778 -1595312 1719790
8503A719790K140602M95989o114p87119k581170l026943n31086K335046K258099
$$ 1719790 3860392 4356381 4350267 3563148 981978 -2044965 -2576051 -241005 2017094
8494B017094k2250j271797o23600P1872j83534n02380l14477j05756P224L64342
$$ 2017094 1994844 723047 99447 171319 -12215 -514595 -829072 -934828 -927604 -563262
8484e63262M96169k92413j183120o84437P76586J175813P1733o36300K15632J180836
$$ -563262 -67093 -359506 -1542626 -2227063 -1450477 -274664 -202931 -839231 -623599 557237
8474E57237N09717j183525j914268j073439P7790K38698n54781j247023q74289
$$ 557237 1066954 -116571 -2030839 -3104278 -3026488 -2787790 -3342571 -4589594 -5463883
8465e463883N86755K190300K859122K247985P24376j131000k617007k947372j898967
$$ -5463883 -4877128 -2686828 172294 2420279 3144655 2013655 -603352 -3550724 -5449691
8456e449691k54830R52988J414063J327081P66550n2762m51628q6150M15922M40603
$$ -5449691 -5704521 -4751533 -3337470 -2010389 -1243839 -1296601 -1748229 -1834379 -1418457 -977854
8446i77854L82441P19540Q64273J41764q07379r79727o97841q40924j037273l37168
$$ -977854 -595413 124127 988400 1130164 322785 -656942 -1354783 -2195707 -3232980 -3570148
8436c570148Q10287J055733K80969m82082q31572r45181l81682J041078J871409
$$ -3570148 -2759861 -1704128 -1423159 -1905241 -2736813 -3681994 -4063676 -3022598 -1151189
8427a151189Q90066l39048M54642K215727J877808n29560j767359o66779L52028
$$ -1151189 -261123 -600171 -145529 2070198 3948006 3418446 1651087 984308 1336336
8418A336336j58163n60162R3304J22294j135394j561719k79524L53651p69742
$$ 1336336 1178173 618011 711315 833609 -301785 -1863504 -2143028 -1789377 -2559119
8409b559119r74196J181387K366911m0200k603020r20228K752920K652990j351017
$$ -2559119 -3533315 -2351928 14983 -25217 -2628237 -3548465 -795545 1857445 506428
8400E06428l660982j655750J098805J123900l77473p84499l5851N57503O69258
$$ 506428 -3154554 -4810304 -3711499 -2587599 -2965072 -3749571 -3785422 -3227919 -2558661
8391b558661M80337j07425p01498o03016k42502n76659r50643J73534K163143
$$ -2558661 -2078324 -2185749 -2887247 -3490263 -3732765 -4309424 -5260067 -5086533 -2923390
8382b923390K422232K49716j866293j649153K49659J698976J536449l757j713833
$$ -2923390 -501158 -251442 -2117735 -3766888 -3517229 -1818253 -281804 -285561 -1999394
8373a999394j879811J21900K478632K695547O67546j535524k558008k536669j514549
$$ -1999394 -3879205 -3757305 -1278673 1416874 2084420 548896 -2009112 -4545781 -6060330
8364f060330N21727K207337J881262J64890q03986n51268k80815j15108P77141
$$ -6060330 -5538603 -3331266 -1450004 -1285114 -2089100 -2640368 -2921183 -3036291 -2259150
8355b259150J563016N89892j091316p00666J303233J204870j844558l687999j203335
$$ -2259150 -696134 -106242 -1197558 -1898224 -594991 609879 -1234679 -4922678 -6126013
8346f126013K954795M205205J980982p35627j798661j456644r28195j192893k155681
$$ -6126013 -3171218 1033987 3014969 2279342 480681 -975963 -1904158 -3097051 -5252732
8337e252732k273790n37221J208643N47101j006234L40025L934903M494475M46860
$$ -5252732 -7526522 -8063743 -6855100 -6307999 -7314233 -6974208 -3039305 1455170 1902030
8328A902030k770452r74650K251027J805106p09360p58651O95472o22943l729639
$$ 1902030 -868422 -1843072 407955 2213061 1503701 745050 1440522 817579 -2912060
8319b912060l291938J155055L871232J897917r02072q48959J66787o54722j698338
$$ -2912060 -6203998 -5048943 -1177711 720206 -181866 -1030825 -864038 -1518760 -3217098
8310c217098j74993K558839K920898M96688j847500k109409p09700J186575K557161
$$ -3217098 -3392091 -833252 2087646 2584334 736834 -1372575 -2082275 -895700 1661461
8301A661461K409366Q00027n51941l09878M89432O8487j241028j596587n78209
$$ 1661461 4070827 4870854 4318913 4009035 4498467 4566954 3325926 1729339 1151130
8292A151130L69581K91370k27677m80963n55453n41496j99435K10487K2918m90344
$$ 1151130 1520711 1812081 1584404 1103441 547988 6492 -192943 17544 40462 -449882
8282d49882j83874R34860J161795k95749j449398o6006K590675K801135m95657
$$ -449882 -633756 301104 1462899 1167150 -282248 -348254 2242421 5043556 4547899
8273D547899l745535l169122M09758K837447J877446p24129k200362j852833p02125
$$ 4547899 802364 -2366758 -1957000 880447 2757893 2033764 -166598 -2019431 -2721556
8264b721556L21472Q15887N29960l54390j003486q02463j51581K20943L85537
$$ -2721556 -2400084 -1584197 -1054237 -1408627 -2412113 -3214576 -3366157 -3145214 -2759677
8255b759677R07981J608893J525747L90982o04157k74582O67790K97504j663816
$$ -2759677 -1851696 -242803 1282944 1673926 1069769 795187 1462977 1760481 96665
8246I6665k948849j792045K57854M58314r21408j156303K43031P31987m40458
$$ 96665 -2852184 -4644229 -4386375 -3928061 -4849469 -6005772 -5762741 -5030754 -5471212
8237e471212l86885K213095L866688J809507o45698P67936L504158J837245l127596
$$ -5471212 -5858097 -3645002 221686 2031193 1385495 2153431 5657589 7494834 4367238
8228D367238m364378k63255K563184R4864k882355j466242J163160J9090k587437
$$ 4367238 2860 -260395 2302789 2397653 -484702 -1950944 -787784 -768694 -3356131
8219c356131j229048K920031L950495R15765j488868j206479r18114j683206j098675
$$ -3356131 -4585179 -1665148 2285347 3201112 1712244 505765 -412349 -2095555 -3194230
8210c194230J040597J367558r00774k003047j42947J297451r7352j438716J0103
$$ -3194230 -2153633 -786075 -1686849 -3689896 -3832843 -2535392 -2632744 -4071460 -4061357
8201d061357J561124j84260k934589k165421J403787L075156J647829M68624J288048
$$ -4061357 -2500233 -2684493 -5619082 -7784503 -6380716 -3305560 -1657731 -1189107 98941
8192I8941J956461R58849n5901K96236P22708L6793n79594p1545J88032j161077
$$ 98941 2055402 3014251 2958350 3254586 3977294 4014087 3434493 3362948 3550980 2389903
8182B389903k626472j914916L96948J645465Q84530l22501o97051p34530j087508
$$ 2389903 -236569 -2151485 -1754537 -109072 775458 452957 -244094 -978624 -2066132
8173b066132j185750k33575J400350K423588J820938k44779k246110k327174l51320
$$ -2066132 -3251882 -3485457 -2085107 338481 2159419 1914640 -331470 -2658644 -3009964
8164c009964J480031J174232l08378m11401J152467J960921O72053r92993j136264
$$ -3009964 -1529933 -355701 -664079 -1075480 76987 2037908 2709961 1716968 580704
8155E80704n01010p68425j675193j776357r26728n8588O06164J213568J021664
$$ 580704 79694 -688731 -2363924 -4140281 -5067009 -5125597 -4519433 -3305865 -2284201
8146b284201m14418j497567l30769K141651L016277J355759r36418k106106k163865
$$ -2284201 -2698619 -4196186 -4526955 -2385304 630973 1986732 1050314 -1055792 -3219657
8137c219657j434480J27016J729614K032425J190711O83969P62379J72365j193756
$$ -3219657 -4654137 -4527121 -2797507 -765082 425629 1109598 1871977 2044342 850586
8128H50586j683530n75689P99996J326416J357129J108840P4711j264260j450459
$$ 850586 -832944 -1408633 -608637 717779 2074908 3183748 3258459 1994199 543740
8119E43740m60265K19975L48995R86845J423157m21668l595675m068901p66112
$$ 543740 83475 303450 652445 1639290 3062447 2640779 -954896 -5023797 -5789909
8110e789909K319889K229668J172996J750789K206431K48058k024742j455046
$$ -5789909 -3470020 -1240352 -67356 1683433 3889864 4137922 2113180 658134
8102F58134P72456J545105J085813J186315O55483k246533m783906k898542J641566
$$ 658134 1430590 2975695 4061508 5247823 5903306 3656773 -1127133 -4025675 -2384109
8093b384109K980346j80690l101160k413169J01857J744829K129067J377191m92345
$$ -2384109 596237 415547 -2685613 -5098782 -4996925 -3252096 -1123029 254162 -238183
8084b38183j606816J30350K913914K856846K45883q64680K57653m7981k610714
$$ -238183 -1844999 -1714649 1199265 4056111 4301994 3437314 3694967 3646986 1036272
8075A036272l193339P1216K767057J184626j765118j605201R49377K442621K292031
$$ 1036272 -2157067 -2085851 681206 1865832 100714 -1504487 -555110 1887511 4179542
8066D179542J762125M55142j950005l133485j440265O36737K65901q55393K81612
$$ 4179542 5941667 6396809 4446804 1313319 -126946 509791 775692 -79701 201911
8057B01911K185765J142200k182918l444980j420069N35725J6627j442128j495522
$$ 201911 2387676 3529876 1346958 -2098022 -3518091 -2982366 -2965739 -4407867 -5903389
8048e903389R2096K202061L478355K545530n28141l090726k489800M64715K672511
$$ -5903389 -5811293 -3609232 -130877 2414653 1886512 -1204214 -3694014 -3229299 -556788
8039e56788K707279J474119m9917j236597j069811L17614N76039j523979l206927
$$ -556788 2150491 3624610 3574693 2338096 1268285 1585899 2161938 637959 -2568968
8030b568968j549828J440485J786623P2343l0036J250697K33173k751596k871738
$$ -2568968 -4118796 -2678311 -891688 -819345 -849381 401316 634489 -2117107 -4988845
8021d988845Q03966K880012L19943k446834q91995K427512K702141N43538l42284
$$ -4988845 -4184879 -1304867 -984924 -3431758 -4323753 -1896241 805900 1349438 1007154
8012A007154K01075j47775r06721K9547J522471O52944j917135k802477j418936
$$ 1007154 1208229 1060454 153733 183280 1705751 2358695 441560 -2360917 -3779853
8003c779853j88058Q5029N56704P92823l42789r02273J649062M433000J927465
$$ -3779853 -3967911 -3882882 -3326178 -2533355 -2876144 -3778417 -2129355 2303645 4231110
7994D231110m482857o584140j347293L891775K286735k585803l199863M12592
$$ 4231110 -251747 -6835887 -8183180 -4291405 -2004670 -4590473 -7790336 -7377744
7986g377744K427144J352780R76046K324525J949812j024157k534552l38282K067033
$$ -7377744 -4950600 -3597820 -2621774 -297249 1652563 628406 -1906146 -2244428 -177395
7977a77395J107606j380159j664666j26188o351j732167k150169N81007M048812
$$ -177395 930211 -449948 -2114614 -2240802 -2247153 -3979320 -6129489 -5548482 -1499670
7968a499670M522702J502648j806532k375178p64112J11878q41085j621527n37296
$$ -1499670 3023032 4525680 2719148 343970 -420142 -308264 -1149349 -2770876 -3308172
7959c308172J078701J089034j70327r08667q28028o85499j23735J339977K186869
$$ -3308172 -2229471 -1140437 -1310764 -2219431 -3047459 -3732958 -3856693 -2516716 -329847
7950c29847P90678j385602j693074n28800o5892K20813K236884M164359K217447
$$ -329847 460831 -924771 -2617845 -3146645 -3212537 -2991724 -754840 3409519 5626966
7941E626966k242988l477032n12008J026806j402612k723993O33242L906557K025215
$$ 5626966 3383978 -93054 -605062 421744 -980868 -3704861 -3071619 834938 2860153
7932B860153j496936p96389J974677P05663l485394l969261l6181K259570P64890
$$ 2860153 1363217 566828 2541505 3247168 -238226 -4207487 -4243668 -1984098 -1219208
7923a219208J36780K551337L562110K63098l272675k645722J94891J048835k1723
$$ -1219208 -1082428 1468909 5031019 5294117 2021442 -624280 -429389 619446 597723
7914E97723l31999M99052R72489P27225K22518n68320j049461O6863J950785J588228
$$ 597723 265724 764776 1737265 2464490 2687008 2118688 1069227 1136090 3086875 4675103
7904D675103j523205l623364j940860J207583K116223P85920l84219n36586j90661
$$ 4675103 3151898 -471466 -2412326 -1204743 911480 1697400 1313181 776595 585934
7895E85934O76874J639170R21977j790895l557536j922897J240940K307348P49942
$$ 585934 1262808 2901978 3823955 2033060 -1524476 -3447373 -2206433 100915 850857
7886H50857j113538j702877j022671N74509K067705J710305m42812j669226n06820
$$ 850857 -262681 -1965558 -2988229 -2413720 -346015 1364290 921478 -747748 -1254568
7877a254568O08086o10329j971411j83484L309715M144246J727670k44626J61662
$$ -1254568 -646482 -1256811 -3228222 -3411706 -101991 4042255 5769925 5525299 5686961
7868E686961P35159n23459k308817k615103j691995r50579q27934r36946j015092
$$ 5686961 6422120 5898661 3589844 974741 -717254 -1667833 -2495767 -3432713 -4447805
7859d447805r07070m95879N8403O61663J483026K067452J301291m97597q89139
$$ -4447805 -5354875 -5850754 -5792351 -5130688 -3647662 -1580210 -278919 -776516 -1665655
7850a665655J305587L292032J675156k296933l957030j574970J573497K025122
$$ -1665655 -360068 2931964 4607120 2310187 -1646843 -3221813 -1648316 376806
7842C76806K31806j226174j234373m56496M42494J332567J957310J788958O04287
$$ 376806 608612 -617562 -1851935 -2308431 -1865937 -533370 1423940 3212898 3817185
7833C817185r90999j764765j123762k10953o50574j918031j627484P50604K502350
$$ 3817185 2826186 1061421 -62341 -273294 -923868 -2841899 -4469383 -3718779 -1216429
7824a216429J527775m53014o92336M26130O50738k19211o31749m04679n06936
$$ -1216429 311346 -141668 -834004 -407874 242864 23653 -608096 -1012775 -1519711
7815a519711n48522M08571J206307K7058j969709j871445K73078J481359P32428
$$ -1519711 -2068233 -1659662 -453355 -426297 -2396006 -4267451 -3994373 -2513014 -1780586
$$ [...]
##END NTUPLES=NMR SPECTRUM
##END=
