##TITLE=31Pdec_PR184_IN
 D2O, 24 sc
 26.08.2021
##JCAMPDX= 6.0         $$ Bruker NMR JCAMP-DX V2.0
##DATA TYPE= NMR SPECTRUM
##DATA CLASS= NTUPLES
##ORIGIN= UXNMR, Bruker Analytische Messtechnik GmbH
##OWNER= root
$$ XWIN-NMR		Version 3.5
$$ Thu Aug 26 12:37:12 2021 Russian Standard Time (UT+4h)  she@DPX200
##.OBSERVE FREQUENCY= 81.013821
##.OBSERVE NUCLEUS= ^31P
##.ACQUISITION MODE= SIMULTANEOUS
##.ACQUISITION SCHEME= undefined
##.AVERAGES= 24
##.DIGITISER RES= 16
##SPECTROMETER/DATA SYSTEM= spect
##.PULSE SEQUENCE= zgpg30
##.SOLVENT NAME= CDCl3
##.SHIFT REFERENCE= (INTERNAL, CDCl3, 0, 248.564)
##AUDIT TRAIL= $$ (NUMBER, WHEN, WHO, WHERE, WHAT)
$$ ##TITLE= Audit trail, XWIN-NMR		Version 3.5
$$ ##JCAMPDX= 5.01
$$ ##ORIGIN= Bruker BioSpin GmbH
$$ ##OWNER= she
$$ F:/spectra/data/she/nmr/P31/1/pdata/1/auditp.txt
$$ ##AUDIT TRAIL=  $$ (NUMBER, WHEN, WHO, WHERE, WHAT)
(   1,<2021-08-26 12:35:57.75 +0400>,<she>,<DPX200>,
      <created by zg, POWCHK disabled, PULCHK disabled
       configuration hash MD5:
       00 E9 B6 7A A2 85 ED C7 34 08 36 98 17 FE 4E 26
       data hash MD5: 32K
       A3 7C 30 80 99 68 CB DE 5C 71 29 76 D3 E4 07 B0>)
(   2,<2021-08-26 12:36:00.14 +0400>,<she>,<DPX200>,
      <Start of raw data processing
       efp BC_mod = 2 LB = 1 FT_mod = 6 PKNL = 1 PHC0 = -7774.343 PHC1 = 109.2735 SI = 64K 
       data hash MD5: 64K
       AD 33 54 0B 1C B6 27 9F 95 BF 69 AA 3A D1 5D 49>)
(   3,<2021-08-26 12:36:37.93 +0400>,<she>,<DPX200>,
      <pk PHC0 = -136.177 PHC1 = 355.9999 
       data hash MD5: 64K
       89 74 6F 92 E4 CF C8 40 BF EC E6 A9 53 73 FF A2>)
(   4,<2021-08-26 12:36:48.76 +0400>,<she>,<DPX200>,
      <abs ABSG = 5 
       data hash MD5: 64K
       C4 ED 98 55 7E 06 E7 89 FA 2E 94 60 5E 1C 96 AA>)
$$ ##END=
$$ 
$$ hash MD5
$$ 81 2C 0F CE 00 15 17 06 D7 39 05 A0 58 12 73 79
##$RELAX= 
##$RELAX= 
##$RELAX= 
##$RELAX= 
##$RELAX= 
##$RELAX= 
##$RELAX= 
##$RELAX= 
$$ Bruker specific parameters
$$ --------------------------
##$DU= <F:/spectra>
##$EXPNO= 1
##$NAME= <P31>
##$PROCNO= 1
##$TYPE= <nmr>
##$USER= <she>
##$AMP= (0..31)
100 100 100 100 100 100 100 100 100 100 100 100 100 100 100 100 100 100 
100 100 100 100 100 100 100 100 100 100 100 100 100 100 
##$AQSEQ= 0
##$AQ_mod= 1
##$AUNM= <au_zg>
##$AUTOPOS= <>
##$BF1= 81.014009
##$BF2= 200.13
##$BF3= 200.13
##$BF4= 200.13
##$BF5= 200.13
##$BF6= 200.13
##$BF7= 200.13
##$BF8= 200.13
##$BYTORDA= 1
##$CFDGTYP= 0
##$CFRGTYP= 5
##$CHEMSTR= <none>
##$CNST= (0..31)
1 1 145 1 1 1 1 1 1 1 1 1 1 1 1 1 1 1 1 1 1 1 1 1 1 1 1 1 1 1 1 1 
##$CPDPRG= <waltz16>
##$CPDPRG1= <>
##$CPDPRG2= <waltz16>
##$CPDPRG3= <>
##$CPDPRG4= <mlev>
##$CPDPRG5= <mlev>
##$CPDPRG6= <mlev>
##$CPDPRG7= <mlev>
##$CPDPRG8= <mlev>
##$CPDPRGB= <>
##$CPDPRGT= <>
##$D= (0..31)
0 1 0 0 0 0 0 0 0 0 0 0.03 2e-05 3e-06 0 0 0 0 0 0 0 0 0 0 0 0 0 0 0 0 
0 0 
##$DATE= 1629966957
##$DBL= (0..7)
120 120 120 11 120 120 24 19 
##$DBP= (0..7)
150 150 150 150 150 150 150 150 
##$DBP07= 0
##$DBPNAM0= <>
##$DBPNAM1= <>
##$DBPNAM2= <>
$$ [...]
##$SUBNAM3= <"">
##$SUBNAM4= <"">
##$SUBNAM5= <"">
##$SUBNAM6= <"">
##$SUBNAM7= <"">
##$SUBNAM8= <"">
##$SUBNAM9= <"">
##$SW= 501.771253377433
##$SWIBOX= (0..15)
0 1 3 0 0 0 0 0 0 0 0 0 0 0 0 0 
##$SW_h= 40650.406504065
##$TD= 32768
##$TD0= 1
##$TE= 0
##$TE2= 300
##$TE3= 300
##$TEG= 300
##$TL= (0..7)
0 120 53 12 22 120 120 120 
##$TP= (0..7)
150 150 150 150 150 150 150 150 
##$TP07= 0
##$TPNAME0= <>
##$TPNAME1= <>
##$TPNAME2= <>
##$TPNAME3= <>
##$TPNAME4= <>
##$TPNAME5= <>
##$TPNAME6= <>
##$TPNAME7= <>
##$TPOAL= (0..7)
0.5 0.5 0.5 0.5 0.5 0.5 0.5 0.5 
##$TPOFFS= (0..7)
0 0 0 0 0 0 0 0 
##$TUNHIN= 0
##$TUNHOUT= 0
##$TUNXOUT= 0
##$USERA1= <user>
##$USERA2= <user>
##$USERA3= <user>
##$USERA4= <user>
##$USERA5= <user>
##$V9= 5
##$VALIST= <valist>
##$VCLIST= <CCCCCCCCCCCCCCC>
##$VD= 0
##$VDLIST= <DDDDDDDDDDDDDDD>
##$VPLIST= <PPPPPPPPPPPPPPP>
##$VTLIST= <TTTTTTTTTTTTTTT>
##$WBST= 1024
##$WBSW= 4
##$XGAIN= (0..3)
0 0 0 0 
##$XL= 0
##$YL= 0
##$YMAX_a= 3717
##$YMIN_a= -1287
##$ZGOPTNS= <>
##$ZL1= 120
##$ZL2= 120
##$ZL3= 120
##$ZL4= 120
##$ABSF1= 248.5645
##$ABSF2= -253.2056
##$ABSG= 5
##$ABSL= 3
##$ALPHA= 0
##$AQORDER= 0
##$ASSFAC= 0
##$ASSFACI= 0
##$ASSFACX= 0
##$ASSWID= 0
##$AUNMP= <proc_1d>
##$AZFE= 0.1
##$AZFW= 0.5
##$BCFW= 0
##$BC_mod= 2
##$BYTORDP= 0
##$COROFFS= 0
##$CY= -3
##$DATMOD= 1
##$DC= 0
##$DFILT= <>
##$DTYPP= 0
##$F1P= 0
##$F2P= 0
##$FCOR= 1
##$FTSIZE= 65536
##$FT_mod= 6
##$GAMMA= 0
##$GB= 0
##$INTBC= 1
##$INTSCL= 5.30512e-09
##$ISEN= 30
##$LB= 1
##$LEV0= 0
##$LPBIN= 0
##$MAXI= 10000
##$MC2= 0
##$MEAN= 0
##$ME_mod= 0
##$MI= 50
##$NCOEF= 0
##$NC_proc= -7
##$NLEV= 6
##$NOISF1= 182.463
##$NOISF2= 159.3651
##$NSP= 0
##$NTH_PI= 0
##$NZP= 0
##$OFFSET= 248.5645
##$PC= 4
##$PHC0= -7910.52
##$PHC1= 465.2734
##$PH_mod= 1
##$PKNL= yes
##$PPARMOD= 0
##$PSCAL= 0
##$PSIGN= 0
##$REVERSE= no
##$SF= 81.014009
##$SI= 65536
##$SIGF1= 159.3651
##$SIGF2= -187.1042
##$SINO= 113.3802
##$SIOLD= 16384
##$SREGLST= <1H.CDCl3>
##$SSB= 0
##$STSI= 65536
##$STSR= 0
##$SW_p= 40650.406504065
##$SYMM= 0
##$S_DEV= 0
##$TDeff= 32768
##$TDoff= 0
##$TI= <>
##$TILT= no
##$TM1= 0
##$TM2= 0
##$TOPLEV= 0
##$USERP1= <user>
##$USERP2= <user>
##$USERP3= <user>
##$USERP4= <user>
##$USERP5= <user>
##$WDW= 1
##$XDIM= 65536
##$YMAX_p= 383695302
##$YMIN_p= -14780996
$$ End of Bruker specific parameters
$$ ---------------------------------
##NTUPLES= NMR SPECTRUM
##VAR_NAME=  FREQUENCY,     SPECTRUM/REAL,   SPECTRUM/IMAG
##SYMBOL=    X,             R,               I
##VAR_TYPE=  INDEPENDENT,   DEPENDENT,       DEPENDENT
##VAR_FORM=  AFFN,          ASDF,            ASDF
##VAR_DIM=   65536,         65536,           65536
##UNITS=     HZ,            ARBITRARY UNITS, ARBITRARY UNITS
##FACTOR=    0.620285442955139, 1,           1
##FIRST=     20137.2065510759, 0,            0
##LAST=      -20513.1999529892, 0,           0
##MIN=       -20513.1999529892, -14780996,   0
##MAX=       20137.2065510759, 383695302,    0
$$ Real data points
##PAGE= N=1
##DATA TABLE= (X++(R..R)), XYDATA
$$ [...]
##PAGE= N=2
##DATA TABLE= (X++(I..I)), XYDATA
15275 -3176431 -1112108 1577698 2448786 1449980 995185 1931530 2242253 775191 -669918
15266 -669918 -606014 -421137 -1503382 -2278757 -792718 1643215 2247022 928803 -57121
15257 -57121 279760 906771 914690 129893 -1765657 -4529502 -6381237 -5812925 -3730210
15248 -3730210 -1856283 -69387 2288778 3602751 1591985 -2746059 -5906634 -6463642
15240 -6463642 -5858989 -4741307 -2056449 1618012 3389679 2112795 220379 6925
15232 6925 728795 943494 1075803 1738820 1881300 763289 -244927 -2918 152902 -1196945
15222 -1196945 -2679458 -2222413 -570937 38571 -377424 26050 1511209 2672639 3326549
15213 3326549 4468821 5346700 3697330 -354557 -3397000 -2956919 -459252 1282767
15205 1282767 1572686 1395025 1225323 1035876 1238390 1826771 1477125 -662185 -2862585
15196 -2862585 -2464818 395936 2554774 1758851 -709863 -2111084 -1584858 -241306 1053821
15187 1053821 2309575 3122551 2543952 747253 -578288 -391810 246185 -24557 -658621
15178 -658621 -368280 305073 -258335 -1597819 -1325467 796056 1508258 -1398801 -5268513
15169 -5268513 -5905812 -3423440 -1629686 -1959856 -1584716 1382669 4072793 2776083 -1321182
15160 -1321182 -3445004 -1694945 808139 726305 -1215478 -2250072 -1911003 -2096563 -3622844
15151 -3622844 -5055999 -5115456 -4266987 -3339260 -2295265 -1274590 -1189362 -1967865 -1753175
15142 -1753175 366961 2206446 1390209 -645490 -543914 1547901 2041140 -114184 -1462356
15133 -1462356 181786 1813232 193837 -2413922 -1709344 1438225 2190693 -428650
15125 -428650 -2066689 -287953 1621204 420534 -1634760 -619630 2586912 3686387
15117 3686387 1423573 -1235914 -1995335 -1634159 -1082947 500998 3287230 5055124 4020051
15108 4020051 1741929 1077843 2209236 2853366 1987745 1094743 1344423 1606061 429478
15099 429478 -1425173 -2045866 -1282528 -900299 -1767720 -2405402 -1050863 1754740 3569466
15090 3569466 2761991 169139 -1945023 -2202373 -1251780 -694196 -1114933 -1618434 -1342600
15081 -1342600 -573469 241586 1587413 3710037 5177189 4529897 3023606 3373979 5548661
15072 5548661 6452724 4687044 2781266 2958074 3432516 1623472 -1159002 -1666754 -41363
15063 -41363 490950 -1182783 -2736839 -2524805 -1757109 -1825645 -2248019 -2188492 -1710659 -871184
15053 -871184 183857 -52380 -2864533 -6076136 -5711501 -1847872 768510 -452474 -2251520
15044 -2251520 -1139148 899653 -51058 -3267981 -4599293 -2845616 -926464 -1203157
15036 -1203157 -3075918 -5070680 -6355711 -6242983 -4758452 -3554192 -3954027 -4649025 -3840748
15027 -3840748 -2788801 -3962470 -6200876 -5655788 -1981768 419760 -1210788 -3861351
15019 -3861351 -3206957 453304 3233499 2923210 831133 -719305 -820366 -255455 -483144
15010 -483144 -2046892 -3598966 -3280824 -1245703 407650 441210 -265964 -599607 -650083
15001 -650083 -712368 -570096 -464453 -1071711 -1845032 -1257345 517723 1252577 64817
14992 64817 -977692 -43780 1742456 2400763 1927148 1207185 59494 -1505597 -1881086
14983 -1881086 -135962 1834461 1952716 1335380 2236868 3845196 3367645 739372 -1026177
14974 -1026177 -284346 1328245 1789245 967113 -407170 -1718992 -2018144 -792525 479676
14965 479676 -210472 -2130996 -2480685 -729828 529901 -71843 -530558 693574 1490763
14956 1490763 -734148 -4644908 -6522521 -5285453 -3448586 -3362645 -4566047 -5036381 -3622639
14947 -3622639 -972414 1090078 1057258 -853492 -2949998 -3909345 -3696489 -2511308 -211977
14938 -211977 2410738 3261971 1347348 -1400218 -2284686 -1188643 -158054 -162909 -136718
14929 -136718 706395 1371334 602289 -1184726 -2292762 -1674203 -50797 819305 9937
14920 9937 -1466245 -1875484 -1081333 -632993 -1171746 -1206117 413372 2234985 2253125 1152158
14910 1152158 1156118 2193369 1998152 236925 -482910 1075870 2236200 345343 -2775174
14901 -2775174 -3107294 -136022 2623842 2648049 1194753 478754 539945 289498 -191162
14892 -191162 -191524 -25910 -250191 46456 2079976 4669062 4921915 2240163 -341021
14883 -341021 -27920 2112860 3065706 2190696 1493548 2105260 2865599 2675217 2022825
14874 2022825 1333910 -132438 -2311135 -3002906 -551956 3190739 4774591 3533016
14866 3533016 1832056 1055959 -75480 -2353439 -3686330 -1841642 1779601 3425917
14858 3425917 1816158 -309026 87555 2602270 4348983 3748622 2137513 1689639 2712053
14849 2712053 3533192 2762429 1039007 195444 906194 1808247 1322326 -161045 -759622
14840 -759622 286164 1499832 1180756 -340475 -1378701 -1220037 -531363 293127 1668519
14831 1668519 3401706 4233833 3559923 2296330 1050449 -1197076 -5048494 -8473528
14823 -8473528 -8740727 -6069344 -3195607 -1465708 238836 2371731 3221581 1834136
14815 1834136 172358 435800 1783071 1800736 194499 -1121625 -1081384 -574354 -579677
14806 -579677 -920749 -1063515 -837640 -222699 534986 674258 -163017 -992538 -637220 438430
14796 438430 752678 35491 -650438 -888365 -1301759 -1814370 -1325776 313554 1661624
14787 1661624 1837401 1843752 2732703 3735225 3466816 2098005 1059157 1094697 1658986
14778 1658986 1921551 1571925 927445 826298 1946903 3630835 3967686 1874637 -1307330
14769 -1307330 -3129170 -2703217 -1284116 -375079 -160286 -17248 135847 -387324 -1979205
14760 -1979205 -3849035 -4540571 -3386455 -1194406 579732 961076 -260357 -2468284
14752 -2468284 -3905032 -2557738 1303632 4263344 3243272 -461682 -2632242 -1595029
14744 -1595029 160948 443903 671654 2869799 5542157 5350834 2077722 -758426 -328904
14735 -328904 2507088 4969680 5412275 4051905 2056540 696374 514855 725414 113969
14726 113969 -1077468 -1066884 997181 3307333 3275080 876893 -1103359 -527952 1461761
14717 1461761 2181748 1054281 34701 409646 932028 55829 -1469521 -1809463 -865085
14708 -865085 -37904 223247 582012 785242 -224213 -1924156 -2238282 -584133 1251947
14699 1251947 2027627 2520133 3055221 2120461 -822374 -3471638 -3846187 -3311258 -3934486
14690 -3934486 -4642372 -3092650 -118473 1168598 286434 -37713 1499727 2743043 1685848
14681 1685848 -452716 -1172120 45693 1724144 2471148 2058730 1199799 852249 1231259
14672 1231259 1517508 1187503 1100109 2150992 3567488 4120597 4285654 5118008 5593208
14663 5593208 3737015 343594 -1339656 -187876 1347231 1264860 700390 1224036 2126855
14654 2126855 2265807 2304656 2938511 2840983 853271 -1258201 -891784 1377041 2379628
14645 2379628 612675 -2265896 -4102768 -4443391 -3858693 -2728021 -1223813 425341
14637 425341 1936720 2784316 2349588 862725 -408562 -687589 -679824 -1131132 -1334525
14628 -1334525 -397821 819034 708370 -584363 -1369675 -930715 -122233 530122 1482065
14619 1482065 2512792 2196557 -34249 -2630832 -3845666 -3943195 -4278322 -4842443 -4223602
14610 -4223602 -2018120 109635 458944 -518756 -1067615 -665126 -368911 -593160 -230031
14601 -230031 1022679 991764 -2307074 -6982247 -8614682 -5631532 -1275389 553248 -451073
14592 -451073 -1981825 -2544080 -2208447 -1199479 318902 1555218 1805196 1646996 2165999
14583 2165999 3200028 3491846 2462292 886613 -105856 -48703 582417 658817 -447469
14574 -447469 -1621950 -994711 1179187 2106351 186681 -2352406 -2457979 -661683 -55039
14565 -55039 -1551552 -2930987 -2625374 -1681631 -1223882 -479790 1294271 2876362 2803492
14556 2803492 1788252 1669584 2605567 2927549 1701492 153746 168351 2040498 4201962
14547 4201962 5052597 4696037 4511287 5083547 5295615 3976266 1775709 447625 584531
14538 584531 1100110 898337 75207 -633993 -738839 -172690 690609 1109706 707233 92231
14528 92231 111118 686159 1176484 1528979 1946814 1710313 -116368 -2612479 -3262934 -1060440
14518 -1060440 1913272 3008137 2197688 1601667 2322764 3032817 1953672 -564900 -2163254
14509 -2163254 -1201875 1169733 2288088 1190789 -326709 -133076 1772867 3851381
14501 3851381 5007902 4950810 3551461 1289491 -333896 -384646 -15176 -796542 -2035998
14492 -2035998 -1715860 103014 1046048 -75490 -1654666 -1912229 -1246530 -945702 -1083208
14483 -1083208 -843179 104188 1418856 2413219 2094623 4410 -2557290 -3427740 -2197016
14474 -2197016 -608423 61156 390744 953839 918701 -324336 -1671102 -1772963 -836163
14465 -836163 185200 1061140 1875998 2252750 1981058 1340707 80126 -2449808 -5329404
14456 -5329404 -6125668 -4207185 -2139548 -2209055 -3429791 -3816859 -3593211 -3741156 -3278769
14447 -3278769 -1059202 1055564 288706 -2345329 -2859393 89845 3537258 4622043
14439 4622043 3782503 2768830 2084751 1533057 1224068 923043 611 -1220162 -1620356
14430 -1620356 -1217651 -1136367 -1260357 -76663 2416986 3909012 3049612 1544840 1638740
14421 1638740 3201583 4605161 4876499 3748145 1275163 -1235753 -1666577 3286
14413 3286 1002566 -272907 -1530273 -150766 2206113 1602401 -2434588 -6277227 -7162776
14404 -7162776 -5914201 -4427830 -3227571 -2376402 -2418431 -3127339 -3128860 -2050366 -1494347
14395 -1494347 -2487966 -3317870 -1618784 2152808 5028417 5077838 3218519 1433564 514354
14386 514354 94158 -55498 262983 883439 1069855 478156 -140484 187591 1192724
14377 1192724 1471039 267372 -1495408 -2357317 -1916706 -858592 -79184 -391744 -2282401
14368 -2282401 -4935373 -6169763 -4692232 -2058796 -950232 -1662301 -1940647 -431220
14360 -431220 1529577 2238941 2065525 2402863 3386288 3957274 3502384 2355639 1193436
14351 1193436 718235 1259673 1912793 947273 -1897976 -4354666 -4100593 -1663435 434279
14342 434279 867659 408450 33486 -242706 -621948 -1028246 -1558168 -2291726 -2597875 -1760795
14332 -1760795 -273046 715756 1148622 1812027 2389569 1625490 -136062 -542588 1567251
14323 1567251 4146850 4499537 2719369 1172346 1331279 2466337 2990011 1964270 -345989
14314 -345989 -2458259 -2611266 -618463 1591663 2061047 912946 -439213 -1484379 -2751932
14305 -2751932 -4106958 -4355704 -2893957 -817481 162735 -403491 -1263711 -988952 135951
14296 135951 298910 -1215021 -2355659 -762778 2457798 3618692 1564263 -574383
14288 -574383 -15777 1758070 1868073 664856 553763 1645714 1954387 1290213 1479094
14279 1479094 2611134 2461200 412800 -1108746 -361392 1191978 1548868 1046967 940163
14270 940163 1088196 829170 502796 399817 -248734 -1459854 -1243967 1664761 5022733
14261 5022733 5467091 3064643 1044785 1168946 1843605 1348140 630010 1444783 3123377
14252 3123377 3082419 386734 -2742814 -3677802 -2714481 -2397150 -3693346 -4491795 -2767498
14243 -2767498 230332 1665386 1060067 369335 508249 369862 -408387 -407588 821834
14234 821834 1474563 462061 -606474 -275451 98765 -1059387 -2185678 -849750 1808356
14225 1808356 2290128 36090 -1833567 -1452454 -684312 -1517552 -2778133 -2349576 -727675
14216 -727675 -145321 -1173037 -2239242 -2143100 -1260729 -215755 1058855 2402609 2795744
14207 2795744 1594478 -224227 -1040070 -584336 2649 75844 271924 978346 1283296
14198 1283296 477771 -408847 361 1185397 1501835 737786 44759 -460443 -1877655
14189 -1877655 -4075067 -5214463 -4321576 -2398893 -460363 1429649 2629293 1990550
14181 1990550 391271 428182 2268031 2826197 876385 -412579 1262571 3004347 1498244
14172 1498244 -873553 285860 3536889 3186410 -1762757 -5986175 -5898072 -3957283 -3258316
14163 -3258316 -2847920 -1175625 -19479 -1389261 -3368022 -2656825 470188 2905447
14155 2905447 3253682 2904350 3292884 4391952 5483525 5663676 4101776 1289096 -631478
14146 -631478 -202621 1364043 1863670 956395 -72156 -612992 -1138607 -1734983 -1803539
14137 -1803539 -1168627 -329975 293891 488113 -99569 -1517903 -3016439 -3833764 -4155152
14128 -4155152 -4444009 -4217177 -2588579 -12500 1553721 706424 -1629690 -2957737 -1776871
14119 -1776871 864470 2680064 2839115 2625642 3288795 4391756 5011988 5270087 5308498
14110 5308498 3999671 694082 -2607201 -3255109 -1721340 -774739 -1021951 -195541 2672781
14101 2672781 5353529 5699594 4135625 1754853 -1283568 -3948272 -3730270 -55303
14093 -55303 3794022 4349431 1928002 -800928 -2337750 -2585380 -1537000 95727 620936
14084 620936 -218814 -279638 1584824 3229491 2638927 1412318 1950484 3246822 2908135
14075 2908135 1666033 1999688 3363166 2864555 310149 -1376654 -954902 -472080 -1489376
14066 -1489376 -2831130 -2864475 -1516698 426165 1836358 1201968 -1492579 -3324291 -1741534
14057 -1741534 1310563 1975230 479648 230707 1207841 -359622 -4646919 -6239143 -2179109
14048 -2179109 2936588 3590088 1036354 130809 1663675 2614169 2030314 1880091 2886190
14039 2886190 3691950 3938493 4585647 5142342 3783709 570785 -2088471 -2543378 -1330592
14030 -1330592 467390 2099934 2489431 1047564 -700625 -502070 1411508 2580339
14022 2580339 1928015 886575 578596 203213 -996755 -2214814 -2527064 -2197997 -1642804
14013 -1642804 -631731 575108 792214 -366405 -1583395 -1607447 -761754 154833 1164404
14004 1164404 2275637 2652307 1928983 1273571 1659590 1953118 416983 -2373508 -3915848
13995 -3915848 -3092207 -1466133 -877725 -1145670 -931441 92643 906857 567000 -744308
13986 -744308 -1891196 -1585930 635470 3713959 5656173 5453940 4187947 3514526 3348430
13977 3348430 2204971 -95616 -1612623 -1011187 303611 264481 -706537 -644120 449305
13968 449305 587300 -482406 -324893 2185318 4451018 3849873 1908222 2060876 4393876
13959 4393876 5646625 4181110 1991853 1298878 1788764 2227774 2516284 2724660 1926469
13950 1926469 -302004 -2453539 -2804271 -1760322 -1092770 -1497820 -2243872 -2694439 -2837426
13941 -2837426 -2609409 -1903948 -1093348 -525995 311457 2135004 4473401 5876365 5535435
13932 5535435 3967964 2136564 573250 -631140 -1490272 -1756230 -777677 1632853 3874628
13923 3874628 3295382 -626857 -4778865 -5594881 -3140834 -424908 794139 1439591 2463951
13914 2463951 3112881 2550185 1289647 36694 -1277899 -2294274 -1668363 909887 3419198
13905 3419198 3726941 2212281 849519 549910 783834 1007800 933656 33874 -1610141
13896 -1610141 -2426577 -938477 2064527 4484684 5686986 6520411 6815447 5163260 1784586
13887 1784586 -485773 600808 3849031 6265109 6629380 6103948 5838849 5413803 3901606
13878 3901606 1626178 223336 877464 2759547 3744252 2891598 1515256 1139736 1207534
13869 1207534 96774 -2067224 -3306043 -2577686 -1040346 -122399 140599 245462 180505
13860 180505 45784 354401 841797 361853 -989489 -1140395 1072164 3564532 3470083
13851 3470083 1162146 -246280 823356 2647603 2968703 1745950 388069 -457581
13843 -457581 -1279507 -2456055 -3588053 -4102692 -4014815 -3759560 -3298010 -1859538 851546
13834 851546 3432828 3772968 1548429 -1178090 -2297547 -1727949 -710491 -110499 -158764
13825 -158764 -876035 -1833758 -2292044 -2306225 -2723604 -3448824 -3177476 -1844295 -1521554 -3240690
13815 -3240690 -4740719 -3674954 -1464260 -1060390 -2048871 -1404234 1403788 3753469 4425338
13806 4425338 4943625 5562497 3943168 -301155 -3381085 -2410938 101044 3472 -2315479
13797 -2315479 -2918063 -329193 2746987 3401580 1515240 -1149309 -2620949 -1602600
13789 -1602600 1284095 3285396 2442905 380636 86875 1402468 1420767 -612854 -1928534
13780 -1928534 -715118 937548 387695 -1508809 -1955484 -369461 1340495 1846089 1528854
13771 1528854 794756 -702657 -2828899 -4444010 -4606944 -3396069 -1392497 700131
13763 700131 1882547 1495057 363666 231443 1587644 3092995 3684550 4023590 4875990
13754 4875990 5227230 3638419 921156 -401172 545753 1828063 1470583 -84814 -1203270
13745 -1203270 -1494355 -1734527 -2157346 -2257399 -1975876 -1785023 -1673187 -1202414 -590865
13736 -590865 -595449 -1146979 -1216602 -401060 392519 398963 238338 919109 2139269 2424177
13726 2424177 910782 -1467258 -2689261 -1570865 871430 2172798 940093 -1587461
13718 -1587461 -3054567 -2782141 -2159366 -2378764 -2968547 -2920215 -2212733 -1558994 -1326072
13709 -1326072 -1296275 -1036602 -142530 1425118 3053747 4031029 4347184 4258261 3355767
13700 3355767 1313187 -612785 -585258 1013855 1747468 802726 371929 2074450 4134142
13691 4134142 4069157 2391893 1265805 969310 454411 251599 1524319 2770422 1155000
13682 1155000 -2513630 -3887725 -1431516 897631 -440312 -3075748 -2427602 1145960
13674 1145960 2820707 383474 -2919748 -3312184 -1135638 970901 2140724 3270270
13666 3270270 4280038 3913502 2135759 620915 311872 153297 -871358 -1913251 -1851813
13657 -1851813 -1550646 -2521993 -3849867 -2870455 662334 3467417 2972941 577432 -971962
13648 -971962 -1445125 -1978536 -1769352 716510 3898338 4172342 1356476 -421714 1426479
13639 1426479 4303524 4485839 2137617 -47708 -938305 -1010749 -173375 1409728 1692421
13630 1692421 -711437 -3198804 -2034207 1607290 2326074 -1926576 -6645480 -6965169
13622 -6965169 -3950002 -2128553 -3051405 -4407391 -4314027 -3278965 -2035426 -265838 1791521
13613 1791521 2605101 1444631 -84120 131033 1988151 3399440 3039224 1871734 1653588
13604 1653588 2604270 3264030 2520329 1003782 153580 538625 1672575 2890364 3539782
13595 3539782 2837649 821120 -761392 -35879 2310099 3486475 2260383 536616
13587 536616 405258 1260625 1278225 393428 -31373 339744 637218 686518 1243670 2308558
13577 2308558 2770408 1982385 543593 -571279 -698875 468537 2382117 3452122 2647707
13568 2647707 1047715 486761 1022867 1301187 1012776 1009776 1146204 305134 -1168163
13559 -1168163 -1451882 -295580 314282 -508977 -1004906 -2446 637184 -1127311 -4001642
13550 -4001642 -4984518 -3386025 -1154060 -11001 -83469 -689458 -907736 -59533 1095218
13541 1095218 699899 -1368313 -2555761 -1293651 164996 -919694 -3159894 -2993571
13533 -2993571 -361427 1160952 -155092 -2083792 -2393332 -1636039 -916584 178843 1866209
13524 1866209 2717070 1591003 -681773 -2775933 -4370744 -5223562 -4692364 -3296514 -2717930
13515 -2717930 -2973339 -1786932 1565361 4070846 2988260 219089 -127422 2564381
13507 2564381 5005525 4827103 3083919 1791757 1358795 1143677 805554 272682 -489127
13498 -489127 -1048329 -654675 769172 2368118 3274711 3321009 2861860 2338278 1873264
13489 1873264 981712 -859685 -2953542 -3477523 -1637442 977353 2165679 1625302 629074
13480 629074 -159383 -1144739 -2378265 -3146268 -3125691 -2842048 -2770882 -2786776 -2547200 -1756097
13470 -1756097 -263808 1331903 1590481 -204818 -2673056 -3720539 -3132004 -2473366 -2429240
13461 -2429240 -1758804 580901 3503260 4827475 3640520 1059504 -989977 -1471737
13453 -1471737 -1019772 -1069752 -1995504 -2559485 -1797511 -721879 -904148 -1850625 -1543645
13444 -1543645 284844 1269094 -432503 -3563114 -5367580 -4660646 -2299189 366232
13436 366232 2284083 2722228 1871743 1091401 1382183 1841731 711106 -2231507 -5439814
13427 -5439814 -7643203 -8839258 -9093470 -7802716 -4958698 -2088825 -802403 -891792 -909540
13418 -909540 -351709 -165534 -1018954 -2110508 -2171653 -986287 571625 1545409 1529781
13409 1529781 744644 -80336 -250282 106961 199367 -226892 -546881 -572413 -1227612 -2930570
13399 -2930570 -4203654 -3395942 -1269824 -93509 -265950 173808 2236982 4167540 4001491
13390 4001491 2361919 1286162 1336746 1351451 462870 -913960 -1801459 -1491560 -72120
13381 -72120 1236917 1000571 -476942 -1148056 -180820 330870 -1724408 -4847417 -5449459
13372 -5449459 -2738702 228778 767857 -342506 -966864 -916687 -1454590 -2585270 -2813711
13363 -2813711 -1543109 -116213 105030 -366994 -75395 1126300 1897914 1512168 924348
13354 924348 1113905 1409421 626451 -863977 -1736585 -1969731 -2641564 -3495079 -2902907
13345 -2902907 -840441 402039 -333570 -1133027 -252393 802185 -145706 -1972407 -1879282
13336 -1879282 -24637 737717 -470873 -1424777 -787366 -73447 -505347 -786133 221570
13327 221570 940756 -529446 -3032871 -3753792 -2177005 -437877 -10858 -78281 565332
13318 565332 1675737 2324253 2404852 2560714 3139090 3845008 4168917 3728243 2435518
13309 2435518 825057 81037 1073668 3118586 4265773 3350316 1382418 290015 640657
13300 640657 1416251 1696002 1418655 654076 -411446 -639384 1182164 4067194 5235256
13291 5235256 3701999 1626355 852348 199446 -1832514 -3636027 -2656136 198349 1535841
13282 1535841 549725 -89598 1201563 2463937 1447924 -1023075 -2449537 -1898565 -519064
13273 -519064 224989 -139445 -980027 -1314226 -1100516 -1452521 -2730631 -3242281 -1475262
13264 -1475262 1105573 1746887 524444 138576 1550844 2783974 2718742 3010712 4841199
13255 4841199 6542146 6349411 5207250 4744467 4443475 3097573 1454521 984907 1193582
13246 1193582 520442 -917383 -1731571 -1815734 -2313696 -3298383 -3444759 -2055609 88567
13237 88567 1856119 2539577 1849677 399434 -248305 620020 1480227 436563 -2012841
13228 -2012841 -3752170 -4177783 -4520534 -5062019 -4342642 -1931577 43539 -408032 -2240775
13219 -2240775 -2826458 -1593993 -488769 -887313 -1749054 -1512591 -529572 -326663 -1085256
13210 -1085256 -1452346 -951870 -920862 -2162696 -3034868 -1397541 2234959 5096870 5444077
13201 5444077 3886398 1594680 -1041245 -3571948 -4934642 -4627197 -3474412 -2602570
13193 -2602570 -2413552 -2838893 -3586703 -3794191 -2526824 -94089 2081187 3228988 3830912
13184 3830912 4218795 3871213 2583050 1078791 -119147 -1243259 -2140288 -1867266 -211738
13175 -211738 1488273 1856261 934930 -430865 -1685096 -2484238 -2533444 -2079804 -1737967
13166 -1737967 -1517835 -926757 -58499 592379 1234821 2131742 2088185 -256579 -3539011
13157 -3539011 -4603193 -2900989 -1348534 -1840990 -2621346 -1579540 385566 1214061 784645
13148 784645 202300 -222224 -437959 229189 1701511 2527531 2159119 1999643 2716843
13139 2716843 2784475 1496916 917606 2496239 4171628 3560888 1785951 1146067 1137686
13130 1137686 147672 -843248 -33509 1238685 335455 -1880417 -2177443 -346661 652207
13121 652207 -97482 -145162 1846418 3875045 3818297 1968775 -452665 -2675705 -3599875
13112 -3599875 -2233725 233665 1019931 -810560 -3296212 -4320242 -3619998 -1999024
13104 -1999024 -434376 59137 -492133 -389972 1414036 3128839 2548591 677985 60040
13095 60040 407104 -640475 -2962855 -4022695 -3405236 -3296827 -4046067 -3281425 -290130
13086 -290130 2601882 4068042 5368651 6720021 6119559 3515974 2198633 3741254
13078 3741254 5126135 3522338 757763 153428 1579795 2657320 2756460 2889569 3167878
13069 3167878 2896120 2059390 887210 -784620 -2394804 -2621590 -1648562 -1356895 -2106650
13060 -2106650 -1907013 -129888 1020594 552756 789896 2916434 3902875 1280005 -2081948
13051 -2081948 -2044307 328968 810889 -1120631 -2084955 -712220 684614 411728 -445933
13042 -445933 -589011 -76039 1029607 2808743 4061909 3320024 1350787 161159 -297453
13033 -297453 -1601824 -3197184 -2623409 49071 1370227 -539007 -3010889 -2663499 -105455
13024 -105455 1287524 63843 -1823691 -1904900 -171412 1125645 205655 -2078251 -3230441
13015 -3230441 -2268884 -887828 -914581 -1893578 -2365916 -2256427 -2270890 -1989264 -662133
13006 -662133 809224 928853 180076 246392 1021303 938563 144273 422548 1544891 835080
12996 835080 -2321403 -4390639 -2244786 2264300 4772847 4150145 3094819 3413190 3444248
12987 3444248 1075196 -2569024 -4129675 -2165045 1189779 2985232 2689737 1788603
12979 1788603 1067816 -53398 -1542719 -1996546 -767634 561765 128475 -1672569 -2806102
12970 -2806102 -2067635 123290 2640242 4249979 4095875 2786402 2215809 3104976 3705420
12961 3705420 2364549 217193 -562425 -117524 -136945 -451262 792537 3585855 5495265
12952 5495265 5247334 4383477 4365472 4231497 2493681 -286344 -2270058 -2633870 -1945752
12943 -1945752 -1053004 -483175 -345230 -258357 109988 350823 -30867 -421586 168383 1215946
12933 1215946 1114727 -281752 -1290772 -1099544 -1024870 -2167087 -3478238 -3428013 -2295429
12924 -2295429 -1462175 -1362162 -1325628 -716270 713436 2753621 4167181 3266416 180973
12915 180973 -2461098 -2426960 -579762 719653 1031131 1817358 3467753 4475291 3941840
12906 3941840 3086847 3344745 4195794 3993263 2274204 231406 -819440 -611553 300363
12897 300363 1155956 1287047 504647 -471083 -491582 611303 1450277 575251 -1543129
12888 -1543129 -2725293 -1516919 1085060 2683837 1993176 35197 -1044196 -260074
12880 -260074 1086219 828248 -1348878 -3292652 -3181373 -2103268 -2407296 -4048110 -4672509
12871 -4672509 -3428080 -2264509 -2610079 -3171063 -2540982 -1778813 -2329139 -3267807 -3090254
12862 -3090254 -2685949 -3663798 -4842989 -3674640 -737449 519450 -1158631 -3044116
12854 -3044116 -2503298 -308785 1103777 586955 -1384877 -3458013 -3804752 -1672754 945027
12845 945027 1241239 -358937 -551190 1706241 3246845 1382536 -2102283 -3711527 -2873296
12836 -2873296 -1551167 -894540 -611986 -497244 -453448 85200 1001765 852488 -948505
12827 -948505 -2635086 -2655075 -2216953 -2968520 -3654932 -2088762 543504 778863 -1878115
12818 -1878115 -4128692 -3701011 -1866607 -343379 1200225 3060860 3664900 1940412
12810 1940412 -405352 -1131499 -560938 -359463 -460509 421541 1922327 2197600 984361
12801 984361 217833 1061907 2293208 2555667 2496336 3226050 3876576 2555999 -607595
12792 -607595 -3094718 -2960772 -919073 950290 1433171 536368 -1212338 -2737544 -2541297
12783 -2541297 -275814 2154200 2496655 1121513 595344 2014669 3374263 2431602 -198252
12774 -198252 -2078851 -2046643 -748733 1192900 3683911 5900944 6410518 5137604 3750367
12765 3750367 3274036 2619578 603696 -1681643 -2105530 -559767 907877 959748 290154
12756 290154 -207088 -793782 -1527064 -1240008 574367 2118600 1480138 -338350 -825938
12747 -825938 -3895 -359296 -2378007 -3115016 -729372 2126065 1856133 -886998 -2388488
12738 -2388488 -1314917 -8963 -453656 -1777305 -2436711 -2507112 -2662614 -2681781 -2288699
12729 -2288699 -2197683 -2980437 -3695467 -2855446 -416206 2003498 2710721 1397684 -624448
12720 -624448 -1440105 -250609 1742963 2594283 1683862 -3548 -1359702 -1981120 -1736059
12711 -1736059 -676298 589742 1505564 2456698 3865471 4702600 3651655 1761334 1793253
12702 1793253 4273773 6213869 4839275 908102 -2798935 -4639109 -4498323 -2705019
12694 -2705019 -226553 1305478 1388632 1415077 2260079 2511743 902671 -925725 -525851
12685 -525851 1379124 1710180 -436916 -2720046 -3264279 -2931491 -3094800 -3383572 -3007670
12676 -3007670 -2740871 -3934661 -6228047 -7543769 -6310001 -3120166 -279388 201640
12668 201640 -1466083 -2974237 -2519175 -1029626 -788195 -1950458 -2016021 522833 3433179
12659 3433179 3157462 -569582 -4119888 -4259291 -1790367 -84125 -713347 -1838331 -1086743
12650 -1086743 1193106 2589003 1966663 772076 806945 1974847 2982761 3335975 3522931
12641 3522931 3654633 3113717 1719973 439021 497928 2034092 3849636 4547036 3938767
12632 3938767 3136947 2945414 2531818 571538 -2376453 -3929839 -2863319 -850319 -278821
12623 -278821 -1267709 -2072552 -1816832 -1389292 -1752631 -2631464 -3132840 -2793591 -1696311
12614 -1696311 -110564 1676201 3358179 4493551 4476262 3100225 1244222 255823 333892
12605 333892 376897 -124042 -175850 900388 1960920 1714705 955718 1393274 2797828
12596 2797828 3239717 2143703 1215325 1834438 3102901 3319730 2306811 1373082 1574409
12587 1574409 2672244 3482917 2953817 1272128 17071 669151 2802548 4310649 3677113
12578 3677113 1590632 56234 206165 1229791 1396437 30483 -1731108 -2391455 -1923739
12569 -1923739 -1337873 -712627 808790 2735227 2870432 504235 -1709623 -964150 1775420
12560 1775420 3186044 2110599 338915 -637700 -1071361 -1143759 -348259 741918 529590
12551 529590 -829419 -922234 1367034 3729599 3424646 892262 -1255887 -1669075 -1010224
12542 -1010224 -180243 436276 354496 -777499 -2258041 -2728552 -1618247 447912 2532082
12533 2532082 4019978 4543654 3978085 2632885 1100369 -173990 -1122569 -1937989 -2621309
12524 -2621309 -2530145 -872565 1844191 3554310 2883027 1109072 446891 763103 -96916
12515 -96916 -2671384 -4768666 -4661315 -3293460 -2196566 -1192838 245204 1052561 20838
12506 20838 -1892872 -2727707 -2356659 -2317202 -3218343 -4081435 -4109083 -3492756 -2407048 -649089
12496 -649089 1422609 2680913 2358825 862423 -520498 -384800 1732097 4363753 4917027
12487 4917027 2529667 -399500 -681678 2024722 5090098 5986472 4382807 1680783
12479 1680783 -212905 39589 2037513 3704920 3626282 2899775 3402712 4830283 5198076
12470 5198076 3900980 2244689 999587 -359024 -1648838 -1561731 -141130 464024 -933939
12461 -933939 -2506255 -1983450 154437 1788450 2313289 2730292 3256670 2871422 1242713
12452 1242713 -540758 -1481178 -1723289 -1793173 -1773356 -1597439 -1413809 -1304169 -1160950 -1043826
12442 -1043826 -1173010 -1416384 -1244760 -363768 962507 2260923 3101477 2983580 1571920
12433 1571920 -637878 -2313569 -2394425 -1077638 558066 1704663 2239727 2194675 1504915
12424 1504915 569757 442038 1717486 3420787 3822320 2519969 975308 699683 1670190
12415 1670190 2951670 3955158 4283855 3242821 795500 -1494257 -1917302 -884923
12407 -884923 -368703 -1091909 -1781109 -1475190 -998833 -1432994 -2421262 -2868108 -2328874 -969227
12397 -969227 864866 2335968 2481417 1703429 1709202 2992449 3691812 2310748 310311
12388 310311 166306 1734499 2640225 1863433 783418 629032 960780 1126412 1388624
12379 1388624 1887205 1999954 1548738 1393793 2064952 2920019 3339314 3564418 3588769 2531930
12369 2531930 249118 -1575461 -1375945 18246 546825 -141892 -529422 141616 797098
12360 797098 541622 261612 1275255 3345471 5132697 6036149 6352709 5846050 3675769
12351 3675769 283563 -1991003 -1464889 375875 424047 -2066681 -4553136 -4612857 -2826353
12342 -2826353 -1477173 -1637952 -2604822 -3196626 -2433697 171869 3692840 5915222 5695128
12333 5695128 4375407 3501491 2312012 -469797 -3416026 -3756852 -1624374 9861
12325 9861 -166554 -377833 532630 1104257 278741 -519450 -148184 26614 -1156501 -2065396
12315 -2065396 -936950 838910 900989 -165134 -68908 1140389 1387826 379501 62985
12306 62985 1282134 2624200 2870496 2362856 1697333 1090037 1189189 2489611 3741850
12297 3741850 2973298 448603 -1293927 -817811 543619 898332 82542 -853531 -1154286
12288 -1154286 -814946 -397964 -510020 -816345 -174238 1308485 1515424 -753709 -3388615
12279 -3388615 -3746186 -2585576 -2374710 -2774682 -1503852 747413 564544 -2385374 -3999386
12270 -3999386 -1734068 1742252 2862445 1828518 686397 -313975 -1760549 -2767898
12262 -2767898 -2301002 -1199911 -724206 -579590 -144856 50091 -299775 -342370 -79565
12253 -79565 -1054849 -3285479 -4060139 -1952544 570674 1016941 619360 1306327 1733121
12244 1733121 41983 -1810933 -784216 1869760 2403371 653715 -139785 1044610
12236 1044610 2034909 1874288 1738364 1273517 -1438739 -5437416 -6713806 -3895663 -343809
12227 -343809 956724 1067071 1889009 2635712 1801736 71551 -1004012 -1309572 -1370472
12218 -1370472 -1110885 -913146 -1934848 -3820546 -4121401 -1747316 865568 936754 -903616
12209 -903616 -1997019 -1495847 -822606 -1108867 -1932907 -2255779 -1483159 81719 1334548
12200 1334548 1575385 1694547 2895316 4228938 3352067 180953 -2457043 -2749856 -2206423
12191 -2206423 -2726742 -3619554 -3341280 -2288518 -1806325 -1906343 -1937208 -2172215 -2777152
12182 -2777152 -2527060 -677100 1039979 535690 -1445470 -2576218 -2613810 -3241120 -4542011
12173 -4542011 -4326195 -1466012 2246302 4380808 4425098 3326281 1899433 665957 251223
12164 251223 755971 1089860 -48090 -2340994 -3695258 -2500579 238906 1932430 1691103
12155 1691103 1342155 2390349 3444503 2389001 -68578 -1475176 -1562030 -2102637 -3003718
12146 -3003718 -2108929 390182 1225246 -522724 -1082046 2122202 5636438 4835476 1084050
12137 1084050 -370891 1802734 3919048 3471708 1919044 838549 -498109 -2363472
12129 -2363472 -2857015 -834138 1919519 3169181 2954828 2391132 1579206 270343 -885331
12120 -885331 -1311661 -1626067 -2456766 -3080277 -2446415 -804992 716181 1503080 1621519
12111 1621519 1327390 1178574 1866705 3140293 3671543 2894728 2234349 3337321 5474150
12102 5474150 5981186 3511321 -61417 -1554282 59852 2701090 3780933 3144080
12094 3144080 2739983 3653442 4644486 4053986 2017199 -114116 -1606881 -2423996 -2255570
12085 -2255570 -985677 263033 116301 -1065583 -1595182 -903281 -220979 -673792 -2022177
12076 -2022177 -3555073 -4946919 -5824572 -5638644 -4468075 -3075444 -1868670 -665581
12068 -665581 408147 839715 721303 747852 1014111 847060 -20586 -1158987 -2326333
12059 -2326333 -3459579 -3907904 -3149035 -2137470 -2132408 -2276752 -682869 1822138 1944981
12050 1944981 -1005190 -3313409 -2078551 522274 853935 -701773 -1317931 -983453 -2022331
12041 -2022331 -4014286 -3614373 -78861 3002652 2926033 1351396 658943 104014 -1640327
12032 -1640327 -2840290 -1267634 1203595 648986 -2600047 -3740947 -470757 3439721
12024 3439721 3520484 765570 -337257 1741527 4166834 4247694 2430130 396047 -1297945
12015 -1297945 -2566614 -2715154 -1567889 -437326 -378794 -365697 1055717 2866149 2449735
12006 2449735 -428194 -2632600 -1709941 717850 1260100 -558717 -1965265 -1071365 810428
11997 810428 1665641 1714542 2346100 3283970 2759987 286088 -2470515 -3834516 -3710500
11988 -3710500 -2653384 -860575 1125821 2090767 1696522 1324712 2116969 3131658 2937543
11979 2937543 2157667 2483668 3642948 3620637 2031035 950965 1657331 2669398 2270137
11970 2270137 1123651 735456 807584 186849 -500594 493272 2903254 4214101 3172982
11961 3172982 1776370 2635713 5500114 7749992 7828470 6738819 5991616 5465586 4262759
11952 4262759 2741539 2098351 2112664 1173214 -905847 -2059131 -1237907 -564316 -2108907
11943 -2108907 -4187169 -3818571 -1744104 -1283335 -2513666 -1912014 1375635 3442255 1882784
11934 1882784 -115120 860529 2711690 1645425 -1168493 -1687979 64924 456361 -1092103
11925 -1092103 -1278898 877480 2212017 1113881 265732 1550481 2492027 665060 -1859659
11916 -1859659 -1863265 -140563 204587 -1279621 -2661549 -3498319 -4764901 -5520171 -3354852
11907 -3354852 1383397 4903530 4567533 1889541 -155819 -845326 -1301424 -1880666 -1803934
11898 -1803934 -860860 94589 482997 742017 1293154 1501958 459170 -1339884 -1950047
11889 -1950047 -147739 2771154 4126256 2775906 196734 -1528698 -2027074 -2403123
11881 -2403123 -3317165 -4248110 -4642442 -4839809 -5233614 -5045929 -3009216 540822 3350990
11872 3350990 3888409 3397125 3882194 4687173 3338155 1430 -1634405 593835 3781429
11863 3781429 3851045 1239202 -294017 495318 1129378 24331 -1100050 -413974 1226292
11854 1226292 2151550 2392345 2721607 2859875 2281786 1658067 2029739 3257642 4264874
11845 4264874 4162136 2654539 332551 -1141485 -576742 605055 -406950 -3673039
11837 -3673039 -5593750 -3441762 1005659 3939810 4021640 2671510 1350988 629211 914900
11828 914900 2019337 2592611 1754033 674174 927313 2042599 2428057 1905342 1333131
11819 1333131 430291 -1680101 -4031626 -4352845 -2345068 -357837 -320666 -1796510 -3551724
11810 -3551724 -5212021 -6511797 -6442015 -4322969 -963396 1962039 3177965 2349940 302590
11801 302590 -1131642 -554717 1365559 2612888 2323118 1499792 1114209 879327 398976
11792 398976 157926 517632 817683 443654 -18958 376332 1555148 2680325 3242299
11783 3242299 3180926 2510149 1585632 1187352 1509147 1572773 549388 -799547 -1087209
11774 -1087209 -449208 -492418 -1963362 -3610391 -3838304 -2576861 -817252 1004842 3173121
11765 3173121 5411182 6401714 5047044 1899857 -1056551 -2155473 -1548826 -898083 -1476361
11756 -1476361 -2725952 -3079150 -2132653 -1200011 -1273275 -1368734 -50086 1956266 2337897
11747 2337897 566045 -1010822 -262334 1968809 3404605 3441408 3162849 3015168 2234735
11738 2234735 423404 -1753363 -3406929 -3830361 -2420746 405390 2560454 2227282
11730 2227282 347620 -544722 133999 690054 473660 1023002 3018461 4483120 3567154
11721 3567154 1304176 -87796 -196968 -12391 248401 1141593 2663584 4384038 6092465
11712 6092465 7121499 6266111 3867285 2562033 3959577 5837326 5114659 2667323
11704 2667323 2177732 4403594 5829385 3838321 347516 -1356562 -1233880 -1708956 -3413449
11695 -3413449 -4138830 -2260721 526255 1028399 -1370257 -3592120 -2367673 1795687
11687 1795687 5223247 5495458 3799076 2424357 1654857 540721 -541258 -99950 2113217
11678 2113217 4623716 5931422 5389538 2924355 -441014 -2171317 -359536 3529409
11670 3529409 5827764 4918914 2751420 1834555 2430944 3263056 3370048 2471337 824148
11661 824148 -499527 -310362 1122586 2273966 2493984 2543645 2575868 1386870 -1288047
11652 -1288047 -3385427 -2923904 -659581 1160211 1767862 2009224 2174344 1476272 -302809
11643 -302809 -2027970 -2421727 -1335172 287064 1255474 1162324 993718 2230133 4730263
11634 4730263 6166385 4557680 904837 -1880600 -2443594 -2046708 -2079645 -2043174 -874170
11625 -874170 804961 1124076 -580393 -2926022 -4333370 -4755207 -4997741 -5121305 -4554267
11616 -4554267 -3479399 -2863917 -2877394 -2429509 -884661 757640 1239978 753556 257703
11607 257703 -96912 -556754 -441425 1089588 3177204 3932613 3116185 2467782 3036311
11598 3036311 3927065 4308570 4817252 5856953 6168061 4681712 2613402 1943561 2544409
11589 2544409 2602507 1545276 754713 1231698 2100559 1983704 819019 -288371 -429097
11580 -429097 267864 770311 67663 -1572397 -2411423 -1058074 1534999 2828871 1729616
11571 1729616 -81943 -445666 505893 908135 65766 -574678 253934 1455805 803988
11562 803988 -1971130 -4503760 -4575353 -2719265 -1306499 -1514285 -2161297 -1575156 264896
11553 264896 1925345 2375222 1991059 1638511 1220418 -245186 -2838150 -4618985 -3365813
11544 -3365813 412820 3370385 3004529 503354 -1163050 -1104453 -862818 -1426359 -1956374
11535 -1956374 -1749630 -1489460 -1678951 -1451358 -108435 1431283 2024762 2140582 2902377
11526 2902377 4054333 4384243 3731585 3067818 2736422 2111090 1216563 1325302 3231946
11517 3231946 5678972 6254175 3830505 -38958 -2263271 -1191679 1368877 1874557
11509 1874557 -687923 -3301074 -2862827 -606675 -495017 -3470040 -5878749 -4532290
11501 -4532290 -1043063 728493 -16857 -669411 468715 2095117 2524340 2150023 2136038
11492 2136038 2273955 1713221 846307 747254 1143884 675681 -735975 -1401174 -263956
11483 -263956 1645847 2978220 3913571 4969944 5113107 2961341 -527276 -2591701 -2185795
11474 -2185795 -1180004 -1408576 -2235478 -2194173 -1533912 -1438234 -1687286 -1075269 219152
11465 219152 676312 -41988 -534203 -109923 108408 -514945 -588098 933854 2316317
11456 2316317 1212506 -1488038 -2446307 -516402 1829237 2352367 1978720 2524824 3518920
11447 3518920 3352000 2305487 2074174 2824882 3050205 2328861 1979474 2478467 2316978
11438 2316978 444954 -1809095 -2528625 -1696103 -614089 150851 832055 1170616 611564
11429 611564 -336821 -214619 1640319 4141271 5460949 4732987 2826083 1503837 1526896
11420 1526896 1771088 953126 -126539 408350 2211581 2598021 653897 -820946 718257
11411 718257 3657492 4751715 3939331 3543936 3676054 2084610 -1353350 -3603879 -2916421
11402 -2916421 -1184770 -458800 94236 1827798 3578453 3380774 1659394 377514 31367
11393 31367 -325657 -754386 -281834 1061787 1833983 1033808 -767570 -2235547 -2455204
11384 -2455204 -1519803 -620994 -1172284 -3186731 -5000352 -5160523 -3898664 -2218594 -604304
11375 -604304 563312 596396 -232570 -181739 1671008 3629702 3556278 1944727 958233
11366 958233 1227155 1762747 2391887 3701922 4760263 3719097 1167068 146923 1791628
11357 1791628 3413192 2437479 118823 -574087 820110 2237540 2241087 1111728 -610277
11348 -610277 -2618819 -3915332 -3175179 -542762 2029533 2729088 1613862 206346 -257894
11339 -257894 -97730 -741223 -2697067 -4186319 -2946621 349734 2149215 571164 -1756492
11330 -1756492 -1284920 1394895 2703975 1595352 720254 1701047 2539592 1339257 -159420
11321 -159420 690533 2993068 3614296 2196313 1742614 3763919 5556816 3846638 -468868
11312 -468868 -3097807 -1487591 2276558 4053068 2285469 -698932 -1916503 -1287283
11304 -1287283 -1038515 -2009738 -2319541 -497583 1693588 1400950 -1172543 -2940791 -2192054
11295 -2192054 -479581 296472 558677 1499608 2512309 2009024 13474 -1780528 -2293158
11286 -2293158 -2005191 -1657145 -1234898 -516665 228908 448779 -173114 -1414275 -2422850
11277 -2422850 -2217001 -795708 550193 677659 69353 108989 1052609 1615552 701749
11268 701749 -1198334 -2597263 -2499056 -1129636 380798 898979 242759 -640550 -686613
11259 -686613 177844 1263207 2202957 3133954 3799545 3317759 1327509 -1161470 -2728664
11250 -2728664 -3188394 -3613158 -4584660 -5124707 -4040173 -1970447 -997071 -1893786 -2832336
11241 -2832336 -1716040 1000199 3067062 3482273 3203759 2995948 2424559 1409715 943736
11232 943736 1328099 1259398 -129381 -1634002 -1724958 -789972 -170177 38200 558816 1062069
11222 1062069 494730 -1101514 -2708976 -3961502 -5081333 -5486922 -4230145 -1872895
11214 -1872895 -266580 -165126 -481626 -227950 204894 189226 38471 358696 1081780
11205 1081780 1738781 2109333 2191860 1965460 1435693 681875 -89896 -401366 132863 1057040
11195 1057040 1496949 1716396 2995025 5150028 5816517 3769052 1383230 1496115 3039970
11186 3039970 2698773 286727 -851147 923387 3155696 3212815 1784251 942045 980456
11177 980456 961181 681107 312646 -658220 -2498145 -4135088 -4370338 -3477832 -2545315
11168 -2545315 -1956652 -1434475 -834086 -62831 1078349 2293987 2784948 2388340 1888510
11159 1888510 1734610 1444047 787140 490545 1135866 2300327 3298610 3836244 3595737
11150 3595737 2322972 706304 -36851 174430 257364 -166600 -313310 147773 685628
11141 685628 1355700 2725729 4017869 3591256 1911388 1529391 3035317 3597938 1070385
11132 1070385 -2797063 -4952983 -4645568 -2747407 45555 2265844 1524833 -1963693
11124 -1963693 -3998063 -1636424 2153937 2512537 -417950 -2540214 -2435290 -2444526 -3508461
11115 -3508461 -3609210 -2109462 -1403974 -2726337 -3882494 -3033546 -1685385 -1796765 -2547135
11106 -2547135 -2396343 -2198357 -3487215 -5054356 -4119385 -495406 2822461 3394733 1882789
11097 1882789 500678 285068 532536 252824 -388164 -99847 1947245 4652068 5814048
11088 5814048 4766511 3299017 3199466 3767873 3113940 1458293 1350922 4156079 7833738
11079 7833738 9282649 7933945 5774428 4431829 3770912 3270071 3107778 3277289 2967030
11070 2967030 1790094 689216 588722 870878 275203 -1209476 -2376439 -2290987 -856754
11061 -856754 1513456 3780631 4495756 3329258 1803004 1338816 1376525 786281 65499
11052 65499 191374 281062 -1093674 -2854050 -2516332 -199365 1470824 1708483 2625757
11043 2625757 5115966 6833559 5778695 3263611 1630080 1184936 930892 332174 -995034
11034 -995034 -3289385 -5114425 -4105571 -555947 2193443 2335669 1824823 2412113 2675021
11025 2675021 1398881 704586 2519034 4590013 3805722 1485938 1343135 3485263 4479885
11016 4479885 2757158 214755 -1344052 -1978171 -1797954 -501218 980976 963826 -624061
11007 -624061 -2426941 -3891348 -5097388 -5032395 -2776472 -29547 435425 -1235573 -2328397
10998 -2328397 -1845243 -1428232 -1733759 -1037736 1593482 4437984 5663264 5602864 5350126
10989 5350126 4965289 4269654 3872950 4228518 4752019 4717672 4099159 2988223 1210156
10980 1210156 -891041 -2160004 -1784763 -330450 742190 495791 -474435 -533381 947677
10971 947677 2261268 1297631 -1269371 -2615728 -1934530 -1561150 -2940072 -4148855 -3234468
10962 -3234468 -1521858 -1292898 -2308636 -3041028 -3275361 -2975606 -838209 3061670 5398714
10953 5398714 3742526 578898 -326234 554062 664872 839158 3490110 6683778 5724461
10944 5724461 624761 -3314490 -3020899 -924515 135775 558755 1166561 1073317 143205
10935 143205 -46562 711489 556927 -711258 -727344 1030087 1430119 -1565134 -5272235
10926 -5272235 -5771037 -2960565 -149580 -63131 -2568871 -5120625 -4827766 -1392811 2013913
10917 2013913 2345711 457138 -812740 -1062726 -1653721 -1833100 195823 2850619 2651025
10908 2651025 377383 629290 4167160 5948638 2951574 -851936 -392831 3419857
10900 3419857 5872057 5010691 2943362 2253979 3408594 4708888 3879505 943553 -803518
10891 -803518 994485 3465044 2106701 -2040116 -3704473 -1828806 -866841 -2544553
10883 -2544553 -2673164 1180554 4810971 3988647 990024 290152 1876935 3128519 3738465
10874 3738465 4453800 4019688 1634163 -204109 720658 2390887 1971673 673273 1275142
10865 1275142 3061800 3279065 1857335 846571 596093 21430 -556664 2803 1303500
10856 1303500 2189168 2605115 2648453 1586564 -259439 -979987 -373200 -915244 -3240898
10847 -3240898 -4034616 -1236731 2161434 2868144 2322967 3121545 3853456 2064018 -522165
10838 -522165 -596559 1201151 2087761 2376773 4031890 5741508 4445550 631659 -2452496
10829 -2452496 -3760554 -4350313 -3801090 -1390185 459820 -1103531 -4041777 -3771267 -266603
10820 -266603 2155266 1878613 1696474 3123806 3947815 2538830 382397 -1005921 -2179903
10811 -2179903 -3548771 -4027616 -2982240 -1210052 512194 1799030 1796301 301673 -757653
10802 -757653 415070 2359147 2308947 587125 -53758 1068861 1971476 1589016 799919
10793 799919 115543 -603312 -424269 1582356 3820275 3771625 1857306 694368 873210
10784 873210 627837 -543832 -1138196 -511945 406392 1157859 1839322 1609188 -114139
10775 -114139 -1607937 -935650 695648 779056 -255622 -190615 498625 -588938 -2844426
10766 -2844426 -2696534 958155 4977407 6200647 4496897 1508878 -730733 -207351
10758 -207351 2937803 5082987 3145748 -725150 -1965703 -208156 1035890 554786
10750 554786 526954 1560750 1689275 898960 1663760 3779710 3515773 -233174 -3320231
10741 -3320231 -2192670 1293152 3300288 3153668 2608040 2420833 1990845 848642 -1018531
10732 -1018531 -3043527 -3687728 -1865544 1012614 2438078 2236857 2263666 2880373 2667883
10723 2667883 1716369 1944237 3552046 4273281 3030149 1502771 1123243 1106049 416695
10714 416695 -590298 -1268431 -1404764 -536928 1371663 2630286 1612225 -250293 87444
10705 87444 2844797 5134095 5147588 3893105 2740113 2068022 2458667 4375238 6380298
10696 6380298 6298345 4358851 2805187 2513134 2441192 2092201 1924632 1664290 705027
10687 705027 -305288 -556365 -755041 -1417212 -1121122 864611 2365422 1901800 1865158
10678 1865158 4139658 5552738 2789078 -985566 -544990 2664090 3118667 820773
10670 820773 608860 2727913 2408904 -764822 -1541282 1349712 2416644 -1022951 -4027790
10661 -4027790 -2312994 1235829 2152463 776160 -713497 -2475654 -4460602 -4249620
10653 -4249620 -1054073 1991749 2466382 1860990 1876816 1655522 895786 1410736 3348472
10644 3348472 4148333 3262424 3389608 5131285 5375451 3081398 1444543 1946156 1673494
10635 1673494 -733946 -2037968 -477380 582226 -1313911 -3204317 -2087471 119923
10627 119923 964212 1954875 4378600 5200348 1928548 -2238794 -2821027 -415142 1592515
10618 1592515 2580708 3757614 4430205 3362037 1805348 1716450 2706581 3332658 3384092
10609 3384092 2914847 1494520 74169 663877 2687386 3027208 1098064 85507 1660921
10600 1660921 3571260 4101129 4624573 5934201 6340282 5220187 4314063 4165442 3667629
10591 3667629 3855767 6822361 10176892 8893802 3873225 1777955 4633662 6946672
10583 6946672 5465764 3999301 5336675 6237357 4517331 3666121 5887263 7522263
10575 7522263 5978893 4439264 5149583 4931531 2123120 1012045 4208321 7324376
10567 7324376 6513431 4750544 5340399 5741701 3336259 1049025 1815249 3456422 3905271
10558 3905271 5164120 7529725 6920995 2670116 495696 2838463 4220342 1424442
10550 1424442 -237678 3293636 7367777 7251495 5732525 5792920 4533179 1007853 920633
10541 920633 6413797 10405774 8285812 5686090 7400670 8982820 7192018 7666281
10533 7666281 13343451 16534905 12128499 7376624 8632854 10219320 7050864 5730321
10525 5730321 11272716 15534080 11706015 7640491 11228468 15478637 12480087 8911437
10517 8911437 12400525 16085413 12894866 11018699 17924641 23743293 19047557 13768301
10509 13768301 18642636 24204383 19670224 15187132 21691100 27448838 20902848 16586456
10501 16586456 28644783 40388914 34120217 27624292 41387209 55160323 44928702
10494 44928702 36071723 60555986 88230686 76938915 69323481 138303427 233505479
10487 233505479 200819512 -711 -204189845 -242599963 -148805445 -77081265 -82789182
10480 -82789182 -94465789 -66400969 -39313098 -45492829 -54389733 -39547120 -24747157
10473 -24747157 -32092908 -41548716 -32691790 -20899939 -23671212 -28870755 -22486682 -15694656
10465 -15694656 -20340548 -25334192 -19366768 -12650412 -16049301 -20595259 -16216291 -10783108
10457 -10783108 -13370156 -16962439 -13695373 -10146726 -12762326 -14496615 -9903360 -7591981
10449 -7591981 -13963512 -19716967 -16007862 -9697550 -9457093 -10589082 -6795363 -3789164
10441 -3789164 -7765997 -12358192 -10218256 -6561654 -8542959 -11650732 -9202504 -5575858
10433 -5575858 -7480844 -10888790 -8873067 -4631950 -5026584 -8108104 -7985602 -5786217
10425 -5786217 -5769047 -6588576 -5595904 -5713199 -9374745 -11825395 -8757804 -4440111 -4379903
10416 -4379903 -6291379 -5947308 -5235961 -6670342 -6802591 -3064429 -351358 -2771428 -5607702
10407 -5607702 -3599324 -415012 -1518699 -4331336 -4179467 -3525854 -6269829 -8999572
10399 -8999572 -7137269 -4095500 -5099703 -7368952 -5780933 -3002656 -4283509 -7037775
10391 -7037775 -5601737 -2069012 -2255890 -4618030 -3509021 -461455 -1777825 -6868362
10383 -6868362 -9042865 -6759771 -4720037 -4559518 -3385328 -1184457 -1212627 -2954795 -2465702
10374 -2465702 125122 617808 -1722408 -3446545 -3671988 -4890359 -6983439 -6905847 -4673225
10365 -4673225 -3696440 -4822828 -5583930 -5473550 -6500267 -8314134 -8079981 -5565047 -3529763
10356 -3529763 -2820592 -1610742 340660 986917 -256772 -1797545 -2787109 -3535520 -3726635
10347 -3726635 -3223598 -3260740 -3891011 -2549811 1425902 3893866 1849243 -1005469 83130
10338 83130 2848028 1853223 -2149523 -3722278 -1997599 -1208523 -2639172 -3153748 -1924999
10329 -1924999 -1956800 -4122855 -5628001 -5229494 -4574521 -3842225 -1526449 978534 239679
10320 239679 -3023682 -4217698 -2295145 -1301674 -3277204 -5218499 -4823471 -3883472 -3848192
10311 -3848192 -3081672 -1049561 -677230 -3733353 -7658181 -9551407 -9912298 -10120662 -9557696
10302 -9557696 -7674910 -5987939 -5675919 -5723929 -5376777 -5831442 -7557694 -8494795 -7054132
10293 -7054132 -4799105 -4106928 -4885317 -5375864 -4769027 -3525945 -2255654 -1348353 -802462
10284 -802462 -571 1291432 1910371 851541 -583115 -270387 1411192 2029778 585515
10275 585515 -1873374 -4650536 -7499060 -8631647 -6087277 -1464606 1019245 -94019
10267 -94019 -2135720 -2965750 -3654151 -5349251 -6687309 -6137083 -4543419 -3665744 -3944113
10258 -3944113 -4766046 -5198876 -3895332 -411733 2873818 2628823 -916806 -3807189 -3518029
10249 -3518029 -1710438 -919966 -1253553 -1753709 -2502731 -3626620 -4164145 -3513337 -2462922
10240 -2462922 -1702676 -950453 -364013 -887013 -2330914 -3133264 -2879031 -2919185 -3634157
10231 -3634157 -3514030 -2096440 -1272366 -2121325 -2846695 -1731272 -44349 64864 -1113595
10222 -1113595 -1657455 -823879 666950 1917632 1954609 -29166 -2993595 -4092807 -2115641
10213 -2115641 444215 533128 -1432030 -2494053 -1137586 1396909 2954282 2069754 -1334965
10204 -1334965 -5235088 -6405045 -3821111 -435447 215618 -1527693 -2351142 -830682
10196 -830682 892520 466072 -1777547 -4025323 -5350421 -5688759 -4669664 -2110765 557791
10187 557791 891455 -1796787 -4981257 -5238474 -1939562 2244103 4581312 4861433 4264331
10178 4264331 3140915 1345093 -252404 -562090 -307980 -1337550 -3749430 -5497298
10170 -5497298 -5277424 -4135531 -3529825 -3319313 -2634064 -1592838 -1105002 -1590702 -2588106
10161 -2588106 -3210238 -2763713 -1462894 -476781 -576765 -1114233 -1306272 -1753410 -3020482
10152 -3020482 -3582298 -1785658 535808 -214511 -3552355 -4588574 -1198907 2267892
10144 2267892 1339866 -1800657 -1927198 1076713 2457554 160779 -2700865 -3394359 -3047342
10135 -3047342 -3101132 -2308641 279204 2426846 1721349 -671362 -2051254 -2198026 -2407949
10126 -2407949 -2142587 -239663 1429887 -337651 -4434738 -5636225 -1887874 2304171
10118 2304171 2130205 -1016368 -2440399 -1153172 -135089 -916017 -1967101 -2232443 -2374490
10109 -2374490 -2089448 1789 2661778 1947998 -3135166 -8002195 -8116097 -4842548 -2867234
10100 -2867234 -3778383 -5457439 -6495625 -7620229 -9035034 -9607932 -9097860 -8537329 -7877029
10091 -7877029 -5672623 -1875728 1245221 1997210 1297394 792940 575976 -18685 -715137
10082 -715137 -831131 -623173 -740204 -878212 -226309 1016683 1756106 1738978 2178408 4057919
10072 4057919 6264714 6215194 2680668 -2381733 -5439882 -4880769 -2346360 -485550 -175816
10063 -175816 -453446 -381922 12234 408358 889367 1784692 3137635 4313600 4155823
10054 4155823 2049004 -1023413 -3195588 -3779331 -3804122 -4227789 -4763653 -5041235 -5496790
10045 -5496790 -6012912 -5082023 -2007629 1068985 1355213 -811196 -2333512 -1492572 106100
10036 106100 52940 -1937439 -4171362 -4887157 -3484055 -779213 1383749 1394234 -743686
10027 -743686 -3433487 -4868928 -4241239 -2062245 128688 786762 -192876 -1278092 -1035004
10018 -1035004 347189 1648782 1964358 878613 -1654432 -4578225 -5803380 -4308896
10010 -4308896 -1582369 115013 164538 -782575 -2377287 -4062072 -4070224 -1298640 2170650
10001 2170650 2784340 -52225 -3342268 -4650435 -4762562 -5351478 -5961704 -4996594 -2782615
9992 -2782615 -1857711 -3822515 -6771868 -6851334 -2759735 2055164 2996840 -56987 -2609803
9983 -2609803 -1573596 827924 773251 -1608354 -2956751 -1751730 126481 561331 -479577
9974 -479577 -1776287 -2096496 -773197 1271022 1628979 -614804 -2879977 -2356036 -282141
9965 -282141 -372 -1495131 -1576734 519633 1844008 1002527 635829 2644308 4519053
9956 4519053 3255420 254156 -830061 619727 2115567 2233727 1923339 1971627 1688207
9947 1688207 486569 -865317 -1065222 357138 2427661 3169671 1420115 -1348965 -2226025
9938 -2226025 -596719 878691 235922 -665694 869104 3652940 3838393 564040 -2583721
9929 -2583721 -2410713 98101 2013635 2333909 1912662 1182154 170257 -66036 1621138
9920 1621138 4173060 5110623 4027131 3324403 4667944 6584430 6854278 5624322 4443003
9911 4443003 3597202 2513522 1796601 2451962 3597697 3422065 2220516 1951882 2748042
9902 2748042 2562027 666599 -1220985 -1928962 -2180441 -2163829 -734249 1760088 2867291
9893 2867291 1829310 1070070 2097201 2928753 1822574 623318 1672876 3896799 4786680
9884 4786680 4145928 3292524 2659242 2495660 3575287 5164714 5309831 4946913 7117055
9875 7117055 9247731 2451404 -15657425 -32913451 -35411423 -24930900 -15097542 -12719714
9867 -12719714 -12602307 -10008493 -7523595 -7396530 -6662023 -3870044 -2918371 -5800732 -8091796
9858 -8091796 -6101525 -2748181 -1870336 -2042504 -717797 358571 -1109931 -2936950 -2195373
9849 -2195373 -604827 -1380837 -3620153 -4406471 -3939771 -4163934 -4574330 -3682722 -2709708
9840 -2709708 -3703399 -5552445 -5635405 -4096143 -3130083 -3325917 -3742549 -4283469 -5196826
9831 -5196826 -5499194 -4330222 -2583158 -1367328 -612327 -595955 -2269221 -4602657 -4961505
9822 -4961505 -3910901 -5552458 -10567868 -13501247 -10484505 -5147495 -2563774 -1791841
9814 -1791841 371806 2424626 1245430 -1047739 -94612 2972291 3484361 1472868 1240090
9805 1240090 3450248 4252937 2279969 300977 -484661 -1861978 -3575616 -2656170 931193
9796 931193 3162281 2003109 -20022 -653868 -868116 -1572688 -1699873 -1138470 -1610815
9787 -1610815 -3130079 -3389010 -2024908 -1570002 -2727345 -2843424 -970024 -313196 -3012716
9778 -3012716 -5998171 -5126401 -936731 2578018 3146586 1756559 368944 58151 551310
9769 551310 482340 -978750 -2389390 -1444320 1617726 3887217 3448608 1317526 -552799
9760 -552799 -1275688 -872002 -69702 -301710 -1999313 -3274559 -2457200 -1093467 -1598664
9751 -1598664 -2895650 -2024169 546059 1445876 134327 -511207 195278 -564516 -3534128
9742 -3534128 -5261042 -3576199 -965681 -239415 -721769 -1041346 -1916601 -3661768 -4510325
9733 -4510325 -3999570 -4533998 -6971939 -8265714 -6360705 -3748894 -2904278 -1990654 950243
9724 950243 3189934 1523185 -1630508 -1703718 470660 249905 -2768745 -4133059 -2091371
9715 -2091371 -186166 -982652 -2091985 -792529 1183375 517730 -2379511 -3992669 -2711767
9706 -2711767 -728653 -830647 -2941139 -4577635 -4100812 -2567270 -2017945 -2660637 -2883645
9697 -2883645 -1894822 -855339 -959629 -1793923 -2289062 -2007602 -811874 1259195 2913403
9688 2913403 2055796 -1392464 -4536919 -4780747 -2863157 -1330750 -1235805 -1781647 -2075694
9679 -2075694 -1733045 -724222 77224 -691927 -2684920 -3424789 -1545000 964245 1424236
9670 1424236 5444 -1245431 -1559225 -1509017 -1075022 48896 1013320 876862 447133
9661 447133 967915 1680307 905570 -1059680 -2439447 -2848430 -3225541 -3297113 -1852582
9652 -1852582 360996 824936 -960146 -2337223 -1274136 722367 887357 -971023 -2346289
9643 -2346289 -1117320 2173093 4851688 4625651 1913007 -460243 -454838 765977 643529
9634 643529 -1077872 -2071760 -823140 1429853 2652638 2423474 1563676 526968 -724510
9625 -724510 -1763651 -1641635 12998 2116313 2655608 579438 -2665579 -4191727 -2811134
9616 -2811134 -386945 672765 288980 -119002 -283686 -952862 -1643908 -944521 672451
9607 672451 693467 -1828989 -4532358 -4956393 -3800494 -3284202 -3654711 -3491800 -2718764
9598 -2718764 -2866055 -4238610 -5063823 -4224843 -2996446 -2870349 -3134959 -2224377 -494130
9589 -494130 238601 -449896 -1130568 -1076508 -1386739 -2835636 -4213952 -3939917 -2160379
9580 -2160379 -121203 1520088 2550451 2392482 924910 -632459 -1156785 -1279114 -2035548
9571 -2035548 -2625210 -1540663 507189 1133238 -151378 -1212269 -639653 352983 219148
9562 219148 -712669 -1442095 -2014630 -2749109 -3103456 -2621613 -1979524 -1898252 -1829528 -758475
9552 -758475 1284841 3230486 3954137 3032930 1385345 1113973 3295439 5890555 5763604
9543 5763604 3100297 1447877 2493262 3500251 1738950 -1010189 -1084750 1517371 3201097
9534 3201097 1734771 -1506649 -4085115 -4904527 -3885652 -1396234 1275655 2368201
9526 2368201 1384491 -393846 -1523222 -1885906 -2339324 -3434681 -4732319 -5187352 -4231845
9517 -4231845 -2522615 -1349489 -1299126 -1869679 -2193126 -1542146 395214 2684218 3189068
9508 3189068 1101268 -1075787 -316958 2391958 3231136 1578619 1279025 4411069 7417669
9499 7417669 6191035 2115232 -383985 -263138 -110047 -1176336 -1929081 -1318309 -267760
9490 -267760 335622 621133 541712 -133894 -629175 27414 1122644 1166638 453150 647327
9480 647327 1977201 2913892 2613547 1751611 1040635 790180 1624086 3514294 4394894
9471 4394894 2215773 -1485293 -2549752 617694 4889380 6238126 4129577 1393903
9463 1393903 918713 2964312 5022012 4443971 1762612 344023 1724949 3149537 1860301
9454 1860301 -185443 699166 3614070 4052709 911664 -2037572 -2381938 -2237630 -3527388
9445 -3527388 -4325279 -2584100 -155462 25036 -1639226 -2825495 -3298260 -4495032 -6291925
9436 -6291925 -6924836 -5587039 -3135289 -865418 -82407 -1714363 -4615815 -5536968 -2852230
9427 -2852230 762660 1587455 -151842 -1051899 258038 1456879 375900 -1959538 -3130591
9418 -3130591 -2492020 -1351820 -867461 -755283 118483 2273689 4717451 5634354 4196532
9409 4196532 1445131 -824344 -1634935 -1175188 -361685 -331441 -1340721 -1748273 483296
9400 483296 4405774 5930270 2772473 -1890938 -3095736 -522911 1580736 663213 -1233197
9391 -1233197 -1662199 -1618445 -3113941 -5351412 -6106179 -5491692 -5396704 -5870365 -5139646 -3267271
9381 -3267271 -2703367 -4331975 -5756975 -4958857 -3180897 -2329120 -1855235 -715388 -355267
9372 -355267 -2457460 -5080999 -4855546 -2503844 -2097650 -4492607 -5766367 -3510882 -531624
9363 -531624 19471 -562247 234331 1276711 105552 -2105147 -2234685 -656131 -652405
9354 -652405 -2739360 -3763996 -2187855 -550566 -1480400 -4157125 -6018798 -5687971 -3160689
9345 -3160689 765965 4176816 5004932 3319871 1206210 -51110 -904113 -1489073 -1002351
9336 -1002351 236128 548763 -273097 -315592 1044917 1582076 -157759 -2025201 -1455137
9327 -1455137 344729 260771 -1686113 -2218255 253110 3251783 3701640 1802788 26558
9318 26558 -597561 -1358516 -3057670 -4103949 -2674077 138659 1252050 -257388 -2003770
9309 -2003770 -2119808 -2044770 -3725033 -5954878 -6111306 -4292266 -2774340 -2043939 -585589
9300 -585589 1469973 1851879 -2166 -1598756 -1037062 462999 883533 178361 -375158
9291 -375158 160997 2061322 4480764 5069465 2336839 -1352444 -1898293 971388 3352370
9282 3352370 3013939 1971098 2020254 1736842 79708 -835406 570941 2217819 2044972
9273 2044972 1650565 2776869 3229610 450253 -3372428 -4308360 -2862237 -2427500 -3124390
9264 -3124390 -2323728 -471339 -940076 -3877718 -5384261 -3763499 -1840366 -1693984 -1645524
9255 -1645524 -394161 200882 -879539 -851786 2466433 6154302 5791266 1819868 -1174273
9246 -1174273 -630822 1604336 2735200 2243282 1472812 1827142 3579916 5327672 4929906
9237 4929906 2091845 -670699 -1008625 145436 243867 -816938 -745911 1066856 2259836
9228 2259836 1257694 -129515 308749 1408286 298678 -2989851 -5183640 -4152694
9220 -4152694 -1401000 483553 959345 1051006 1260738 1310324 1031313 394355 -568764 -1052097
9210 -1052097 210576 2924815 4780648 4227423 2360083 719365 -981522 -2950038
9202 -2950038 -3149678 -90059 3660103 4360017 2650630 2295696 3821923 3939656 1720069
9193 1720069 537782 2357815 4569724 4633696 3688739 3006214 1025225 -2804361 -5056273
9184 -5056273 -3174092 -146556 -141939 -2177257 -2620534 -1644516 -2135210 -3679800 -2908679
9175 -2908679 581447 3364141 3321064 1575598 -662866 -3178546 -4649379 -3542085 -1435074
9166 -1435074 -1554289 -3619271 -4094983 -2058577 -599014 -1413214 -2273291 -1455687 -690185
9157 -690185 -1583254 -2604931 -2068823 -1236772 -2010265 -3832660 -5037467 -5225192 -4457402
9148 -4457402 -2187950 1171849 3588317 3957118 3370624 2526109 391744 -2863074 -4448290
9139 -4448290 -2910705 -1012500 -1782594 -3776257 -3451971 -662998 1651144 2249884 2551199
9130 2551199 3128057 2698499 1145691 577260 2140863 3897371 3349963 847581 -904266
9121 -904266 -192832 1887811 2937500 1911841 -51347 -1262678 -1332993 -998239 -649311
9112 -649311 39343 1153625 2143012 2430540 1754434 217583 -1187032 -840210 1304123
9103 1304123 2573799 675231 -2621507 -3464105 -1411976 73687 -981960 -2545691
9095 -2545691 -2606351 -2358485 -3363577 -4491926 -4240980 -3699389 -4410913 -5197434 -4001080
9086 -4001080 -1435554 315886 959918 1677109 2233921 1360483 -554877 -1783589 -1938877
9077 -1938877 -2043276 -2345794 -2314543 -2328961 -3077351 -3702694 -2913873 -1586442 -1808700 -3542367
9067 -3542367 -4685871 -4355296 -3600479 -2853721 -1302843 898034 2386471 3099213 4554497
9058 4554497 6935388 8266406 7359686 5360753 3492592 1569496 -146360 19444 2640223
9049 2640223 5616416 6806547 6633934 6441218 5837996 3677092 566698 -1596684 -2020956
9040 -2020956 -1362923 -284207 831748 1266010 586001 -435945 -791661 -716930 -968001
9031 -968001 -1164472 -378294 926793 1194846 96869 -946868 -868545 -258285 -126983
9022 -126983 -552386 -1186196 -2133412 -3513429 -4712877 -4795389 -3448516 -1224187 835164
9013 835164 1674358 910041 -624417 -1500294 -1195327 -528855 -318064 -185975 787912 2660069
9003 2660069 4424795 5027619 4274494 3025008 2632172 3617072 4668030 3782008 854223
8994 854223 -1879914 -2722559 -2601689 -3010713 -3139658 -1156871 2357917 4767003 5097233
8985 5097233 4820276 4563882 2932177 -253940 -2371736 -1621947 60870 51918 -938760
8976 -938760 -548144 1073757 1779270 1147472 673766 778685 587895 385941 1243298 2208371
8966 2208371 1003824 -2106370 -4237863 -4324645 -4514628 -6096296 -7150278 -5872301 -3513830
8957 -3513830 -2147607 -1825382 -1784914 -2219669 -2845443 -1891231 1147843 3601191 2932479
8948 2932479 428604 -912661 -829131 -1421013 -3263365 -4669708 -4503633 -3304284 -1699719
8939 -1699719 167046 1559824 1382812 -205425 -1745926 -2164835 -1545577 -525259 82173
8930 82173 -434284 -1708364 -2182422 -1041376 407987 365674 -1202556 -2946036 -3803980
8921 -3803980 -3243099 -1066652 1672613 2845297 1831142 621130 784345 960019 -601262
8912 -601262 -2655027 -2741745 -1100036 60252 352085 1312874 3116940 4051670 3282943
8903 3282943 1700934 37277 -1637515 -2710737 -2509462 -1783172 -1715655 -1975388 -1755389
8894 -1755389 -1760895 -2675267 -2783130 -190650 3476640 4914707 3905265 2699482 1492738
8885 1492738 -1295015 -4676219 -5700655 -4585267 -4527234 -5915902 -5730867 -3627869 -3232859
8876 -3232859 -5615444 -6837098 -4527951 -1838154 -1786819 -2438700 -1144897 915418 2100402
8867 2100402 3708990 5931165 4997298 -682875 -5802462 -5278544 -2299212 -2834766 -5407517
8858 -5407517 -3869106 1618976 4564307 2829921 1355254 2976409 3941551 1186188
8850 1186188 -2190497 -2159265 317285 1954769 1958993 1193253 -219637 -1815882 -2172156
8841 -2172156 -1518814 -2055902 -3859217 -3875751 -1037998 1385097 1137911 783639 2821900
8832 2821900 4782547 3522905 1305681 2426913 5754151 6134739 2554921 -443374
8824 -443374 82705 1754744 1610294 336607 -330277 -1089975 -3268176 -5642927 -5754867
8815 -5754867 -3377946 -546299 1415830 3118508 5277956 6959514 6354372 3090378
8807 3090378 -760693 -2532327 -1820204 -637157 -371432 71652 1926093 3731176 2991432
8798 2991432 50661 -2138701 -2129615 -1388639 -1206608 -935338 -397814 -1283707 -4142871
8789 -4142871 -6345713 -5750440 -4610421 -6428046 -9827468 -9523589 -3918954 1972101 2929371
8780 2929371 -47864 -2132132 -1327368 265625 680429 274885 -400802 -1973403 -4383043
8771 -4383043 -5730459 -4463767 -1550884 698350 1104802 18243 -1733050 -3139255
8763 -3139255 -3109191 -1667223 -599851 -1562942 -3750407 -4738275 -3600309 -1823660 -866213
8754 -866213 -190688 1452788 3745966 4932890 3969743 1692099 -184878 -634976 181365
8745 181365 1379116 1910896 1026813 -1172889 -3491680 -4408573 -3477504 -1762603 -631278
8736 -631278 -430613 -663585 -898227 -779199 302461 2360487 3906321 3398684 1739244
8727 1739244 1657105 4021425 6452927 6613506 5240895 4440523 4419051 3913020 2909485
8718 2909485 2642531 3099801 2624614 327718 -2615896 -4393362 -4190746 -2434516 -468137
8709 -468137 257060 -209568 2554 2012334 4076558 3838989 1912201 903151 1407470
8700 1407470 1730140 1398953 1755018 2659169 2061188 -84121 -959558 343819 633242
8691 633242 -2335032 -5712078 -5609495 -2779361 -723712 -157636 722955 1867845 1534450
8682 1534450 260500 469915 1980476 1913320 -271739 -1529121 -221999 1271076 695501
8673 695501 -631409 -773029 -686706 -1967231 -3293598 -2360776 -92441 287267 -1994597
8664 -1994597 -4280069 -4469865 -3564166 -3467954 -4112715 -3922441 -2155031 269910 1966545
8655 1966545 2478351 2462481 2672390 2900721 2202255 208953 -2223865 -3892297 -4299853
8646 -4299853 -3624538 -2268185 -877161 -222347 -447304 -779654 -438294 528619 1638300
8637 1638300 2687524 3636292 4241911 4224111 3424181 1684918 -735025 -2570196 -2541583
8628 -2541583 -1335688 -1185993 -2688781 -3608985 -2220082 -305634 -763374 -3255068 -4749320
8619 -4749320 -3999235 -2767262 -2307753 -1442509 615207 1879079 89973 -3683882 -5957608
8610 -5957608 -4849809 -1687473 1027058 1858857 858638 -868705 -1795021 -1157142 192725
8601 192725 737125 131938 -565615 -525059 -244184 -785795 -2477039 -4640065 -6221379
8592 -6221379 -6454308 -5180134 -2787831 53518 2417962 3039900 1125273 -2105849 -3545687
8583 -3545687 -1254533 2793699 4487339 2388465 -611413 -1054439 1004476 2706804
8575 2706804 2065727 -451649 -3291868 -5162058 -5213924 -3433356 -1157257 -111176 -618338
8566 -618338 -1555956 -2061639 -2197537 -1869266 -486924 1736933 3324220 3136945 1637950
8557 1637950 16579 -1051522 -1336774 -942215 -913844 -2577558 -5232918 -5942093 -3137403
8548 -3137403 774928 2255925 1095914 -107956 -188718 -475778 -1665160 -2407635 -1855258
8539 -1855258 -1281451 -1882257 -2792705 -2749361 -2328060 -2971365 -4642771 -5747076 -4893594
8530 -4893594 -2019112 1520914 3538670 2874412 1245928 1744061 4655060 6572611 4970541
8521 4970541 1707442 -14892 -362280 -1715452 -3974150 -4440381 -2390057 -491692 -728269
8512 -728269 -1591005 -772757 1424798 3066726 3476457 3381440 3061396 1999277 68904
8503 68904 -2067502 -3537155 -3525908 -1527756 1739896 4116441 3832519 1589894 -62058
8494 -62058 367976 1674375 1566569 -475009 -2469964 -2143544 510735 3296120 4302380
8485 4302380 3626236 2410146 1148877 -144278 -787547 155526 2334387 4186233 4775913
8476 4775913 4559499 4103370 3144545 1412651 -550492 -2031635 -2948798 -3488962 -3551834
8467 -3551834 -3091000 -2525485 -2307845 -2374408 -2294485 -1698066 -568455 446282 229847 -1503285
8457 -1503285 -3282867 -3318547 -1792595 -435906 163986 1038893 2152478 1419486 -2046497
8448 -2046497 -5387936 -4940660 -1008100 2442394 2740287 1204493 503590 1070202 1169608
8439 1169608 -423178 -2927549 -4551062 -4323315 -2846227 -1491053 -1050414 -1235054 -1263802
8430 -1263802 -556686 1016734 2890318 3733001 2538711 208814 -854339 560791 2952393
8421 2952393 4088763 3768447 3543532 4269757 5212874 5392270 4621489 3204374 1640921
8412 1640921 697584 770893 1039868 219868 -1582357 -2666139 -1794142 236723 1481771
8403 1481771 816544 -1203276 -2952173 -3095951 -1917813 -1307948 -2673904 -4850794 -5194955
8394 -5194955 -3061270 -828540 -600302 -1260810 -431676 1575773 2054607 169099 -1508920
8385 -1508920 -822587 629344 -139060 -3103762 -5525892 -6069598 -6065613 -6444766 -6027629
8376 -6027629 -4060401 -2323536 -2844120 -4755552 -5267077 -3091621 539081 3614992 4747893
8367 4747893 3540548 990809 -1010117 -1724023 -2254326 -3140445 -2900185 -825460 609915
8358 609915 -1000431 -3748655 -3904588 -1719257 -702045 -1490518 -1103172 1147074 1986735
8349 1986735 114785 -1028980 894378 2915905 1843923 -337167 -292102 682840 -762518
8340 -762518 -3807649 -4812975 -3538202 -3166422 -4724007 -5972665 -5753452 -5326464 -5200370
8331 -5200370 -4347091 -2856794 -1990141 -1421592 284835 2419561 2706609 1124238 -279553
8322 -279553 -1162144 -2589350 -3192072 -335374 4325475 5477694 1754216 -2164665 -2934242
8313 -2934242 -2963651 -4687066 -5492767 -2526867 1520398 2312814 659608 411828 1607321
8304 1607321 880043 -2290552 -4757651 -5118507 -5392882 -6531561 -6273333 -3096625 667218
8295 667218 1609967 -630575 -3524809 -4744399 -3968527 -2412931 -1449230 -1383068 -1282871
8286 -1282871 -169954 1871431 4038591 5591094 5751632 3803400 354622 -2257558
8278 -2257558 -2119195 76813 1994279 2293777 1314860 -228346 -1934715 -3405114 -4397215
8269 -4397215 -5176700 -5911718 -6031509 -4980560 -3286188 -2156310 -2285399 -3471006 -4871362
8260 -4871362 -5337048 -4373356 -3189339 -3673867 -5737846 -6938154 -5558002 -2780001 -838206
8251 -838206 -320124 -433432 -646020 -675991 95049 1791081 3374101 3867156 3436111 2530828
8241 2530828 1193141 22027 275619 1952190 3323797 3384985 2960299 2424251 773858
8232 773858 -1565908 -1911658 370449 1559264 -1311538 -5526880 -6565179 -4819637 -4178264
8223 -4178264 -5349643 -5385572 -3414167 -2065528 -2616740 -2960127 -1551128 200204 799643
8214 799643 897242 1367855 1812174 2129036 3173546 4808150 5501170 4688250 3408711
8205 3408711 2099204 169561 -1764206 -2005031 -916286 -1071639 -3108139 -4169933 -1961949
8196 -1961949 2060922 5050402 6050580 5417019 3221120 146504 -1750551 -1100065 976653
8187 976653 2327583 2013033 430113 -1396678 -2072708 -937332 666698 936959 512239
8178 512239 1532714 3658295 3987444 1669928 -556487 -696514 -284066 -1225143 -2802074
8169 -2802074 -3690079 -4172680 -4406964 -3303019 -1223688 -858599 -3018529 -4585590 -3408174
8160 -3408174 -2047622 -3193207 -4472893 -2329596 1276650 1263125 -2535080 -4904498 -2923403
8151 -2923403 573830 2030314 1578316 1001085 644684 229686 427819 1845866 3733372
8142 3733372 4757072 4189471 2123697 -400642 -1670019 -1004183 229194 749650 1666185
8133 1666185 4592365 8264448 9692777 8379777 6602013 5464158 3617378 409008
8125 409008 -2587293 -4155104 -4956854 -5340591 -4130305 -1107343 1520700 1965444 1455337
8116 1455337 2110557 3568720 3704632 1912655 -142257 -750682 206212 1664561 2421296
8107 2421296 1951373 936946 731158 1678129 2346515 1179317 -1302613 -2715846 -1415465
8098 -1415465 1513789 3173711 1789159 -1454944 -3758981 -3704704 -2285508 -983511 68216
8089 68216 1411584 2815738 3568235 3544231 2972380 1749347 -5591 -1389627 -1812213
8080 -1812213 -1943538 -2405758 -2407830 -1182036 77330 -423268 -2324507 -3640850 -3626315
8071 -3626315 -3131860 -2480266 -1251147 -108301 -418973 -1665822 -1480005 1092296 4280427
8062 4280427 6120367 6426813 5694772 3984682 1656727 -472344 -2253793 -3819505 -3984056
8053 -3984056 -1440271 2056778 2669434 -202026 -2558417 -1499673 683425 575876 -951444
8044 -951444 -758024 1092448 1761439 619736 -146331 80053 -803777 -3372951 -4661676
8035 -4661676 -2382464 1221593 2138718 -152289 -2555823 -2887920 -2147730 -1966240 -1926624
8026 -1926624 -738119 1228372 2397671 2579178 3161730 4384451 4438417 2548306 1188225
8017 1188225 3041241 6686857 7862351 4921860 603404 -1998148 -2788834 -3153887 -3413341
8008 -3413341 -3289914 -3168509 -3258584 -2741953 -1187651 240209 230038 -1032566 -2657750
7999 -2657750 -4201418 -4996085 -3946128 -1391886 436796 448370 460866 2002718 3213303
7990 3213303 1630724 -1411426 -2432691 -1068602 -286814 -1539152 -3126544 -3752349 -4286432
7981 -4286432 -5000452 -4262104 -1619230 500586 118496 -1426060 -1919907 -1663091 -2168321
7972 -2168321 -3034962 -2662039 -1174585 -156158 126685 852088 1949804 1574413 -983138
7963 -983138 -3599170 -3698933 -1382258 901341 1323703 340789 -575062 -944979 -1364845
7954 -1364845 -1934172 -1724051 -407353 523771 -465389 -2332117 -2382114 -105720 1817700
7945 1817700 1336303 38087 635402 2792681 3719383 2320336 385722 -435364 -624354
7936 -624354 -1133277 -1642363 -1491370 -914534 -275980 758418 2192721 2860639 1816606
7927 1816606 -177636 -1670846 -2343104 -2709766 -2758974 -2235308 -1684626 -1679877 -1429516 67612
7917 67612 1623457 700393 -2848374 -5861973 -5749279 -3616781 -2145401 -1803841 -1052021
7908 -1052021 640638 2223237 3296738 4655640 6054530 5465440 1901368 -2310485
7900 -2310485 -3727782 -1791909 837150 1861217 1747046 1994427 2363625 1314808 -1152519
7891 -1152519 -2778018 -1847368 447049 1619188 1128486 482124 420708 7900 -930187
7882 -930187 -544538 2246355 5144548 4871402 1675607 -752787 -31419 2229688 3082883
7873 3082883 1827584 -57904 -1194473 -1266662 -589437 111665 34180 -655408 -667835 608486
7863 608486 1755321 884193 -1822103 -4257850 -4920851 -4232339 -3403626 -3079835 -3266437
7854 -3266437 -3620279 -3518495 -2670758 -1943044 -2690626 -4837689 -6492513 -6137562 -4464561
7845 -4464561 -3195343 -2704890 -1953949 -504803 720158 935672 573878 300565 -10342
7836 -10342 -444714 -104343 1655458 3478258 3065853 154241 -2945217 -4170428 -3734076
7827 -3734076 -2782513 -1625697 -463825 -390480 -1842273 -3020911 -2006531 68017 353597
7818 353597 -1261624 -1802368 -76713 994148 -1159533 -4312214 -4363968 -1460646 121538
7809 121538 -1737056 -3959498 -2829847 654576 2035695 -942165 -5775808 -8238510
7801 -8238510 -6659354 -2881145 128482 946257 220384 -783130 -1594206 -2451574 -3431720
7792 -3431720 -4313119 -5039814 -5513949 -5011377 -2849634 76759 1555810 603293 -1168196
7783 -1168196 -1706459 -1221786 -1383928 -2405337 -2726399 -1648276 -406455 -21621 130240
7774 130240 531865 37479 -2088226 -3976741 -3343515 -1264228 -1134971 -3626720 -5304645
7765 -5304645 -3434234 2490 932076 -1510489 -4283062 -4411906 -1888611 1202789 2879393
7756 2879393 2417435 553911 -1064871 -1312105 -604888 -73221 -8237 165171 724399
7747 724399 1384283 1984482 2487422 2469344 1677007 997401 1637775 3158002 3560403 1823339
7737 1823339 -720797 -2168919 -2274956 -2099210 -2202816 -2222986 -1861311 -1250556 -391504
7728 -391504 792918 1626123 908211 -1284700 -2749556 -1312378 2279190 4894830 4722658
7719 4722658 3016558 1505010 -90510 -2264509 -3192551 -924928 2600313 3192461 372420
7710 372420 -1838765 -1172329 -387315 -2108702 -4015328 -2701487 331396 824822 -1550435
7701 -1550435 -3039719 -1907661 -560516 -1188864 -2903064 -4058873 -4448398 -4291882 -3637365
7692 -3637365 -3511799 -5210785 -7747066 -8384138 -6368071 -3835729 -2519071 -1996607 -1702618
7683 -1702618 -1982403 -2404999 -1666337 -15223 761423 449046 732324 1754160 1532579
7674 1532579 -161733 -713121 1086759 2969467 3046248 2446316 2240609 1175464 -1230826
7665 -1230826 -2717808 -2055913 -1521600 -2736375 -3402895 -1572433 156791 -1198835 -3514540
7656 -3514540 -2822126 155918 1556643 808420 554941 1235236 796960 -580495 -425941
7647 -425941 1112103 931393 -1653870 -3384128 -2072600 452314 1743265 1965768 2322052
7638 2322052 2753610 2528997 1348886 -749893 -3007871 -3632713 -1863636 166100 50479
7629 50479 -1086352 -352774 1974511 2847327 1679085 1367616 3521242 6215781 7376781
7620 7376781 7133932 5915659 3405675 466465 -833659 -93399 1209166 2778548 5505869
7611 5505869 8008215 7191131 3437324 1129563 2210420 3225556 1127273 -1803107
7603 -1803107 -1848901 521471 2229628 2294978 1778168 1076458 323475 759599 2847028
7594 2847028 4522430 3909363 2221987 1483869 1116170 -377663 -1961049 -1560984 297
7585 297 -166631 -2641131 -5036580 -5653166 -5210995 -4746849 -4061905 -2821998 -1527232 -742753
7575 -742753 -377546 -139194 -141454 -861239 -2519935 -4263774 -4427644 -2647037 -1109393
7566 -1109393 -1837263 -3204388 -1965805 1149083 1524959 -2375496 -5900818 -4551941 -235192
7557 -235192 2007708 995049 -468061 -702407 -670907 -1251755 -2226352 -3481648 -4584281
7548 -4584281 -3912545 -815701 2233059 2389490 544397 -168054 792344 1185824 268536
7539 268536 -69580 1257091 2899511 3535701 3514692 3319282 2442407 573218 -1562613
7530 -1562613 -2953431 -2820096 -740779 2344375 3923793 2528842 -53908 -1101256
7522 -1101256 -664969 -656975 -1113731 -373973 1364834 1978947 1240157 1458490 3384501 4471233
7512 4471233 2684818 -452217 -2347472 -2859715 -3461683 -4378137 -4562461 -3810054 -3186427
7503 -3186427 -3404908 -3843017 -3424446 -2116657 -1256987 -2022959 -3574506 -3621363 -1343831
7494 -1343831 1376524 2535654 2485944 2479402 2217890 931161 -276114 296188 1965069
7485 1965069 2540904 1770381 1269096 1328339 715723 -306795 97919 1852864 2447017
7476 2447017 851995 -907628 -1258247 -1303583 -2049819 -2237801 -1038935 -439634 -2288845
7467 -2288845 -4717537 -4336687 -1047124 1973487 2648238 1937798 1343921 693791 -778845
7458 -778845 -2550058 -3093751 -1695678 572643 1732676 774304 -1258181 -2214397 -1022674
7449 -1022674 1221248 2460367 1818699 396045 -96743 603618 1074932 444311 120549
7440 120549 1874677 4497116 4629002 1626176 -889409 -52506 1930926 1079337 -2425283
7431 -2425283 -4735276 -3876569 -1526957 460437 2059313 3284180 3406454 2717505 2570702
7422 2570702 2924934 2140653 -96997 -1900527 -1912728 -739335 918274 3151439 5089452
7413 5089452 4798111 2179560 -173436 -254153 1138427 2422011 3298539 3640617 2576645
7404 2576645 220088 -1666420 -2286685 -3189862 -5399303 -7073637 -6045790 -3179992 -1069931
7395 -1069931 -485486 -222515 189596 -279916 -2156540 -4125266 -4212075 -1949017 774770
7386 774770 1337081 -691208 -2838659 -2832563 -1439116 -656844 -291322 1054661 2358537
7377 2358537 969974 -2811159 -5368683 -4699230 -2519408 -732957 723805 1525641 318924
7368 318924 -1932724 -1819670 1185251 3056334 1337392 -951499 -536788 940171 806688
7359 806688 682758 3152830 6091725 5679158 3042729 2352043 3605414 3098811 617454
7350 617454 168759 2782135 4234452 1895762 -972458 -512372 1856027 2043275 -662336
7341 -662336 -3226136 -3247773 -1219344 1003663 2150692 2099351 1615427 1582194 2129597 2704248
7331 2704248 2928728 2886310 2697781 2401087 2057399 1498395 385534 -1065099 -2132772
7322 -2132772 -2760397 -3572664 -4251125 -3483073 -1396873 -190846 -1029040 -2217220 -2043669
7313 -2043669 -1384604 -1558779 -1746224 -892992 -81644 -378233 -481113 552915 635637 -1716708
7303 -1716708 -3507851 -1481356 1835728 1523543 -1756596 -3032926 -1542734 -1496795 -3936872
7294 -3936872 -4613805 -1743817 638231 -48826 -352059 2625426 5396049 3708300 -232715
7285 -232715 -1529096 -459745 -934903 -3015303 -2755509 845999 3800647 2834654 -585448
7276 -585448 -2926196 -2521849 6438 3037957 4815874 4581690 3390607 2757319 2596629
7267 2596629 1696694 -81216 -1486335 -1628560 -811696 243176 935614 773418 -178718
7258 -178718 -1059749 -1199542 -929950 -751087 -452049 57454 -67779 -1365040 -2687245
7249 -2687245 -2460743 -1008016 -320330 -1464692 -3180335 -3346118 -1416408 879275 1430298
7240 1430298 325564 -244149 727854 1155082 -1040566 -4025745 -4057736 -1102021 867243
7231 867243 -221000 -1798734 -1271989 38320 -139955 -1103714 -1102779 -799122 -1571097 -2162517
7221 -2162517 -426792 2711737 4251191 3348207 1681900 295053 -1021757 -1742711 -971748
7212 -971748 426437 803478 635026 1720728 3635268 3888135 1848718 -260213 -771470
7203 -771470 -467903 -527790 -881953 -1162207 -1215599 -395965 1506057 2603487 772247 -2662995
7193 -2662995 -4042186 -2651979 -1680031 -2972394 -4327702 -3717697 -2815849 -3793278 -5445444
7184 -5445444 -5545492 -4824955 -5250526 -5946206 -4499367 -1589359 -657940 -2757992 -4902165
7175 -4902165 -4364194 -2057891 -492825 -417976 -930995 -1511991 -2379744 -3429274 -4060016
7166 -4060016 -4012291 -3682157 -3495491 -3259184 -2334517 -571958 1132348 1798475 1859800 2638922
7156 2638922 3898710 3363441 -1685 -3460227 -3354561 -22197 2459753 1676266 -294771
7147 -294771 -370800 1279743 2049641 591152 -1992857 -3838304 -3716966 -1453445 1534172
7138 1534172 2687845 936882 -1502329 -1636051 316207 1462429 756268 465724 2217586
7129 2217586 4004988 3076002 152755 -1642267 -1290826 -822932 -1746639 -2881348 -2595890
7120 -2595890 -1435542 -1149867 -2026157 -2568678 -1668681 -119134 300156 -1137041 -3236568
7111 -3236568 -4078654 -2989129 -1078317 228750 698835 948353 1138726 790366 -303295
7102 -303295 -1706138 -2811518 -3121392 -2318833 -781213 267959 1585 -847163 -1030562
7093 -1030562 -714382 -1086850 -2122305 -2278932 -853021 737858 749696 -811388 -2526885
7084 -2526885 -3054947 -1736597 1235930 4439252 5807482 4494523 1797113 -198975
7076 -198975 -464455 519017 1300895 407908 -2105005 -3912345 -2679022 581450 2145346
7067 2145346 333922 -2222188 -2312399 -332672 1055207 975727 761436 1092528 1067124
7058 1067124 134074 -911746 -1218950 -944629 -842103 -1629551 -3589271 -5950415 -7065562
7049 -7065562 -6159607 -4468820 -3710593 -4050872 -4631771 -5215970 -5792906 -5345886 -2996220
7040 -2996220 -103003 809677 -541242 -1600513 -265228 2591589 4385298 3565029 761610
7031 761610 -1918919 -2560401 -1145176 423333 610563 61094 259441 1226879 1958611
7022 1958611 2358107 2861456 2669830 588399 -2412545 -3706279 -2427748 -397990 728465
7013 728465 1200687 1537553 1281284 323148 -288898 145858 1069450 1860702 2376610 1900185
7003 1900185 -383951 -3116345 -3262633 -192250 2810661 2667285 274452 -1497373 -1730837
6994 -1730837 -1397899 -953842 -233932 347694 548572 1252604 2748612 3236294 1320228
6985 1320228 -1046756 -774656 1756954 3041320 1351001 -1262229 -2146402 -871760 1541217
6976 1541217 3875694 4466457 1941759 -2540556 -5486394 -4803540 -2161208 -596875 -939865
6967 -939865 -1709723 -1584724 -765336 -356181 -1136583 -2528001 -2575190 71400 3836729
6958 3836729 5261817 3141765 224984 -387482 811437 1058199 -480285 -2069150 -2649624
6949 -2649624 -3267547 -4599781 -5170675 -3540277 -979647 -140578 -1491074 -2793603 -2308109
6940 -2308109 -964763 -608027 -1340141 -1911585 -2027248 -2571894 -3524927 -3425506 -1748509
6931 -1748509 -372565 -1248258 -3486238 -4493606 -3671112 -3069432 -4035382 -5036744 -3887620
6922 -3887620 -894159 1523319 1696893 83447 -1775828 -2630348 -2155156 -1169285 -1036303
6913 -1036303 -2073254 -2931256 -2474923 -1739378 -2567513 -4476266 -4708381 -2003632 1294624
6904 1294624 2062248 217214 -1643553 -1746454 -772734 -155292 -230110 -562406 -1093022
6895 -1093022 -2115571 -3393456 -3950920 -2987897 -893841 906558 1322857 619790 -289826
6886 -289826 -1228527 -2547179 -3648983 -3105992 -813157 1310369 1762014 1369517 1480160
6877 1480160 1511518 192484 -1704330 -2222076 -1394638 -1056482 -1516048 -1142416 303457
6868 303457 877742 76653 253643 2547325 4149939 2294080 -1184665 -2383815 -918768
6859 -918768 420588 668061 1576492 3482683 3980039 1805601 -937509 -1943795 -1718183
6850 -1718183 -1815328 -2126470 -1841173 -1550774 -2236632 -3025217 -2031751 734394 2958017
6841 2958017 2723569 523905 -1668522 -2489497 -1990972 -939545 99908 902252 1163047
6832 1163047 532988 -687142 -1456856 -1192620 -613528 -668370 -1076743 -897717 -155409 320266
6822 320266 480110 1109213 2208341 2675343 1927801 682767 -209329 -652513 -801664
6813 -801664 -763778 -962565 -1621933 -1798552 -341022 1999867 3028526 2074903 824258
6804 824258 578503 470322 -610889 -1920876 -1975444 -655344 881658 1540154 906996
6795 906996 -439372 -899536 475461 2101071 1594248 -359807 -574923 1405392 2000899
6786 2000899 -581893 -2673631 -490409 3625155 4390144 1232598 -1676442 -2184856 -2303477
6777 -2303477 -3340589 -3388468 -1177630 1092340 887606 -1029386 -2035097 -1161910 328365
6768 328365 808323 -266777 -1917359 -2269825 -607402 1363819 1688444 1075456 1529790
6759 1529790 2586502 1899966 -304877 -927449 799927 1435702 -1280922 -4478773 -4537544
6750 -4537544 -2753154 -2964976 -5219658 -5845166 -3376806 -578884 7503 -704894 -782727
6741 -782727 -306392 -212305 6403 1246706 2369207 1182397 -1895980 -3170103 -29861
6732 -29861 5071175 6944421 3982187 52978 -900098 -31291 -1121050 -4450745 -6494374
6723 -6494374 -5539595 -4004426 -4054789 -4189886 -2240577 832131 2654381 3006046 3021106
6714 3021106 2402458 372919 -1617405 -1211811 1135690 2495528 1506988 -301742 -1201560
6705 -1201560 -904150 498888 2755440 4321992 3427195 782820 -931689 -636972 399484
6696 399484 1551338 3557183 5512802 4603447 672858 -2098286 -683177 2277625 2581478
6687 2581478 834931 825063 2902390 3517355 1438673 48747 1949161 4797576 4874412
6678 4874412 2409993 728562 1438038 2998538 3569127 3066649 2193028 1049409 -622823
6669 -622823 -2599573 -4086153 -4316589 -3274048 -1913572 -1305698 -1414594 -1354118 -1064344
6660 -1064344 -1653424 -3339374 -4241013 -2640207 330311 1984156 1662078 1090680 1259668
6651 1259668 1246648 720706 1130803 2917951 3761580 1919393 -303764 630952 3997487
6642 3997487 5402788 3032426 -55277 -950187 -915496 -2209716 -3680876 -2850680 -778179
6633 -778179 -993899 -3815895 -5420326 -3446269 -316585 689911 46753 355719 1976113
6624 1976113 2986513 2591179 1883447 1368488 204166 -1569060 -2100448 -81891 3267248
6615 3267248 5532199 5553561 3869713 1622634 -183324 -1054687 -1442609 -2294854 -3599540
6606 -3599540 -4055950 -2900830 -1336590 -1156808 -2431040 -3596528 -3553233 -2598366 -1409241
6597 -1409241 -217469 850481 1580472 2110221 2757789 3133694 2280708 205704 -1449237
6588 -1449237 -1010886 1257654 3386804 3756321 2464254 741764 -469970 -1078091 -1189339
6579 -1189339 -457179 1406483 3602443 4582231 3890677 2954164 3225744 4102337 3746402
6570 3746402 1633111 -921511 -2590203 -3084125 -2479658 -1067033 -36721 -595378 -1955968
6561 -1955968 -2034083 -772799 -596059 -2393882 -3498539 -1725486 792606 739324 -1043857
6552 -1043857 -946545 1416279 2542869 694638 -1610948 -1931040 -1235201 -1086668 -621124
6543 -621124 1156976 2587419 1806496 164621 125459 1090635 605890 -1066867 -1154965
6534 -1154965 780275 1702776 -190607 -2576191 -2419489 -29461 2128279 2949709 3012827
6525 3012827 2559867 1344305 94851 167304 1467704 2151481 985165 -865447 -1111351
6516 -1111351 888961 3188492 3263550 798194 -1911077 -2508243 -1083471 387384 620820
6507 620820 44580 -533105 -869685 -567690 1132344 3882371 5634632 4763834 2188954
6498 2188954 270351 62836 755678 1400248 1887653 2287656 2402002 2135032 1462134
6489 1462134 88234 -1962319 -3613647 -3765030 -2976983 -2794860 -3317872 -3008943 -1322352
6480 -1322352 169965 104574 -810286 -1378966 -1837165 -2720145 -3251853 -2787965 -2707078 -4519965
6470 -4519965 -6826105 -6822976 -4645240 -3321878 -4036264 -4471017 -2994658 -1495587 -2057200
6461 -2057200 -3369578 -3082998 -1777343 -1563677 -2125402 -1508888 -88739 -139521 -1512637
6452 -1512637 -1441154 669622 1921479 788402 -236729 944168 2226141 1005868 -907152
6443 -907152 9343 2895675 3379446 260173 -2739621 -2632295 -995874 -676849 -1605271
6434 -1605271 -1934449 -1310792 -903303 -1398306 -2616075 -4134260 -5004002 -3980158 -1362918
6425 -1362918 543882 256256 -713602 -75263 1897900 3027081 2343468 616389 -1467847
6416 -1467847 -3467596 -4062138 -2290491 100037 148916 -1981005 -2755512 -401316 2202511
6407 2202511 1533641 -1621310 -3472011 -2316658 -3949 1262230 1429653 1630900 2257553
6398 2257553 2623950 1878820 40401 -1578219 -1405647 365313 1471655 220377 -2212860
6389 -2212860 -3308227 -2484597 -1442682 -1571884 -2621757 -3912843 -5166890 -5793706 -4946220
6380 -4946220 -2922563 -1200134 -460334 113393 899935 705727 -1245205 -3359819 -3224712
6371 -3224712 -584259 2427708 3689974 2798232 784858 -942319 -1677965 -2113714 -3491075
6362 -3491075 -5535347 -6180953 -4289247 -1565483 -339549 -361859 331412 1974028 2748565
6353 2748565 1894177 815914 523636 114778 -1187276 -2407909 -2603015 -2636510 -3519807
6344 -3519807 -4283263 -3443208 -1729273 -1256194 -2347305 -3276595 -3228620 -3408648 -4604769
6335 -4604769 -5595798 -5189488 -4345474 -4652191 -5624119 -5403244 -3924291 -3448481 -5336553
6326 -5336553 -7804251 -8061818 -5814705 -3304786 -2238198 -2054185 -1369670 113273 1640648
6317 1640648 2363750 1697993 -327591 -2372779 -2441980 -289169 1677834 1166030 -1055791
6308 -1055791 -2461413 -2307607 -1888090 -1648742 -587849 1081712 1336923 -371795 -1615159
6299 -1615159 -540150 1114158 812111 -643718 -562716 1070504 1581991 -42535 -1819230
6290 -1819230 -2244753 -2307340 -2973382 -3129159 -1621872 478740 1416822 1297620 1451606
6281 1451606 2155857 2539945 2176992 1416240 525266 -408071 -1128060 -1692454 -2734131
6272 -2734131 -4251522 -4808367 -3214364 -555371 840477 323561 -489381 -115544 1011434
6263 1011434 1505531 871762 -116318 -476348 -159881 -151170 -1212766 -2576672 -2666619 -1384020
6253 -1384020 -514937 -1127682 -1912661 -1431980 -714824 -1638625 -3623069 -4337564 -3392837
6244 -3392837 -2823147 -3676214 -4525645 -3977558 -2502180 -1090572 -163577 -434992 -2495125
6235 -2495125 -4659726 -3871651 -143856 2523818 1464485 -1066658 -1860309 -1516579 -2115238
6226 -2115238 -2586171 -468322 3159739 4755536 3668971 2383898 1840157 778295 -342423
6217 -342423 527516 2389569 1643462 -1433186 -1790218 2373494 5752783 3766166 -246779
6208 -246779 -414280 2622359 3627744 1439392 -279070 -72684 -622302 -3197072 -5311464
6199 -5311464 -5125524 -3947448 -3052766 -1790130 -150372 373803 -175349 140488 1186508
6190 1186508 315496 -2402571 -2794119 904442 4277487 3126940 65277 261018 3373968
6181 3373968 4807595 3242689 1530357 763442 -1074304 -4078314 -5199118 -3527550
6173 -3527550 -2315497 -3626792 -4879198 -3336116 -734408 -316302 -1745869 -2296191 -1367755
6164 -1367755 -517461 -84146 978401 2399367 2745156 2219714 2499795 3498159 3059575
6155 3059575 716594 -801478 694377 3521979 4364546 2663178 932996 1201600 2738457
6146 2738457 3347784 1788274 -1274134 -3994446 -4896744 -4167818 -3407418 -3785653 -4721567
6137 -4721567 -4835106 -3843013 -2815213 -2714943 -3377802 -3920047 -3601183 -2349681 -952787
6128 -952787 -546102 -1334832 -2144321 -2018701 -1796889 -2849553 -4570936 -4907877 -3596833
6119 -3596833 -2824783 -3768383 -4501663 -2961704 -339177 572319 -750650 -2563830 -3824396
6110 -3824396 -4701848 -4788617 -3611770 -2673590 -3884919 -5783353 -4766765 -911010 1239824
6101 1239824 -539050 -2450086 -708256 2255782 1868390 -898975 -1190603 1485667 2373337
6092 2373337 -600558 -3444570 -2677451 -563166 -639986 -1845412 -1210179 173292 -1333166
6083 -1333166 -5316012 -6876357 -3499209 1358378 3073629 1441837 -498616 -1090285
6075 -1090285 -985907 -528742 1063860 3638373 5345456 4959036 3607479 2928891 2412199
6066 2412199 262409 -3291366 -5471113 -4505171 -2199377 -1598660 -3027959 -4056798 -2950313
6057 -2950313 -511457 1458697 1991307 1077157 -562293 -1491287 -703502 863168 1234730
6048 1234730 80915 -1003948 -1131803 -1080308 -1031501 307216 2995369 4561281 3410061
6039 3410061 1573454 1621469 2510487 1468013 -1211103 -2710810 -2512092 -2914730 -4418361
6030 -4418361 -4419155 -1875535 190711 -897944 -3265098 -3360959 -1064799 1041276 2152467
6021 2152467 3691539 5613421 5548966 2579921 -555017 -661243 1736520 2985242 764231
6012 764231 -3153151 -4875759 -2685361 1109935 2804686 1416156 -621492 -970204 -362595
6003 -362595 -1016265 -2899353 -3322451 -560269 3487385 5252370 3607682 1033624 511066
5994 511066 1969469 2634814 894686 -1275539 -753512 2452696 4988496 4468869 2351014
5985 2351014 1509335 2316833 2730471 1578376 49039 -120118 1289720 2910076 3039736
5976 3039736 1057721 -1803501 -3483246 -3518159 -3633362 -4934238 -5712402 -3939889 -1052381
5967 -1052381 -549479 -2816043 -4250908 -2511267 83747 197906 -1601185 -2030801 -93998
5958 -93998 1612311 491793 -3003307 -6180166 -6755282 -4537802 -1382285 390965 45174
5949 45174 -1218823 -2131995 -2726602 -3251506 -2958150 -1372178 89663 -384454 -2121507
5940 -2121507 -2401335 -74565 2795028 3554807 2115651 676612 894986 2048596 2005353
5931 2005353 -166838 -2807677 -3459274 -2075208 -1244736 -2539379 -4091318 -3331504 -893784
5922 -893784 463485 147540 223214 1546760 2327337 1554497 1184805 3010897 5262685
5913 5262685 4692121 1164587 -1970611 -1929105 672203 3090035 3399863 1978090 771496
5904 771496 1264532 2970927 4174706 4134252 3731900 3734538 3571542 2482808 776180 -888786
5894 -888786 -2387021 -3359641 -2788230 -659612 1060808 784510 -219507 424342 2526993
5885 2526993 3483430 1963181 -592129 -2357804 -2995393 -2594897 -762381 2078540 3994063
5876 3994063 3612811 2036430 1376236 1913095 1952199 336214 -2009909 -3327165 -3131316
5867 -3131316 -2540042 -2602480 -2845011 -2066015 -478529 12701 -1582812 -3412938 -2911430
5858 -2911430 -404801 1244290 753394 135333 1324456 2929082 2178586 -900640 -3340777
5849 -3340777 -3116010 -1322801 -85426 138292 238300 498026 195383 -1126538 -2935095
5840 -2935095 -4294911 -4554072 -3443020 -1194130 1180677 2350782 1909503 801949 75644
5831 75644 -341482 -956357 -1325645 -580665 710324 708601 -1038614 -2487351 -1808676 -129609
5821 -129609 39534 -1506530 -2459707 -1508853 -171986 -432723 -2034717 -3167860 -2855544
5812 -2855544 -1607123 -378751 116796 -439456 -1553617 -2000690 -1218478 -291559 -555427
5803 -555427 -1475272 -1193490 623640 1835804 565997 -2039852 -3030534 -1334021 1041969
5794 1041969 1737509 818927 62616 286802 620289 253896 -335967 -341729 101931 278155
5784 278155 2163 -278398 -218112 113173 472051 636241 565623 581163 1009547 1487477
5774 1487477 1264416 506559 408313 1330418 1744869 134491 -2690362 -4422253 -4029327
5765 -4029327 -2479936 -1030151 -155789 -22204 -523855 -761712 75687 1124841 650139
5756 650139 -1260576 -2488228 -1999157 -1408156 -2346980 -3937806 -4488321 -4370706 -5110729
5747 -5110729 -6260953 -5500152 -2140287 1364737 2306687 924594 -271700 307830 1811406
5738 1811406 2423901 1553865 284574 -23942 733627 1347363 698882 -909944 -1972705
5729 -1972705 -1349463 460011 1720428 1187148 -652344 -2176504 -2345905 -1532892 -724503
5720 -724503 -439298 -615265 -990746 -1185034 -883458 -394667 -507750 -1268477 -1517764 -382990
5710 -382990 1391566 2526118 3000592 3599542 4191268 3906034 2757667 1557950 367825
5701 367825 -1252736 -2445135 -1561753 969612 2340121 1032195 -921298 -757087 1322903
5692 1322903 2881756 2674043 1640501 1009417 974493 1142371 1083710 397737 -940096
5683 -940096 -2284371 -2869183 -2484554 -1404991 -251510 -164225 -2057879 -5001001 -6352276
5674 -6352276 -4548557 -1079673 1208477 1107411 -424189 -1796446 -1859528 -388909 1306713
5665 1306713 1159616 -948216 -2184837 -129924 3634260 5286125 3749721 1743030
5657 1743030 1660112 2535718 1998783 -317534 -2531982 -2877163 -1290063 1034555 2918854
5648 2918854 3874553 3754338 2264642 -424305 -2679575 -2405166 199306 2183673 1382974
5639 1382974 -780782 -1598611 -958422 -744287 -1281572 -1221151 -790590 -2032231 -5043443
$$ [...]
##END NTUPLES=NMR SPECTRUM
##END=
