##TITLE=31Pdec_PR184_CR2
 d2O, 24 sc
 29.09.2021
##JCAMPDX= 6.0         $$ Bruker NMR JCAMP-DX V2.0
##DATA TYPE= NMR SPECTRUM
##DATA CLASS= NTUPLES
##ORIGIN= UXNMR, Bruker Analytische Messtechnik GmbH
##OWNER= root
$$ XWIN-NMR		Version 3.5
$$ Wed Sep 29 13:08:05 2021 Russian Standard Time (UT+4h)  she@DPX200
##.OBSERVE FREQUENCY= 81.013821
##.OBSERVE NUCLEUS= ^31P
##.ACQUISITION MODE= SIMULTANEOUS
##.ACQUISITION SCHEME= undefined
##.AVERAGES= 24
##.DIGITISER RES= 16
##SPECTROMETER/DATA SYSTEM= spect
##.PULSE SEQUENCE= zgpg30
##.SOLVENT NAME= D2O
##.SHIFT REFERENCE= (INTERNAL, D2O, 0, 248.564)
##AUDIT TRAIL= $$ (NUMBER, WHEN, WHO, WHERE, WHAT)
$$ ##TITLE= Audit trail, XWIN-NMR		Version 3.5
$$ ##JCAMPDX= 5.01
$$ ##ORIGIN= Bruker BioSpin GmbH
$$ ##OWNER= she
$$ F:/spectra/data/she/nmr/P31/1/pdata/1/auditp.txt
$$ ##AUDIT TRAIL=  $$ (NUMBER, WHEN, WHO, WHERE, WHAT)
(   1,<2021-09-29 13:05:58.62 +0400>,<she>,<DPX200>,
      <created by zg, POWCHK disabled, PULCHK disabled
       configuration hash MD5:
       00 E9 B6 7A A2 85 ED C7 34 08 36 98 17 FE 4E 26
       data hash MD5: 32K
       BD CF 51 A8 60 94 6B C7 C2 5A 5F 49 F7 D4 C8 E6>)
(   2,<2021-09-29 13:06:01.67 +0400>,<she>,<DPX200>,
      <Start of raw data processing
       efp BC_mod = 2 LB = 1 FT_mod = 6 PKNL = 1 PHC0 = -8768.747 PHC1 = -73.73071 SI = 64K 
       data hash MD5: 64K
       AC 47 8A E9 0F 27 65 CF 36 5D 10 50 F3 C9 68 44>)
(   3,<2021-09-29 13:06:31.10 +0400>,<she>,<DPX200>,
      <pk PHC0 = -87.92126 PHC1 = 210.8001 
       data hash MD5: 64K
       14 F7 AB 24 26 B1 22 29 7B 39 EA F1 76 B2 E3 39>)
$$ ##END=
$$ 
$$ hash MD5
$$ F0 ED EE 56 DB 14 3D 20 50 E2 01 06 AE 4A 24 37
##$RELAX= 
##$RELAX= 
##$RELAX= 
##$RELAX= 
##$RELAX= 
##$RELAX= 
##$RELAX= 
##$RELAX= 
$$ Bruker specific parameters
$$ --------------------------
##$DU= <F:/spectra>
##$EXPNO= 1
##$NAME= <P31>
##$PROCNO= 1
##$TYPE= <nmr>
##$USER= <she>
##$AMP= (0..31)
100 100 100 100 100 100 100 100 100 100 100 100 100 100 100 100 100 100 
100 100 100 100 100 100 100 100 100 100 100 100 100 100 
##$AQSEQ= 0
##$AQ_mod= 1
##$AUNM= <au_zg>
##$AUTOPOS= <>
##$BF1= 81.014009
##$BF2= 200.13
##$BF3= 200.13
##$BF4= 200.13
##$BF5= 200.13
##$BF6= 200.13
##$BF7= 200.13
##$BF8= 200.13
##$BYTORDA= 1
##$CFDGTYP= 0
##$CFRGTYP= 5
##$CHEMSTR= <none>
##$CNST= (0..31)
1 1 145 1 1 1 1 1 1 1 1 1 1 1 1 1 1 1 1 1 1 1 1 1 1 1 1 1 1 1 1 1 
##$CPDPRG= <waltz16>
##$CPDPRG1= <>
##$CPDPRG2= <waltz16>
##$CPDPRG3= <>
##$CPDPRG4= <mlev>
##$CPDPRG5= <mlev>
##$CPDPRG6= <mlev>
##$CPDPRG7= <mlev>
##$CPDPRG8= <mlev>
##$CPDPRGB= <>
##$CPDPRGT= <>
##$D= (0..31)
0 1 0 0 0 0 0 0 0 0 0 0.03 2e-05 3e-06 0 0 0 0 0 0 0 0 0 0 0 0 0 0 0 0 
0 0 
##$DATE= 1632906357
##$DBL= (0..7)
120 120 120 11 120 120 24 19 
##$DBP= (0..7)
150 150 150 150 150 150 150 150 
##$DBP07= 0
##$DBPNAM0= <>
##$DBPNAM1= <>
##$DBPNAM2= <>
##$DBPNAM3= <>
##$DBPNAM4= <>
##$DBPNAM5= <>
##$DBPNAM6= <>
##$DBPNAM7= <>
##$DBPOAL= (0..7)
0.5 0.5 0.5 0.5 0.5 0.5 0.5 0.5 
##$DBPOFFS= (0..7)
$$ [...]
##$SUBNAM2= <"">
##$SUBNAM3= <"">
##$SUBNAM4= <"">
##$SUBNAM5= <"">
##$SUBNAM6= <"">
##$SUBNAM7= <"">
##$SUBNAM8= <"">
##$SUBNAM9= <"">
##$SW= 501.771253377433
##$SWIBOX= (0..15)
0 1 3 0 0 0 0 0 0 0 0 0 0 0 0 0 
##$SW_h= 40650.406504065
##$TD= 32768
##$TD0= 1
##$TE= 0
##$TE2= 300
##$TE3= 300
##$TEG= 300
##$TL= (0..7)
0 120 53 12 22 120 120 120 
##$TP= (0..7)
150 150 150 150 150 150 150 150 
##$TP07= 0
##$TPNAME0= <>
##$TPNAME1= <>
##$TPNAME2= <>
##$TPNAME3= <>
##$TPNAME4= <>
##$TPNAME5= <>
##$TPNAME6= <>
##$TPNAME7= <>
##$TPOAL= (0..7)
0.5 0.5 0.5 0.5 0.5 0.5 0.5 0.5 
##$TPOFFS= (0..7)
0 0 0 0 0 0 0 0 
##$TUNHIN= 0
##$TUNHOUT= 0
##$TUNXOUT= 0
##$USERA1= <user>
##$USERA2= <user>
##$USERA3= <user>
##$USERA4= <user>
##$USERA5= <user>
##$V9= 5
##$VALIST= <valist>
##$VCLIST= <CCCCCCCCCCCCCCC>
##$VD= 0
##$VDLIST= <DDDDDDDDDDDDDDD>
##$VPLIST= <PPPPPPPPPPPPPPP>
##$VTLIST= <TTTTTTTTTTTTTTT>
##$WBST= 1024
##$WBSW= 4
##$XGAIN= (0..3)
0 0 0 0 
##$XL= 0
##$YL= 0
##$YMAX_a= 2202
##$YMIN_a= -1294
##$ZGOPTNS= <>
##$ZL1= 120
##$ZL2= 120
##$ZL3= 120
##$ZL4= 120
##$ABSF1= 0
##$ABSF2= 0
##$ABSG= 0
##$ABSL= 0
##$ALPHA= 0
##$AQORDER= 0
##$ASSFAC= 0
##$ASSFACI= 0
##$ASSFACX= 0
##$ASSWID= 0
##$AUNMP= <proc_1d>
##$AZFE= 0.1
##$AZFW= 0.5
##$BCFW= 0
##$BC_mod= 2
##$BYTORDP= 0
##$COROFFS= 0
##$CY= -3
##$DATMOD= 1
##$DC= 0
##$DFILT= <>
##$DTYPP= 0
##$F1P= 0
##$F2P= 0
##$FCOR= 1
##$FTSIZE= 65536
##$FT_mod= 6
##$GAMMA= 0
##$GB= 0
##$INTBC= 1
##$INTSCL= 5.30512e-09
##$ISEN= 30
##$LB= 1
##$LEV0= 0
##$LPBIN= 0
##$MAXI= 10000
##$MC2= 0
##$MEAN= 0
##$ME_mod= 0
##$MI= 50
##$NCOEF= 0
##$NC_proc= -7
##$NLEV= 6
##$NOISF1= 182.463
##$NOISF2= 159.3651
##$NSP= 0
##$NTH_PI= 0
##$NZP= 0
##$OFFSET= 248.5645
##$PC= 4
##$PHC0= -8856.668
##$PHC1= 137.0694
##$PH_mod= 1
##$PKNL= yes
##$PPARMOD= 0
##$PSCAL= 0
##$PSIGN= 0
##$REVERSE= no
##$SF= 81.014009
##$SI= 65536
##$SIGF1= 159.3651
##$SIGF2= -187.1042
##$SINO= 113.3802
##$SIOLD= 16384
##$SREGLST= <1H.CDCl3>
##$SSB= 0
##$STSI= 65536
##$STSR= 0
##$SW_p= 40650.406504065
##$SYMM= 0
##$S_DEV= 0
##$TDeff= 32768
##$TDoff= 0
##$TI= <>
##$TILT= no
##$TM1= 0
##$TM2= 0
##$TOPLEV= 0
##$USERP1= <user>
##$USERP2= <user>
##$USERP3= <user>
##$USERP4= <user>
##$USERP5= <user>
##$WDW= 1
##$XDIM= 65536
##$YMAX_p= 349602430
##$YMIN_p= -40058335
$$ End of Bruker specific parameters
$$ ---------------------------------
##NTUPLES= NMR SPECTRUM
##VAR_NAME=  FREQUENCY,     SPECTRUM/REAL,   SPECTRUM/IMAG
##SYMBOL=    X,             R,               I
##VAR_TYPE=  INDEPENDENT,   DEPENDENT,       DEPENDENT
##VAR_FORM=  AFFN,          ASDF,            ASDF
##VAR_DIM=   65536,         65536,           65536
##UNITS=     HZ,            ARBITRARY UNITS, ARBITRARY UNITS
##FACTOR=    0.620285442955139, 1,           1
##FIRST=     20137.2065510759, 0,            0
##LAST=      -20513.1999529892, 0,           0
##MIN=       -20513.1999529892, -40058335,   0
##MAX=       20137.2065510759, 349602430,    0
$$ Real data points
##PAGE= N=1
##DATA TABLE= (X++(R..R)), XYDATA
$$ [...]
45228 -2438028 -1956162 -252640 -128189 -2005134 -3238809 -2554400 -2018828 -3276693 -4786035
45219 -4786035 -4717804 -4056854 -4497477 -5331036 -5013429 -4227965 -4599172 -5434817 -4672338 -2611521
45209 -2611521 -1794939 -2945437 -3683417 -2135858 373030 1503161 1093781 591578 363369
45200 363369 -559094 -2234310 -3010969 -1681780 543993 1316770 209860 -537156 1232137
45191 1232137 4861322 7698272 8150586 6805450 4676916 1924087 -990948 -2360269
45183 -2360269 -1117260 913523 585168 -2376088 -4420757 -2545029 1537696 3273812
45175 3273812 963856 -2334530 -3158894 -2059290 -2025287 -3637126 -4269751 -2368673 -134741
45166 -134741 -499860 -2965439 -4366126 -3071301 -495583 1470756 2699621 4012390
45158 4012390 5576419 6945667 7836106 8128589 7634066 6386521 4821506 3429039 2584880
45149 2584880 2611532 3280080 3385459 1949914 14799 -85964 2205502 4609361 4859758
45140 4859758 3406282 2128138 1487881 582645 -660725 -1212744 -809861 -445967 -732538
45131 -732538 -1177227 -1461766 -2073609 -3086765 -3567709 -2975362 -2081265 -1646527 -1222415
45122 -1222415 -312161 272162 -357853 -1232836 -494627 1808726 3439019 2736559 418652
45113 418652 -1713831 -2734482 -2872509 -2870861 -3459241 -4541694 -4728535 -2868300 -214020
45104 -214020 569309 -927614 -2103372 -1262410 -188639 -1113038 -3085743 -3720739 -2948455
45095 -2948455 -2245412 -1455521 280703 1326213 -741394 -4290668 -4812300 -1767911 144735
45086 144735 -1683571 -3624258 -1896769 1217218 1288731 -1212122 -2511698 -2132721 -2792601
45077 -2792601 -4633647 -4718534 -2501534 -1081087 -2054829 -3303490 -3130299 -2634694 -2377140
45068 -2377140 -605792 2918499 4832174 2718327 -1070772 -3003768 -3227115 -3736368
45060 -3736368 -4109850 -2852354 -1315663 -2105374 -4275317 -4175637 -1151589 1419092 1407565
45051 1407565 646217 1115528 1709421 753791 -864383 -1424967 -1366539 -2137638 -3304364
45042 -3304364 -3177384 -1621300 -44731 1041217 2337089 3665908 3680942 2179315 936739
45033 936739 1377663 2757691 3551099 3428248 2798812 1540128 -361203 -1705452 -1369120
45024 -1369120 -370232 -779991 -2484690 -3065196 -1569433 -296280 -1346328 -3195401 -2919959
45015 -2919959 -671318 776729 544590 670288 2009552 2120563 -961577 -5092759 -6634379
45006 -6634379 -5417486 -4461820 -5185501 -5512011 -3249333 703974 3571329 3866164 2384197
44997 2384197 841124 357722 813049 1083806 254192 -1059926 -1055534 1157230 4168931
44988 4168931 5465321 3891858 690078 -1766613 -2075882 -751888 735031 1611664
44980 1611664 2109544 2211577 1111305 -1286256 -3152312 -2459557 250407 2275348 2130847
44971 2130847 1125424 1122259 2168684 3189323 3744108 3881301 3164884 1245791 -1015201
44962 -1015201 -2173504 -1778163 -533958 731521 1495837 1474671 1017123 1019774 1554119
44953 1554119 1334179 -332991 -2003631 -2074314 -1412862 -1941089 -3251561 -3274598 -2193717
44944 -2193717 -2597958 -4952345 -6024872 -3554709 111914 1305269 -80827 -1470611
44936 -1470611 -1746399 -1749363 -1751413 -1310261 -1128310 -2364740 -4298683 -5125215 -4850499 -4862847
44926 -4862847 -4848242 -3085834 -54207 1401934 361722 -723266 -140527 462530 -634687
44917 -634687 -2063833 -1895790 -1085710 -1588882 -2672443 -2116268 -126644 885751 -8284
44908 -8284 -1491736 -2678932 -3818657 -4224152 -2411155 791056 1808326 -1395365 -6276212
44899 -6276212 -8590930 -7228777 -4628709 -3140057 -2694800 -2096149 -1127232 -580513 -816595
44890 -816595 -1213184 -1175141 -1050741 -1514335 -2396163 -2902209 -2897640 -3012377 -3305884 -2925706
44880 -2925706 -1572285 -179740 595209 1400909 2663936 3204915 1927562 78422 -39825
44871 -39825 1636053 2714494 1604956 -569590 -1738982 -1260820 47741 1203489 1651848
44862 1651848 1204545 69234 -1217863 -2170057 -2647210 -2872454 -3201755 -3555532 -3112918
44853 -3112918 -1327862 645380 766608 -1069322 -2379599 -1261537 1111863 2427196
44845 2427196 2251639 1458268 74801 -1998883 -3161459 -1691231 1230321 2632344
44837 2632344 1774852 631316 464144 531036 354283 594235 1197891 1181175 660633 495655
44827 495655 -357457 -3886960 -8642887 -9974118 -6374607 -2175587 -1543640 -2899982 -2253483
44818 -2253483 586968 2625567 2585624 1594931 260775 -1379383 -1837954 298664 3131019
44809 3131019 3160081 365267 -1614365 -741654 1073776 1573520 1049105 484425 -381073
44800 -381073 -1475254 -1269956 723821 2168505 875432 -1644144 -1944763 588408 2962339
44791 2962339 2640348 474994 -995896 -668459 718465 2278902 3678715 4357982 3504042
44782 3504042 1451796 96954 736917 1988275 1332426 -1251229 -2949777 -2121916 -818945
44773 -818945 -1698665 -3851488 -4134925 -2122673 -867483 -2111872 -3444231 -1990478 1044443
44764 1044443 2093840 596971 -246727 1541298 3657752 2991451 288207 -950466
44756 -950466 546570 2355780 2017592 -59417 -2119892 -3495099 -4175723 -3587147 -1614312
44747 -1614312 202804 396839 -215002 44141 710734 -96621 -2124183 -2668882 -389085
44738 -389085 2722539 4045016 3203826 1366367 -555308 -1848605 -1668145 -80943 1592282
44729 1592282 2450308 2976616 3593769 3627201 2707355 1839877 1850467 1944197 1131769 111024
44719 111024 367948 2047716 3821073 4373983 3313731 1220428 -724188 -1899058 -3111999
44710 -3111999 -5109815 -6420550 -4772211 -932465 1424764 586231 -1051705 -930911
44702 -930911 281049 864316 804045 343317 -1350179 -3550547 -2898901 1845719 6523471
44693 6523471 6622591 3385863 1075912 397712 -809795 -2149319 -1263081 923455 965623
44684 965623 -1021923 -1284295 946230 1933218 -120205 -2062591 -1253869 422139 491763
44675 491763 -75522 421239 967774 36497 -1408118 -1822557 -1712849 -1911029 -1477322
44666 -1477322 243707 1618451 1258452 614331 1609010 3500399 4476116 4589750 4712529
44657 4712529 4337274 2955668 1944204 2426902 2818255 1274475 -851518 -983485 494058
44648 494058 1210428 980550 1507504 2398373 1238726 -1928035 -3683591 -2025551 699893
44639 699893 1239503 -296239 -1362949 -744970 437728 839458 457555 65688 49037
44630 49037 162294 100151 -62327 -105119 -89507 -182155 -213314 47077 311501 194538 43177
44619 43177 369837 615442 -207862 -1654896 -2221386 -1748333 -1606838 -2112921 -1931086 -806109
44609 -806109 -471325 -1551119 -2009900 -480542 1230573 1229843 886879 2258157 4007792
44600 4007792 3227073 172513 -2145338 -2358242 -1446293 287532 3227349 5506369 4059975
44591 4059975 -482220 -3560485 -2773786 -960174 -1367332 -2835543 -2437989 -545898 20243
44582 20243 -1255790 -1879906 -339984 1804081 2440503 1635209 920106 1046258 1403129
44573 1403129 1054559 -396499 -2574656 -4281563 -3992335 -1316622 1918861 2982508
44565 2982508 1222468 -992162 -1170818 117772 238818 -1767364 -4163257 -5287696
44557 -5287696 -5383947 -5040526 -3841703 -1833160 -567765 -1010958 -1770628 -1192527 -22016
44548 -22016 -37348 -1095795 -1751118 -2004780 -2953272 -4062222 -3440766 -1114633 382757
44539 382757 -538019 -2379335 -2770635 -1364908 340740 943705 109485 -1599186 -3284354
44530 -3284354 -4522524 -5616229 -6559455 -6327500 -4272640 -1714024 -718590 -1526456 -2520486
44521 -2520486 -2465947 -1414908 134280 1305039 565796 -2540102 -5589204 -5453511 -2416063
44512 -2416063 72620 -56891 -1531092 -2655441 -3521477 -4367835 -4315981 -3204504 -2554625
44503 -2554625 -3131203 -3400363 -2034989 -225803 285275 -31323 388877 1507240 2014667
44494 2014667 1489774 472427 -869034 -2459620 -3366874 -2847814 -1911075 -2178487 -3408412
44485 -3408412 -3713618 -2272671 -434190 203064 -193378 -76278 1518476 3733092 4699177
44476 4699177 3692642 2103205 1608084 1857305 1268154 -178680 -868804 -485724 -653829
44467 -653829 -1720658 -1424235 1389064 3961901 3187555 436504 -238200 2024320 3988164
44458 3988164 3306620 1298764 -69915 -1146569 -2838013 -3976271 -2779584 -149940
44450 -149940 672477 -1955946 -5906927 -7721069 -6378120 -3711686 -1509218 360409
44442 360409 2397746 3525192 2414118 154743 -581309 678545 1424991 10341 -1889686
44433 -1889686 -2149935 -1535538 -1966746 -2892969 -2070857 647958 2887051 3073943 1956218
44424 1956218 639404 -735720 -1910396 -2080979 -1311198 -824461 -1185812 -1511581 -1055902
44415 -1055902 -279853 235082 689941 1301354 1799627 2217951 3028484 4045103 4445430
44406 4445430 4315660 4702724 5509755 4974109 2281640 -725103 -1681520 -412460 1557880
44397 1557880 2920818 2782608 411204 -3433752 -6012320 -5440124 -3278586 -2307812 -2436081
44388 -2436081 -1277278 1459198 3022049 1792818 -122906 92491 2247305 4075200
44380 4075200 4459631 3903728 2767799 1027508 -564056 -882196 -101475 477811 490013
44371 490013 1095053 3092242 5524659 6745441 6130358 4275268 2200145 868642 876753
44362 876753 1963997 3101202 3472043 3159477 2684404 2244708 1632222 559794 -1040058
44353 -1040058 -2634786 -3067464 -1641275 680576 2029705 1817543 1201219 1063154 756804
44344 756804 -465530 -2034162 -3069200 -3657772 -3962271 -3234642 -1201357 666449 1044189
44335 1044189 923702 1817840 2756944 1768063 -173346 102358 2970092 5096462 4513676
44326 4513676 3323782 3622149 3884821 2043399 -427053 -813655 145477 -509256 -2830103
44317 -2830103 -3678874 -1708623 595497 670924 -907476 -2033937 -1848757 -793264 460470
44308 460470 1028523 72433 -1955789 -3344318 -3124690 -2026471 -911198 413377 1988342
44299 1988342 2632075 1322386 -1148826 -3023494 -3538052 -3149825 -2396916 -1507759 -766247
44290 -766247 -372308 -133374 47448 -358911 -1878679 -4012604 -5392883 -4970638 -2866607
44281 -2866607 -292008 1243644 1099293 116163 -371197 -236584 -563256 -1749435 -2640612
44272 -2640612 -2201327 -1095621 -588320 -565808 126127 1720851 3159783 3640595 3383023
44263 3383023 2732911 1691928 763254 1107459 2936706 4493513 3804384 1246403 -802526
44254 -802526 -1091952 -1073743 -2456734 -4085733 -2952186 1501065 5766386 6156937 3288953
44245 3288953 1038294 1371033 2130564 535670 -2798090 -4733573 -3706896 -1434473
44237 -1434473 -529873 -1532845 -2690125 -2065520 526512 3369312 4302845 2496349 -885396
44228 -885396 -3622500 -4184291 -2887411 -1504588 -1469301 -2240623 -1824762 660207 3440754
44219 3440754 3945987 1913058 -456313 -1402912 -1393074 -1685848 -2448443 -3022438 -2987585 -2172653
44209 -2172653 -635102 547287 -317093 -3136620 -5226343 -4513502 -2583418 -2496247 -4159665
44200 -4159665 -4323364 -1341888 2485205 4198670 3734873 2865172 2256803 1408630 590258
44191 590258 895373 2352967 3388285 2641481 664618 -605587 89652 1990769 3220412
44182 3220412 3044009 2623314 2967225 3006198 1147851 -1761767 -3099616 -2196299 -1018690
44173 -1018690 -432864 1391345 5029081 6977124 3953678 -1574566 -3818717 -1151171
44165 -1151171 2383975 3238832 2402654 2133250 2043193 701815 -1186244 -1765993 -930596
44156 -930596 -91897 95207 -18642 -379568 -1146103 -1888819 -2260860 -2778129 -3636989 -3719755
44146 -3719755 -2372123 -1184774 -2016632 -3953879 -4412449 -2818262 -881644 549188
44138 549188 2329059 4512895 5694265 5579021 5666302 6253913 5281661 1812880 -1599905
44129 -1599905 -2212943 -1001426 -839299 -2088619 -2686803 -1843337 -805856 -94986 1231301
44120 1231301 3098552 3757408 2572764 1334656 1562348 2315508 2086721 1241141 862388
44111 862388 525727 -681617 -1771912 -868733 1506208 2474236 707537 -1686436 -2246038
44102 -2246038 -1500777 -1728025 -3449748 -4990645 -5176356 -4680044 -4356714 -3730026 -2012084
44093 -2012084 273715 1717486 1718604 893830 -100982 -1320378 -2842838 -3957918 -3647866
44084 -3647866 -1839003 225791 1079485 426707 -660486 -911914 -126457 734096 648742
44075 648742 -265141 -671142 632288 3063969 4309565 2657296 -799015 -3119761 -2834292
44066 -2834292 -1299759 -372230 -97016 197945 -91066 -1731559 -3335479 -2724285 -700483
44057 -700483 -743489 -3982468 -7002955 -6382738 -3291446 -1251008 -928049 -115973 1754063
44048 1754063 2307253 91287 -2769263 -3180089 -868431 1768124 2765215 2349049 1867737
44039 1867737 1876064 1622096 353494 -1215587 -1464515 -117737 1072114 721492 -60510
44030 -60510 732516 2958344 4482680 4101490 2701510 1541220 920969 690973 657094
44021 657094 338220 -345003 -193175 1849168 4378543 4588281 2081190 -295260 -179685
44012 -179685 1530307 2594510 2419922 1862943 1388641 809635 15247 -1061879 -2436234
44003 -2436234 -3334005 -2492503 58001 2568046 3640161 3587058 3048799 1692448 -626876
43994 -626876 -2659940 -3010580 -1790805 -106970 1252776 1903150 1701816 1245343 1434540
43985 1434540 1984436 1724855 858079 1061849 2569289 3327157 2321963 1501498 2659176
43976 2659176 4512881 4941952 4227141 3816713 3618568 2920645 2400001 2739205 2801452
43967 2801452 1714996 1059599 2144142 2963225 1294354 -865261 -6993 2970840 4016971
43958 4016971 2397804 1119656 1045653 -165853 -2482846 -2287141 1263809 3583331 1252298
43949 1252298 -2843182 -4239546 -3206369 -2637333 -2587878 -1163333 990749 1336462 -168767
43940 -168767 -1005233 -252948 271516 -800539 -2671534 -4219966 -5415488 -6346979 -6463861
43931 -6463861 -5394245 -3550256 -1659847 -299538 311108 603672 1236881 1863543 1244795
43922 1244795 -643682 -1781590 -576458 1805150 2892183 1877629 -136121 -1978276
43914 -1978276 -3054786 -2935587 -1902463 -1415135 -2510082 -4045491 -3904397 -1744965 574381
43905 574381 1101049 -481602 -2696347 -3158620 -641615 2780913 2995881 -1254652 -6030330
43896 -6030330 -6645686 -3340602 -250631 349038 -1024 541201 1553124 1825290 1037566
43887 1037566 -735883 -3181498 -4815268 -3949018 -1303657 405688 343844 769591 3057904
43878 3057904 4774332 2893276 -1556277 -4496694 -3812266 -1208266 698865 1156386
43870 1156386 921254 790845 1063122 1400150 834399 -1219737 -3770906 -5072175 -4888064
43861 -4888064 -4760132 -5475846 -5606537 -3759628 -1280784 -922717 -3005734 -4714218 -3725427
43852 -3725427 -997357 972702 1314606 853683 93270 -989145 -1565244 -437606 1829364
43843 1829364 3075958 2450672 1505362 1590599 1849244 1086295 139612 583599 1981710
43834 1981710 2338871 913696 -1112637 -2553588 -3162034 -2781584 -1337993 100122 7948
43825 7948 -1282842 -1559063 176825 2062076 1929061 223350 -1054173 -1347973 -1729512
43816 -1729512 -2503604 -2568965 -1526699 -759765 -1405279 -2336946 -1518626 1016551 2918079
43807 2918079 2550286 1176380 1268406 3204324 4767497 4012314 1568559 -540638 -1558127
43798 -1558127 -2293851 -3021219 -2607803 -489279 1613599 1326013 -1381116 -4155394 -5214842
43789 -5214842 -4930073 -4203381 -3018247 -1621414 -1460856 -3082375 -4242419 -2501601 795383
43780 795383 1774380 -603875 -3198210 -3415231 -2392203 -2023755 -1690802 -320262 675300
43771 675300 -443895 -2266461 -2163717 -678879 -647288 -2489113 -3811501 -3635943 -3561224
43762 -3561224 -4289962 -4393648 -3430708 -3059977 -3763817 -3509357 -1339861 479453 -88932
43753 -88932 -1630260 -1682044 -437126 121995 -744231 -2311321 -3832808 -4508203 -3452933
43744 -3452933 -1318940 -405505 -1538971 -2523951 -1412752 530032 1066454 245125 -802088
43735 -802088 -2287163 -4255896 -4537493 -1550901 2098379 2364023 -517761 -2436375 -1294458
43726 -1294458 780252 1217919 -95049 -2139135 -4165375 -5091589 -3929188 -1582619
43718 -1582619 -263829 -639205 -1365980 -1549958 -1554225 -1255712 148331 2186881 3199182
43709 3199182 2854917 2488501 2559101 2068765 1020075 1026817 2592609 3962418 3657314
43700 3657314 2201460 511609 -1345783 -2845651 -2615458 -656934 866799 387545
43692 387545 -1062451 -1716940 -1399951 -903933 -577681 -623988 -1373000 -2301978 -2245666 -1373568
43682 -1373568 -1254547 -2173170 -2448023 -1480112 -1150616 -2624351 -4102688 -3848255 -3275619
43673 -3275619 -4387993 -5910767 -5139345 -2588471 -1419092 -2424653 -2834876 -743198
43665 -743198 2038490 2750197 1218584 -808325 -2330629 -3484034 -4141348 -3762137 -2498920
43656 -2498920 -1226987 -291646 827733 2225777 2838710 1892483 544816 714307 2154980
43647 2154980 2295980 -61762 -2359659 -1387128 2047940 3814688 1867597 -1280167
43639 -1280167 -2318380 -1518404 -1869365 -4807097 -8319486 -9278335 -6842370 -3266505 -1410674
43630 -1410674 -1649611 -1844293 -523345 1122708 1369269 738732 839700 1367833 614957
43621 614957 -1368395 -2585094 -2178868 -1342072 -854780 -143735 702237 468002 -846470
43612 -846470 -1593324 -1238096 -1133824 -1626533 -1074311 951560 2233213 1391926 203847
43603 203847 442798 936235 114524 -859038 -236437 1009848 939786 124472 440377 1657116
43593 1657116 2105595 1690142 1457271 1212985 446279 606945 3266620 6650005 7271566
43584 7271566 4797312 2195480 1220069 928159 703740 1342730 2565667 2680005 1598748
43575 1598748 1174892 1561568 429567 -2716350 -4616196 -2852154 337539 1526875
43567 1526875 1138791 1728604 2732928 911875 -3889952 -7140755 -5335460 -726588
43559 -726588 1826137 1084555 -122309 602 -204392 -2258030 -4272744 -3577995 -1038597
43550 -1038597 107798 -785774 -959598 1224297 3801485 4386086 3344934 2247553 1323759
43541 1323759 314830 -28381 623688 797311 -657679 -2456616 -2942845 -2771407 -3247047
43532 -3247047 -3462240 -1751964 1173338 3275667 4303498 5088758 4975657 3229435 1910989
43523 1910989 3468026 6052452 5498062 1965476 83125 1760034 3530400 2602106
43515 2602106 977517 1138494 1835919 1360067 1321330 3249314 4321854 1037714 -4532231
43506 -4532231 -6724364 -3903413 40266 1786402 2140356 2668492 2502071 470515 -2088881
43497 -2088881 -2939970 -2045992 -1138608 -924253 -434996 973643 2349734 2281211 642958
43488 642958 -1206971 -1822293 -1142299 -622330 -1764294 -4288658 -5927686 -4596776 -985485
43479 -985485 1642216 916148 -1776862 -2873179 -888531 2180886 3797422 3567037 2360777
43470 2360777 631134 -976590 -970453 998567 2612599 1601661 -763240 -1281689 529584
43461 529584 1994516 1437417 108096 -489125 -660279 -1127206 -1806281 -2824474 -4628471
43452 -4628471 -6241596 -5657087 -3014925 -1081084 -1247716 -1438031 226644 1969814 1003827
43443 1003827 -2051975 -4102316 -3962191 -3212836 -3099157 -2981329 -2008452 -427122 1126762
43434 1126762 2245290 2405741 1196533 -808672 -2288805 -2569922 -2221469 -2151227 -2505150
43425 -2505150 -2527015 -1434864 382350 1277686 170779 -1713702 -2073158 -560939 798076
43416 798076 545305 -456158 -875923 -858962 -1035556 -1096103 -690025 -466502 -785208 -551158
43406 -551158 1059692 2669510 2269335 174382 -1250812 -580766 1352911 2985410 3611097
43397 3611097 3395864 2723688 1731758 209162 -1816299 -3386362 -3328921 -1886880 -630902
43388 -630902 -464646 -860236 -1244772 -1547687 -1046900 1248071 4268661 5224493 3529935
43379 3529935 2066150 2878553 4067718 3189708 1325903 798215 845742 -861008 -3733651
43370 -3733651 -5116342 -4919974 -5429846 -6507283 -5102106 -586682 3068786 2343232 -1249649
43361 -1249649 -3635930 -3307201 -1922062 -1084750 -666791 -87593 297615 -364365 -2015345
43352 -2015345 -3241821 -2750811 -1216966 -673844 -1749612 -2883483 -3033220 -3378733 -4862364
43343 -4862364 -5866594 -4549711 -1997203 -453714 323972 1974602 3795294 3530579
43335 3530579 1468651 189534 203843 -511377 -2203137 -2402353 -416181 884046 -472104
43326 -472104 -2442508 -2388049 -925263 -142041 -216349 -191927 -450762 -2086314 -4756577
43317 -4756577 -6844832 -7078175 -5173751 -2057133 42793 -566002 -2523432 -2769428 -963712
43308 -963712 23318 -1084898 -1760914 73182 2606476 3237009 2419711 1817968 1067996
43299 1067996 -644037 -1850798 -870418 946102 1156445 120858 -92421 515138 397020
43290 397020 -147650 614945 2518778 3569332 3028093 1763697 134399 -1628480 -1646025
43281 -1646025 1623515 5843419 6679773 3478818 -120054 -1529428 -1804973 -2262935 -2073429
43272 -2073429 -724773 120611 -812029 -2166428 -2061712 -759534 275759 549007 509225
43263 509225 592073 1197201 2374982 2962258 1556665 -1124316 -2618144 -2041049 -1090891
43254 -1090891 -1006204 -705503 881600 2663734 3019002 1938579 281422 -1455459 -2417723
43245 -2417723 -1294151 1568915 3646115 3365220 2109310 1564429 988924 -852998 -2820099
43236 -2820099 -2974384 -1784713 -1166550 -1180102 -285682 1594460 2830819 2829122 2699967
43227 2699967 3015915 2990565 2280174 1797135 2193393 2942630 3367501 3429703 3238653 2790258
43217 2790258 2292488 1880045 1243494 497335 812300 2779786 4746224 4587969 2779920
43208 2779920 1670520 1907189 1965869 1418319 1924083 3980470 5289595 4101812 2100997
43199 2100997 1779624 2460654 1463561 -1518075 -3790823 -3508106 -1940472 -1229878 -1555476
43190 -1555476 -1577134 -659387 479430 958495 755773 585603 1151288 2404682 3327744
43181 3327744 2769067 906688 -397450 636603 3512687 5646428 5071396 2458694
43173 2458694 -13990 -1261243 -1926669 -2762907 -3588890 -4075123 -4388777 -4438549 -3480982
43164 -3480982 -1341964 788440 1768635 1980689 2265774 2162137 814814 -791188 -527671
43155 -527671 1651299 3114488 2085598 158579 -68023 1289432 1735725 -33333 -2584910
43146 -2584910 -3941644 -3925346 -3629727 -3436513 -2562587 -504197 1790643 2627627 1393260
43137 1393260 -532418 -836629 1624413 5584820 8128905 7005439 2735876 -1509270
43129 -1509270 -2681826 -798373 1301888 1346424 74364 -249049 1024868 2388714 2479540
43120 2479540 1671271 1145588 1362678 1931105 2335007 2253206 1499898 123787 -1410731
43111 -1410731 -2265924 -1636918 477065 2797751 3677309 2899518 1971566 2113506 2732682
43102 2732682 2668238 2065510 1833950 1983151 1930957 1885742 2312617 2498136 1482225 94791
43092 94791 -15402 756905 470740 -821455 -767642 1233753 2468422 928728 -1555616
43083 -1555616 -2202162 -1232026 -669136 -881956 -849771 -621888 -842293 -609717 1507363
43074 1507363 4643411 6328756 5941154 5035828 4065372 1377323 -3517403 -7741287 -7749795
43065 -7749795 -3441243 1516403 3227067 1049188 -2205432 -3439218 -2603099 -2249772
43057 -2249772 -3645394 -4836120 -3701937 -1370370 -552309 -1510773 -2123968 -1427205 -434243
43048 -434243 503526 2313095 4588954 5053560 2780718 -253603 -2093084 -3229689 -4656355
43039 -4656355 -5393325 -3864055 -527662 2586578 4152672 4058380 2638006 778529 -103658
43030 -103658 396724 860510 -29228 -1587935 -2394774 -2480717 -2749485 -3094924 -2847351 -2482378
43020 -2482378 -3030224 -4090945 -4224929 -3180158 -2005309 -1041150 326906 1767111 1824244
43011 1824244 199703 -1569904 -2437122 -3120554 -4125544 -4276533 -2698858 -820270 -584126
43002 -584126 -1675086 -2452102 -2849883 -4015081 -5298513 -4301711 -697052 2357432 2116662
42993 2116662 -185178 -1432046 -897181 -254406 -202708 376373 1897959 3072043 3015295
42984 3015295 2442316 2062329 1633994 1421960 2543272 4548645 4713550 1750013 -1453871
42975 -1453871 -1365468 1023505 1517258 -1151036 -3665101 -3187418 -1130442 -408479 -1263631
42966 -1263631 -1900826 -1777007 -1918067 -2496939 -2232465 -491387 1512888 2235516 1589454
42957 1589454 584090 -186820 -862579 -1328346 -923986 346804 1084964 87104 -1565426
42948 -1565426 -1443299 804073 2444954 1142072 -1762592 -2909858 -1124210 1591237
42940 1591237 2816680 1968336 72140 -1239599 -646919 1597583 3496528 3600043 2941188
42931 2941188 3166041 3489434 1761781 -1740909 -4197199 -4201466 -3289998 -2858266 -2149719
42922 -2149719 -495737 830480 661015 -37561 75667 444890 -111357 -1053584 -888178
42913 -888178 385015 1156408 319746 -1429884 -2246963 -865895 1751263 2760867 673478
42904 673478 -2161844 -2278954 4007 1186836 242167 72481 2133292 3520305 1896420
42895 1896420 -215027 459148 2315511 1456448 -1937739 -4094423 -3495689 -2050610 -837068
42886 -837068 1157960 3698912 4530466 2927188 905223 -93410 -886001 -1900135 -1717547
42877 -1717547 160249 1509712 344970 -1917644 -2182168 327155 3349429 4419425
42869 4419425 3226123 1242652 -173269 -925935 -1477062 -1545067 -521959 811127 639849
42860 639849 -1033500 -1750362 -256353 1114868 -121215 -2520958 -2882209 -1162747 18656
42851 18656 -90675 38445 457877 -548519 -2630414 -3073325 -1308552 -134895 -1063353
42842 -1063353 -1867875 -630931 902771 365122 -1371819 -1890883 -907619 86875 394633
42833 394633 288448 -82603 -223796 935370 3234976 4744202 4573939 4472480 5791526
42824 5791526 6782539 5346577 2860696 2323489 3633437 3817813 1775297 -185606 -111772
42815 -111772 828772 588621 -495741 -310413 1858563 4253036 5011621 4598437 4821948
42806 4821948 5691093 4940315 1667408 -1235582 -505549 2619774 3832065 1759887 -795561
42797 -795561 -1996986 -3430046 -5894654 -6710761 -4092676 -950754 -708761 -1828286 -584792
42788 -584792 2508282 3602959 1985745 940002 1950746 2522461 910052 -924108
42780 -924108 -923272 -284029 -933921 -2100841 -1833034 -323347 551880 18394 -1176943 -2457127
42770 -2457127 -3876326 -5238605 -6014991 -5951801 -4996192 -3077545 -673603 1015735 1284757
42761 1284757 788106 424633 -22408 -1146778 -2311621 -2046075 -117275 1844732 2223653
42752 2223653 1241068 335238 100810 -360303 -1842409 -3507830 -3795885 -2699382 -2026657
42743 -2026657 -2892014 -3957910 -3251974 -1090302 264704 -234994 -1160901 -978146 -247991
42734 -247991 -423066 -1454870 -2027339 -1776008 -1746346 -2393742 -2508063 -1016870 1024493
42725 1024493 1471444 -148058 -2082619 -2634069 -1813593 -395588 1338655 2987986 3335364
42716 3335364 1758923 -286047 -805036 -6617 164289 -835761 -1428905 -794203 -444647
42707 -444647 -1716553 -3229569 -2510902 594406 3592509 4143983 2195422 -421146 -1687871
42698 -1687871 -895411 924057 2106792 2001016 1114612 -93964 -1415921 -1931756 -605728
42689 -605728 1548892 1750216 -913714 -3782334 -4079596 -2572244 -1940339 -2812065 -3621419
42680 -3621419 -3486383 -2848251 -1781558 -110994 977574 -67568 -2341952 -3055164 -1490144
42671 -1490144 -140482 -1016773 -2917628 -3605828 -2843633 -1703927 -416734 1127782 1708074
42662 1708074 -149835 -3492863 -5307623 -4180944 -2149515 -1893254 -3063885 -2842917
42654 -2842917 64489 3548338 4839364 3890861 2751406 2329891 1534657 -404656 -2548103
42645 -2548103 -3723917 -3863228 -3133869 -1270427 1220379 2669791 2405846 2019646 2981740
42636 2981740 4228525 3925246 2568469 2155258 2862598 2844363 1268955 -512551 -1084962
42627 -1084962 -536183 401681 1327985 2016539 2450002 3024955 3672202 3212043 982115
42618 982115 -1463538 -2057625 -1120713 -511307 -375608 657405 2124889 1607472 -1300011
42609 -1300011 -3731197 -3552518 -2179354 -1879681 -2492129 -2646783 -2374007 -2442850 -2461269
42600 -2461269 -1614013 -338002 420524 744117 1041354 774591 -515490 -1795936 -1867991
42591 -1867991 -1481973 -2429968 -4836012 -6803675 -6629668 -4317484 -1220031 885803 863021
42582 863021 -691067 -1890611 -1795573 -1357903 -1452964 -1377846 -557083 -189280 -1288304 -2372506
42572 -2372506 -1447758 608867 1227977 139071 -619704 -439884 -746192 -1535234 -739590
42563 -739590 1713825 2525059 -100689 -2934476 -1972725 1739810 3774212 2586912 619096
42554 619096 -422546 -1589785 -3293385 -3487555 -1200298 850392 -172189 -2703509
42546 -2703509 -2686265 734400 4188065 4755949 3100538 1264509 -339677 -2293545 -4062102
42537 -4062102 -4302332 -2779255 -732498 444563 137759 -1397727 -3032055 -3277611 -1745687
42528 -1745687 139454 662081 -213047 -1145387 -1313196 -995969 -478280 400534 1351161
42519 1351161 1379433 120975 -1155753 -684359 1655748 3863677 3874543 1940095 304727
42510 304727 228169 303887 -1120249 -2727197 -1646956 1908731 4163856 3031511 1111469
42501 1111469 1384730 2509420 1583804 -361949 187922 3032992 4020154 1551066 -978319
42492 -978319 -759869 351270 -244887 -1236261 140209 3268213 5156850 4934433 4255995
42483 4255995 4083229 3934529 3838096 4303728 4502323 2971904 246116 -1421688 -1140863
42474 -1140863 -208327 271142 598778 1101991 1505957 1999298 3010086 3586992 2054664
42465 2054664 -1166867 -3461889 -3474900 -2607880 -2228340 -1710246 -581405 -200479 -1238888
42456 -1238888 -1583161 623594 3410848 3430813 946523 -872030 -1086001 -1756449 -3333193
42447 -3333193 -3269923 -750765 856997 -1110657 -4099444 -3931821 -926987 1142550 952177
42438 952177 569168 879552 199114 -1785499 -2513234 -714248 1059841 309108 -1540532
42429 -1540532 -1723307 -618627 -699998 -2191010 -2787021 -1375859 582957 1552124 1681820
42420 1681820 1757704 2071099 2693355 3584078 4230080 4193813 3896366 3871697 3673548 2669589
42410 2669589 1330127 408631 -429686 -1619763 -2203943 -1234982 153865 313848 -42942
42401 -42942 865868 2376790 2281435 974160 1108960 2766771 2863375 551388 -694443
42392 -694443 1529194 4537580 4637234 2376064 722911 356866 39322 -104715 875679
42383 875679 1998470 1339260 -777961 -2327951 -2750853 -2910310 -2471716 -254715 2876626
42374 2876626 4279338 3085127 1205671 434974 638628 1156402 1921254 2616033 2514093
42365 2514093 1767788 1381694 1525727 1344997 735759 737577 1711355 2573885 2368755 1372156
42355 1372156 215573 -956423 -2097521 -3025569 -3756949 -4186280 -3647889 -1984907 -704718
42346 -704718 -1459422 -3493213 -4345104 -3143091 -1386663 -345696 222071 336124 -878669
42337 -878669 -3015897 -3630950 -1383048 1460652 1533245 -1296770 -3767883 -3306231 -983515
42328 -983515 28723 -1611933 -3734440 -3375246 -843708 373405 -1556695 -3913749
42320 -3913749 -3290574 -797429 -321077 -2279315 -2938370 -549007 1696408 619295 -2306413
42311 -2306413 -3699378 -3006222 -1755708 -302483 1569609 2428374 902075 -1335578
42303 -1335578 -1433121 363686 1283673 436268 -417281 -317586 -154606 -60314 1040649 2646855
42293 2646855 2560103 538831 -887513 -446399 51146 -564633 -480896 1424380 2600479
42284 2600479 662014 -2185466 -2247906 -208218 145914 -1851972 -3091067 -2227714 -1530406
42275 -1530406 -2238626 -2202788 -33037 1972196 1584568 409028 933542 2165939 1582180
42266 1582180 -243205 -633038 441558 374229 -1382309 -2305567 -1195623 -204472 -1076669
42257 -1076669 -2253150 -1656241 -96756 310757 -506698 -1085108 -1125767 -1436672 -1887777
42248 -1887777 -1643797 -1158806 -1849484 -3658608 -4784408 -4218666 -2956668 -2128036 -1371099
42239 -1371099 82269 1809916 2723712 2573176 2021656 1557267 1086130 475699 -93369
42230 -93369 -335665 -84092 606671 1263812 1083014 -246709 -1749475 -1838935 -275234
42221 -275234 1011022 -58866 -2852043 -4259218 -2438272 575565 1222155 -1014795
42213 -1014795 -2907914 -1646803 1706634 3815783 3177330 1432602 890183 1875054 2852142
42204 2852142 2543515 1314516 409310 304837 525100 1055109 2682244 4996842 5276967
42195 5276967 1414179 -4338323 -6897580 -4270544 119693 2036930 1311814 534808
42187 534808 766197 979987 805533 1215183 2472794 3441571 3261002 2184300 530003
42178 530003 -1746687 -4096052 -5267758 -4645892 -2834386 -750893 1001646 1926839 1926288
42169 1926288 1880970 2797307 4202128 4524104 3304738 1858202 1348647 1336847 818013
42160 818013 -194610 -770493 -226504 1119242 1914726 646245 -2595362 -5395489 -5283928
42151 -5283928 -2749443 -627604 -405071 -867203 -782370 -699663 -853819 501736 4405540
42142 4405540 8261880 8338910 4722225 1178249 59072 -2373 -716156 -1224657 -192175
42133 -192175 1379664 1720770 1316606 1849024 2837709 2069976 -573312 -2449692 -2122983
42124 -2122983 -1502145 -2523580 -3825709 -2909314 -212363 1473579 1079176 361833 931211
42115 931211 2301259 3319310 3754426 3848487 3692820 3621987 4062510 4610780 4399450 3559071
42105 3559071 2991657 2590194 1341378 -522494 -1408551 -1040495 -1213981 -2772359 -3736561
42096 -3736561 -2021432 1401191 3670510 3398360 1581192 86665 273367 2047742
42088 2047742 3384007 2106387 -967348 -2391676 -726197 1325603 1100001 -38340
42080 -38340 528911 1908208 1143685 -1541529 -2543762 -37202 3627618 5236731 4118530
42071 4118530 1693923 -423581 -1255487 -807694 1407 619056 1639302 3232862 3796015
42062 3796015 1907261 -1251238 -3385516 -4065682 -3987695 -2408536 1596240 5794054 6143915
42053 6143915 2029989 -2596101 -3977883 -2227024 108099 879279 -561312 -2916895
42045 -2916895 -3453397 -1053947 1561236 1205753 -789646 -336146 2947911 5075223 3955927
42036 3955927 2057356 1615553 1435770 326337 -286110 457455 678749 -631722 -1255357
42027 -1255357 247801 1580182 890157 522299 2795320 5081311 3555924 -458115
42019 -458115 -2624830 -2379701 -2637176 -3772730 -3140914 -567348 767537 -160362 -442206
42010 -442206 1420282 2515288 257006 -3082141 -3408447 -346325 2867594 3780689 2763202
42001 2763202 1380143 677017 936305 1803588 2587121 3086451 3856751 5096270 5737561
41992 5737561 4473230 1605870 -813631 -976595 811380 2553171 2821874 2131537 1701140
41983 1701140 1475594 480764 -1033520 -1373967 97515 1688758 1657776 588938 130399
41974 130399 252704 -546985 -2573759 -4044561 -3222249 -526763 1875105 2248879 980441
41965 980441 123532 985594 2349486 1942487 -374082 -2205584 -1795950 -131070 929985
41956 929985 1218456 1779744 2908563 3868163 3840792 2361827 -237348 -2200658 -1605553
41947 -1605553 833687 1872745 -109434 -2822457 -3507343 -2767746 -2761857 -3248459 -2274876
41938 -2274876 142406 1949139 2347786 2491804 2881391 2550571 1218296 150685 338915
41929 338915 1383125 2474673 3142709 3021589 2170975 1386970 956050 -161775 -2281711
41920 -2281711 -3220306 -1042951 2168821 2373828 -654639 -2863389 -1860989 -68198
41912 -68198 -477597 -2135590 -2080523 145078 2307191 2804259 2144454 1509006 1383687
41903 1383687 1587216 1745177 1712771 1805127 2276156 2588594 1996446 917491 684190 1657332
41893 1657332 2627213 2456216 1345373 139396 -623030 -611021 344607 1784390 2910558
41884 2910558 3481859 3538196 2471181 -123275 -2654158 -2564536 153703 2302261 1474706
41875 1474706 -835093 -1593623 -533329 -306607 -2687820 -6101390 -7208383 -4316099
41867 -4316099 883771 4760233 5129265 3256479 2106633 2834695 3939773 3831476 2866327
41858 2866327 2314756 2515432 2911660 3113734 3143206 3161991 3413990 3822065 3481584 1593118
41848 1593118 -840035 -1659913 -542700 214563 -1018411 -2697940 -2543266 -1185919 -1165524
41839 -1165524 -2910815 -4126365 -3264078 -1349800 210922 1524004 2836380 3177456
41831 3177456 2037782 1071522 2145811 4395410 5210979 3874255 2195257 1491387 1104471
41822 1104471 454957 309433 829853 475846 -1394111 -2659932 -1404735 796310 1269039
41813 1269039 731456 2039455 4903759 5643859 2831152 -391428 -962225 310048 1298799
41804 1298799 1884102 2575635 2538622 1508447 1297653 2715835 3250812 835746 -2174055
41795 -2174055 -2237808 -45058 1143888 1073253 1969741 3314246 2163245 -1018465 -1911707
41786 -1911707 795812 2714168 356067 -3449848 -3933045 -1254097 587658 -112544
41778 -112544 -1366638 -1470654 -1038380 -868931 -496173 271378 272288 -1328352 -3308685 -3544458
41768 -3544458 -1632122 522701 874863 -647151 -2590882 -3921514 -4585112 -4450981 -3147266
41759 -3147266 -1335935 -685194 -1659914 -2557629 -1807342 -81486 1041256 1300544 1272567
41750 1272567 908997 185858 62554 1024553 1766272 1152630 245105 287887 79085 -2005238
41740 -2005238 -4529778 -4601510 -2264435 -215486 411813 836455 1485696 1355023 587529
41731 587529 513532 865880 -11984 -1955544 -3000390 -2751289 -2589386 -2489235 -1137709
41722 -1137709 610229 258197 -1862266 -2647359 -1412908 -757532 -1306348 -301698 2942442
41713 2942442 4963712 3825057 2304568 2703777 2910412 829920 -1492989 -1807907 -1748411
41704 -1748411 -3054274 -3562728 -1464704 16566 -2589640 -6403757 -6027522 -2005458
41696 -2005458 277151 -979016 -2298482 -1333859 379015 1483187 2866421 4741896
41688 4741896 5608257 5070308 4379609 3551063 1189679 -2212596 -4016941 -3287545 -2029478
41679 -2029478 -1775064 -1593493 -379892 1213707 2026663 1747058 541210 -1066128 -1929465
41670 -1929465 -1528066 -1068198 -1574561 -1774470 -179912 1769987 1573532 -116622 -411007
41661 -411007 1173239 2443454 2620194 2964713 3261646 1651469 -1376874 -2673857 -1168396
41652 -1168396 604619 779920 424523 383830 -359215 -1630542 -1226779 837319 1069783
41643 1069783 -1894442 -4071790 -1809868 2432861 3769788 1877098 229632 160650
41635 160650 -9470 -903841 -1417771 -1878557 -3813717 -6152228 -5513382 -1475650 1780681
41626 1780681 886529 -2284764 -3663965 -2388911 -754556 -153903 208715 900961 1054963
41617 1054963 109479 -1051364 -1512561 -1557070 -1669977 -1557062 -1186787 -1600879 -3203855
41608 -3203855 -4205865 -2718602 57404 921251 -995420 -3199343 -3558720 -2736344 -2061259
41599 -2061259 -1387146 -530757 -676823 -2482555 -4533935 -5494164 -5977422 -6356158 -4833316
41590 -4833316 -360766 4348544 5855611 4707362 3938484 4125404 3502707 2024652 1282878
41581 1282878 791235 -1438925 -4515638 -5169033 -3249543 -2378628 -3977557 -5006408 -3390328
41572 -3390328 -1429680 -1385967 -1623340 -195888 1132348 -59036 -2490410 -3460686 -3290419
41563 -3290419 -3889772 -4701662 -3812731 -1847286 -1086963 -1525788 -1311978 -578798 -1309271
41554 -1309271 -3457439 -4570138 -3652961 -2399916 -1987648 -1468777 -252756 367146 -562716
41545 -562716 -1857380 -1862154 -464935 1458373 3151826 3678236 2034399 -1277919 -3961804
41536 -3961804 -4351126 -3249108 -2398005 -2100004 -1586900 -984733 -1307206 -2516635 -3000072
41527 -3000072 -1608804 563657 1265409 -246744 -2343005 -2992150 -1987188 -727228
41519 -727228 -281560 -530680 -1051022 -1722111 -2124930 -1430754 306589 1497903 640261
41510 640261 -1773747 -3826432 -4391426 -3926033 -3221055 -2353828 -1127442 209904 1202393
41501 1202393 1859509 2702251 4136512 5918971 7300643 7710265 7240868 6401037 5520142
41492 5520142 4577376 3454829 2066586 396508 -1207398 -1939162 -1269640 228219 1260743
41483 1260743 1057701 -90629 -1366784 -2057781 -1918810 -1479152 -1691170 -2627593 -2974852
41474 -2974852 -1739949 26070 512755 -136138 -24655 1478476 2712465 2351313 1440276
41465 1440276 1750195 3324865 4884166 5802802 6386230 6595201 5713961 3452721 761359
41456 761359 -767498 -404010 733701 629161 -1187893 -2729814 -2070526 -189791 276818
41447 276818 -1083326 -1803823 -211027 2135488 2659718 973182 -1247740 -2491374 -2455236
41438 -2455236 -1671102 -989004 -926922 -1148337 -1223120 -1768582 -3509984 -5253482 -4697312
41429 -4697312 -1746564 926236 1395733 590429 -61033 -914610 -2529425 -3712861 -3039629
41420 -3039629 -1035580 728103 1530211 1262601 -138879 -1668475 -1410477 724701 2286414
41411 2286414 1939598 1568200 2609259 2906405 371932 -2472416 -1635637 2045496 4048737
41402 4048737 2966939 1733210 1957534 1571271 -744964 -2825416 -2596758 -1219017 -630810
41393 -630810 -522480 218261 1125603 1185554 655904 231090 -204224 -685673 -531567 193890
41383 193890 176451 -926857 -1405915 -40200 1860588 2485235 2106291 1992833 2088068
41374 2088068 1555916 573234 -158667 -811515 -1751916 -2359598 -2124013 -2030254 -3099690
41365 -3099690 -4252380 -3443037 -537340 2523819 4054935 3724303 1947113 -182173
41357 -182173 -913572 363848 1720026 981157 -874580 -824039 1649404 3563810 2731475
41348 2731475 774687 504049 2037704 3202575 2661428 971513 -798527 -1964432
41340 -1964432 -2074224 -1214531 -374118 -434940 -961654 -1036534 -1004753 -1948816 -3381947 -3206275
41330 -3206275 -718603 1946763 2728454 2628111 3705613 4880877 2690022 -3110639
41322 -3110639 -7613820 -6590320 -2296053 -528612 -2808654 -4894839 -3374417 -238217
41314 -238217 791050 -374790 -1172792 -867068 -842947 -1173223 -137623 2510390 4571191
41305 4571191 4584361 3698549 3217437 2360411 78660 -2512275 -3423357 -2547376 -1402953
41296 -1402953 -893553 -1021366 -2123151 -4352202 -6164116 -5447054 -2507962 -82777 215995
41287 215995 -266852 222467 1189824 1176553 363177 55744 231821 -475564 -2342137 -3862362
41277 -3862362 -4038028 -3870850 -4513575 -4984718 -3316393 192086 2511968 1469519 -1318424
41268 -1318424 -2446043 -1178640 -196724 -1566537 -3778975 -4096310 -2504685 -1355213
41260 -1355213 -1625894 -1747612 -429714 1314000 1792811 809417 -727228 -2155037 -3074328
41251 -3074328 -3028978 -2112907 -1081382 -175384 1175610 2851222 3545427 2673034 1396131
41242 1396131 646567 -372991 -2261816 -3523768 -2548446 -324279 918051 838910 626571
41233 626571 402728 -578862 -1764424 -1886525 -1357045 -1535430 -1956100 -1092172 298968
41224 298968 -199859 -2363988 -2983535 -733490 1787152 2157781 1233472 576190 -191346
41215 -191346 -1409893 -1518715 348056 2141322 1805744 464500 180007 424228 -425518
41206 -425518 -1693070 -1542891 -363619 -51888 -772316 -1241000 -1414460 -1990742 -1972755
41197 -1972755 85905 2767573 2994340 607943 -1385137 -1376066 -741633 -367116 935742
41188 935742 3250973 4044922 1880736 -839198 -1123791 405342 774251 -1167730 -3885815
41179 -3885815 -5586685 -5713973 -4664190 -3519259 -3513408 -4567001 -5085385 -4322623 -3803679
41170 -3803679 -4810942 -5654630 -3823721 -296376 1165587 -481782 -1599194 959489
41162 959489 4932284 5530500 2150780 -858275 -378360 1485213 1084034 -1447741 -3023464
41153 -3023464 -2417794 -1317066 -879526 -262730 817176 892141 -514840 -1354857 -103216
41144 -103216 1646229 1744611 870745 841161 1043735 -349500 -2438115 -2287751 334478
41135 334478 2132050 929204 -1672200 -3333882 -4019638 -4456183 -3864937 -1325069 2015765
41126 2015765 4033918 4136358 3290132 2384229 1772604 1547681 1098452 -603882 -3035437
41117 -3035437 -3626285 -957069 2500634 2965789 274344 -2000282 -1493428 144503 257901
41108 257901 -984431 -1451401 -591794 -53836 -840996 -1695802 -1131200 178329 389569
41099 389569 -617981 -914573 548244 2031790 1134903 -1862988 -4091319 -3490974 -1043254
41090 -1043254 700650 489861 -716986 -1190125 -225916 1335198 2024558 1145687 -604251
41081 -604251 -1779882 -1345695 612193 2835969 3549653 1913980 -793711 -2140862 -1187665
41072 -1187665 520184 1163657 929750 1149209 2086447 2960570 3527789 4049544 4019197
41063 4019197 2623631 464038 -842746 -966896 -1134873 -1774262 -1651596 -99131 1505982
41054 1505982 1572007 354923 -956465 -2153506 -3665592 -5008115 -5003253 -3403364 -1218235
41045 -1218235 597489 1940562 2917788 3142872 2167063 419665 -799791 -697551 -233059
41036 -233059 -1235350 -3884487 -5908001 -5208304 -2645586 -880032 -749028 -425612 1536444
41027 1536444 3908348 4468973 2990375 1424091 1391536 2335636 2440222 1130027 50671
41018 50671 852529 2336761 1457017 -2239681 -5187040 -4488180 -2169667 -2101104 -4032929
41009 -4032929 -4235005 -1666067 470221 71279 -807645 39057 1243843 561280 -1283899
41000 -1283899 -2051141 -1390633 -420802 386303 648620 -759182 -3461130 -4303518 -1287325
40991 -1287325 2692937 3305401 871578 -554437 456711 1201517 -101318 -1633223
40983 -1633223 -1486890 -533056 -124928 355994 1703911 2682449 1667232 -775574 -2595058
40974 -2595058 -2636188 -1239685 444494 845294 -964215 -3557026 -3988288 -1580756 669687
40965 669687 13259 -2286341 -3125985 -2159199 -1609278 -2208139 -2298569 -1197618 -583766
40956 -583766 -1469842 -2222326 -1283759 -26362 -749942 -2935374 -3814365 -2331839 -334982
40947 -334982 389467 167982 -184703 -1041852 -2569662 -3171194 -1344227 1600968 2769265
40938 2769265 1567148 367435 868223 1739992 992479 -863212 -1600426 -373444 1550227
40929 1550227 2801200 3252090 3419482 3740301 4548382 5734510 6287561 5182685 2984861
40920 2984861 1576813 1823612 2382982 1522589 -530694 -1922167 -1576740 -398921 119682
40911 119682 -130015 133837 1674060 3374965 3331219 1221275 -1058930 -1460629 41292
40902 41292 1798583 2457535 1840135 392962 -1048233 -1077904 1228634 4544541 5791024
40893 5791024 3366200 -857574 -3626672 -3711298 -2280098 -664316 758086 1734816 1893929
40884 1893929 1693935 2204279 3301732 3318929 1347493 -1175732 -2242615 -1758480 -1051250
40875 -1051250 -673000 -239214 -60886 -1126403 -3146049 -4126094 -2654473 271313 2305147
40866 2305147 2073387 160479 -1624244 -1839137 -854025 -520405 -1629564 -2323130 -587664
40857 -587664 2169023 2425823 -328238 -2518482 -1591673 566040 1114628 467989 353642
40848 353642 -13217 -2254594 -4761735 -4318275 -1389575 189107 -833613 -1408864 423885
40839 423885 2165377 975665 -1838885 -3092346 -2338442 -1506335 -1409718 -1340700 -1258601
40830 -1258601 -1782854 -2354807 -1740422 -371806 -90428 -1246379 -1956137 -945425 459489
40821 459489 280990 -1224295 -2001199 -1209850 -466531 -1574996 -3924313 -5267109 -4918053
40812 -4918053 -4782627 -6481727 -8625603 -8406114 -5405325 -2209740 -1196163 -2194093 -3653658
40803 -3653658 -4691029 -5268990 -5433802 -5224794 -4801583 -4244164 -3714026 -3788673 -4762307
40794 -4762307 -5634316 -4925566 -2663593 -444398 595473 646372 24287 -1351625 -2948065
40785 -2948065 -3632047 -3228781 -2742761 -2732150 -2932700 -3547376 -4884178 -5480038 -3147334
40776 -3147334 1327614 4293147 4316378 4200723 5973147 6954892 3941265 -1130702 -3576390
40767 -3576390 -2643543 -1740892 -2506444 -2828007 -1378691 -269634 -1442620 -3248699 -2864724
40758 -2864724 -437236 1347599 1047972 -3980 126411 1568410 2801333 2589166 1194732
40749 1194732 -335218 -1553642 -2692182 -3632760 -3798739 -3221535 -2652991 -2265666 -1392301
40740 -1392301 -42491 661429 328651 201358 1201303 2395220 2538882 1824357 871425
40731 871425 -579037 -2541753 -3869801 -4123108 -4816820 -6893501 -8529020 -7716372 -5494186
40722 -5494186 -3964413 -2586147 331451 3562602 4142454 2215711 888903 1121123
40714 1121123 707956 -911049 -927490 1978359 4592051 3513951 29370 -1967457 -1170162
40705 -1170162 405121 680333 -542671 -2089885 -2327421 -369088 2463785 3393574 1428672
40696 1428672 -1324809 -2513356 -2141061 -1214291 252047 2062639 2505152 651778 -1252474
40687 -1252474 -410310 2252202 3275587 1899416 1065882 2618508 4407365 3707554 1329169
40678 1329169 262187 1498298 3269199 3857945 3252599 2079803 618579 -752219
40670 -752219 -1510392 -1941911 -2937881 -4194175 -3891137 -1279673 1481102 1619857 -706705
40661 -706705 -2827628 -3199982 -2778009 -2687743 -2615677 -2215801 -2225544 -3024076 -3604672 -3251101
40651 -3251101 -2877814 -3313191 -3538117 -2303837 -500669 -100477 -1350261 -2684790 -3006261
40642 -3006261 -2576443 -2041928 -1886570 -2378688 -2908781 -2136129 10104 1571108 1254977
40633 1254977 520301 1066766 1812225 979593 -233692 564002 2432518 2274986 310501
40624 310501 52609 2158650 2802579 -22866 -2761813 -1654102 1573421 2770760 1531704
40615 1531704 546992 549811 -80437 -1346360 -1101223 1138878 2952410 2470530 719932
40606 719932 -536825 -1437851 -3155689 -5436210 -6257735 -3874731 1084828 5462805 5913157
40597 5913157 2112152 -2586468 -4408678 -2796848 -119851 1557909 2047488 1716154
40589 1716154 443139 -1515573 -2985282 -3090838 -2189832 -948491 575855 2120225
40581 2120225 2494297 979677 -1144011 -1927255 -1323326 -867521 -866353 127610 2460664
40572 2460664 4056994 3311459 1583536 954924 894610 -518292 -2965300 -4102577 -3026719
40563 -3026719 -945320 1345336 3724312 4513861 1571662 -3447263 -5511200 -2673392
40555 -2673392 1098474 1713997 439228 774945 2682529 3463019 2456085 1274137 617722
40546 617722 116919 258001 1392659 1922082 500822 -1172125 -951440 -224258 -1581867
40537 -1581867 -3778431 -3357850 -686712 240355 -1849299 -3762397 -3052349 -900390 956117
40528 956117 2224576 2157425 -309937 -3351355 -3104407 811119 4286126 4639343 3760339
40519 3760339 3742896 3416941 1559420 -125234 -62156 189577 -1149424 -2742019 -2552131
40510 -2552131 -1429559 -1496578 -2624812 -3014818 -2054237 -680159 8041 -711285 -2599917
40501 -2599917 -3683612 -2039598 1060836 2305951 1170943 429981 1118393 940703 -787560
40492 -787560 -978120 1835388 4004982 2119008 -1529483 -2637000 -1323551 -883862 -2154652
40483 -2154652 -3111920 -2843140 -2385398 -2271674 -2004701 -1454214 -852824 -217720 -28207
40474 -28207 -1006924 -2247432 -1703000 481593 1803610 1526585 1639521 2598688 2257063
40465 2257063 693939 1327413 4702988 6206739 3323992 188662 879181 3055134
40457 3055134 2878842 1595659 2112254 3391917 3542238 4193488 6451424 7108194 4587924
40448 4587924 3598547 7538802 11835748 12017163 12189039 16915307 21482678 20850762 21310853
40439 21310853 30388877 42822156 53888661 79585269 137973196 208656140 238702242
40432 238702242 202198713 133192079 83493966 65335114 55091218 38543935 25645223
40425 25645223 24602094 26923156 23495721 17516385 14399669 12025032 8020529 6364393
40417 6364393 9670332 12800539 10678646 6230103 4665448 5194096 4246317 2618331
40409 2618331 3454332 5923780 6330733 3948254 1304858 -273383 -1577858 -2626332
40401 -2626332 -2240119 -487523 987511 1189693 492307 -704436 -2264906 -3271249 -2373032
40392 -2373032 306894 2685331 2758467 689334 -1503359 -2137479 -1471441 -1057450 -1672933
40383 -1672933 -2298516 -1376258 1221168 3815184 4379139 2291189 -965123 -2738803 -1506581
40374 -1506581 1404264 3002034 1940366 -29860 -370138 1304412 3321880 4250548
40366 4250548 4058953 3280618 2046793 276865 -1504732 -1950607 -36041 3261217 5180184
40357 5180184 4103550 1768105 1196373 2751506 3955474 3203526 1677740 1088455 1419705
40348 1419705 1792369 1992626 2175943 2244575 2204770 2087107 1328831 -360168 -1603853
40339 -1603853 -798805 1085924 1606979 852558 1290263 3110160 3414539 1381250 232882
40330 232882 1724689 2614993 17957 -3216904 -2808563 -91046 199557 -2364116 -3607415
40321 -3607415 -1834464 -227289 -1359238 -3506535 -3918461 -2552555 -939855 259202
40313 259202 1090939 1464891 1582876 1895543 2093111 1428278 170311 -696710 -1083880
40304 -1083880 -1473113 -1375751 -169844 911113 165918 -1282711 -496482 2518541 4123513
40295 4123513 2286452 -355496 -515334 1010245 995073 -1301899 -3324944 -2833588 -428456
40286 -428456 1577810 1661675 356189 -459479 343841 1736287 1884763 813708 332740
40277 332740 948324 650655 -1945959 -4772784 -4656774 -1819341 240312 -435472 -1699222
40268 -1699222 -637894 2164038 3528288 2124371 -56840 -827459 -423466 -118688 39305
40259 39305 580853 999141 673167 482697 1371982 2040886 677775 -1365192 -802913
40250 -802913 2247531 3551733 718206 -3298811 -4652412 -3671894 -2921715 -2754842 -2012138
40241 -2012138 -1308122 -2096673 -3463424 -3187554 -1535533 -980832 -2352784 -4005919 -4699534
40232 -4699534 -4712889 -4176619 -2847748 -1606137 -1772270 -2832457 -3048024 -2223010 -1593062
40223 -1593062 -1287834 -574884 -392145 -2492343 -5773278 -6696392 -4205803 -1264192 -471502
40214 -471502 -1065695 -1529385 -2193827 -3409936 -3742019 -2254518 -667999 -1025100 -2659132
40205 -2659132 -3441384 -2771674 -1534742 -316314 515112 52910 -1909542 -3646650 -3241818
40196 -3241818 -1019784 1156063 2275497 2389638 1255975 -1304456 -3970583 -4718829
40188 -4718829 -3333388 -1664978 -953205 -189323 2000490 4704756 5259669 2549341 -1275090
40179 -1275090 -3199671 -2871693 -2388154 -2693794 -2182968 155144 2235648 1621402 -596286
40170 -596286 -1308781 -75588 677574 98471 305767 2426431 4179002 3136024 245471
40161 245471 -1782238 -2065194 -1776134 -1941348 -2619383 -3466996 -3857744 -3134022 -1654203
40152 -1654203 -769156 -1058532 -1636227 -1827761 -2179760 -3013772 -3512574 -3307876 -3435548
40143 -3435548 -4398256 -4733018 -3072771 -444318 1110695 1262263 1204590 1570352 2008105
40134 2008105 2152302 1715253 336834 -1473184 -2135435 -1025961 235178 -72789 -1248774
40125 -1248774 -1342280 -78575 1019383 914663 2083 -772183 -503705 1283014 3555040
40116 3555040 3911973 1333607 -1923337 -2736098 -767695 1802823 3359560 3853363 3481595
40107 3481595 2452677 1682476 1770259 1639167 139069 -1493742 -1085192 840560 1437498
40098 1437498 -306302 -2343368 -2892263 -2368506 -1325017 696661 2931150 2737298 -702267
40089 -702267 -4083044 -3799552 -687754 1425132 884217 -580051 -1212968 -1140898 -802793
40080 -802793 -7350 644672 -480592 -3553499 -6076603 -5704631 -3241049 -1239935 -385769
40071 -385769 813010 2920381 4328408 3822466 2549490 2087113 1897589 424313 -2116940
40062 -2116940 -3963166 -4446851 -4453794 -4325537 -3439274 -2180634 -2025480 -2829934 -2393146
40053 -2393146 -114767 1220240 -607543 -3502347 -3952575 -2236408 -1560280 -2737527
40045 -2737527 -3204254 -1515969 551935 1354570 1796259 2850883 3276964 1894782 164060
40036 164060 131384 1135534 964179 -488764 -1132358 -83132 1017072 501047 -1136327
40027 -1136327 -2177445 -1749097 -474975 198980 -852465 -3222561 -4873541 -4120243 -1748116
40018 -1748116 -158719 -319476 -791078 -169135 878117 944693 173155 -106827 528482
40009 528482 1162019 994517 94332 -1212291 -2543933 -3042368 -2033811 -422437 -158115
40000 -158115 -1743737 -3461733 -3805511 -3396308 -3388763 -3277043 -2015032 -457911 -559933
39991 -559933 -2313057 -3552549 -3085670 -2080683 -1786546 -1785875 -1495574 -1692425 -3171641
39982 -3171641 -5119183 -6167568 -6102724 -5353313 -3896751 -2052767 -1254070 -2271918 -3448834
39973 -3448834 -2588976 -168793 1235756 543553 -731665 -1122651 -1100495 -1754138 -3017495
39964 -3017495 -3912447 -3629044 -2012328 157501 1295260 471992 -1199971 -1748435 -836960
39955 -836960 230325 830847 1559588 2280873 1752526 -6396 -916675 353918 2325313
39946 2325313 2743471 1369126 -503174 -1945983 -2424674 -1323093 790810 1579634 -355002
39937 -355002 -2961229 -3048987 -662451 1019331 74574 -1975908 -2705045 -1654772 -76575
39928 -76575 743913 278568 -1016379 -1829998 -1271196 -110714 241902 -252032 -659281
39919 -659281 -1055401 -2027032 -2341838 65230 4011486 5004489 1152039 -3409324 -3617624
39910 -3617624 -160255 1998539 619815 -1626775 -1783595 -214263 1083645 1228016
39902 1228016 482950 -599945 -1161066 -619900 136440 -389361 -1927867 -2642539 -2010335
39893 -2010335 -1425711 -1420907 -723369 945296 1753744 957017 566764 1796867 2523974
39884 2523974 1045069 -198955 1642716 4340807 3326466 -1061855 -3932548 -3393849
39876 -3393849 -2653827 -3618354 -3682264 -1249862 453557 -1272005 -3467660 -2263798 273527
39867 273527 -647664 -4232330 -4772579 -538992 3510130 3251298 896413 614169 2389013
39858 2389013 3287364 2350001 1099185 573166 544003 859391 1338888 976642 -762926
39849 -762926 -2383406 -1987615 -116275 817238 -306141 -2359314 -3925541 -4473346 -3754084
39840 -3754084 -1928976 -386109 -516748 -1453392 -1097372 228004 -261748 -3059751 -4392321
39831 -4392321 -1407580 2839728 2960517 -1232998 -4433873 -3137562 425480 2673316
39823 2673316 3448695 4266868 4742464 3874373 3001747 4015958 5587173 4689715 1622160
39814 1622160 -78679 864105 1741486 845012 450445 2422778 4068235 1937445 -2255058
39805 -2255058 -3578312 -1033300 1230618 211275 -2063970 -2234245 -186952 1980341
39797 1980341 3365894 4357780 4686536 3701377 2084346 1355424 1664620 1520821 -76796
39788 -76796 -2293692 -3553393 -3319393 -2507167 -2390183 -3194203 -3870005 -3590110 -3195960
39779 -3195960 -4130611 -5869394 -5987585 -3627919 -1291691 -1556372 -3264556 -3210088 -971391
39770 -971391 540173 -514880 -2570748 -3520680 -3396525 -2763015 -846032 2402491 4159040
39761 4159040 1721126 -2997469 -5018645 -2563644 985444 2039537 963786 -83858
39753 -83858 -897071 -2436753 -3942928 -3599001 -1575299 -31931 -50347 -498086 -132588
39744 -132588 886110 1860800 2355066 1830698 71237 -1652487 -1486176 384499 1673231
39735 1673231 1228477 490615 703805 693135 -827519 -2421917 -1784722 487107 1465532
39726 1465532 46520 -1697384 -1579966 175156 1978874 2868643 2790774 2096717 1424286
39717 1424286 1275183 1356908 1060297 590882 643804 993083 638969 -497472 -1299914 -1140566
39707 -1140566 -615648 -348900 -320030 -571971 -1142872 -1107292 549341 2733935 3038287
39698 3038287 1485446 1088515 3292932 5329591 4243138 1336611 -193942 -243482 -1006988
39689 -1006988 -2424070 -2392245 -1235508 -1739102 -4024554 -4588143 -2153757 -519044 -2789047
39680 -2789047 -6135672 -6056099 -3467503 -3086323 -5792576 -7305700 -4897697 -1211586 130163
39671 130163 -682545 -1342741 -1212597 -886764 71448 2162938 3873730 3325160 1505033
39662 1505033 1268734 3156481 4647980 3966041 2321701 1525060 1386503 754446 -458725
39653 -458725 -1760554 -3393975 -5570537 -7132451 -6551471 -3989665 -1173604 518709
39645 518709 834177 -18276 -1507688 -2456415 -1880031 -256868 1016878 1373106 1283718
39636 1283718 959433 143783 -800514 -998157 -497302 -315241 -799174 -1267836 -1529285
39627 -1529285 -2212329 -3184472 -3402537 -3015894 -3628272 -5313148 -5465851 -2468254 1325620
39618 1325620 2621062 1773339 1593751 2573677 2554775 970652 16672 853289 1682377
39609 1682377 910605 -393392 -822299 -1042165 -1835135 -1711024 1001846 4857923 6534475
39600 6534475 4795953 1211597 -2452389 -5401283 -6775075 -5820523 -3392048 -1379805
39592 -1379805 -254431 1154476 3098772 3942032 2526313 55312 -1319345 -801698
39584 -801698 793861 2071468 1773930 -372507 -2761669 -2902478 -227023 2905556 3829281
39575 3829281 2398181 409404 -834441 -1241432 -955070 -83659 782390 936764 459192
39566 459192 -78455 -661069 -1653984 -2627525 -2412841 -694335 1197603 1600551 285980
39557 285980 -1442994 -2210499 -1794432 -898863 -16869 1024512 2207926 2600130 1340949
39548 1340949 -759733 -1672042 -530366 1377480 2500470 2893539 3373739 3742734 3112267
39539 3112267 1577623 332033 129710 525707 653474 113888 -764069 -1011033 216438
39530 216438 2279455 3076222 1412312 -1225680 -2513951 -2370019 -2548545 -3449117 -3447923
39521 -3447923 -1908461 -793093 -1956605 -4236122 -4840182 -2927495 -301145 1217929
39513 1217929 1738436 2361784 3316366 3764599 3228290 2495607 2583981 3018615 2148751 -272603
39503 -272603 -1905513 -630308 2092880 2680272 348891 -1665497 -767272 1290427 1227458
39494 1227458 -841198 -1896016 -801219 221746 -602779 -1848369 -1375586 214078
39486 214078 652164 -328738 -661258 580590 1472844 124435 -2216262 -2707072 -956589
39477 -956589 443891 -350283 -2051147 -2524179 -1900326 -1835588 -2616698 -2889508 -2067572
39468 -2067572 -1279629 -1604867 -2680100 -3481083 -3478510 -2721011 -1729632 -1533133 -2789962
39459 -2789962 -4616684 -5294641 -4334065 -2723691 -1041050 1107256 3244549 3392363 553076
39450 553076 -3365048 -5505112 -5253028 -4304606 -4123078 -4495379 -4367216 -3221628 -1654597
39441 -1654597 -884322 -1363355 -1952618 -1383603 -434742 -1055110 -3019100 -3572929 -1513612
39432 -1513612 524809 -287571 -2864814 -4117227 -3595699 -3390102 -4120453 -4119853 -2773418
39423 -2773418 -1858877 -2733759 -4349768 -4999048 -4324747 -2805518 -856107 732986 969355
39414 969355 177484 17176 1130260 2074643 1516760 174825 -525564 -521253 -508070 -268240
39404 -268240 797513 1963111 1599429 -606416 -2991301 -3707143 -2412558 -95326 1962822
39395 1962822 2715233 1574387 -1090572 -3694967 -4321811 -2388218 664971 2773002
39387 2773002 3287731 3076356 2683647 1508855 -671865 -2573105 -2966934 -2510267 -2537602
39378 -2537602 -2685356 -1574915 373095 958550 -510184 -1916862 -1217084 1058447 3222448
39369 3222448 4682619 5304431 4030060 265158 -4055585 -5973219 -5079319 -3735634
39361 -3735634 -3511944 -3356971 -2131098 -1090761 -2096669 -4369098 -5180518 -3723402 -2160856
39352 -2160856 -2075837 -1932089 136950 2531904 1978510 -1216500 -2876252 -909524 1409444
39343 1409444 241257 -3122377 -4403012 -2710090 -1187470 -1658221 -2306643 -1420206 -124389
39334 -124389 108572 -61671 259667 93733 -1457955 -2958652 -2681406 -1536598 -1544516
39325 -1544516 -2452728 -2444878 -1507805 -1318041 -1955748 -1578725 174256 1152232 129797
39316 129797 -1041736 -254700 1693121 2549316 1881637 920757 -5365 -1678139 -3751445
39307 -3751445 -4365468 -2617240 -23065 1225973 536792 -1108304 -2497658 -2813852 -1758209
39298 -1758209 36854 1235459 1206863 697720 404152 -304764 -2056241 -3593649 -2974230
39289 -2974230 -523597 1214394 802611 -534359 -1235805 -1483016 -1979391 -2387148 -2402588
39280 -2402588 -2936658 -4526846 -5720907 -4885975 -2765253 -1399558 -1299202 -1630178 -2368529
39271 -2368529 -3859041 -4727810 -3008663 492262 2634074 2306790 1811271 3000635 4537903
39262 4537903 4357033 2714209 1177046 302763 -84751 175569 800544 614902 -548085
39253 -548085 -892557 702473 2463553 2106497 288781 -502945 286842 899300 228355
39244 228355 -1001698 -1938781 -2530448 -2679797 -2211018 -1759728 -2084193 -2499923 -1716329
39235 -1716329 -229661 117012 -707890 -358553 2369671 5344221 5808681 3932939 2129503
39226 2129503 1735636 1970556 1826523 1529399 1867617 2910984 3787128 3586690 2517635
39217 2517635 2024043 3159059 4806324 4534217 1707346 -1378049 -2419410 -2067643 -2422461
39208 -2422461 -3401650 -2886707 -559666 918027 -265972 -2157711 -1865462 182101 1200666
39199 1200666 391910 -486495 -755843 -1910515 -4215570 -5241107 -3676033 -2066117 -3074130
39190 -3074130 -4862371 -3534622 657860 3145478 1430448 -1574562 -1866667 463742
39182 463742 2090983 846174 -2477676 -5670146 -6846150 -5192776 -1430439 2355688
39174 2355688 4122845 3444771 1729996 949040 1824449 2974474 2396399 193258 -1273994
39165 -1273994 -831988 -489709 -2160785 -4046441 -3243484 -849708 -622361 -2730659 -3213496
39156 -3213496 -607048 1351677 -269021 -2983460 -3266201 -2030423 -2088301 -2944441 -2207466
39147 -2207466 -205288 936554 1345166 2345373 2521763 -566964 -5135668 -6396902
39139 -6396902 -3620629 -1521957 -3272304 -6157381 -6194714 -3624064 -1262809 -95302
39131 -95302 631469 772864 -256042 -1258635 -199198 2627916 4409567 3286406 698462
39122 698462 -452382 644125 1804259 710181 -1866592 -2715979 -361044 2624699
39114 2624699 2603172 -666698 -4056085 -5057338 -4023275 -2537099 -1409175 -790068 -780838
39105 -780838 -1098325 -956365 141308 1901271 3567726 4294227 3537108 1758882 265315
39096 265315 -367578 -898514 -1567226 -938106 1786774 4552670 4818572 3295949 2758033
39087 2758033 3627806 3610371 1689555 -454501 -1447937 -1819356 -1908597 -958612 729170
39078 729170 1399918 783756 829992 2150011 2413366 134845 -2418063 -2398415 -459540
39069 -459540 794978 834221 1060481 1758332 1837148 1144742 691417 606271 -211585 -2161141
39059 -2161141 -4028831 -4302533 -2641134 -79647 1738919 1869357 942638 215843 -252767
39050 -252767 -1358438 -2838441 -3143199 -1944502 -870575 -881906 -934608 -380804 -443497
39041 -443497 -1667025 -2179843 -683388 914055 450063 -799265 -440934 629526 -212172
39032 -212172 -2324493 -2386984 122268 2047720 1807273 1641803 3165504 4197275 2342622
39023 2342622 -915645 -2354198 -1482310 -330593 73560 547966 1572396 2379277 2238689
39014 2238689 1233730 -129231 -1005199 -394992 1449983 2310475 322523 -3136510 -4618943
39005 -4618943 -2902576 -418675 222859 -527162 -569040 491633 1064652 107810 -1640314
38996 -1640314 -2920714 -3176294 -2454148 -1276767 -759643 -1663854 -3077415 -3260533 -2098379
38987 -2098379 -1265831 -1432616 -1051659 957479 2990837 2892990 1046563 -495417 -929761
38978 -929761 -824810 -299343 701068 1068073 -132689 -1597946 -1618970 -1330224 -3027350
38969 -3027350 -5617939 -5496479 -2319625 99700 -255027 -902977 63161 489666 -1340720
38960 -1340720 -2661771 -646291 2214622 1754293 -993802 -1469243 1111710 3168145
38952 3168145 3121469 3289807 4732871 4950245 2472553 -117837 -39552 1675080 2282683
38943 2282683 1274889 95756 -461719 -675466 -858273 -1332947 -2413428 -3413215 -2953750
38934 -2953750 -1216673 -385302 -1635260 -3152252 -2645547 -642465 400442 -483506 -1873315
38925 -1873315 -2186964 -1456273 -797478 -949408 -1543161 -1598354 -767002 152705 390299 363101
38915 363101 635110 324850 -1638329 -3851563 -3427678 -303552 1860561 486280 -2341681
38906 -2341681 -3011148 -1342797 -20104 -219648 -518995 119332 783340 449393 -538676
38897 -538676 -1460601 -2232005 -2808838 -2815126 -2453024 -2765211 -4183444 -5511862 -5185828 -3215559
38887 -3215559 -1175284 -296305 -129376 564894 1813828 2033739 216275 -2019610 -1930370
38878 -1930370 541348 2039149 -21935 -3874020 -5721934 -4697422 -3170307 -2438083
38870 -2438083 -1031387 1733504 3317419 1388208 -2049564 -2839518 -396252 1619313
38862 1619313 561011 -2068637 -3738863 -4442060 -5112007 -4628376 -1381267 3049520 4877798
38853 4877798 2996872 294856 -461792 426023 1620028 3016534 4289378 3655598 702944
38844 702944 -1344962 624238 4509657 5078953 1178860 -2512027 -1841537 1766799 4265458
38835 4265458 4386137 3735389 3287451 2592679 1807630 1874824 2440873 1670301 -1092522
38826 -1092522 -3869635 -4235202 -2245450 -304054 -283405 -1432447 -1419780 792626 3690352
38817 3690352 5126013 4839847 4061767 3001329 499376 -3296919 -5791999 -4993404 -2413828
38808 -2413828 -1017059 -1129807 -699470 714637 981032 -848450 -2399676 -1283976 1298668
38799 1298668 2364326 1354007 217849 -78053 -580810 -1748006 -2288130 -1479103 -546792
38790 -546792 -398526 223125 2502656 4827835 4606612 2212814 719699 1558421 2655759
38781 2655759 1614059 -1109193 -3257880 -3520939 -1992699 816884 3837309 5102474
38773 5102474 3348755 -98379 -2389871 -2268374 -1070012 -465993 -350451 358126 1542309
38764 1542309 1590005 -464380 -3118780 -3585944 -1023617 2216490 3308153 2212735 1017757
38755 1017757 661687 300210 -107543 870345 3221909 4329364 2546973 -18180 -536807
38746 -536807 360608 72687 -1546538 -2288608 -1453199 -456162 183120 1179891 1681996
38737 1681996 -286766 -3765956 -4879006 -2470321 -246585 -1066290 -2400058 -614341
38729 -614341 2925050 3954605 1886299 118411 338048 513161 -1075924 -3317985 -4693948
38720 -4693948 -5273622 -5222608 -3981559 -2163657 -1714600 -2664868 -2206902 993405 3827095
38711 3827095 2677448 -1367462 -4204825 -4542700 -4739956 -6075604 -6606017 -4615706 -1415961
38702 -1415961 661659 928793 -264783 -2612346 -4723101 -4149128 -859887 1182327
38694 1182327 -1108553 -4775726 -4070148 1513557 6298658 6188335 3537267 2493231
38686 2493231 2960725 2224786 223151 -438540 1153080 3012996 3258019 1794621 -844736
38677 -844736 -3881189 -5446957 -3881232 -409217 1639456 933398 -519300 -736132 -270793
38668 -270793 -304889 -357336 419860 1186684 561638 -989100 -1592572 -480939 1177338
38659 1177338 1823678 1106549 150905 662734 3263111 6385821 7588059 6292740 4268725
38650 4268725 3089424 2518670 2028841 2132689 2885314 2764414 1027580 -135799 1627034
38641 1627034 4518252 3946913 -1324627 -6928603 -8038728 -4940266 -1888855 -1631782
38633 -1631782 -2903280 -2990097 -1076816 1398711 2625748 1869449 -476143 -3366820 -5423201
38624 -5423201 -5432552 -3323342 -686238 328965 -943176 -3021197 -3936891 -3245571 -2088033
38615 -2088033 -1668490 -2196726 -3066066 -3441544 -2735845 -1111596 397441 784820 252844
38606 252844 25037 762240 1696968 1797861 1277880 1044299 822108 -809110 -3802961
38597 -3802961 -5371835 -3054450 1413582 3466926 1407727 -1456083 -1634657 -297893
38589 -297893 -985700 -3939954 -5839909 -4931907 -3260242 -3025717 -3524557 -3213440 -2558278
38580 -2558278 -2786343 -3315803 -2648773 -1063432 -343639 -1000741 -1531829 -742736 480316
38571 480316 320392 -1660358 -3881735 -4409408 -3122121 -1873053 -2151636 -3113275 -2857742
38562 -2857742 -1224892 146135 426317 438924 608408 140610 -957779 -1165660 527
38553 527 796118 207560 -62049 1218898 1726147 -1183041 -5508096 -6585323 -3735545
38544 -3735545 -1227607 -1971206 -3723522 -3123541 -576605 1228896 1709339 2532342 4124899
38535 4124899 4614122 2684065 -233980 -1614073 -918616 -3366 -471085 -1579966 -1528247
38526 -1528247 -219745 666389 452487 522370 1635122 1924474 -528997 -4272026 -5966113
38517 -5966113 -4853271 -3351889 -3175896 -3321205 -2538153 -1507550 -1319436 -1520340 -1126953
38508 -1126953 -456996 -641180 -1983305 -3685156 -4615102 -3934823 -1925398 -545197 -1754843
38499 -1754843 -4559248 -5275555 -1983755 2626791 4404432 2701763 449149 -53264
38491 -53264 541181 458240 -798196 -2370945 -3215740 -2814246 -1413900 133446 1218141
38482 1218141 2113424 3226589 3969870 3283290 1279314 -572442 -1127681 -635372 130279
38473 130279 947884 1827926 2308377 1895870 1013689 781190 1619623 2431196 1581019 -1135167
38463 -1135167 -3719125 -3696888 -860292 2231154 3009102 1630626 77115 -932539 -2454669
38454 -2454669 -4565860 -5203910 -3172633 -663103 -567607 -2216047 -2477704 -876124 -416356
38445 -416356 -2443492 -3950606 -2189500 710411 843366 -1522809 -2687735 -1314403
38437 -1314403 340728 895002 1561186 2638355 2221331 77519 -805430 1078243 2716950
38428 2716950 1231383 -1232389 -941270 1166326 910066 -2446818 -5268352 -5333643 -4545256
38419 -4545256 -5006896 -5872742 -5580730 -4526727 -3805906 -3182976 -1849439 72644 1836309
38410 1836309 2861028 2756024 1767710 1332286 2583239 4220189 3827803 1536798 65476
38401 65476 564465 945737 -581564 -2724072 -3289674 -2028662 201701 2975749 5277557
38392 5277557 5083634 2155775 -529032 -505689 539917 -592015 -3605146 -5207835 -3947939
38383 -3947939 -1672957 -274161 354113 746591 587039 -263889 -1178581 -1880198 -2821349
38374 -2821349 -3954288 -4303050 -3217606 -1164780 907221 2186903 2145404 1093966 399597
38365 399597 1028315 2127988 2260498 1624429 1520032 1983618 1899372 1415285 2028803 3784982
38355 3784982 4593710 3333652 1684584 1526896 2151733 1629155 -330578 -2524794 -4214668
38346 -4214668 -5191652 -4739748 -2521015 -117280 298653 -1128386 -2174497 -1878144 -1674229
38337 -1674229 -2510196 -2839162 -1001788 1810514 2942875 1978613 1042728 1449516 2026017
38328 2026017 1375983 86998 -469018 -286189 -251808 -306339 385521 1751943 2765040
38319 2765040 3054215 3256353 3673522 3895702 3963874 4498071 5203603 4670964 2431153
38310 2431153 -89706 -1617601 -2748777 -4336094 -5309481 -3900736 -540053 2241121
38302 2241121 2821266 1993014 1361178 1536578 2173936 2685170 2585532 1990402 1866445 2853486
38292 2853486 3906669 3403903 1700465 946459 1800451 2114386 166263 -2307441 -2229694
38283 -2229694 458137 2662227 2269982 395250 -983125 -1723347 -2665487 -3443721 -2884617
38274 -2884617 -1192083 -182966 -1041905 -2815185 -3582761 -2574202 -761744 299883
38266 299883 -64862 -1181998 -1876345 -1797152 -1694671 -2239274 -3041805 -3341516 -3183211 -3114072
38256 -3114072 -3101020 -2801755 -2653194 -3348894 -4204991 -3557125 -1165469 1249204 2377638
38247 2377638 2622887 2350547 799291 -1906763 -3483119 -2163238 627704 2190977
38239 2190977 1978102 1149394 61206 -1345983 -1808924 -329810 1197012 67046 -2877187
38230 -2877187 -4227299 -3233022 -2493754 -3165462 -3390033 -2463958 -2556043 -4508681 -5675876
38221 -5675876 -4292587 -2635680 -3108672 -4206926 -3435874 -1574448 -723364 -437331 668112
38212 668112 1429184 -29301 -2505372 -3445471 -3149625 -3569120 -4169237 -3015681 -1059116
38203 -1059116 -1035939 -2516252 -2395819 -306438 861051 171810 -178835 207516 -1474940
38194 -1474940 -5914594 -9221011 -8278392 -5068382 -3044007 -2282506 -1093613 183080
38186 183080 114802 -938332 -1716994 -2408459 -3564021 -3981501 -2204883 761778 2487029
38177 2487029 2206792 1058968 -41904 -1057570 -1989299 -2816630 -3627083 -3808420 -2242908
38168 -2242908 632107 2463180 2069761 1302868 2141279 3558499 3373962 1815738 798450
38159 798450 601161 -194261 -1850821 -2879588 -2349399 -1045148 -231111 -468164 -1422249
38150 -1422249 -1877865 -575069 1998778 3587644 2927768 1238745 -130965 -1672022
38142 -1672022 -3620686 -4053839 -1766325 618037 -356652 -3819001 -5632144 -4087453
38134 -4087453 -1390720 245805 795330 648041 -219856 -878077 -2513 1769604 2532257
38125 2532257 2245111 2470089 3039035 2175868 150915 -691950 -146105 -703307 -2955871
38116 -2955871 -4311382 -3736644 -3752255 -5580602 -6303149 -3766474 -708348 -460668 -1633687
38107 -1633687 -1090060 324676 -467962 -2972168 -3723488 -1996987 -557555 -772360 -961966
38098 -961966 -78848 467052 -556672 -2544030 -4573391 -6093310 -5962591 -3584078 -1091237
38089 -1091237 -1256609 -2888995 -1863400 2358590 5047768 2899515 -1097893 -2181827
38081 -2181827 -354028 903328 466377 398930 1711549 2837409 2694185 2406978 2930525
38072 2930525 3022390 1123745 -1778494 -2782745 -656946 2279129 2685399 315734 -1591800
38063 -1591800 -548298 1875483 2397199 650718 -775794 -558611 -124226 -375559 177767
38054 177767 2457653 4386363 3573106 751445 -1617771 -2770973 -3426376 -3420806 -2211445
38045 -2211445 -1036636 -1848460 -4147361 -5269401 -4044611 -2092824 -1197813 -1334482 -1709912
38036 -1709912 -1989337 -1981702 -1610093 -1548994 -2450098 -3383307 -2724368 -835596 -7172 -1225396
38026 -1225396 -2843159 -3186185 -2699381 -2557558 -2759491 -2714230 -2407408 -1976175 -1296310
38017 -1296310 -780018 -1262360 -2325692 -2249500 -554409 973730 832475 -273454 -1156536
38008 -1156536 -1862227 -2209136 -787171 2435154 4484502 3114108 608024 717886 2965868
37999 2965868 3637912 1930467 1012042 2412914 3410964 1692452 -811709 -1178664 159
37990 159 131073 -1139237 -2047853 -2038664 -2193932 -2720151 -2486102 -1218161 -121631 82051
37980 82051 108212 649439 1322503 1544304 1323013 788062 35036 -188086 1134502 3589617
37970 3589617 5192058 4838729 3901031 4222886 5361840 5357088 3877019 2797718 3273592
37961 3273592 3920517 3023661 1347501 1095116 2475572 3076993 1132014 -1910171 -3001202
37952 -3001202 -974662 2480939 4890016 5097130 3494732 1218079 -468974 -659152
37944 -659152 589052 2127897 2656974 2044756 1554559 2436809 4326703 5514917 5018002
37935 5018002 3785836 3292923 3516839 3296480 2342775 1598077 1580323 1759417 1864540
37926 1864540 2310188 2742963 1817553 -484597 -1839277 -453290 2159035 3003812 1455439
37917 1455439 -431472 -892402 -33455 1155343 1722328 995247 -599481 -1412003 -764348
37908 -764348 -450897 -2069906 -3790070 -2533469 1065601 3108150 2062309 572274
37900 572274 769509 1194569 47162 -1570022 -1875923 -1389035 -1344580 -1266005 -473650 -38845
37890 -38845 -766769 -1117666 192952 1322041 18595 -2357081 -2819052 -1479203 -730052
37881 -730052 -685735 624180 2930815 3747305 2925079 3000858 4198625 3370502 -414178
37872 -414178 -3275002 -2105383 551641 347374 -2547778 -4251835 -2783467 229037
37864 229037 2605823 3676224 3670029 3213110 3196937 3613819 3160748 1396548 120473
37855 120473 746734 1560526 4605 -3231612 -5164705 -5048316 -4971835 -5938381 -6470854
37846 -6470854 -5766795 -5167639 -5162734 -3755253 142638 3905198 4288956 1913889 110420
37837 110420 173870 412208 -355272 -1081911 -862660 -676401 -1519756 -2508702 -2366683 -1617045
37827 -1617045 -1578173 -1905113 -1080645 751066 1476209 192507 -1092614 -290651 1508945
37818 1508945 1423713 -1144522 -3782067 -4520235 -4116885 -4130772 -4335910 -3425415 -1407050
37809 -1407050 126069 -106658 -1849928 -3802628 -4641430 -3879515 -2389013 -1717373 -2275966
37800 -2275966 -2752616 -2020941 -834382 -540753 -925491 -854182 -444752 -684509 -1150874
37791 -1150874 -373219 1259740 1394968 -543920 -1893621 -642187 1345610 1245184 -304563
37782 -304563 -607463 273853 -404203 -3024156 -4185600 -1773977 1445934 1640580 -645446
37773 -645446 -1609751 262974 2671351 3415637 3080432 3003488 2865914 1815493 475206
37764 475206 80587 393667 106181 -1005712 -1797892 -1605606 -1072970 -941936 -1148325
37755 -1148325 -1444567 -1881757 -2220216 -1820906 -724969 -605 -310025 -877941 -703674
37746 -703674 -123186 -132702 -610408 -408856 846314 2168719 2663504 2635071 2743330 2687784
37736 2687784 1472767 -1015016 -3196389 -3122221 -818612 1266328 996575 -663484 -1052337
37727 -1052337 -119 -402589 -3555560 -6328187 -5343166 -2135835 -931878 -2357777
37719 -2357777 -3179427 -2089474 -1439900 -2256674 -1945551 788657 2713091 1029083 -1685012
37710 -1685012 -1475739 513244 135927 -2722522 -4125949 -2656289 -1144411 -1348985 -1494419
37701 -1494419 -378783 258360 -621952 -987832 696341 2593608 2602947 1666434 1484906
37692 1484906 1416883 387065 -314476 853275 2502375 2280624 647339 -231413 -65473
37683 -65473 100207 714416 2522489 3463186 750249 -3977671 -5528509 -1973906 2853445
37674 2853445 4810726 4192648 3464100 3143880 2158126 350945 -1473868 -2810718 -3237488
37665 -3237488 -2133683 111081 1842440 2257229 2424443 3028488 2707293 273737 -2823453
37656 -2823453 -4251880 -4038385 -3988808 -4467907 -3950125 -1801274 451094 1186894 646960
37647 646960 130864 192691 381725 258924 -72234 -445537 -1141425 -2484868 -3973932
37638 -3973932 -4438939 -3540558 -2525365 -2631344 -3224377 -2762009 -1358200 -813089 -1907437
37629 -1907437 -3284781 -3560250 -3049814 -2706751 -2729896 -2994457 -3546107 -3941302 -3468290
37620 -3468290 -2650946 -2862355 -3749417 -3181322 -880310 395245 -881372 -2128704 -700022
37611 -700022 1532345 1135052 -1065218 -1281118 915264 2003495 382385 -1563080 -2158129
37602 -2158129 -2855869 -4230668 -3783561 -593092 1432571 -1217274 -5605499 -5801065 -1247845
37593 -1247845 2491072 1312221 -2837517 -5688524 -5746072 -4244309 -2500423 -1169667
37585 -1169667 -625544 -462576 395877 1930252 2483500 1218263 -114529 445165 1872988
37576 1872988 1473558 -988272 -2799274 -2247006 -785850 -340620 -535483 -105623 670090
37567 670090 858460 822769 1111629 580200 -1731256 -3715490 -2489903 615827 1153735
37558 1153735 -1608228 -3024216 -198161 3189174 2463820 -885020 -1975237 -313308
37550 -313308 190657 -1782556 -3013597 -1353149 1197274 2295222 2256874 1670129 -270719
37541 -270719 -2896124 -2926619 952705 4986954 4833820 1200536 -1887803 -2689714 -2464616
37532 -2464616 -1988249 -944569 -325715 -1967977 -5281597 -7248037 -6380540 -4434611 -3507362
37523 -3507362 -3514154 -3381206 -2895829 -2325742 -1624232 -987386 -1024318 -1524409 -1195696 443997
37513 443997 1952363 1842984 842730 1057228 3128942 5254918 5235879 2975293 635447
37504 635447 335414 1844923 2932315 2169862 710772 491639 1267170 901626 -1321282
37495 -1321282 -3328492 -3030807 -1152344 25628 -101559 -130349 671944 1129143 212522
37486 212522 -1042487 -897693 436161 821808 -1073179 -4042886 -5647756 -4567865 -1367760
37477 -1367760 2382128 5240754 6645040 7035088 6967897 6039443 3508063 247729 -1293840
37468 -1293840 -142566 1469728 1070754 -410857 -247624 1462418 1752121 -227668 -1300850
37459 -1300850 1065824 4722085 5742254 3630575 1126301 -55640 -640716 -1381380
37451 -1381380 -1759684 -1399106 -855511 -546015 -326871 -431726 -1478286 -3196085 -4343740
37442 -4343740 -4268609 -3556345 -2861014 -2063000 -944418 57983 130413 -1199863 -3441514
37433 -3441514 -4929846 -4054432 -1542935 -511444 -2784178 -6045909 -6611608 -4403721
37425 -4403721 -2721737 -3205786 -3927641 -3194019 -2278961 -2645832 -2922542 -1170985 1389032
37416 1389032 1786631 -103676 -1109075 712617 3353388 3738837 1763206 -66840
37408 -66840 -294889 -145715 -1210221 -2852111 -3131515 -1853968 -1137093 -2371265 -3895110
37399 -3895110 -2992023 402369 3414562 3583412 1292225 -1215081 -2124125 -1168740 505707
37390 505707 1274426 546711 -597240 -922829 -741617 -940835 -859376 1012090 4215252
37381 4215252 6240578 5764040 4100753 2763079 1484757 -328371 -1967509 -2503550
37373 -2503550 -2065526 -978266 816535 2407988 1851873 -1010197 -3394552 -3011089 -1103881
37364 -1103881 -253034 -819835 -1699942 -2836964 -4232559 -3928984 -324701 4227027 5527988
37355 5527988 3073645 275982 -809348 -1490432 -2699553 -2939105 -1387565 116661
37347 116661 95217 -148662 867008 2023115 1600565 216907 -477410 -565862 -1126023
37338 -1126023 -1907858 -1894265 -1271113 -893952 -660343 -262947 -556194 -2071502 -3082725
37329 -3082725 -1571529 1416629 2895961 2218582 1643416 2434756 3045752 2038211 495518
37320 495518 186627 1010054 1635561 1442702 567713 -932280 -2695354 -3629923 -3125682
37311 -3125682 -2216042 -2461697 -3963836 -5357961 -5539156 -4582324 -3068556 -1289409 624223
37302 624223 2147984 2342466 723920 -1739549 -3039696 -2144877 -219787 918277 1029386
37293 1029386 956406 453048 -1547486 -4356606 -5407011 -3622308 -1051588 11925 -261354
37284 -261354 -792208 -1827726 -3472857 -3750196 -1069821 2308765 2504786 -426636 -2326331
37275 -2326331 -807757 1769056 2353274 1426435 1297980 2272747 2704267 1658692 -322928
37266 -322928 -2297738 -3346247 -2810539 -1366448 -882484 -2016170 -3101943 -2670093 -1604480
37257 -1604480 -1177742 -594662 1216581 2781503 1938775 -306836 -921248 465943 1249259
37248 1249259 393715 -104478 918420 1846589 1593203 1637445 2810012 3095895 1270903
37239 1270903 53328 2271818 5799301 6093186 2812060 86546 376042 1747992
37231 1747992 1827127 1015279 504977 -7137 -873127 -1008332 253645 1513892 1333810
37222 1333810 484896 345222 354200 -780758 -2232493 -1860568 259467 1421000 -39564
37213 -39564 -2490361 -3358576 -2374878 -1302686 -1300483 -1840233 -1942491 -1314025 -114055 1477867
37203 1477867 2993191 3596770 2925309 1696610 817210 72980 -1433779 -3507888 -4648576
37194 -4648576 -4170891 -3432044 -3845830 -4538270 -3542485 -923907 1116699 1431250 1399836
37185 1399836 2537835 4203452 4677391 3267999 380304 -3198767 -5929564 -5842675 -2889067
37176 -2889067 89423 524032 -672378 -1041727 -731521 -1912582 -4288306 -4437514 -711615
37167 -711615 3830086 5053745 2526992 -882898 -2615560 -2019481 206103 2304329
37159 2304329 2233612 -34655 -1801779 -895965 1282251 1835952 510427 -629627 -1024448
37150 -1024448 -2245268 -4615800 -6033204 -5102752 -3137790 -1861494 -1107915 -126981 617679
37141 617679 492733 87978 52191 -183482 -1059471 -1609899 -1191318 -1155544 -2766759 -4532495
37131 -4532495 -3950407 -1259898 955154 1535297 1581120 1584901 518148 -1598156 -2859459
37122 -2859459 -2414321 -1983283 -2963709 -4028335 -3453927 -2150601 -2098906 -2887630 -2350426
37113 -2350426 -314902 757387 -653495 -2866548 -3250468 -1440637 686396 1410536
37105 1410536 540250 -1146964 -2788240 -3641654 -3158774 -1442431 455270 1204738 493082
37096 493082 -603016 -920111 -610086 -607749 -915997 -467683 1073549 2513467 2830764
37087 2830764 2716972 3363384 4362062 4112931 2209713 297261 297181 2425381 5061331
37078 5061331 6067770 4348483 790057 -2264809 -3001960 -1651441 240415 1615099
37070 1615099 2296605 2071538 634240 -1399337 -2533598 -1963364 -418725 895253 1485886
37061 1485886 1351171 442519 -906859 -1591103 -703085 1152973 2161709 1083888 -1457424
37052 -1457424 -3449136 -3196820 -874528 1434208 1631539 -117377 -1419365 -494867 1435643
37043 1435643 1514212 -1088228 -3999399 -4595334 -3040648 -1370979 -373113 969305 3014553
37034 3014553 4330504 3816957 2423044 1511783 820088 -291718 -687319 1097637 3694478
37025 3694478 3869535 1052693 -1649684 -1870932 -908871 -803606 -968758 29957 1319558
37016 1319558 1121370 32898 19791 929619 987551 316104 725377 1889198 1148018
37007 1148018 -1975803 -4303556 -3631774 -2001403 -2213155 -3436374 -2912683 -405275 1845738
36998 1845738 2688665 2865292 2618941 1135441 -1305169 -2847650 -2564178 -1864167 -2460666
36989 -2460666 -3977532 -4513002 -3045601 -572278 976856 637756 -692422 -1253484 -422426
36980 -422426 562806 189200 -1407898 -2686162 -2633615 -1800857 -1372215 -1690931 -1871603
36971 -1871603 -813635 1252916 2346117 564433 -3382213 -6323765 -5982052 -3436594
36963 -3436594 -1383007 -690989 -54696 1255445 1975642 764275 -1601809 -2918695 -2081259
36954 -2081259 -183273 920887 656779 13174 -34180 233586 46620 -367188 -98236
36945 -98236 683277 590197 -784628 -1754767 -724991 1344182 2022153 636093 -877722
36936 -877722 -436648 1830862 3888662 3825713 1500268 -1375921 -2788256 -2300523 -1145862
36927 -1145862 -381192 220478 1026750 1446220 959631 222132 -177964 -1117801 -3382812
36918 -3382812 -5396367 -4615445 -1125360 2142005 3006358 2030754 666818 -553962 -1309385
36909 -1309385 -955458 168352 493401 -547127 -1465999 -1098922 -568588 -1355830 -2693414
36900 -2693414 -2736212 -1451988 -353211 174933 1173892 2662349 2884103 741481 -2413246
36891 -2413246 -4320819 -4251692 -3050718 -1401512 879086 3753733 5958244 5818150 3250296
36882 3250296 426628 -325839 761473 1250593 -132537 -1697154 -1320351 320934 725369
36873 725369 -704101 -1905780 -1430441 -522932 -873306 -1811476 -1398342 465307 1852401
36864 1852401 1702207 1212696 1724715 2522481 1872046 -386776 -2483568 -2882372 -1853512
36855 -1853512 -734896 -452629 -1099557 -2212145 -2875091 -2126433 -30857 1951972 2446416
36846 2446416 1852374 1735092 2537182 2865299 1449197 -975774 -2414288 -1837349 -63715
36837 -63715 1349601 1526050 635160 -645192 -1806176 -2783374 -3727249 -4704334 -5784824
36828 -5784824 -7122153 -8373668 -8199580 -5354370 -725899 2662768 2647935 392243 -1168765
36819 -1168765 -922587 -274782 -379373 -507745 8152 -115356 -2262731 -4960036 -4939481
36810 -4939481 -1471677 2183971 2621304 308021 -1454912 -752845 1158140 1948747 782039
36801 782039 -1300361 -2599037 -2237894 -1073987 -953059 -2372695 -3430797 -2249063 168804
36792 168804 1262278 764862 877090 2282405 2738018 942711 -792736 52291 2154821
36783 2154821 2429956 801134 -129174 541809 1130533 836905 1015529 2311092 3218404
36774 3218404 2611684 1568753 1523620 2370102 3369752 4163931 3898319 1261749 -3224096
36765 -3224096 -6575465 -6513782 -4047820 -1728503 -751697 -1029145 -2438566 -4185572 -4274706
36756 -4274706 -1711337 1561116 2763979 1649878 108670 -736240 -1093742 -886845 145215
36747 145215 915641 -194977 -2669928 -3874431 -2274266 816702 3113282 3617456 2587790
36738 2587790 613511 -1570831 -3234767 -4164672 -4503294 -4116584 -3004326 -2215043 -3011336
36729 -3011336 -4765059 -4960474 -2148328 1814861 3375355 1071318 -2724820 -4094191
36721 -4094191 -1699238 1716698 2627626 1149678 574457 2274608 3498280 1796579
36713 1796579 -714129 -361647 2340221 3458025 1562539 -785159 -1617145 -1869673 -2258598
36704 -2258598 -1596198 153494 639635 -844347 -1318020 1161099 3720706 3027429 833601
36695 833601 1016768 2937021 2585372 -368187 -1802029 -8721 1524882 -53968 -2589628
36686 -2589628 -2970246 -2070505 -2354107 -3089708 -1748134 1167239 2451198 1133434 -220009
36677 -220009 284677 1081225 -189815 -3040872 -4664625 -3362783 -399939 1436238 735064
36668 735064 -1116233 -1615229 -239585 1020844 669349 -142617 227467 959334 187338
36659 187338 -1424564 -1349034 485544 1037766 -1184497 -3561575 -3227840 -1252555 -639596
36650 -639596 -1692069 -1980206 -287486 1791234 2250241 948812 -729139 -1381212 -747451
36641 -747451 -32264 -551808 -1512821 -399656 3343963 6609183 6376736 3677168 1529985
36632 1529985 425482 -1082162 -2405415 -1508002 588941 113191 -3476145 -5664369
36624 -5664369 -3108454 1476439 3226199 1475569 -603541 -921578 -90263 892831 1853048
36615 1853048 2534907 2457034 1656791 405768 -1328647 -3095936 -3478642 -1690017 987368
36606 987368 2492706 2155361 817636 -338770 -418468 633207 1528045 1062263 402090
36597 402090 1838903 4619030 4853057 1126086 -2717921 -2696012 84882 2064538 2541451
36588 2541451 3014100 3388678 2656068 1829493 2418502 3170138 2008345 -6261 -484639
36579 -484639 -123371 -997282 -1769787 251535 3074710 1951000 -2432096 -3940454 -571563
36570 -571563 2173954 69528 -3550841 -4017543 -2705599 -3365479 -4906126 -3284268 1463789
36561 1463789 5070202 5114456 3266088 1807441 1167811 860406 405530 -616290 -1769815
36552 -1769815 -1658557 -73179 864770 -658517 -3557666 -5533696 -6031524 -5805496 -4952177
36543 -4952177 -3293557 -1516257 -166961 1290552 2931956 3482426 2557518 1854348 2173791
36534 2173791 1399536 -2043109 -5677372 -5921619 -3137640 -757668 -459710 -1094112 -1488953
36525 -1488953 -1453014 -665167 771925 1311477 -37968 -1508427 -872842 996288 1565361
36516 1565361 708271 428550 1269878 1994875 2273274 2727590 2788642 1442001 -341700
36507 -341700 -780119 -272606 -324457 -438324 559261 1198552 -513159 -2516260 -1143914
36498 -1143914 2069148 1603430 -3115444 -5843741 -2868180 1232102 731297 -2864859
36490 -2864859 -4020591 -1486837 1350807 2493817 3099863 3980625 4260034 3570749 2666044
36481 2666044 1796665 837908 823935 2917625 5779429 6315646 3638107 442517 -363217
36472 -363217 928274 1689194 388036 -1888824 -3225454 -3267822 -3103517 -3076087 -2085221
36463 -2085221 218341 1904281 1063487 -1235204 -2333257 -1803660 -1478781 -1846398 -1310703
36454 -1310703 410387 1173733 27288 -820200 452223 2141163 1799895 278994 235850
36445 235850 1731663 2139502 191098 -2274990 -2910830 -1485154 503099 1628012 1547342
36436 1547342 966824 874161 1466480 1899031 1315776 -156129 -1611944 -2198118 -1720025
36427 -1720025 -933058 -1064650 -2328094 -3268871 -2643607 -1458767 -1591565 -2784753 -3063919
36418 -3063919 -2060434 -1486835 -1911955 -1695067 -107078 1036899 340290 -801711 -501083
36409 -501083 849054 1843442 2359684 2742980 2283519 508519 -1212322 -1217108 211917
36400 211917 1604695 2201155 1810474 169052 -2072739 -3068910 -1983401 -201854 884825
36391 884825 1606318 2166898 1238306 -1590528 -3955197 -3691212 -2021398 -1440081 -2079868
36382 -2079868 -2611460 -2956705 -3295626 -2098252 1595244 5249862 5562402 3128533 1123362
36373 1123362 365683 -726560 -2094340 -1890707 -150210 1094336 1294139 1475418 1195113
36364 1195113 -624293 -2052729 18190 3964303 4320192 -116343 -4021187 -3433330
36356 -3433330 -1003771 -421102 -322746 2018365 4706529 4045482 1068767 74740 1689760
36347 1689760 2303125 356981 -1346113 -518467 1274329 1722415 1201374 1123524 1077665
36338 1077665 -101501 -1623900 -1348234 1062091 3220198 2693897 -256948 -3123513
36330 -3123513 -3911051 -2908562 -1737497 -1239441 -841304 151772 1304592 1437203 67797
36321 67797 -1751110 -2166076 -359426 2302796 3462995 2310669 209279 -1490882 -2968387
36312 -2968387 -4304977 -3907937 -626807 3461485 4934964 3498840 1981987 1727433
36304 1727433 951726 -1414049 -3328193 -2965767 -1871187 -2277304 -3216635 -2255240 69386
36295 69386 713051 -1207468 -3100756 -2702312 -788312 715476 1339788 1668137 1817067
36286 1817067 1582789 1202035 919186 420993 -494334 -1316452 -1670929 -2097225 -3005473
36277 -3005473 -3413261 -2005622 661252 2339025 1799193 216806 -729324 -1034187 -1678093
36268 -1678093 -2639864 -2919554 -2135445 -850474 372564 949743 -191123 -3154579 -5312511
36259 -5312511 -3474392 1501360 4774236 3560820 753334 604235 3034385 4836731
36251 4836731 4690469 3710877 2171700 -604009 -3276732 -3075257 -50800 2356003 2043879
36242 2043879 843599 1144770 2371900 2411598 725345 -1477506 -2889327 -2872058 -1705741
36233 -1705741 -620587 -337156 393914 2895262 5433740 4859288 1681089 1522 1238683
36224 1238683 1739911 -1151087 -4391605 -3958606 -1244609 -585261 -2378121 -3150798 -1632132
36215 -1632132 -399583 -1315754 -3068064 -3946247 -3968508 -3388683 -1785639 311536 1115172
36206 1115172 3274 -1421584 -1510309 -355785 1089222 2142286 2175775 836863 -959696
36197 -959696 -1643813 -1030504 -417584 -418575 -286287 256105 294825 -422243 -514675 1135262
36187 1135262 3687608 5447206 5731842 4949313 3713851 2535231 1667571 866577 -55809
36178 -55809 -515730 -90886 19937 -1832544 -4879167 -6154220 -4356968 -1716690 -913527
36169 -913527 -1725783 -2075551 -1054334 626470 2188678 3246428 3411159 2811290 2454290
36160 2454290 2922511 3350695 2766323 1589858 601732 -497591 -1877237 -2047145 197131
36151 197131 2976107 3148998 886654 -401835 786666 2031341 1431004 916870 2543652
36142 2543652 4015061 1687584 -3097391 -4862577 -1554971 2567128 3068792 1040530
36134 1040530 265663 1287479 1556465 110264 -1346958 -1796412 -2231137 -3190060 -3660657
36125 -3660657 -3268333 -3147127 -3512886 -2652107 119176 2520482 2333915 779771 575995
36116 575995 1766017 2048404 702966 -548380 -777326 -1326853 -3109449 -4546904 -3697055
36107 -3697055 -1117754 874616 1034724 -17805 -1312913 -2537771 -3608154 -4276347
36099 -4276347 -4383850 -3906696 -2708350 -871418 649581 504568 -1378434 -3096105 -2579651
36090 -2579651 -109877 1747112 1072413 -1173694 -2451467 -1642951 144746 1455254
36082 1455254 1938748 1795978 1071276 167752 38523 957663 1854250 1825741 1649435 2634067
36072 2634067 4402146 5122017 3892061 1687682 -221317 -1628324 -2725256 -3150265
36064 -3150265 -2611396 -1963746 -2657925 -4894860 -6858017 -6302917 -3013628 625865 1864625
36055 1864625 293986 -2073882 -3278057 -3161794 -2502955 -1505489 -53133 1273390 1706929
36046 1706929 1651238 2288299 3589055 3847193 1891742 -997652 -2360962 -1494451 -120659
36037 -120659 57092 -556680 -598182 -165086 -548463 -1594252 -1227090 1413193 3974317
36028 3974317 3708440 1157067 -1012156 -2020938 -3279587 -4929646 -5052853 -3019226
36020 -3019226 -895373 -296747 -294667 72250 -284026 -1999224 -2951330 -1186249 1449950
36011 1449950 1559375 -862026 -2597699 -1838988 106988 1595439 2494682 2986529 2800609
36002 2800609 2139505 1600046 960318 -271773 -1185272 -360651 1500460 2074656 976568
35993 976568 625964 2760180 6002148 7889541 7739781 6532696 5319436 4685701 4661652
35984 4661652 4410812 3050352 1290377 1025221 2711764 4418980 4184097 2172798 -147142
35975 -147142 -1794048 -2466761 -2038844 -786020 534030 1417395 1883612 1878687 1315343
35966 1315343 818893 1262216 2267817 2377145 1108606 -331914 -825596 -637645 -447819
35957 -447819 -265875 64220 298405 352508 607250 1216953 1873708 2468021 3133133 3591597
35947 3591597 3489661 3358972 4010318 4932734 4659667 2897076 960228 -87273 -457749
35938 -457749 -728733 -1176350 -1920391 -2411504 -1197687 2081757 4988151 4751650 2102624
35929 2102624 214286 145519 198861 -317529 -88147 1006009 1194809 222030 -35520
35920 -35520 592023 -141161 -2322756 -2674872 -96716 1660203 -202518 -2856406 -2571166
35911 -2571166 -717736 -845414 -2498972 -2552763 -830489 142213 -261647 -668294 -1204124
35902 -1204124 -2954615 -4645688 -3893169 -1311966 375892 792469 1670884 2821863 2523409
35893 2523409 1595210 2615748 4940481 5065174 2553243 966273 1748527 1867593 -509953
35884 -509953 -2385963 -797778 2164308 2383362 -646519 -4027503 -5434035 -4472551 -1793314
35875 -1793314 836159 1003941 -1648481 -4302258 -4222206 -1933223 306503 1634340 2404013
35866 2404013 2355099 1107969 -380880 -734739 61596 1232326 2734803 4673175 5972868
35857 5972868 5392638 3530908 2295887 2433261 2788306 2095479 570761 -530602 -510877
35848 -510877 -152102 -834274 -2510162 -3184793 -1406790 1229405 1674748 -542755 -2741194
35839 -2741194 -2903756 -2053747 -1910050 -2150427 -1604669 -739900 -969381 -2057559 -2029907
35830 -2029907 170191 3174959 4838745 4701995 4053313 3589051 2101186 -1319812 -4455782
35821 -4455782 -3758194 397704 3043772 1087663 -2232207 -2278701 97869 740135 -587346
35812 -587346 -404943 1611774 1699607 -1266377 -3684320 -3563461 -3572599 -5308242 -5812288
35803 -5812288 -3235953 -1131964 -2828808 -5617428 -5227118 -2612509 -1337696 -1283281 -342263
35794 -342263 165296 -2371028 -6018957 -6535928 -4392175 -3690842 -4744986 -3941215 -1066416
35785 -1066416 -277861 -2587543 -3659936 -1329574 442480 -1739254 -4972580 -4783276
35777 -4783276 -1747911 493412 898495 897373 810380 -8528 -920269 -908425 -525065 -475563
35767 -475563 277768 2502970 4259132 3198208 248512 -1598650 -1387783 -677955 -593305
35758 -593305 -734784 -660798 -432439 39906 588590 297812 -1051772 -1935860 -1249267 -520019
35748 -520019 -1814028 -4205955 -4734639 -2512290 405159 2012259 1947633 328744 -2396981
35739 -2396981 -4211159 -2855229 694649 2433957 283267 -3098313 -3913612 -2046561
35731 -2046561 -577922 -1536296 -3853279 -5110580 -3963300 -1008701 1731252 2295187
35723 2295187 532750 -1672206 -2370884 -1449767 -172246 588994 919991 1115151 1313292
35714 1313292 1785352 2726033 3645360 3658993 2574869 1137689 49735 -605696 -672672
35705 -672672 562776 3312463 6060961 6495564 4046632 762226 -966144 -1015887 -1049452
35696 -1049452 -1842171 -2444433 -2245564 -2322501 -3557878 -4576876 -3504652 -1416618 -1621309
35687 -1621309 -4714048 -6680403 -3959127 1182458 3229439 925553 -1146977 567675
35679 567675 3433219 2827906 -833178 -2907460 -1500543 301501 -209363 -1432204 -805692
35670 -805692 735431 409284 -1969444 -4054033 -4663211 -4708564 -4681345 -3806231 -2050794
35661 -2050794 -774577 -703352 -1008252 -1021862 -1203956 -1677465 -1422423 93749 1808302
35652 1808302 2544867 2410586 1826831 504319 -1417103 -2428064 -1412309 386462 690880
35643 690880 -882150 -2527420 -2656746 -1455631 -193799 39752 -889857 -1769892 -783928
$$ [...]
##END NTUPLES=NMR SPECTRUM
##END=
