##TITLE=31Pdec_PR184_CR
 D2O, 24 sc
 27.09.2021
##JCAMPDX= 6.0         $$ Bruker NMR JCAMP-DX V2.0
##DATA TYPE= NMR SPECTRUM
##DATA CLASS= NTUPLES
##ORIGIN= UXNMR, Bruker Analytische Messtechnik GmbH
##OWNER= root
$$ XWIN-NMR		Version 3.5
$$ Mon Sep 27 13:26:51 2021 Russian Standard Time (UT+4h)  she@DPX200
##.OBSERVE FREQUENCY= 81.013821
##.OBSERVE NUCLEUS= ^31P
##.ACQUISITION MODE= SIMULTANEOUS
##.ACQUISITION SCHEME= undefined
##.AVERAGES= 24
##.DIGITISER RES= 16
##SPECTROMETER/DATA SYSTEM= spect
##.PULSE SEQUENCE= zgpg30
##.SOLVENT NAME= D2O
##.SHIFT REFERENCE= (INTERNAL, D2O, 0, 248.564)
##AUDIT TRAIL= $$ (NUMBER, WHEN, WHO, WHERE, WHAT)
$$ ##TITLE= Audit trail, XWIN-NMR		Version 3.5
$$ ##JCAMPDX= 5.01
$$ ##ORIGIN= Bruker BioSpin GmbH
$$ ##OWNER= she
$$ F:/spectra/data/she/nmr/P31/1/pdata/1/auditp.txt
$$ ##AUDIT TRAIL=  $$ (NUMBER, WHEN, WHO, WHERE, WHAT)
(   1,<2021-09-27 13:24:53.10 +0400>,<she>,<DPX200>,
      <created by zg, POWCHK disabled, PULCHK disabled
       configuration hash MD5:
       00 E9 B6 7A A2 85 ED C7 34 08 36 98 17 FE 4E 26
       data hash MD5: 32K
       E3 3B F0 D8 0F 8A CE E1 6B 73 C9 95 90 B1 F2 9F>)
(   2,<2021-09-27 13:25:05.04 +0400>,<she>,<DPX200>,
      <Start of raw data processing
       efp BC_mod = 2 LB = 1 FT_mod = 6 PKNL = 1 PHC0 = -8487.172 PHC1 = 183.2688 SI = 64K 
       data hash MD5: 64K
       76 1B 0A 97 C0 65 8F 94 A8 7B 23 CF 02 8E 7B C1>)
(   3,<2021-09-27 13:25:20.95 +0400>,<she>,<DPX200>,
      <pk PHC0 = -26.1243 PHC1 = 7 
       data hash MD5: 64K
       78 5C A9 CE 45 0C CF 64 91 9E FD D6 07 0C 7F 4E>)
(   4,<2021-09-27 13:25:25.93 +0400>,<she>,<DPX200>,
      <abs ABSG = 5 
       data hash MD5: 64K
       C1 8B 6F 3A 32 02 30 B1 4D A9 67 6E 23 23 70 68>)
$$ ##END=
$$ 
$$ hash MD5
$$ 83 07 F6 54 2A DE 49 8F 25 A2 E3 C5 DA B0 9F 04
##$RELAX= 
##$RELAX= 
##$RELAX= 
##$RELAX= 
##$RELAX= 
##$RELAX= 
##$RELAX= 
##$RELAX= 
$$ Bruker specific parameters
$$ --------------------------
##$DU= <F:/spectra>
##$EXPNO= 1
##$NAME= <P31>
##$PROCNO= 1
##$TYPE= <nmr>
##$USER= <she>
##$AMP= (0..31)
100 100 100 100 100 100 100 100 100 100 100 100 100 100 100 100 100 100 
100 100 100 100 100 100 100 100 100 100 100 100 100 100 
##$AQSEQ= 0
##$AQ_mod= 1
##$AUNM= <au_zg>
##$AUTOPOS= <>
##$BF1= 81.014009
##$BF2= 200.13
##$BF3= 200.13
##$BF4= 200.13
##$BF5= 200.13
##$BF6= 200.13
##$BF7= 200.13
##$BF8= 200.13
##$BYTORDA= 1
##$CFDGTYP= 0
##$CFRGTYP= 5
##$CHEMSTR= <none>
##$CNST= (0..31)
1 1 145 1 1 1 1 1 1 1 1 1 1 1 1 1 1 1 1 1 1 1 1 1 1 1 1 1 1 1 1 1 
##$CPDPRG= <waltz16>
##$CPDPRG1= <>
##$CPDPRG2= <waltz16>
##$CPDPRG3= <>
##$CPDPRG4= <mlev>
##$CPDPRG5= <mlev>
##$CPDPRG6= <mlev>
##$CPDPRG7= <mlev>
##$CPDPRG8= <mlev>
##$CPDPRGB= <>
##$CPDPRGT= <>
##$D= (0..31)
0 1 0 0 0 0 0 0 0 0 0 0.03 2e-05 3e-06 0 0 0 0 0 0 0 0 0 0 0 0 0 0 0 0 
0 0 
##$DATE= 1632734692
##$DBL= (0..7)
120 120 120 11 120 120 24 19 
##$DBP= (0..7)
150 150 150 150 150 150 150 150 
##$DBP07= 0
##$DBPNAM0= <>
##$DBPNAM1= <>
##$DBPNAM2= <>
$$ [...]
##$SUBNAM3= <"">
##$SUBNAM4= <"">
##$SUBNAM5= <"">
##$SUBNAM6= <"">
##$SUBNAM7= <"">
##$SUBNAM8= <"">
##$SUBNAM9= <"">
##$SW= 501.771253377433
##$SWIBOX= (0..15)
0 1 3 0 0 0 0 0 0 0 0 0 0 0 0 0 
##$SW_h= 40650.406504065
##$TD= 32768
##$TD0= 1
##$TE= 0
##$TE2= 300
##$TE3= 300
##$TEG= 300
##$TL= (0..7)
0 120 53 12 22 120 120 120 
##$TP= (0..7)
150 150 150 150 150 150 150 150 
##$TP07= 0
##$TPNAME0= <>
##$TPNAME1= <>
##$TPNAME2= <>
##$TPNAME3= <>
##$TPNAME4= <>
##$TPNAME5= <>
##$TPNAME6= <>
##$TPNAME7= <>
##$TPOAL= (0..7)
0.5 0.5 0.5 0.5 0.5 0.5 0.5 0.5 
##$TPOFFS= (0..7)
0 0 0 0 0 0 0 0 
##$TUNHIN= 0
##$TUNHOUT= 0
##$TUNXOUT= 0
##$USERA1= <user>
##$USERA2= <user>
##$USERA3= <user>
##$USERA4= <user>
##$USERA5= <user>
##$V9= 5
##$VALIST= <valist>
##$VCLIST= <CCCCCCCCCCCCCCC>
##$VD= 0
##$VDLIST= <DDDDDDDDDDDDDDD>
##$VPLIST= <PPPPPPPPPPPPPPP>
##$VTLIST= <TTTTTTTTTTTTTTT>
##$WBST= 1024
##$WBSW= 4
##$XGAIN= (0..3)
0 0 0 0 
##$XL= 0
##$YL= 0
##$YMAX_a= 2227
##$YMIN_a= -2107
##$ZGOPTNS= <>
##$ZL1= 120
##$ZL2= 120
##$ZL3= 120
##$ZL4= 120
##$ABSF1= 248.5645
##$ABSF2= -253.2056
##$ABSG= 5
##$ABSL= 3
##$ALPHA= 0
##$AQORDER= 0
##$ASSFAC= 0
##$ASSFACI= 0
##$ASSFACX= 0
##$ASSWID= 0
##$AUNMP= <proc_1d>
##$AZFE= 0.1
##$AZFW= 0.5
##$BCFW= 0
##$BC_mod= 2
##$BYTORDP= 0
##$COROFFS= 0
##$CY= -3
##$DATMOD= 1
##$DC= 0
##$DFILT= <>
##$DTYPP= 0
##$F1P= 0
##$F2P= 0
##$FCOR= 1
##$FTSIZE= 65536
##$FT_mod= 6
##$GAMMA= 0
##$GB= 0
##$INTBC= 1
##$INTSCL= 5.30512e-09
##$ISEN= 30
##$LB= 1
##$LEV0= 0
##$LPBIN= 0
##$MAXI= 10000
##$MC2= 0
##$MEAN= 0
##$ME_mod= 0
##$MI= 50
##$NCOEF= 0
##$NC_proc= -6
##$NLEV= 6
##$NOISF1= 182.463
##$NOISF2= 159.3651
##$NSP= 0
##$NTH_PI= 0
##$NZP= 0
##$OFFSET= 248.5645
##$PC= 4
##$PHC0= -8513.296
##$PHC1= 190.2688
##$PH_mod= 1
##$PKNL= yes
##$PPARMOD= 0
##$PSCAL= 0
##$PSIGN= 0
##$REVERSE= no
##$SF= 81.014009
##$SI= 65536
##$SIGF1= 159.3651
##$SIGF2= -187.1042
##$SINO= 113.3802
##$SIOLD= 16384
##$SREGLST= <1H.CDCl3>
##$SSB= 0
##$STSI= 65536
##$STSR= 0
##$SW_p= 40650.406504065
##$SYMM= 0
##$S_DEV= 0
##$TDeff= 32768
##$TDoff= 0
##$TI= <>
##$TILT= no
##$TM1= 0
##$TM2= 0
##$TOPLEV= 0
##$USERP1= <user>
##$USERP2= <user>
##$USERP3= <user>
##$USERP4= <user>
##$USERP5= <user>
##$WDW= 1
##$XDIM= 65536
##$YMAX_p= 290873190
##$YMIN_p= -36692918
$$ End of Bruker specific parameters
$$ ---------------------------------
##NTUPLES= NMR SPECTRUM
##VAR_NAME=  FREQUENCY,     SPECTRUM/REAL,   SPECTRUM/IMAG
##SYMBOL=    X,             R,               I
##VAR_TYPE=  INDEPENDENT,   DEPENDENT,       DEPENDENT
##VAR_FORM=  AFFN,          ASDF,            ASDF
##VAR_DIM=   65536,         65536,           65536
##UNITS=     HZ,            ARBITRARY UNITS, ARBITRARY UNITS
##FACTOR=    0.620285442955139, 1,           1
##FIRST=     20137.2065510759, 0,            0
##LAST=      -20513.1999529892, 0,           0
##MIN=       -20513.1999529892, -36692918,   0
##MAX=       20137.2065510759, 290873190,    0
$$ Real data points
##PAGE= N=1
##DATA TABLE= (X++(R..R)), XYDATA
$$ [...]
45477 1203342 1522083 1437748 1156728 1132859 846078 -379142 -1894420 -2461172 -2048351
45468 -2048351 -1559124 -1181764 -490896 96574 -375205 -1582070 -1980597 -987636 323495
45459 323495 1087352 1767408 2768814 3253537 2319126 482944 -932643 -1305051 -893504
45450 -893504 -123228 581104 744740 337553 -29623 62563 238295 57891 -192120 -98680
45440 -98680 -3909 -466135 -1183948 -1359138 -997169 -940093 -1504954 -1904777 -1357498 -193151
45430 -193151 570763 447601 -98766 -328997 -34884 374557 466179 308053 280616 444035
45420 444035 379494 -252202 -1271240 -2234014 -2830301 -2878670 -2346789 -1674245 -1608352 -2221046
45410 -2221046 -2501613 -1601394 -180435 318752 -393898 -1201063 -1336006 -1332207 -1790193 -2197770
45400 -2197770 -1768718 -749805 18293 360890 622030 587012 -333188 -1836863 -2709112
45391 -2709112 -2351911 -1512373 -1174467 -1473395 -2034575 -2607181 -2906808 -2574865 -1860819
45382 -1860819 -1653048 -2177514 -2340773 -1175381 646401 1672882 1575746 1181606 993687
45373 993687 833877 723523 861394 764108 -263999 -1667297 -1992325 -1025888 -201677
45364 -201677 -349455 -480733 318855 1158900 767713 -390540 -871213 -461346 -186164
45355 -186164 -464370 -625576 -162018 697955 1617854 2349801 2415127 1582039 534246 67350
45345 67350 -181686 -1063783 -2162798 -2098357 -676360 671023 912843 534467 177632
45336 177632 -439747 -1502724 -2236112 -2005846 -1321463 -857003 -409359 237755 409752
45327 409752 -300907 -827889 -21469 1328694 1433789 218970 -512209 287573 1651108
45318 1651108 2330846 2311784 1924259 832411 -981136 -2227020 -1690244 -133451 505455
45309 505455 -307791 -1185394 -1023475 -467756 -608027 -1277340 -1616127 -1644040 -2061968 -2687161
45299 -2687161 -2341563 -647584 1044391 1191464 -51839 -1164557 -1165117 -536760 -336630
45290 -336630 -889266 -1441260 -922432 856981 2709312 3153615 2173507 1306167 1584077
45281 1584077 2134934 1620765 370198 -178276 173625 110141 -932347 -1732278 -1220735
45272 -1220735 -215181 -162215 -987055 -1400320 -913590 -339792 -338764 -549018 -442007 -200364
45262 -200364 -250119 -442100 -285349 187833 317057 -329120 -1341770 -1955639 -1953035 -1774630
45252 -1774630 -1809253 -1965762 -2007271 -1877125 -1513812 -786920 125348 771055 1126677 1642730
45242 1642730 2174898 1723729 39554 -1391657 -1192192 -208135 -209788 -985731 -729614
45233 -729614 719996 1309825 66420 -1261673 -1073405 -450335 -1099897 -2332515 -2207852
45224 -2207852 -740641 224454 -76188 -585703 -552348 -514025 -872303 -1094912 -843727 -621086
45214 -621086 -769709 -876242 -654316 -513591 -786942 -1162597 -1280605 -1201023 -960689 -362391
45204 -362391 455208 864345 490385 -390867 -1330817 -1983206 -1853499 -604654 1126308
45195 1126308 2023790 1611170 796938 513463 506044 9181 -949138 -1571207 -1336805 -532714
45185 -532714 129838 162144 -287945 -572774 -297339 158570 240594 100062 179521 112753
45175 112753 -905592 -2521075 -3182520 -2213196 -816944 -286184 -274166 126146 560986
45166 560986 114986 -740727 -539064 906331 2165206 2389055 2349185 2692876 2629004 1457324
45156 1457324 259262 524255 1693203 1800658 532845 -135894 1030073 2457348 1947023
45147 1947023 -178031 -1690997 -1658443 -1263123 -1438152 -1465105 -560834 614072 1039553
45138 1039553 850799 670857 316459 -552481 -1137544 -328649 1403824 2352308 1861314
45129 1861314 993928 714936 684270 335647 16800 295831 915646 1209072 1035801 646361
45119 646361 38362 -896635 -1835838 -2195012 -1746268 -761969 264021 798106 477114
45110 477114 -508239 -1422242 -1657185 -1276901 -771305 -518158 -619089 -957806 -1221179 -1118930
45100 -1118930 -741838 -457425 -378621 -277955 -96091 -73088 -198292 -20327 681311 1418698
45090 1418698 1513088 804533 -365672 -1506244 -2075794 -1700228 -702326 -64655 -408482
45081 -408482 -1235534 -1595231 -1309789 -1090947 -1509708 -2259784 -2545508 -1995886 -1073239 -577886
45071 -577886 -781588 -1195931 -1297672 -1221274 -1411668 -1837394 -2063272 -1967298 -1777237 -1457647
45061 -1457647 -785663 -106340 -196721 -1082939 -1733686 -1360741 -418072 121754 -73412 -666374
45051 -666374 -1176253 -1053262 146934 2017513 3206518 2756248 1232037 -49654 -580762
45042 -580762 -854740 -1302807 -1695438 -1514306 -490034 1074188 2225765 1991750 515476
45033 515476 -819164 -883732 -50895 534885 450845 109823 -177016 -414652 -410658 140867
45023 140867 1062558 1763116 1852213 1259739 43637 -1312819 -1748347 -627658 1169714
45014 1169714 1963734 1164805 -177842 -761868 -354020 351718 630799 324129 -96415
45005 -96415 -20203 506141 704836 137817 -552856 -559040 -154085 -229578 -869835 -1303309
44995 -1303309 -1156592 -839269 -692354 -642725 -739498 -1142187 -1482080 -1110867 -122387 687608
44985 687608 932919 815406 225056 -1146367 -2585574 -2581242 -860259 930073 1285748
44976 1285748 590172 47729 -105768 -344116 -636893 -626397 -494541 -614184 -709886 -306812
44966 -306812 298955 418169 75426 -100255 80098 166296 -234141 -1131372 -2231222 -2830926
44956 -2830926 -2206158 -804895 -318305 -1498265 -2595379 -1410835 1531144 3547096
44948 3547096 3407322 2496344 2055886 1317567 -571489 -2479335 -2751394 -1726543 -1164152
44939 -1164152 -1682227 -2268805 -2134823 -1650722 -1326042 -1038196 -613005 -303787 -328861 -553038
44929 -553038 -878620 -1387181 -1877243 -1817432 -1040101 -47434 612861 912736 1120892 1390237
44919 1390237 1718696 1970293 1853402 1284701 803698 1051255 1693582 1541238 87662
44910 87662 -1708367 -2669260 -2829560 -2938618 -3016315 -2338152 -761010 826489 1593514
44901 1593514 1641052 1463051 1067237 146030 -1090125 -1782607 -1317070 -134359 646344
44892 646344 492288 77410 338278 1129871 1417072 832508 266067 491035 929090 537708
44882 537708 -563024 -1288514 -1211993 -1017856 -1272712 -1647052 -1642369 -1354334 -1118178 -937531
44872 -937531 -655805 -315221 -54036 46338 -135532 -627736 -1013204 -667318 451348
44863 451348 1617510 2077779 1636150 548934 -635239 -1170024 -746051 -109949 -306003
44854 -306003 -1184010 -1507141 -730719 309074 816295 1043951 1300819 1075342 59269
44845 59269 -874877 -778075 -30345 359004 232120 62124 -105736 -383953 -313868 375359
44835 375359 829529 252683 -451673 186315 1678787 1964780 462601 -1009111 -874183
44826 -874183 204117 756875 633271 695146 1295444 2016972 2354665 1950451 680086
44817 680086 -884139 -1592732 -879381 543605 1511629 1541839 937125 302572 196283
44808 196283 714756 1239106 1138061 716104 686919 779028 15967 -1459485 -2214649 -1692569
44798 -1692569 -1164180 -1678898 -2338472 -1735392 -86587 1302846 1916718 2148324 2199881
44789 2199881 2065786 2060717 2211340 1694539 101604 -1323027 -1117785 155998 643711
44780 643711 -77763 -643692 -289810 93393 -302243 -930731 -1057028 -985079 -1288291 -1681432
44770 -1681432 -1476796 -621088 333103 886048 844945 355781 -76504 -101273 -184063 -1066124
44760 -1066124 -2372062 -2616199 -1067739 1122736 2247504 1931972 1134403 753988 866676
44751 866676 1023594 737984 -153056 -1225758 -1773346 -1657517 -1549415 -2006663 -2660804
44742 -2660804 -2724184 -2012748 -1032396 -274815 117727 122132 -250490 -741423 -866293 -335259
44732 -335259 599619 1310169 1400052 1150988 1146635 1345424 934140 -465564 -1813120 -1624778
44722 -1624778 126426 1856250 2240505 1511527 667644 164029 -146827 -380724 -523608
44713 -523608 -650361 -797620 -832191 -702384 -550118 -422883 -247038 -175209 -418257 -598758
44703 -598758 17677 1337738 2230662 1957497 1083575 421763 -139909 -980165 -1652997
44694 -1652997 -1500416 -887541 -711704 -924456 -672081 127043 462786 -283777 -1467098
44685 -1467098 -2114158 -1971363 -1293955 -336750 490106 593582 -72845 -638391 -258054
44676 -258054 762427 1298823 815957 -29993 -346975 -199689 -422232 -1249237 -1662053
44667 -1662053 -616234 1297244 2210379 1237716 -365038 -850410 -161089 348355 -51229
44658 -51229 -727695 -905684 -578655 27855 971120 2074598 2589801 1985567 667495
44649 667495 -580843 -1484965 -2082370 -2036873 -957418 600522 1222991 144131 -1708954
44640 -1708954 -2619313 -1898627 -431416 542022 733091 735172 1065497 1652971 2049440 1779882
44630 1779882 697820 -598851 -998308 -128612 873369 647757 -532323 -1240979 -1135372
44621 -1135372 -1251509 -1759414 -1195431 1022815 2936297 2544847 765441 -74127 153609
44612 153609 -409787 -2105664 -3019355 -2169510 -1067396 -1082467 -1251225 -122387 1736324
44603 1736324 2663986 2301717 1542425 847691 118209 -252390 306370 1311587 1611518
44594 1611518 1083829 891111 1843371 3347382 4250869 4104248 3300153 2386191 1543412
44585 1543412 631790 -376814 -1138100 -1329998 -1208709 -1303866 -1545894 -1305938 -428801
44576 -428801 478418 1006752 1398265 1718625 1483025 618537 -107864 -263885 -444386 -1054319
44566 -1054319 -1399761 -967443 -617594 -1229670 -1983862 -1478384 17730 996392 1008459
44557 1008459 894638 936652 549379 -83847 136578 1265792 1816615 934198 -317694
44548 -317694 -671535 -409858 -411301 -517628 -79767 574036 534434 -73783 -62973 1061406
44538 1061406 2191747 1933446 429705 -653968 -49859 1564388 2359373 1571216 225390
44529 225390 -530620 -836971 -1159660 -963335 255617 1253912 213639 -2343680 -3669407
44520 -3669407 -2365704 -199841 530447 -39296 -243692 401328 914512 697936 254117
44511 254117 199438 618577 1334435 1984987 1940740 935480 -275627 -596852 84413 867376
44501 867376 1084683 940475 858832 823168 605654 238272 -39090 -118254 -94293 -47970
44491 -47970 67237 208586 40269 -677244 -1375882 -922637 876761 2468476 2109376
44482 2109376 47227 -1811492 -2356832 -2270612 -2385800 -2349772 -1616921 -741568 -709882 -1550378
44472 -1550378 -2417906 -2669123 -2246877 -1423071 -722904 -685263 -1190113 -1445318 -1051420 -539142
44462 -539142 -429630 -419129 -36975 523611 803051 695521 188776 -757882 -1567669 -1258619
44452 -1258619 -28666 460749 -609849 -1747719 -1329633 -217539 -421209 -1828415 -2330016
44443 -2330016 -1096299 266674 180020 -1013721 -2193192 -2996507 -3449113 -3275439 -2478238
44434 -2478238 -1772288 -1697103 -1947565 -2112762 -2336070 -2673345 -2563697 -1677113 -699969 -496973
44424 -496973 -897707 -1073267 -842120 -804090 -1206984 -1423899 -840742 217307 892420 942104
44414 942104 960385 1320041 1424492 551498 -853565 -1499231 -872574 241148 990458
44405 990458 1309230 1250505 541096 -563777 -1003982 -388440 149005 -397933 -1240639 -1004121
44395 -1004121 129409 878927 883941 751380 532558 -187416 -924045 -759170 -137008 -426053
44385 -426053 -1553388 -1914995 -1015025 -307751 -704991 -1046463 -120914 1295192 1686438
44376 1686438 961531 125180 -366383 -767865 -1182912 -1523500 -1855347 -2061146 -1702187
44367 -1702187 -793990 -41459 231743 537548 1008969 779137 -512205 -1558241 -925816
44358 -925816 867178 1963906 1445797 4130 -1264844 -1743726 -1277014 -239841 502472
44349 502472 451000 129564 295924 827958 1054102 840365 613502 565776 545745 550611
44339 550611 690184 792675 560551 16692 -501848 -570523 194409 1687521 2877870
44330 2877870 2660187 1443496 906125 1715909 2641129 2579660 2121632 2052797 1708891 376516
44320 376516 -829023 -434235 773384 689820 -863459 -1954690 -1629301 -1087960 -1367829
44311 -1367829 -1812530 -1634299 -1310183 -1396027 -1302443 -382144 781578 1254478 1103302 841309
44301 841309 251223 -1088224 -2552142 -2921315 -2021179 -977855 -714458 -896255 -629566
44292 -629566 246418 930399 654860 -296815 -779646 -108511 1043508 1441485 846291
44283 846291 211364 265451 573209 391379 -81040 45991 1035227 2082076 2318066 1813317
44273 1813317 1293835 1120566 970918 531571 47335 -109870 -77129 -224839 -428824 -217722
44263 -217722 354760 621184 251354 -278050 -385786 -36667 495243 934400 890594 126140
44253 126140 -803982 -926965 -185318 404993 242585 -196412 -584939 -1378567 -2478974
44244 -2478974 -2602720 -1136424 549307 982435 704552 984030 1472879 1005786 -82231
44235 -82231 -509235 -388744 -891230 -1919000 -2333445 -2277769 -2882696 -3705002 -3110736 -1492522
44225 -1492522 -1209033 -2533153 -2692185 -412291 1491009 263144 -2465660 -3208698 -1714076
44216 -1714076 -570746 -795663 -862278 113337 946315 535602 -616009 -1559415 -2052060
44207 -2052060 -2161234 -1957520 -1860641 -2248950 -2670582 -2421029 -1730710 -1274095 -789744 452530
44197 452530 1980106 2424023 1571446 663560 456563 397108 2665 -361902 -519344 -942287
44187 -942287 -1630186 -1768816 -1135552 -696155 -1125766 -1795536 -1924884 -1718340 -1609123 -1361317
44177 -1361317 -767845 -351422 -477708 -551834 26035 853047 1340840 1736822 2333333 2470268
44167 2470268 1571432 546762 751728 1900870 2444211 1883529 1282466 1392848 1694121
44158 1694121 1640726 1564854 1785586 1935551 1819921 1946388 2460599 2481444 1418123 202307
44148 202307 155290 1137250 1898842 1916005 1717037 1540607 930147 -135778 -869306 -894144
44138 -894144 -855611 -1201288 -1260933 -404339 617946 637208 -3542 223946 1688164 2826641
44128 2826641 2281781 847657 403813 1441602 2606844 2542699 1301492 -179421 -1202540
44119 -1202540 -1537761 -1151005 -320834 240805 -7439 -688633 -806584 74187 1256198
44110 1256198 1688653 1110218 239740 -25355 567106 1480825 1880724 1330131 186175
44101 186175 -695501 -756834 -212174 325592 530695 487448 294725 -90468 -593273 -928240
44091 -928240 -883365 -487509 134798 792571 1081196 619877 -359889 -1027008 -836185 -113518
44081 -113518 488288 740822 694487 238814 -565368 -1007340 -380935 884349 1509465 978821
44071 978821 198959 230887 964777 1512616 1432799 964938 328006 -540771 -1527492 -2167877
44061 -2167877 -2162825 -1784961 -1544797 -1575215 -1537202 -1129964 -550074 -325639 -705038 -1334398
44051 -1334398 -1604706 -1214174 -332750 589506 1014291 564389 -568484 -1587061 -1840487
44042 -1840487 -1559772 -1468786 -1746533 -1880088 -1555478 -1088651 -782098 -430756 219413 1031255
44032 1031255 1843124 2740142 3502118 3353854 1985757 430312 44988 754656 1197426
44023 1197426 681978 66524 331257 1129512 1450135 1150541 946198 1081336 946432
44014 946432 224897 -364291 -7315 987238 1568656 1356276 988087 1014042 1146134 946130
44004 946130 660706 785946 1175040 1273820 1072764 1079810 1337162 1255682 671679 318981
43994 318981 753623 1376380 1176658 153270 -625535 -286371 983804 2255418 2651878
43985 2651878 1930215 665216 -189846 -238691 -39560 -282007 -798784 -860522 -282005 357366
43975 357366 591458 589863 703295 1006094 1416055 1744422 1483399 185411 -1605880 -2447530
43965 -2447530 -1626815 -249973 34445 -856487 -1463189 -916555 -95034 -194413 -905228
43956 -905228 -881825 240365 1236943 930956 -283014 -1062647 -819280 -139227 319200
43947 319200 617172 1073537 1633068 2056136 2298378 2290248 1709023 477926 -775233 -1329951
43937 -1329951 -1274754 -1192737 -1095197 -461732 602368 1161896 787420 276666 443843 907589
43927 907589 889684 617729 859161 1391256 1203086 283805 -83989 714942 1533522 1136541
43917 1136541 42606 -382348 -35795 20277 -452981 -390811 740494 1831105 1604767
43908 1604767 428200 -253161 125612 782072 992761 1045241 1448580 1870309 1522619
43899 1522619 399246 -529521 -519435 30512 226848 -71721 -206992 139738 384616
43890 384616 -116054 -1105085 -1692459 -1343339 -308967 687754 957220 369508 -329543
43881 -329543 -136105 900597 1478240 678757 -754881 -1533703 -1646016 -1982842 -2527162
43872 -2527162 -2296125 -1121519 -123255 -73876 -509023 -891710 -1437436 -2166039 -2300212
43863 -2300212 -1444660 -434420 -191456 -553053 -954753 -1363880 -1737966 -1524364 -650625
43854 -650625 -109756 -554867 -1194622 -1105551 -658067 -499649 -244432 407926 421942 -904290
43844 -904290 -2062921 -1286816 406619 556635 -823665 -1347945 -217932 742565 441484
43835 441484 65271 359465 115613 -1203582 -1826513 -521515 999935 636482 -826018
43826 -826018 -1245505 -624070 -673493 -1697344 -2293695 -1876490 -1368952 -1336999 -1221208 -653066
43816 -653066 -82828 181379 420316 786557 1052889 1155422 1235576 1221716 1022011 858135
43806 858135 791906 453472 -43612 278902 1681396 2593559 1512162 -623220 -1559360
43797 -1559360 -826783 -31261 -285433 -1110788 -1887300 -2597996 -2880214 -2066359 -643488
43788 -643488 -100832 -761880 -1255906 -776579 -338917 -879923 -1488202 -737185 1166339
43779 1166339 2754616 3204528 2841182 2158938 1253971 91992 -1205816 -2240978 -2388703
43770 -2388703 -1425682 -168505 230152 -221524 -395791 213491 798853 656835 194931
43761 194931 -57088 -331536 -743458 -622076 249608 687404 -336938 -1872189 -2067671
43752 -2067671 -684148 758481 1114306 634439 -67056 -788687 -1263127 -1016964 -158145
43743 -158145 473194 336777 -223119 -686846 -1009340 -1238721 -1130549 -640881 -329620 -679280
43733 -679280 -1249434 -1095083 -36730 954540 848003 -222629 -1099779 -901981 100230
43724 100230 995387 1316805 1309635 1306513 1332312 1395269 1689508 2223590 2547619 2163333 1070550
43713 1070550 -275074 -1391386 -2034547 -2259879 -2370182 -2583412 -2635428 -2022223 -823388
43704 -823388 77633 -57259 -899585 -1487797 -1469880 -1491408 -2244897 -3415667 -3855532 -2866242
43694 -2866242 -1124890 -31316 -132612 -646476 -737226 -603047 -699807 -574965 395562
43685 395562 1470231 1199973 -270618 -1101514 -469341 178504 -470414 -1427696 -1127866
43676 -1127866 -167421 -408640 -1898991 -2696352 -1803795 -448560 -14002 -292462 -490568
43667 -490568 -630649 -1036339 -1414655 -1399360 -1316957 -1575281 -1850957 -1639285 -1102527 -654614
43657 -654614 -212241 383948 717592 469632 330236 1162700 2409789 2468992 842297
43648 842297 -1074876 -1739655 -1188383 -515848 -308123 -283970 -116907 100880 173387 105112
43638 105112 45805 168237 520131 805358 522893 -383141 -1238518 -1396017 -1078786 -978554
43628 -978554 -1175744 -1112764 -637196 -301840 -379177 -331222 268549 956373 1160498 1164064
43618 1164064 1442726 1513910 546710 -1045205 -1823511 -1317526 -654583 -778334 -1133785
43609 -1133785 -843267 -256867 -350304 -1182161 -1949333 -2195681 -2028514 -1444034 -420417
43600 -420417 502755 732133 631896 1043557 1818042 1888438 919293 -215170 -834316 -1168601
43590 -1168601 -1285569 -600280 767138 1355107 234015 -1377634 -1671816 -777859 -296108
43581 -296108 -701551 -823085 40810 1064525 1445068 1689081 2551538 3615315 3811095
43572 3811095 2832431 1364024 303576 212956 999979 1647069 909724 -1005089 -2072710
43563 -2072710 -736895 1816320 2810502 1270199 -888971 -1461908 -546445 194715 30363
43554 30363 -232176 83032 454666 225525 -126774 338912 1401320 1702521 597172
43545 597172 -841271 -1185143 -443001 199395 51177 -467635 -727718 -590074 -152444
43536 -152444 477946 1015368 1197171 1214296 1340793 1234630 457012 -386927 -176794 894814
43526 894814 1339793 653159 158624 830968 1713546 1601970 956632 747304 610392 -176580
43516 -176580 -925455 -652343 -124037 -654594 -1480168 -768083 1001224 1326855 -351539
43507 -351539 -1660196 -1055523 -34646 -324799 -1183597 -1190512 -774812 -958212 -1099289 -92322
43497 -92322 1201492 966527 -604207 -1426224 -551655 683788 781625 -54995 -613933
43488 -613933 -291194 425626 646159 61518 -682033 -837847 -687896 -1009198 -1408382 -598689
43478 -598689 1133775 1445655 -822282 -3419567 -3466260 -1360643 93072 -276250 -1034738
43469 -1034738 -946289 -527228 -486680 -484564 -84558 416601 699170 923876 1117624 947378
43459 947378 364792 -323382 -1083051 -1980567 -2432077 -1649915 83510 1525852 1923576
43450 1923576 1529461 807799 82738 -164664 299662 830951 658002 104250 51724 472667
43440 472667 637358 444433 245083 -277891 -1513504 -2509302 -1941311 -415958 99155
43431 99155 -730573 -1186578 -447809 131041 -516648 -1359052 -1068961 -106093 229734 -322711
43421 -322711 -1140367 -1815083 -2187374 -2077666 -1675075 -1456092 -1336739 -835626 -283531 -588312
43411 -588312 -1458885 -1339399 298444 2017822 2438102 1819979 976413 60168 -781204
43402 -781204 -969181 -565092 -441392 -642644 -43350 1588028 2799490 2635015 1932596
43393 1932596 1465292 625614 -812623 -1541140 -878475 -258256 -779252 -1034100 519672
43384 519672 2585730 2824428 1456656 608813 879715 1011935 487931 92444 63578
43375 63578 -223326 -775968 -1005027 -1098370 -1652574 -2117403 -1382629 146361 773758 -105368
43365 -105368 -1345781 -1817674 -1463111 -610343 444391 1154559 1156880 908246 970389 1057517
43355 1057517 750592 493893 757727 1014792 802797 817135 1470559 1529322 48983 -1477736
43345 -1477736 -1145577 192907 328230 -550199 -394122 854223 1085659 -215285 -1092829
43336 -1092829 -486770 367224 556784 784460 1257174 960479 -13502 -27563 1133627
43327 1133627 1468173 193575 -656501 340085 1516553 1040304 36236 488848 1867099
43318 1867099 2291657 1691293 1363551 1366466 701450 -462377 -855821 -170572 633482 892745
43308 892745 735528 288017 -371411 -737386 -431879 78803 209830 222835 607427 1085371
43298 1085371 1129262 903518 864750 1033678 1357072 1989134 2527906 2015188 526898 -434765
43288 -434765 -144782 95031 -805485 -1688911 -1106394 -24355 -380937 -1788928 -2090504
43279 -2090504 -865945 13574 -528584 -1364280 -1340352 -909612 -806633 -730576 -304387 -77605
43269 -77605 -562823 -1180767 -1098328 -486030 -140604 -297178 -497736 -378754 -67999 84139
43259 84139 -131662 -593739 -892592 -687027 -56329 610389 994820 993792 683772 350631
43249 350631 337649 641125 886456 863831 743116 617808 350762 89411 273776 772477
43239 772477 762686 11947 -493134 70981 1059513 1293374 683050 -2427 -416366 -670560
43229 -670560 -604391 -128568 121541 -359835 -825492 -289509 665108 600379 -377631 -656091
43219 -656091 182824 501930 -765200 -2271352 -2319639 -1503928 -1610782 -2600271 -2621779 -1091633
43209 -1091633 122720 -552226 -1899219 -1637424 70341 666843 -1055711 -3015817 -2679589
43200 -2679589 -544411 801258 412450 -116413 497897 1396155 1305196 533094 122538
43191 122538 117652 -92733 -432068 -336555 136545 429563 386952 159565 -431680 -1547333
43181 -1547333 -2649348 -3031144 -2772371 -2369216 -1722932 -387348 1370397 2632693 2901495
43172 2901495 2417171 1545640 524035 -308785 -654766 -554862 -164050 436869 854216
43163 854216 479773 -404989 -419857 1067396 2589853 2267487 340254 -1263224 -1537203
43154 -1537203 -1220943 -1176796 -1349660 -1461826 -1520862 -1399223 -902728 -411341 -545561 -1142175
43144 -1142175 -1454074 -1303945 -1064778 -654337 257052 1119653 968582 143748 92260 1075700
43134 1075700 1511634 278544 -1549758 -2119865 -1031077 639718 1793252 2032454 1519015
43125 1519015 810068 506696 659916 825820 784195 671251 445431 5870 -188302 378584
43115 378584 1085644 670733 -818008 -1826178 -1492347 -743345 -568435 -555632 -77563
43106 -77563 312733 -113301 -819889 -868654 -507342 -609305 -1061885 -992998 -254215 511520
43096 511520 1001009 1281533 923677 -619640 -2721017 -3818636 -3190325 -1609310 -108394
43087 -108394 977116 1541154 1305143 425060 -202606 166056 1289553 2329851 2673510
43078 2673510 2136288 909590 -292794 -549266 252018 1064964 917191 153517 -253989
43069 -253989 -349024 -1087631 -2451408 -2866405 -1306628 893109 1508282 272085 -1076845
43060 -1076845 -1477987 -1721169 -2516672 -2985255 -2158615 -791275 -259141 -421332 -112223
43051 -112223 695917 882080 255591 -813 712618 1465910 1364498 823930 586716 498233
43041 498233 53624 -610149 -1009765 -1018575 -706694 -69690 593683 687277 209215 -46454
43031 -46454 276637 391468 -446035 -1737070 -2485785 -2539262 -2373320 -2095299 -1584561 -1224406
43021 -1224406 -1506630 -2077418 -2060047 -1275408 -382819 149972 469947 711462 704960 513400
43011 513400 611701 1161488 1529575 974673 -322313 -1288917 -1123803 -224296 264755 -258879
43001 -258879 -1349215 -2288239 -2786443 -2650893 -1553113 104480 802626 -374531 -2010160
42992 -2010160 -1838194 82140 1340374 640659 -536670 -575761 -206736 -858422 -1949108
42983 -1949108 -1778240 -409070 290298 -643757 -2153036 -2862558 -2535394 -1609727 -499143
42974 -499143 267352 161555 -654302 -1378547 -1541897 -1406677 -1356812 -1467916 -1673109 -1767170
42964 -1767170 -1331502 -316004 424175 -31395 -1298911 -1979389 -1432407 -504977 -310986
42955 -310986 -974423 -1822490 -2237181 -2052846 -1543680 -1189523 -1138704 -954023 -290907 374701
42945 374701 312559 -313921 -607131 -213968 323627 549734 632749 759317 744689 489471
42935 489471 152579 -337881 -1207862 -1985544 -1548908 397066 2500479 3133349 2278847
42926 2278847 1400622 1530715 2084124 1757307 232960 -1400454 -1923234 -1274102 -241229
42917 -241229 764392 1850358 2620729 2138619 438342 -964441 -977249 -460601 -713962
42908 -713962 -1277002 -817635 331958 479482 -572050 -981192 269364 1819668 2205062
42899 2205062 2053862 2656785 3578394 3340546 1852090 596284 557210 1197224 1509770
42890 1509770 1104355 189725 -681018 -753362 299130 1720937 2248941 1524605 448700
42881 448700 -29323 22405 -35228 -299317 -204408 481972 1063636 748821 -137285 -422949
42871 -422949 298113 1042901 865636 176077 -135769 -229755 -849300 -1751675 -1955157 -1425034
42861 -1425034 -1089300 -1118282 -751447 -126843 -535183 -2118393 -3005966 -1871209 126661
42852 126661 1278577 1809401 2756025 3535841 2737102 775682 -358735 4526 444527
42843 444527 -154311 -1067528 -1121391 -314778 579337 1089759 1187967 1047071 1000761 1167895
42833 1167895 1035197 89778 -1170340 -1697731 -1353218 -957321 -844680 -436091 511118
42824 511118 1253738 1072331 142180 -880997 -1397439 -894176 598214 1923166 1762389
42815 1762389 463331 -231553 381829 1097656 892688 464031 764679 1327199 1288184
42806 1288184 1010203 1242261 1452761 555835 -1158111 -2330212 -2534544 -2525973 -2598334 -2204029
42796 -2204029 -1382471 -1105947 -1701162 -2137192 -1532733 -400963 279145 385960 312173
42787 312173 26476 -669339 -1448223 -1866300 -2115577 -2557827 -2805129 -2210979 -1200588
42778 -1200588 -1085245 -2264331 -3473565 -3333811 -2000612 -668454 39725 418110 722353
42769 722353 748107 390248 -107749 -591395 -1051056 -1151945 -465152 600194 926605 200210
42759 200210 -499845 -234362 444408 481004 -43939 -282480 -93800 -4204 -62698 46891
42749 46891 9581 -683095 -1441395 -1188010 -281581 -186200 -929499 -718801 1133882 2699914
42739 2699914 2170000 653094 518677 1827430 2259479 382223 -2539146 -4152858 -3410292
42730 -3410292 -1208718 616914 861918 -48023 -733995 -686506 -753388 -1457643 -1857761
42721 -1857761 -949302 703324 1819803 2105523 1934605 1157104 -320071 -1416461 -1015105
42712 -1015105 138956 332852 -552025 -1085541 -793356 -767553 -1579849 -2395496 -2619823
42703 -2619823 -2749615 -2974596 -2491030 -981084 559861 1244946 1376155 1450928 1274641
42694 1274641 709604 124767 -515319 -1754192 -3231710 -3612642 -2711897 -2134389 -2727415
42685 -2727415 -2971081 -1358773 989535 1845725 1023164 209334 322294 800798 1113021
42676 1113021 1263151 957562 -166228 -1430895 -1566886 -412387 853695 1188441 522415
42667 522415 -676619 -1723732 -1842813 -976967 -246731 -629189 -1505464 -1573806 -796205
42658 -796205 -181153 11534 381363 863759 663646 -171509 -596915 -275072 -83879 -574817
42648 -574817 -1185635 -1364387 -1279588 -1053578 -497140 37143 -180238 -829730 -674899 330998
42638 330998 592833 -618096 -1720241 -1127042 301717 664427 -71606 -318710 443073
42629 443073 999171 472160 -464486 -860635 -825314 -987928 -1371064 -1418472 -798228 227021
42619 227021 1049026 1135694 401027 -665750 -1336607 -1222401 -531658 187841 523231 486449
42609 486449 370129 300529 97597 -243015 -222247 505261 1304661 1108733 -93188 -1019449
42599 -1019449 -637627 681056 1880014 2443987 2461861 2103610 1647907 1523673 1669362
42590 1669362 1296582 1281 -1308456 -1439763 -561901 143264 313332 726286 1606574
42581 1606574 1841666 610828 -1112265 -1717344 -1149148 -821934 -1419556 -1920279 -1201943
42572 -1201943 316412 1348426 1418376 1002062 400949 -492163 -1401987 -1722476 -1537359
42563 -1537359 -1558912 -1739836 -1098209 469613 1422431 666982 -624878 -665091 300919
42554 300919 661081 221914 344548 1327573 1747170 954160 291659 826554 1519266 964034
42544 964034 -356748 -1049610 -1078691 -1477161 -2385382 -2907247 -2635353 -1972398 -1143651 -204618
42534 -204618 99022 -1095241 -3140441 -4117777 -3139084 -1391084 -439559 -456215 -705684
42525 -705684 -898023 -1192418 -1390873 -1067468 -393523 -91631 -440313 -845097 -646895 -14593
42515 -14593 320162 67459 -326874 -483370 -681684 -1210886 -1517336 -786706 677727 1569803
42505 1569803 1345819 948545 1189175 1323264 270143 -1351839 -1754304 -497795 791529
42496 791529 622911 -449170 -793802 79831 1095664 1153522 327868 -609719 -1296062
42487 -1296062 -1938771 -2537187 -2528613 -1567047 -316031 154727 -257838 -581461 -190753 407913
42477 407913 609510 728631 1240490 1663846 1239718 353202 97228 485929 348428 -708166
42467 -708166 -1414039 -589277 1103579 2037877 1731020 1168992 1220931 1569155 1373943 462513
42457 462513 -446193 -547717 155090 793674 581828 -173977 -319657 684939 1864643
42448 1864643 1726154 61858 -1714647 -2171668 -1432839 -843571 -1242448 -1987344 -1861466
42439 -1861466 -655610 568795 826318 386640 265550 791354 1230981 920606 229588
42430 229588 -722 324602 444890 -137759 -922478 -1041627 -319133 636105 1226470 1371964
42420 1371964 1242206 880941 274644 -439199 -1019556 -1274362 -1132157 -759127 -593137
42411 -593137 -901944 -1242711 -866423 101905 482174 -457064 -1836338 -2219661 -1454231
42402 -1454231 -623632 -424510 -570253 -740115 -1032286 -1277493 -963470 -242098 -20885
42393 -20885 -512063 -653759 290161 1440978 1579032 1018842 1078409 2070452 2989595 3084393
42383 3084393 2624907 1984655 1002327 -320603 -1272622 -1196721 -422842 84977 -112757
42374 -112757 -499778 -360428 290462 765174 681004 526497 885653 1360469 993996 -157993
42364 -157993 -743901 117172 1530886 2035447 1564398 1259697 1576148 1595414 409537
42355 409537 -1563521 -3020178 -3156216 -2335050 -1517298 -1180050 -915943 -268835 278839
42346 278839 -136998 -1151589 -1173890 351782 1672359 842849 -1545586 -3121295 -2884830
42337 -2884830 -2095157 -1965491 -2061580 -1564516 -789893 -496412 -554072 -314289 186344 326240
42327 326240 -4015 -189184 200146 819289 989212 457945 -329046 -626018 -137180 597317
42317 597317 767715 270906 -209260 -190647 -11784 -153912 -341787 136781 1317746 2289837
42307 2289837 2185616 1114556 -80209 -722775 -685621 -138730 517917 468743 -1004950
42298 -1004950 -3328260 -4582815 -3543761 -1441379 -615275 -1500183 -2254835 -1648376 -784031
42289 -784031 -1064612 -1846155 -1611683 -568079 -276965 -1031301 -1408316 -608101 394670
42280 394670 564085 275969 283161 319955 -238421 -1034333 -1135800 -518366 -192259 -771003
42270 -771003 -1607361 -1677563 -952857 -420915 -719472 -1228797 -992486 -253873 -206036 -1083016
42260 -1083016 -1575783 -814132 78454 -434741 -1870426 -2345649 -1368659 -445982 -724232
42251 -724232 -1478077 -1471536 -626497 354743 1079899 1432977 1192801 454424 -78444 92968
42241 92968 509742 389203 -246077 -577003 -37812 952153 1341764 559889 -671843 -944691
42231 -944691 151215 1434228 1737076 1445032 1523626 1709648 1110663 199240 379836
42222 379836 1479872 1617580 138713 -1197090 -922096 -1191 58430 -299689 218369
42213 218369 1284049 1477351 691517 187598 465167 710832 394976 -29260 -235942
42204 -235942 -602493 -1319783 -1869864 -1749584 -1045330 -107707 739330 1112737 847787 426805
42194 426805 514803 1019277 1204295 769852 229294 165656 645239 1371809 1897052 1728231
42184 1728231 819881 -47421 20118 893552 1558292 1428774 952657 802651 1009562 1092236
42174 1092236 669934 -182695 -924240 -920834 -115898 815486 1289639 1485836 1742670 1727902
42164 1727902 987430 -12074 -402812 -352077 -817862 -1751532 -1841387 -572127 682003
42155 682003 531444 -422377 -617884 77523 363805 -337508 -1119673 -1197172 -1024280 -1229844
42145 -1229844 -1453498 -1120200 -674877 -950888 -1590894 -1268290 303546 1567745 922617
42136 922617 -1257739 -3054319 -3161113 -2012522 -881976 -443969 -374675 -48761 575301
42127 575301 791656 -942 -1292838 -1741868 -741411 732735 1333958 1009177 771239
42118 771239 1103538 1495555 1549971 1577438 1774940 1663642 916854 161790 283820 1203595
42108 1203595 1927917 1767908 1100178 827571 1259207 1679263 1178650 -91766 -903567
42099 -903567 -485452 410816 620096 310435 598158 1534011 1720270 336455 -1515297
42090 -1515297 -2180760 -1431565 -375955 46208 -201601 -605711 -572260 149803 1037780
42081 1037780 1129758 213680 -737981 -796003 -290333 -218695 -810420 -1338763 -1168600 -395445
42071 -395445 476587 1005180 977338 470895 -224809 -905915 -1578119 -2218084 -2642238 -2706998
42061 -2706998 -2415613 -1840297 -1241563 -1111324 -1569110 -1881357 -1347886 -579067 -878749
42052 -878749 -2228724 -3053439 -2423237 -1342104 -1161714 -1770369 -2232683 -2305384 -2278208 -2019447
42042 -2019447 -1279284 -470669 -145764 -54001 387631 1033155 1272150 1046291 795675 665424
42032 665424 492988 295513 111420 -295106 -958728 -1390993 -1348132 -1342106 -1686534 -1737020
42022 -1737020 -988183 -217753 -389435 -974102 -669283 524873 1270815 854201 -30355
42013 -30355 -525941 -587845 -542184 -527423 -570975 -637044 -572545 -416299 -490454 -758878 -648705
42002 -648705 -90787 33226 -676977 -1139234 -370426 794618 1021445 734543 1244220
41993 1244220 2127871 1621367 -341181 -1599519 -831459 645611 938799 5234 -887772
41984 -887772 -1036708 -733766 -498368 -518691 -479467 193668 1444387 2185574 1585150 378984
41974 378984 -183177 -273711 -953962 -2057282 -2350354 -1727535 -1364066 -1530896 -1207394 -211756
41964 -211756 299451 -16893 -110625 214272 -297271 -1706047 -1956410 -68521 1887866
41955 1887866 1801568 563964 70322 391 -923090 -1893465 -1099770 889874 1641505
41946 1641505 585617 -315240 214716 1202668 1506531 1373827 1273967 946318 366942
41937 366942 193410 515373 431479 -462873 -1342577 -1543378 -1538996 -1827735 -1931514 -1351885
41927 -1351885 -633835 -569072 -970963 -1056109 -573390 131804 771222 1226386 1339808 1082491
41917 1082491 639700 30414 -903895 -1839328 -1945745 -1040177 -167856 -358442 -1262418
41908 -1262418 -1752825 -1505027 -1136160 -978114 -643724 71262 643175 513273 -164507
41899 -164507 -762326 -837507 -376364 298140 711794 631823 367935 356507 449392 146736
41889 146736 -393518 -351397 382564 692087 -135094 -1013717 -478737 930114 1182298 -265671
41879 -265671 -1542297 -1017201 467036 1043576 492642 180646 881952 1943348 2458417
41870 2458417 2205250 1423038 538558 151221 554919 1254715 1542595 1403614 1249119
41861 1249119 1075393 684683 412010 668057 1027991 847246 523943 870268 1400246
41852 1400246 810012 -700030 -1305846 -320086 596360 -65550 -1408677 -1625670 -607955
41843 -607955 353029 672719 811502 929729 568171 -406062 -1549743 -2486063 -3035011
41834 -3035011 -2910849 -2042853 -956784 -125219 714269 1807612 2404423 1602727 -61023
41825 -61023 -1042793 -859532 -626332 -1290035 -2341176 -2736255 -2285348 -1546979 -931055 -540402
41815 -540402 -574971 -1277126 -2490356 -3643295 -4246553 -4238568 -3813181 -3075603 -2056512 -1060270
41805 -1060270 -678017 -1117793 -1702105 -1558255 -801202 -392571 -668598 -777576 -33665
41796 -33665 918093 1062215 609481 663983 1492670 2107108 1699731 696225 67641 159474
41786 159474 553007 724656 525149 187378 39084 92521 -95641 -934568 -2129009 -2750265
41776 -2750265 -2122500 -537547 975660 1529495 1043788 155909 -475367 -771602 -1129056
41767 -1129056 -1790899 -2473968 -2613867 -1861736 -423650 903428 1194927 264126 -1007525
41758 -1007525 -1587716 -1419009 -1129287 -819654 -4653 1158191 1613713 891167 -26047
41749 -26047 -30127 591129 775487 276957 -289361 -620503 -940340 -1172296 -865993 -42818
41739 -42818 695137 1052037 1288206 1374719 684153 -980196 -2596379 -2814830 -1473586
41730 -1473586 260620 1226018 1321479 1141955 978080 600961 -35776 -385052 74042
41721 74042 1037378 1584237 1133138 -92687 -1426702 -2211421 -2027344 -1018588 -45255
41712 -45255 -10099 -893593 -1831202 -2140322 -1780144 -859604 551370 1934375 2416228 1770948
41702 1770948 783015 273236 300611 605363 1143436 1707478 1662458 699466 -547252 -1166711
41692 -1166711 -954557 -403015 -132714 -606090 -1818801 -2918531 -2793130 -1494314 -390028
41683 -390028 -380522 -718661 -275446 771913 1362368 1053875 251638 -502371 -618067 513565
41673 513565 2521142 3640637 2542405 236235 -1101610 -970705 -840633 -1629859 -2423280
41664 -2423280 -2187767 -1458483 -1418380 -2066802 -2241109 -1209352 430616 1474948 1411362
41655 1411362 875787 830162 1392475 1782038 1484537 945805 758290 726943 382518 -23552
41645 -23552 137994 774380 1162372 1050305 833693 616107 -40346 -1198535 -2118161 -2123713
41635 -2123713 -1400610 -570257 154011 990624 1914686 2310437 1506719 -295489 -1873321
41626 -1873321 -2178310 -1620898 -1525873 -2166612 -2187293 -528848 1836157 2973227 2347725
41617 2347725 1212448 859559 1339729 1875310 1820065 1127145 343495 149504 612862
41608 612862 1089766 1102130 886185 749491 497290 8839 -295246 -247825 -500594 -1425886
41598 -1425886 -2111864 -1523286 -168551 539270 237712 -223249 -315552 -337905 -495706 -605806
41588 -605806 -703154 -923834 -833237 102404 1381387 1795057 937083 -459514 -1598837
41579 -1598837 -2173752 -2049942 -1375600 -822643 -767638 -554801 370549 1108069 511893 -654438
41569 -654438 -520849 1034813 2188512 1980804 1407319 1267647 881963 -208822 -1019125
41560 -1019125 -732077 -160107 -429843 -1291359 -1795027 -1715962 -1350969 -763441 -96288 198060
41550 198060 197474 657008 1562703 1595379 -1385 -1981307 -2595227 -1740816 -599416 97653
41540 97653 376491 312575 141706 497306 1455425 1880145 809341 -988199 -1936996 -1705765
41530 -1705765 -1213783 -976222 -688355 -290956 -205234 -406782 -324062 121354 258507 -254408
41520 -254408 -797196 -587149 331321 1167008 1215086 524155 -105643 132983 1151424 1993968
41510 1993968 1927073 1184921 427869 -88108 -439119 -590506 -543105 -600696 -975711 -1341993
41500 -1341993 -1202427 -504881 414787 1211193 1580674 1363051 947252 1105125 1989436
41491 1989436 2763233 2667624 1907047 945904 -386582 -2240260 -3743190 -3769999 -2550055
41482 -2550055 -1484163 -1337813 -1575320 -1630598 -1828044 -2540462 -3192897 -2833395 -1381193
41473 -1381193 269486 1247255 1357720 867533 162156 -297884 -158816 412258 832942
41464 832942 930896 1270068 2140322 2647927 1756539 104770 -447966 601856 1609166
41455 1609166 1286327 611251 966769 1631669 993484 -517679 -919616 93094 689608
41446 689608 -15242 -654371 -174822 370895 -133838 -770600 -144674 1173821 1474684
41437 1474684 481482 -429244 -243897 695173 1548158 1869970 1710372 1426819 1259699
41428 1259699 874909 -140576 -1190640 -1048190 285438 1230505 769062 -231774 -610339
41419 -610339 -559187 -670282 -612477 -53358 258529 -209131 -461710 427551 1433529 1145659
41409 1145659 317609 671127 1750673 1441009 -448228 -1625437 -814520 501032 697483
41400 697483 302886 441748 736810 334150 -221232 148116 1009981 922782 -214915 -824050
41390 -824050 53513 1287946 1191348 -143108 -929638 -73927 1361298 1599497 536829
41381 536829 -249689 176151 903988 755293 1621 -387851 -362481 -466135 -490893 130528
41371 130528 836288 375494 -1082163 -1727887 -564197 1133153 1605734 943040 649709
41362 649709 1448455 2547006 2940932 2530150 1746604 775965 -343491 -1178672 -1119818
41353 -1119818 -265394 466785 515665 496081 1176640 2023185 1810677 640713 74106 842146
41343 842146 1683464 1257374 101645 -416094 -211457 -228811 -651746 -774082 -435471 -286636
41333 -286636 -591717 -841312 -673634 -322084 -82525 -67187 -450974 -1257157 -1989267 -2149911
41323 -2149911 -1965706 -1944867 -1989211 -1664744 -1033904 -464974 -4793 275059 -124483 -1177401
41313 -1177401 -1595751 -363856 1430374 1773709 512705 -546192 -249877 706870 1263987
41304 1263987 1162711 436934 -797792 -1758760 -1580876 -778640 -777388 -1765264 -2483427 -2382052
41294 -2382052 -2264372 -2327107 -1463423 579717 2132977 1944985 1099049 1191153 1867581
41285 1867581 1753905 871401 440556 812250 1150538 972593 717335 816838 1191259 1631484
41275 1631484 1904836 1588623 493313 -839356 -1594304 -1502654 -869757 -144072 202489
41266 202489 -127135 -761104 -908131 -486648 -301468 -631457 -543060 622970 1940270
41257 1940270 2099511 1271553 639276 524268 172551 -798389 -1869750 -2535714 -2780132
41248 -2780132 -2573886 -1783259 -765002 -299494 -623043 -1027600 -703993 299633 1120007
41239 1120007 933469 -245846 -1550375 -2136950 -2042975 -1880146 -1785836 -1295441 -340524
41230 -340524 392926 431016 130376 -60309 -247507 -566744 -754946 -737078 -855885 -1005929
41220 -1005929 -460763 791341 1580242 1286934 961338 1595685 2354248 1945977 838774
41211 838774 441049 779604 795341 412149 333227 128355 -1253197 -3057169 -3169784 -1430238
41201 -1430238 -171823 -647342 -1223613 -394799 620392 118324 -1078366 -1104552 -289159
41192 -289159 -441527 -1561366 -1774694 -530419 458685 -40937 -1059777 -1239446 -764297
41183 -764297 -484861 -372839 18943 435375 383201 159989 405080 980875 1229232 1137427
41173 1137427 1367939 2132458 2800207 2806978 2401655 2226293 2470240 2670603 2236353 1077864
41163 1077864 -250712 -1065167 -1202618 -1022813 -819272 -581957 -381035 -448743 -616477
41154 -616477 -253532 733379 1360393 725448 -666589 -1539030 -1542843 -1402562 -1472557 -1193329
41144 -1193329 -179866 1088440 2001312 2434812 2325289 1492713 312630 -299712 -97294
41135 -97294 155620 84201 405451 1409185 1859999 722711 -866005 -961769 320479
41126 320479 1038688 403455 -296131 -45993 392590 72871 -606111 -1012723 -1627702 -2937924
41116 -2937924 -3930308 -3245877 -1400420 -340620 -802424 -1459468 -998918 119524 597207
41107 597207 161538 -326850 -264425 -3960 -105385 -444437 -381700 391316 1484070 2265561
41097 2265561 2410030 1889403 762419 -656541 -1608559 -1440938 -478993 134305 -244514
41088 -244514 -983718 -1083281 -520297 -144834 -366236 -583743 -127478 722351 1075752 578436
41078 578436 -212037 -563038 -278840 397587 1146280 1556805 1179429 124636 -636888
41069 -636888 -264571 697380 830665 -211409 -1105690 -678469 450097 805401 96161
41060 96161 -610717 -496978 140153 614050 658175 394248 85795 14089 147440 4975
41050 4975 -659024 -1225125 -898825 160081 1138745 1780304 2338275 2467492 1404507 -527164
41040 -527164 -1851874 -1905670 -1710339 -2160472 -2456029 -1437165 336586 1192113 723170
41031 723170 298170 1072488 2473483 3022737 2068253 345328 -877242 -969224 -381622
41022 -381622 -26036 -272676 -745057 -1050909 -1222485 -1232364 -677596 508638 1461981 1223239
41012 1223239 14075 -985834 -1111141 -845313 -913537 -1340307 -1650512 -1546614 -1054714
41003 -1054714 -292085 568222 1249230 1584425 1727177 1907627 2017304 1727125 1095153
40994 1095153 718835 970967 1308777 851825 -345641 -1178868 -889358 -12185 513084
40985 513084 630165 858416 1109289 789623 16930 -313399 45954 142870 -752411 -1925145
40975 -1925145 -2155998 -1400517 -714133 -699377 -823687 -389537 439283 915168 703599 241106
40965 241106 104024 249563 84960 -690943 -1545103 -1673193 -1040895 -508766 -756534 -1342101
40955 -1342101 -1161031 161470 1641536 1946193 917609 -294181 -702538 -545105 -446234
40946 -446234 -138418 972540 2229870 2092894 400488 -1084088 -1103498 -611278 -1018155
40937 -1018155 -1944467 -2169932 -1864781 -2072477 -2505814 -1815823 7151 1359061 1376422
40928 1376422 855540 457630 -282269 -1495711 -2117481 -1437413 -300662 188510 178796
40919 178796 418298 940322 1224167 1009167 364469 -383757 -472082 593422 1813704
40910 1813704 1418104 -626383 -2176797 -1808296 -775102 -944277 -2017958 -2269057 -1168593
40901 -1168593 230643 1018229 1196556 1052518 866556 976569 1280271 1101618 298644
40892 298644 -170583 350756 1064228 1016407 704438 1106438 1886575 2038823 1684855 1622389
40882 1622389 1576729 672523 -613201 -847744 -44345 181534 -806438 -1682870 -1358475
40873 -1358475 -567812 -438572 -844460 -1155646 -1480128 -2041898 -2187091 -1208273 330659
40864 330659 1167140 989199 607548 612583 697038 376868 -300084 -968044 -1376056 -1372166
40854 -1372166 -847447 -34689 389923 -29762 -772536 -735812 379910 1537285 1663868
40845 1663868 1083601 921000 1315556 1243197 262930 -627864 -436141 391144 725575 325817
40835 325817 -153173 -268183 -96388 276464 824458 1290503 1436502 1443887 1569099 1619696
40825 1619696 1282007 744163 465293 486410 429471 47757 -563519 -1120301 -1274614 -872396
40815 -872396 -258133 70190 181740 473767 660920 -54564 -1531789 -2519442 -2450688 -2229046
40805 -2229046 -2497904 -2416343 -1244719 51413 166194 -551419 -951772 -1063212 -1565378
40796 -1565378 -2012709 -1445833 -353732 -135456 -786510 -984019 -461679 -413780 -1308385
40787 -1308385 -2104398 -2061079 -1656316 -1226210 -364501 666801 559718 -1085146 -2795495
40778 -2795495 -3182814 -2643420 -2137560 -1513806 -319248 695172 368186 -1028103 -2031235
40769 -2031235 -1882646 -1107824 -330055 422138 1074990 1121372 370960 -436446 -361581 483485
40759 483485 905782 85368 -1263686 -1702562 -981029 -414633 -1018580 -2024760 -2023007 -1039310
40749 -1039310 -418010 -789018 -1263092 -897052 -45160 264617 -244895 -838056 -763497 -196269
40739 -196269 -101361 -1080138 -2411248 -2669537 -1486720 -127733 108026 -552708 -1036348
40730 -1036348 -1061148 -1175797 -1524055 -1578700 -1043516 -208013 589551 1220086 1557219 1514421
40720 1514421 1109365 189168 -1334822 -2585866 -2067754 218696 2080853 1827696 631097
40711 631097 566166 1280193 813193 -832089 -1539895 -588796 310512 126076 128969 1227135
40701 1227135 1961983 892140 -786237 -994239 70898 592776 209089 317737 1450839
40692 1450839 2249276 1485409 -270681 -1611191 -1963276 -1677257 -1136187 -524792 -185352
40683 -185352 -473777 -1160902 -1499479 -1191965 -903250 -1297968 -1831798 -1310526 288191
40674 288191 1502218 1319023 495174 220139 326304 -107839 -978974 -1240384 -534100
40665 -534100 396104 877739 935048 781635 553533 485401 583975 330954 -479449 -964619
40655 -964619 -254202 926293 991078 -266227 -1384569 -1283598 -482379 -61081 -361399
40646 -361399 -971563 -1277575 -906734 -180153 29538 -538412 -946057 -395801 425122 351012
40636 351012 -492271 -1114443 -1301581 -1469700 -1368989 -464009 704392 1078368 797885
40627 797885 871567 1366759 1461618 1084295 914779 938273 599655 206397 540556 1290134
40617 1290134 1537777 1497595 1954795 2374312 1652591 438545 392436 1283531 1292623 218952
40607 218952 -230208 423757 715776 117639 -112076 363336 173432 -905320 -1062002
40598 -1062002 362573 1409789 652989 -597110 -755591 -331301 -191794 323201 1661369
40589 1661369 2349629 1061788 -1061627 -2010537 -1636823 -1199936 -1269101 -1501258 -1587115
40580 -1587115 -1300235 -483595 292441 158034 -485039 -208433 1218918 2469853 2857824
40571 2857824 3003359 2990118 2125197 1055720 1600747 3634995 4679619 3611649 2231210
40562 2231210 2016215 1961402 999678 -5089 -192565 -248943 -623544 -574911 -212677 -883175
40552 -883175 -2300293 -2189353 -201904 894716 -399848 -1884586 -1481198 -360126 -199797
40543 -199797 -402781 -161202 -239142 -627576 351467 2509095 2877047 631205 -812862
40534 -812862 786888 2893775 2897626 2352245 3153219 3549743 1813240 77953 467379
40525 467379 999720 -521656 -2092869 -1175053 769969 1562504 2360544 4189153 4537761
40516 4537761 2035381 221903 1745520 3360891 1945826 481713 2144763 3769134
40508 3769134 1898659 -65632 1860447 4411245 3567816 2967638 6855339 10954142
40500 10954142 10520259 10717231 17316429 24524865 25914771 29235218 43269936 59361995
40492 59361995 69643242 95642772 164467668 252662372 290873190 243120279 153269586
40485 153269586 89988268 69402211 59674896 41656702 27793547 27101594 27546220 19886292
40477 19886292 12611665 13449177 15527696 11612163 6693349 7046498 9033829 7393130
40469 7393130 4598855 4287805 4006872 1402370 -98194 1873807 3195523 636008
40461 636008 -1937431 -592225 1604719 548731 -1411029 -115405 2873345 3443990
40453 3443990 1979033 1577019 2160006 1508442 -111372 -821350 -683072 -662231 -74899
40444 -74899 1630234 2693841 1760841 592994 1145880 2228352 1991767 1394913 2098300
40435 2098300 3069418 2459336 1022922 625908 970211 684768 159816 482777 890925
40426 890925 1134 -1524028 -2009841 -1465822 -1016516 -647837 334187 1480045 1781503
40417 1781503 1301671 639406 -251490 -1251605 -1293376 41151 1315649 1191550 451484
40408 451484 586597 1513732 2166946 2256108 2055624 1533601 924721 984629 1551675 1236509
40398 1236509 -304465 -1348923 -674511 455949 353011 -576486 -918956 -464822 174155
40389 174155 791247 1023195 47309 -1723898 -2241178 -658550 1077402 1129839 489472
40380 489472 854903 1555516 945586 -491777 -895972 37559 1103469 1789425 2390805
40371 2390805 2662765 2268608 1844564 1875679 1419783 -261630 -1852437 -1752644 -704963
40362 -704963 -528416 -1123081 -986478 -22407 422606 -142390 -1058567 -2000485 -2816745 -2584635
40352 -2584635 -893069 654985 400700 -685281 -628309 99337 -457816 -1947650 -2061921
40343 -2061921 -590296 115241 -867439 -1697626 -1219506 -776256 -1400187 -1851956 -922674
40334 -922674 533991 1305724 1561091 1532036 482088 -1440206 -2207978 -623351 1496584
40325 1496584 1723109 363518 -497396 -276696 -152737 -598662 -666201 229237 1333996
40316 1333996 1632121 912906 -362127 -1520464 -1971170 -1595518 -852913 -252350 12178
40307 12178 -206197 -985308 -1775609 -1693343 -827491 -368773 -859719 -1306591 -819750 -82202
40297 -82202 -64454 -212230 636943 2125099 2730743 2032480 1131937 813112 697549 440293
40287 440293 408224 703440 680355 50788 -492204 -418319 -287141 -774269 -1457947 -1428911
40277 -1428911 -641761 186492 710704 1144003 1481772 1413136 1065437 1050505 1527723 1853164
40267 1853164 1483348 711182 128406 -192237 -488751 -603133 -94313 964411 1799858
40258 1799858 1730590 915383 202002 332661 1267085 2154628 2067039 963983 -156265
40249 -156265 -320100 280917 527433 -256889 -1520054 -2175785 -1804231 -990980 -626008
40240 -626008 -1002236 -1568594 -1576325 -984490 -528818 -736690 -1168494 -1011599 -199085 563832
40230 563832 751687 440325 -127186 -741155 -997152 -602012 -28394 -111199 -798902 -1126765
40220 -1126765 -717640 -354301 -541435 -527809 355450 1281105 1071254 173832 84167 988099
40210 988099 1437879 588264 -598493 -954430 -782500 -1055888 -1716301 -1831674 -1155904
40201 -1155904 -549568 -746643 -1419677 -1760169 -1525424 -1141057 -1003869 -1068209 -1090448 -960422
40191 -960422 -694904 -355821 -142019 -341703 -948765 -1506172 -1626312 -1484899 -1425746 -1315362
40181 -1315362 -897860 -637125 -1317876 -2635067 -3137312 -2102148 -633340 -128797 -339102
40172 -339102 69044 1437435 2679731 2814856 1994262 988208 500888 1016688 2391385
40163 2391385 3400663 2633730 282008 -1705865 -1776994 -500567 381165 97242 -611678
40154 -611678 -762858 -220292 470362 796834 680344 444817 519140 1057859 1807878 2376018
40144 2376018 2581729 2521972 2373621 2180844 1811259 1162466 437003 35412 35089 8772
40134 8772 -362560 -725281 -509406 203344 737084 660032 77758 -809743 -1824647 -2490307
40124 -2490307 -2317206 -1597424 -1244550 -1577767 -1913976 -1675178 -1193992 -979570 -907528 -757166
40114 -757166 -885327 -1571485 -2231089 -2192667 -1848990 -2010636 -2387026 -1914411 -631437 26914
40104 26914 -759978 -1954704 -2118157 -1320640 -776004 -1072009 -1633093 -1750980 -1369996 -783167
40094 -783167 -133891 536783 1028496 1010453 351673 -570574 -1017416 -587116 291382 901418
40084 901418 1178660 1544812 1844223 1361169 236196 -172787 840447 1989314 1697240
40075 1697240 493218 226303 1205936 1877860 1529596 1431726 2437805 3146285 1944399
40066 1944399 -242961 -1018835 172542 1528477 1627512 1029455 749257 607446 -35867
40057 -35867 -898694 -1171694 -828915 -646559 -1067074 -1738972 -2192336 -2440413 -2771290 -3247901
40047 -3247901 -3562052 -3286772 -2273469 -896711 138223 375064 49865 -84522 549602
40038 549602 1755761 2671724 2616722 1829293 1113585 720795 48230 -1259015 -2441675
40029 -2441675 -2512155 -1677960 -1047524 -1011665 -860523 -192420 272070 -175510 -1044223 -1313122
40019 -1313122 -779263 11071 799701 1722418 2500766 2414352 1322327 105317 -259456
40010 -259456 270518 949871 1159273 903020 519990 149172 -406083 -1238440 -1837624 -1373431
40000 -1373431 229284 1758273 1823914 555565 -378709 244310 1658854 2065011 870132
39991 870132 -680265 -1146733 -507665 223509 479444 617939 1092014 1774131 2229556
39982 2229556 2213637 1717787 864319 -76230 -858442 -1547163 -2252294 -2523180 -1639566 177363
39972 177363 1532782 1451962 643366 391903 706744 650221 208093 410358 1340129 1453501
39962 1453501 -249835 -2405597 -2822231 -1343149 22512 -246443 -1480295 -2044246 -1405516
39953 -1405516 -415664 -32001 -412608 -1141236 -1760678 -1946795 -1591987 -1024999 -879983
39944 -879983 -1363999 -1816414 -1450661 -427663 403817 796747 1269482 1762918 1282156
39935 1282156 -318505 -1263436 54199 2558640 3700369 2891685 1892105 1668392 996670
39926 996670 -964900 -2693092 -2437189 -945961 -264228 -688411 -780199 51262 850212
39917 850212 964470 899236 1046997 1007666 588079 238710 52293 -501897 -1330007 -1366446
39907 -1366446 -206478 921702 717943 -405877 -1011930 -532100 417592 1160673 1475383
39898 1475383 1290626 788302 677656 1520304 2796835 3386660 2968221 2214947 1631545
39889 1631545 1086317 658360 956999 2069952 3001588 2894624 2220907 1915169 1782790
39880 1782790 858495 -738507 -1487968 -437208 1389278 2203201 1525961 394300 -111079
39871 -111079 159947 701524 894326 321935 -823874 -1610902 -1193734 154132 1329081
39862 1329081 1724120 1675228 1561794 1261298 794077 707791 1232424 1654053 1230667 317324
39852 317324 -135770 106376 508035 785825 1133676 1470645 1342442 740942 230774 -5396
39842 -5396 -469582 -1305244 -1752769 -1294201 -645518 -698162 -951046 -149681 1615119 2690202
39832 2690202 2081409 773688 156235 91154 -407838 -1213130 -1135150 143406 1416701
39823 1416701 1546036 756526 -21829 -248999 225771 1382797 2590080 2675046 1242723
39814 1242723 -581077 -1449851 -1326692 -955715 -431715 589426 1623749 1610384 505779
39805 505779 -485906 -533511 -122229 -97580 -570505 -1083768 -1190601 -628318 433261 1152056
39795 1152056 744410 -361294 -870975 -344503 252839 7384 -808436 -1469807 -1776229
39786 -1776229 -1700196 -875086 740352 2175991 2228186 771471 -1158317 -2400711 -2518132
39777 -2518132 -1894688 -1235368 -797212 -209726 595999 718627 -526149 -2035434 -1885415
39768 -1885415 15112 1666880 1738061 1054390 701290 281613 -809159 -1790831 -1647727
39759 -1647727 -894302 -772395 -1406119 -2015153 -2271332 -2242864 -1710261 -749982 -250841 -612658
39749 -612658 -763145 172108 1126546 610404 -870768 -1692386 -1639133 -1580694 -1316502 -62226
39739 -62226 1301758 1016795 -482808 -859751 386677 1072341 -18223 -1217309 -960557
39730 -960557 -289344 -639586 -1156293 -357041 962707 812202 -752258 -1639669 -797562
39721 -797562 542883 863925 191138 -445179 -397245 182437 771347 1016547 1021579 1118794
39711 1118794 1340868 1389536 1172905 968878 1002902 1313585 1952534 2680949 2669276 1479011
39701 1479011 214177 381737 1512088 1494046 -281338 -1840924 -1557788 -454810 -282334
39692 -282334 -803779 -670537 134749 567665 483599 536945 631351 188767 -428110 -468393
39682 -468393 -427765 -1294145 -2342468 -1732113 463761 1877462 1170632 -115162 -56450
39673 -56450 900785 1065239 223593 -341270 7204 575991 726541 750835 1100464 1520796
39663 1520796 1347522 335417 -1042297 -2008653 -2142673 -1667148 -1049314 -411308 410935
39654 410935 1303514 1845350 1959270 2074061 2351177 2265082 1446303 536751 510329 1270523
39644 1270523 1640307 875425 -439921 -1300414 -1511504 -1492374 -1271776 -481477 667923
39635 667923 1219444 657014 -304882 -628738 -254132 94250 101906 129578 344039 361131
39625 361131 -23584 -380917 -285018 62228 247634 344775 743221 1439138 1907232 1714920
39615 1714920 1034419 445959 285414 292063 32653 -391944 -411334 151799 786511 1164469
39605 1164469 1687502 2568654 3010505 2268919 1075753 782107 1311083 1357797 642976
39596 642976 382752 1097457 1550228 728447 -475265 -672667 -10205 395996 236137
39587 236137 42526 94021 389422 1136423 2193710 2584734 1668910 285496 -366005
39578 -366005 -436914 -825775 -1424031 -1381263 -756868 -398651 -329373 223721 1166937 1430359
39568 1430359 744542 77852 -85915 -534224 -1823941 -3195612 -3667675 -3254948 -2496965
39559 -2496965 -1659672 -971821 -802552 -1041536 -1101216 -1004014 -1524964 -2679651 -3131937 -1986113
39549 -1986113 -260570 468177 155715 -123304 -69863 -262914 -618281 -231070 959845
39540 959845 1603905 715462 -798019 -1196911 -102763 1135298 1193205 232119 -596137
39531 -596137 -619685 -179133 125611 185604 212545 210341 -13879 -444823 -781507 -755767 -359483
39520 -359483 174023 500344 465494 432006 997226 2085808 2650969 1759798 -214052 -1965384
39510 -1965384 -2676796 -2562385 -2136115 -1568298 -863329 -200196 91784 -253326 -1116962
39501 -1116962 -1727792 -1163991 434100 1679398 1651077 1217319 1629189 2313061 1566253
39492 1566253 -608623 -2074789 -1511816 -270118 -301098 -1422759 -1898713 -1008171 251216
39483 251216 737498 368059 -214708 -414370 -106472 222495 -95490 -978497 -1471825 -1025094
39473 -1025094 -363184 -351616 -487487 413232 2166436 3026596 1884491 -235274 -1456109
39464 -1456109 -1260771 -740735 -875264 -1289043 -973051 189401 1171974 1144933 555012
39455 555012 411312 788715 767049 -81890 -930001 -837289 -49524 481102 497043 622080
39445 622080 1224096 1758187 1452449 284790 -932279 -1293450 -549945 757953 1812091
39436 1812091 2110902 1564915 264848 -1470546 -2904059 -3288624 -2665337 -1835566 -1341826
39427 -1341826 -935237 -309086 196982 126162 -268335 -326454 89287 508024 586791 442955
39417 442955 280721 108702 -125801 -416662 -742226 -1027739 -1088555 -776029 -163678 453153
39407 453153 646054 40976 -1240091 -2368810 -2563237 -2125884 -2090443 -2642498 -2701620 -1546606
39397 -1546606 -27219 620982 480908 485287 761383 643488 129723 33649 493718 497665
39387 497665 -591838 -1901920 -2084678 -962979 411268 995703 608240 -195429 -694189
39378 -694189 -570828 -142102 62444 -31436 -51886 142002 210000 -100151 -552534 -846929
39368 -846929 -1090576 -1524801 -2039836 -2310822 -2256322 -2015143 -1541166 -586903 808459 2074569
39358 2074569 2584513 2313602 1817510 1534248 1368941 1133961 1081799 1557991 2286923 2592879
39348 2592879 2347358 2055906 1898231 1468249 762013 503403 878063 863898 -234468
39339 -234468 -1381761 -1183492 -84621 279324 -371947 -745347 -369469 -396066 -1421215
39330 -1421215 -2190758 -1523849 -183533 426352 360124 512176 734385 218981 -648112
39321 -648112 -549266 546572 991783 -194893 -1823587 -2137045 -1080145 -134338 -350923
39312 -350923 -1314181 -1928171 -1684078 -1070441 -942402 -1528145 -2113619 -1894182 -1036905 -498604
39302 -498604 -772397 -1306520 -1335177 -797394 -146005 289443 343097 -158468 -1033551 -1472083
39292 -1472083 -803986 467763 1026071 308326 -784818 -1017776 -246795 647958 962773
39283 962773 823047 684131 612360 272576 -503085 -1309351 -1435772 -630924 450004 792913
39273 792913 99844 -927162 -1485277 -1484415 -1186391 -490172 784244 2109927 2543426 1927195
39263 1927195 1140809 930331 1103109 1178150 1183958 1318712 1352512 973193 360476 -158139
39253 -158139 -677441 -1297367 -1430905 -337689 1641035 3068722 2860026 1388831 55696
39244 55696 -32481 986740 1898344 1661536 566969 -242006 -423330 -753373 -1447356 -1381049
39234 -1381049 13905 1241993 721475 -580661 -515156 692001 656829 -1210882 -2549460
39225 -2549460 -1771668 -557598 -1039532 -2446333 -2580126 -1282460 -259416 -240391 -368281
39216 -368281 -37666 468794 980016 1508649 1539651 706002 -126194 39362 516269 -32623
39206 -32623 -1042415 -592443 1391788 2646328 1856566 456969 269849 1109197 1817712
39197 1817712 2128539 2212544 1665865 375635 -538745 -42434 1175043 1578844 826283
39188 826283 -110047 -412245 -66858 551983 895603 406465 -800742 -1815914 -2043204
39179 -2043204 -1817338 -1373043 -166662 1847926 3239254 2717202 1077933 139566 202884
39170 202884 41450 -846986 -1547226 -1373544 -803704 -451091 -262257 -118814 -270988 -763886
39160 -763886 -1182993 -1283182 -1258189 -1234366 -1099671 -878386 -671860 -322941 183579 239959
39150 239959 -552136 -1315304 -822881 585436 1299164 753956 102453 278174 786432
39141 786432 962903 1093892 1514846 1779001 1617927 1696467 2445886 3051441 2629455 1647335
39131 1647335 1123010 1050265 666324 -229410 -1192959 -1875783 -1953869 -955029 771919 1551695
39121 1551695 192183 -2060612 -2742351 -1162012 1144247 2740713 3480569 3302451 1706302
39112 1706302 -783087 -2155859 -1152469 938991 1845576 1022638 -262611 -1011399 -1401693
39103 -1401693 -1762754 -1849310 -1435782 -806649 -271874 249786 826970 1138502 855012 105399
39093 105399 -724085 -1412268 -1871893 -1941397 -1518612 -772707 3388 608661 842892 504098
39083 504098 -203395 -587221 -310505 -72619 -756755 -1989147 -2387488 -1404979 -71719
39074 -71719 455186 216655 -207040 -753961 -1398878 -1414196 -328845 844324 675910 -565246
39064 -565246 -1225776 -725696 -262973 -730828 -1380043 -1285170 -899618 -1120889 -1701238 -1730633
39054 -1730633 -1166624 -785308 -842683 -740511 -48622 813172 1044972 313876 -841591
39045 -841591 -1364141 -714771 392502 774121 330816 68792 408712 496446 -282800 -1155249
39035 -1155249 -1188499 -790275 -903727 -1352359 -1152213 -86137 1124977 1966272 2446369
39026 2446369 2490954 1994001 1351072 1097039 1163489 1218538 1390958 1823553 1973930 1405203
39016 1405203 834577 1167774 1849975 1591955 519517 -5230 271970 89183 -1002460
39007 -1002460 -1661767 -947005 41535 -130565 -1027713 -1137461 -102104 1101420 1738984
38998 1738984 1898784 1732774 1207702 632771 551786 937014 1140034 834748 469792 520650
38988 520650 735702 548877 12615 -232835 -4846 5437 -657254 -1193983 -577360 580191
38978 580191 463591 -1281512 -2676296 -2082135 -521645 -13904 -575853 -570022 538456
38969 538456 1625809 1946735 1914472 1723539 938841 -183963 -597678 -184845 -60560
38960 -60560 -597112 -690457 248340 1058205 590523 -520417 -918983 -394465 284168 574575
38950 574575 381408 -130139 -278505 657134 2092975 2378667 1091484 -139201 14693
38941 14693 709289 541332 -254608 -653588 -808017 -1524562 -2488487 -2617546 -1777695 -784350
38931 -784350 -70600 442931 604472 326973 126679 254391 -34859 -1116655 -1747839
38922 -1747839 -745698 856760 1203193 581270 837904 2064157 2264662 694444 -776984
38913 -776984 -521306 590423 977362 772568 991987 1456685 1177807 230723 -253719
38904 -253719 158246 683855 709520 706703 1311813 2138133 2198213 1361467 684355 962357
38894 962357 1498480 1031867 -355684 -1228595 -805720 61008 340428 223617 374438
38885 374438 720649 897402 1100996 1499858 1495007 653232 -221171 -78771 804605 1335937
38875 1335937 1172468 681059 -88331 -1147366 -1811838 -1501620 -824622 -597819 -418252
38866 -418252 347680 904672 179906 -976290 -836170 348661 818890 441530 827874
38857 827874 2148264 2539350 1356400 375186 701579 1023133 349200 57493 1320909
38848 1320909 2582439 1855554 -7807 -680852 133131 876853 1022657 1417790 2097251
38839 2097251 2013599 1068077 476368 735207 841138 57247 -891229 -1054210 -658466 -522589
38829 -522589 -755096 -803456 -502852 -398772 -911839 -1566840 -1434912 -353009 723022
38820 723022 882433 364777 261 7909 139025 568661 1501029 2148662 1499156 84890
38810 84890 -536485 -215299 -376006 -1324470 -1385873 264126 1792832 1248918 -571185
38801 -571185 -1493125 -1060694 -495338 -425614 -474663 -570359 -930767 -1033432 -173193 1099453
38791 1099453 1509159 942046 515697 815081 1283203 1419108 1460404 1677206 1855877 1717707
38781 1717707 1320544 976149 1034038 1538574 2019965 2202032 2882674 5017526 7915962
38772 7915962 10135469 12593297 18213129 26829451 32945849 31433664 23958005 16704963
38764 16704963 12800134 10371336 7550228 5379843 4940339 5041677 4395188 3586715 3330700
38755 3330700 2856574 1586120 599147 853446 1489522 1408261 1094981 1330217 1442579
38746 1442579 582387 -346404 115618 1517979 1979416 821638 -740616 -1371342 -854380
38737 -854380 274688 1228922 1204966 102292 -1036171 -1102015 -311564 231789 152124 107178
38727 107178 544991 1023618 952278 390449 -116687 -120522 437605 1240667 1828372 1966425
38717 1966425 1779974 1503691 1295932 1334435 1760619 2380059 2731795 2620436 2301419 2040992
38707 2040992 1823965 1577317 1308534 954147 499162 273980 630221 1267122 1446543
38698 1446543 976346 382066 -13110 -497274 -1241159 -1839929 -1910574 -1587084 -1144804 -681060
38688 -681060 -399948 -603727 -1115044 -1287729 -872510 -313191 48062 443894 1100012 1781890
38678 1781890 2180584 2210405 1806067 1052432 514668 605148 644859 -334013 -1736496 -1728139
38668 -1728139 128058 1944758 1976330 736769 -258595 -620317 -782704 -662905 -38079
38659 -38079 467607 166852 -394265 -177566 691606 1176608 908509 419623 121640 115684
38649 115684 688115 1891776 2911104 2936642 2411373 2325833 2600181 2388722 1698118 1280942
38639 1280942 1034515 85978 -1330120 -1692075 -480882 766365 574648 -417178 -574797
38630 -574797 357541 1161032 1035893 494546 342552 607115 764111 542454 139492 -201423
38620 -201423 -513729 -898127 -1144044 -847296 -11591 711392 640261 -172163 -1010786 -1289517
38610 -1289517 -1105123 -1009258 -1302078 -1581256 -1156382 -64453 646184 125427 -1043291
38601 -1043291 -1547491 -1144148 -796202 -986599 -1107431 -890611 -1104548 -2014149 -2369613
38592 -2369613 -1101533 902271 1993557 1989402 1824382 1609407 669388 -712202 -1230813
38583 -1230813 -463194 471077 489637 -211920 -761545 -595131 343487 1609029 2338076
38574 2338076 2009104 1129308 577266 531121 762928 1461821 2643676 3221417 2138146
38565 2138146 240292 -533536 182110 953211 1067478 1394207 2254392 2414741 1239443
38556 1239443 154718 598805 1795751 2035626 1198960 485841 306860 14492 -534751
38547 -534751 -594878 165097 1037123 1218098 667909 -187152 -1056730 -1798366 -2103937 -1523168
38537 -1523168 -7546 1602835 2108170 1354391 616183 875592 1246208 239078 -1762587
38528 -1762587 -2796463 -2096368 -952290 -510864 -428536 -262490 -389234 -665983 -14736
38519 -14736 1471240 1856665 356866 -820329 328947 2188955 1889046 -78927 -628764
38510 -628764 972971 2084930 1004877 -584289 -523899 820940 1834765 2104906 2122864
38501 2122864 1848017 994797 -69399 -770203 -994162 -658181 452146 1772328 2026699
38492 2026699 1051429 408396 1162660 2163967 1799323 492908 -27259 684903 1461213
38483 1461213 1428985 827318 64774 -705034 -1049068 -512245 424072 655291 -97840 -1012916
38473 -1012916 -1413300 -1419580 -1300976 -1109284 -1095265 -1576007 -2204124 -2249249 -1765838 -1529020
38463 -1529020 -1626284 -1226011 -131524 601702 251034 -416920 -354247 360799 1181233 2158710
38453 2158710 3226535 3301865 1543883 -1006767 -2481901 -2543302 -2260428 -1981668 -1099061
38444 -1099061 55072 64894 -1224602 -2039830 -1321230 -413387 -854705 -1919319 -1971827
38435 -1971827 -1154230 -856426 -1230579 -1231947 -808482 -997784 -1787581 -1925493 -1280356 -1366645
38425 -1366645 -2674145 -3404848 -2207651 -534750 -507370 -1625227 -1677437 -298970 614391
38416 614391 64773 -620547 -188061 506576 12890 -1408760 -2328578 -2256888 -1904269 -1724958
38406 -1724958 -1488885 -1250598 -1509971 -2093406 -1922996 -531075 919469 911314 -501000
38397 -501000 -1796848 -1893898 -1241135 -918450 -1249254 -1619061 -1344136 -432336 393769 348088
38387 348088 -559468 -1326528 -965750 232234 876180 93999 -1473823 -2575781 -2764574
38378 -2764574 -2476663 -2135640 -1803062 -1498651 -1237701 -815919 -89215 580142 645776 82510
38368 82510 -698796 -1488133 -2223292 -2442441 -1622147 -200889 544036 33026 -791919 -607083
38358 -607083 746630 2221155 2729117 2062028 941990 380271 704384 1117262 590170
38349 590170 -766215 -1752384 -1605932 -828707 -249737 21933 255609 355812 114632
38340 114632 -177713 -3947 654049 1263661 1269586 485073 -705897 -1362118 -710053 839865
38330 839865 1910040 1706252 785409 -30328 -704291 -1365578 -1476217 -583577 613186
38321 613186 981374 504894 213953 706783 1556404 2097888 2060002 1483022 684941 216997
38311 216997 224808 37880 -902023 -1916144 -1750454 -313822 1093931 1389121 814088
38302 814088 319268 467253 1073061 1428290 873365 -387667 -1196524 -724896 396620
38293 396620 945504 832728 1032994 1905157 2615897 2383955 1420019 433696 -62409 132965
38283 132965 762086 1059136 576218 -76308 -153205 -108100 -798408 -1649936 -1263452 78826
38273 78826 393356 -977474 -2179351 -1625813 -232837 384923 389545 812294 1427959 1311866
38263 1311866 647456 247696 -31551 -676185 -950524 136427 1695152 1824308 538759
38254 538759 -227625 261800 556646 -259901 -960484 -398467 453496 191419 -656335 -667335
38244 -667335 -2738 781 -712176 -726569 446293 1418708 955622 -286882 -868817 -546104
38234 -546104 -184589 -179276 2800 707157 1385059 1334981 598734 -295032 -1091843 -1810240
38224 -1810240 -2232359 -2041428 -1473983 -1196832 -1333722 -1208640 -400850 521630 844750
38215 844750 770374 915520 1128228 726405 -185589 -635803 -233809 194717 -148846 -913958
38205 -913958 -1297766 -1244815 -1230225 -1275659 -1014951 -573761 -547088 -1003307 -1241070 -822030
38195 -822030 -233131 -61739 16708 734359 1845758 2022435 485458 -1739483 -2768592
38186 -2768592 -1936389 -406225 320171 -53865 -802282 -1331057 -1562365 -1450200 -848574
38177 -848574 30473 588230 525197 181691 -40410 -236453 -659587 -1122586 -1189696 -859561
38167 -859561 -595954 -601751 -488809 36934 460803 -28607 -1252803 -1859237 -932867 548548
38157 548548 671596 -947143 -2531020 -2405795 -1041567 -32149 225402 570622 1151434
38148 1151434 1030542 -13181 -796432 -591844 -390955 -1237766 -2374644 -2450646 -1816036
38139 -1816036 -1917322 -2710444 -2538338 -873913 574517 327751 -720905 -825829 -50082
38130 -50082 39161 -1110906 -2251528 -2147936 -1061688 -69541 288952 197980 -100587 -613703
38120 -613703 -1316874 -1860421 -1699776 -661847 569795 857773 -158841 -1453413 -1683672
38111 -1683672 -770940 84704 -44993 -795134 -1204097 -961095 -616590 -763559 -1310397
38102 -1310397 -1581875 -1084049 -153769 294946 -211091 -1152594 -1713604 -1769507 -1802582 -2063644
38092 -2063644 -2332305 -2398894 -2264263 -1937855 -1551469 -1523470 -1962297 -2080513 -1092532 340534
38082 340534 672832 -275992 -858920 -12048 1057098 629425 -986187 -1979702 -1582783
38073 -1582783 -698098 -148606 316751 1006770 1439589 1100255 334140 -99097 1477
38064 1477 155558 -134649 -802587 -1211946 -794904 147088 557281 -99091 -1020877 -1115746
38054 -1115746 -522620 -266650 -598210 -728115 -308935 -38024 -314507 -322335 731888 2169428
38044 2169428 2593646 1769328 832203 653846 804676 405517 -538619 -1102148 -589965
38035 -589965 609900 1431463 1274572 582378 245421 595720 1137814 1169520 506930 -322784
38025 -322784 -494877 329858 1483817 1832007 1089820 262999 376539 1138837 1470085
38016 1470085 1046899 505408 219993 -180749 -899303 -1442162 -1406903 -1104292 -928862 -686620
38006 -686620 -80557 587674 784551 529426 256753 43634 -482516 -1398581 -2047981 -1631197
37996 -1631197 -216365 1025049 845223 -731164 -2332185 -2693936 -1898824 -898615 -227047
37987 -227047 260954 669586 810389 645049 415218 352743 674805 1595256 2761916 3070643
37977 3070643 1899303 245850 -356066 150464 532175 296997 183352 550339 744101
37968 744101 423994 123883 21644 -439192 -1115275 -859615 496290 1318993 436019
37959 436019 -1077668 -1580780 -1090536 -486391 259484 1394289 1987750 1175156 94200
37950 94200 501897 1815603 1715681 -206941 -1552526 -480777 1840282 3102291 2742865
37941 2742865 1810629 978345 52118 -920679 -1278417 -729727 -36230 -227361 -1246829
37932 -1246829 -1813522 -931622 736175 1604406 1186201 517723 399884 325273 -247293
37923 -247293 -688732 -315189 214318 -63375 -613735 -106206 1392606 2382682 2063548
37914 2063548 1197192 712020 600955 448255 108370 -375012 -814602 -811484 -306208 -24214
37904 -24214 -601247 -1519967 -1779132 -1310915 -786930 -403249 42193 264994 -69036 -418970
37894 -418970 -240650 -307863 -1504460 -2721798 -2023774 182268 1422055 880905 430009
37885 430009 1208072 1687847 528442 -868919 -558162 856220 1392353 811948 493684
37876 493684 894770 1117819 709387 163106 -297896 -958017 -1580392 -1432719 -516021 279728
37866 279728 445937 433414 789371 1428981 1935967 2026070 1583750 695855 -226170 -661791
37856 -661791 -414946 238144 721383 500601 -408572 -1262245 -1370806 -1037448 -1070575 -1375917
37846 -1375917 -992967 204727 931741 249610 -1011821 -1414209 -807036 -216710 -334695
37837 -334695 -908653 -1318216 -1144258 -446629 127085 -89303 -836129 -1145900 -729355 -304603
37827 -304603 -234997 68306 809512 1067312 291609 -545892 -397481 213296 201730 -273707
37817 -273707 -360633 -149718 -307900 -613310 -365930 97464 -170738 -965193 -1102377 -368223
37807 -368223 151842 -135840 -537988 -367028 147342 597197 1020685 1422695 1558537 1494899
37797 1494899 1568141 1593127 1009134 6410 -498907 -332597 -444584 -1301584 -1937747 -1430559
37787 -1430559 -493735 -516327 -1438892 -1747777 -651438 731238 836218 -331634 -1361086
37778 -1361086 -1349740 -805224 -475641 -196413 398657 747316 133096 -692362 -109435 1876876
37768 1876876 3145236 2167223 36460 -1139115 -881278 -260661 45115 311920 775976
37759 775976 1256642 1631591 1801181 1383340 237883 -971156 -1491717 -1437909 -1318624
37750 -1318624 -1104507 -632756 -425354 -1029879 -1878577 -1883463 -976933 -101259 123573 -183933
37740 -183933 -786865 -1404358 -1454872 -703944 107239 202140 -74468 -34030 3859 -575262
37730 -575262 -1140920 -554506 830172 1542619 1294591 1233238 1794308 2012061 1354364 668452
37720 668452 710524 1066815 1156719 1173006 1457729 1924739 2518245 3282066 3701143 3063233
37710 3063233 1766224 1115790 1486885 1854734 1501196 942761 717206 522331 161307
37701 161307 162992 765038 1278758 1095142 436164 -352350 -1297773 -2208611 -2640838 -2812390
37691 -2812390 -3386464 -3994991 -3350861 -1370607 238983 240034 -638860 -1211373 -1405980
37682 -1405980 -1429568 -865524 174600 348391 -1014061 -2363517 -1814144 191170 1557869
37673 1557869 1329023 426398 -44621 9419 69459 -274578 -935133 -1235671 -587763 517146
37663 517146 965847 710505 853278 1618579 1687581 368964 -1046965 -1216448 -617686
37654 -617686 -221799 270023 1279921 1789764 838384 -446279 -331110 766846 1022050
37645 1022050 86826 -809358 -1156886 -1413460 -1246793 216168 2330541 3264038 2656311
37636 2656311 1979715 1953412 1646327 688309 312728 1260179 2399675 2531504 2076538
37627 2076538 1826850 1381874 214267 -747451 -187290 1400025 1996545 586415 -1605663
37618 -1605663 -2648163 -2041113 -945121 -545851 -703492 -529705 59057 241523 -111340
37609 -111340 114857 1459072 2584844 2083072 776242 585783 1520330 1632326 36762
37600 36762 -1787950 -2137121 -1035733 426051 1368216 1238995 -7620 -1232928 -831201
37591 -831201 1194058 2941724 2999785 2040151 1440462 1468821 1588662 1531594 1268917 771519
37581 771519 408779 671876 1043100 330921 -1305346 -2076968 -1136689 50738 1730
37572 1730 -615204 -513001 -85768 -411148 -1075722 -953683 -340331 -297536 -499595 147301
37562 147301 1175884 1147887 430718 916439 2657865 3288032 1634235 -427358 -1015038
37553 -1015038 -1023137 -2073006 -3368547 -2856363 -641528 1000397 827264 -76535 -379945
37544 -379945 -205070 -215046 -306704 -16213 524425 756779 465276 -72846 -483159 -586834
37534 -586834 -462037 -293138 -29920 619695 1543045 1891500 1039669 -297342 -722199
37525 -722199 27854 775385 608278 -18671 -296128 -261190 -297491 -199723 354565 904759
37515 904759 755702 163326 40679 591235 1101052 1054638 621044 36567 -602313 -841840
37505 -841840 -131090 1131359 1708777 1106077 237098 49846 291309 230491 -173295 -587270
37495 -587270 -1097708 -1746530 -1792161 -526110 1381246 2400779 2022581 1190876 796498
37486 796498 711812 606640 741766 1294291 1585742 855995 -457043 -1043179 -400950 486600
37476 486600 473683 -261394 -600597 -107489 458694 373429 -38635 -125781 -85704 -614498
37466 -614498 -1614310 -2137509 -1691228 -831322 -295613 -249788 -557279 -1036267 -1221324 -692021
37456 -692021 51528 -61738 -1023189 -1427773 -439499 908897 1207822 519678 -269702
37447 -269702 -1028902 -2010724 -2608283 -1979206 -555027 493005 1039981 1802012 2522714
37438 2522714 2036109 357874 -882073 -646105 206582 473894 285431 424303 930585
37429 930585 1278316 1328365 1327229 1335889 1203823 824207 151089 -647311 -977270 -394802
37419 -394802 497292 513087 -537240 -1572435 -1834273 -1824507 -2192091 -2631111 -2576049 -2216161
37409 -2216161 -2028878 -1880571 -1361902 -600860 -57338 176986 320735 459354 627999
37400 627999 992610 1505293 1722273 1382907 852272 636543 781895 1032520 1222755 1282429
37390 1282429 1228843 1281303 1555677 1685022 1369096 1142645 1624153 2086182 1110392 -1124332
37380 -1124332 -2726472 -2769209 -2448697 -2758721 -2807680 -1814572 -1101904 -2171422 -3993844
37371 -3993844 -4348747 -3087200 -1898699 -1364242 -563631 527445 644074 -392605 -1061798
37362 -1061798 -579149 -58352 -413812 -827617 -337712 522874 820505 732611 792705 657790
37352 657790 -139520 -990976 -963949 -222303 317314 289967 -26057 -412448 -631829 -150335
37342 -150335 1135691 2306710 2441170 1841653 1377970 1072979 394565 -392728 -395161 418295
37332 418295 1020863 794240 222040 -116550 -360329 -842004 -1498745 -2156952 -2764360 -3026383
37322 -3026383 -2463947 -1224151 -240615 -123903 -371768 -144098 597771 1214620 1321356
37313 1321356 1114928 999491 1268915 1913787 2405456 2026701 861099 63071 523242
37304 523242 1581400 1855010 1171808 699576 1034380 1241201 375731 -939718 -1413708
37295 -1413708 -1029000 -938476 -1510423 -1686309 -719376 462302 512048 -309301 -488169 431750
37285 431750 1042840 67173 -1718838 -2441555 -1593302 -532088 -530030 -1318489 -1937843 -2129022
37275 -2129022 -2118919 -1634579 -180544 1809797 3061556 2914846 1970665 1025243 77572
37266 77572 -1152104 -2332541 -2829287 -2616739 -2273883 -2171430 -2144729 -1934858 -1548059 -1146064
37256 -1146064 -844397 -610161 -198772 659620 1790207 2473130 2108110 877035 -464557
37247 -464557 -1288503 -1406204 -984014 -469044 -351345 -671373 -987541 -1063075 -1166469 -1358106
37237 -1358106 -1078796 -76564 821643 746341 183678 301160 1123385 1554086 1187231
37228 1187231 830419 970063 963494 319714 -277859 23906 998397 1798049 2029010 1767559
37218 1767559 1170393 703985 1079155 2208574 2842117 2073237 696168 180110 706752
37209 706752 1159677 771851 -176701 -1150618 -1892869 -2148877 -1714941 -913723 -356166 -116709
37199 -116709 274149 974537 1578528 1785345 1723670 1518195 1118931 682949 558105 734189
37189 734189 840426 823171 1052012 1556610 1760084 1309114 675319 548329 1015419 1689617
37179 1689617 2272793 2606342 2518432 2089475 1815799 2018620 2265485 1901283 1056425 526389
37169 526389 584274 569987 -4551 -532391 -152778 779473 904867 -329063 -1815173 -2184086
37159 -2184086 -1499976 -936250 -1102109 -1456234 -1346185 -902585 -673573 -877985 -1289078
37150 -1289078 -1526561 -1287751 -577530 201275 678022 998640 1459474 1763190 1325842
37141 1325842 382111 -60238 311334 537995 -157549 -1096791 -1100080 -161470 710051 989596
37131 989596 1081704 1387537 1759215 1961773 2014465 1903707 1438432 575110 -400014 -1101523
37121 -1101523 -1303026 -1048074 -666869 -520500 -583267 -519028 -251523 -24487 208961 764781
37111 764781 1300742 810704 -778442 -1875340 -1125422 596234 1305433 594284 -152593
37102 -152593 -37874 322343 232231 -13593 2797 29644 -120115 72429 1021110 2180175
37092 2180175 2612179 2032860 960825 249333 593315 1858301 2773555 2127998 491622
37083 491622 -264905 430605 919698 -235666 -2029621 -2477866 -1463402 -596901 -641657
37074 -641657 -712217 -141316 376448 69254 -643383 -926988 -770869 -671462 -658860 -442056
37064 -442056 -170283 -290386 -818114 -1385021 -1846984 -2204317 -2083200 -1108382 166574
37055 166574 564328 -190691 -1028882 -1039298 -646512 -653618 -825055 -345545 747329 1587113
37045 1587113 1723538 1404588 788277 -102856 -717020 -385573 516252 932910 744925
37036 744925 767914 1010750 532460 -503092 -471487 1021234 1939941 871693 -382315
37027 -382315 609069 2943700 3549363 1742473 -44573 -156766 269089 -149572 -836918
37018 -836918 -820283 -640582 -1165917 -1740535 -1089504 591570 1786584 1624636 717587
37009 717587 131969 189035 323131 -120442 -952980 -1232850 -632003 -203511 -912194 -1877831
36999 -1877831 -1444070 209152 1207848 898465 738491 1651327 2395143 1709129 436166
36990 436166 37638 308190 203525 -59709 520546 1767260 2486377 2287282 1836522
36981 1836522 1540736 1272639 1222661 1794448 2717699 3283583 3318479 3015212 2153069 596386
36971 596386 -726251 -606367 723938 1799710 1875054 1584153 1570586 1542628 1016642 206195
36961 206195 -177671 403515 1867671 3395723 4044072 3877401 3960374 4690919 4969157
36952 4969157 3921033 2529175 2221670 2613897 2294355 1295630 883421 1143521 854032
36943 854032 -104793 -307167 727500 1528225 938051 -314098 -1155228 -1647834 -1944684
36934 -1944684 -1360268 250802 1511314 1273562 317708 58386 542727 975059 1239309
36925 1239309 1511833 1234985 -2585 -1210944 -1128113 -102018 611892 943142 1779029
36916 1779029 2928330 3054129 1777322 318957 -292118 -355241 -454155 -455070 -69847 500792
36906 500792 979872 1366176 1563351 1356224 980987 977399 1269708 1187914 629252 340514
36896 340514 717776 1180238 1167855 949218 919282 857026 517703 324738 757083 1489565
36886 1489565 1797297 1491417 910632 322909 -117354 -130017 391333 1039283 1342058 1351685
36876 1351685 1329000 1098097 294146 -852824 -1554058 -1362331 -672398 -276184 -671473
36867 -671473 -1756821 -2910529 -3373266 -2815405 -1605216 -451002 162129 180671 -119268
36858 -119268 -324141 -228251 -116444 -415454 -971660 -1127694 -726341 -468577 -845457 -1282156
36848 -1282156 -1012775 -365760 -304462 -863483 -978269 -12176 1341206 2010323 1818746
36839 1818746 1423889 1384739 1683947 1982693 2055455 2004278 2116264 2461986 2724205 2563588
36829 2563588 1991619 1190093 252224 -548761 -599702 334730 1465745 1774258 1340683
36820 1340683 1095481 1286088 1147955 305946 -475721 -415254 234722 808196 1144816 1241604
36810 1241604 713870 -531193 -1592498 -1489916 -511939 223258 368848 592404 1224266
36801 1224266 1608336 1131175 214975 -185968 268358 1021975 1296816 793045 -173943
36792 -173943 -1028756 -1408313 -1373274 -1272061 -1469642 -2048894 -2524421 -2015285 -200449 1897150
36782 1897150 2695559 1808229 410163 -362548 -607513 -837353 -866632 -330528 379713
36773 379713 693740 892560 1516278 2111755 1745749 619196 -29163 304374 845503
36764 845503 961158 1011035 1415155 1883829 2096615 2314601 2748468 2973849 2494436 1358244
36754 1358244 -133746 -1685827 -2618566 -2044472 -112152 1529615 1301842 -553098 -2363426
36745 -2363426 -2885532 -2243387 -1302761 -723151 -582698 -514427 -158091 401430 775741 880617
36735 880617 1066696 1524393 1942926 1962726 1645118 1329710 1306156 1655897 2064285 1894428
36725 1894428 998953 317351 868803 2202329 2849549 2403351 1928141 1974673 1609733
36716 1609733 221107 -1033790 -782251 533302 1447586 1504505 1173708 459058 -838952
36707 -838952 -1874482 -1416370 254051 1530601 1651191 1356918 1279945 1073786 487318
36698 487318 -9550 -200377 -586703 -1286385 -1478902 -618244 635492 1331532 1354991 1103902
36688 1103902 792952 616658 823579 1060429 491653 -769035 -1302184 -368429 684919
36679 684919 236226 -1138497 -1525549 -577660 184671 7141 572 974087 1815704 1237133
36669 1237133 -20582 -234854 616713 785599 -635622 -2402591 -2851750 -1925305 -849291
36660 -849291 -503550 -811724 -1316462 -1649077 -1576901 -1137707 -708657 -589853 -608128 -445794
36650 -445794 -204559 -255550 -630566 -958313 -974511 -771011 -585829 -610640 -862031 -960274
36640 -960274 -321902 965145 1761225 1058723 -585841 -1564763 -1185812 -356580 -161079
36631 -161079 -529135 -650337 -88111 891478 1667875 1734062 1238036 1066016 1789340 2627694
36621 2627694 2375989 1356366 1188650 2273339 2923365 1828705 92023 -402952 338356
36612 338356 788042 267090 -520843 -991328 -1319386 -1648441 -1847734 -2073003 -2556486 -2868363
36602 -2868363 -2357423 -1289099 -598308 -556779 -627454 -565239 -637015 -746934 -394205 376668
36592 376668 926786 1013680 931895 676479 -16669 -791136 -969090 -826143 -1347209 -2490145
36582 -2490145 -2978540 -2228979 -1222133 -895639 -881922 -555053 -204522 -291340 -467794 -251234
36572 -251234 87537 190476 511814 1670818 3359550 4591926 4661762 3469035 1548226
36563 1548226 130147 237495 1178060 1022813 -663069 -1791826 -590802 1683069 2411014
36554 2411014 1175702 -95570 -113832 474191 767137 872745 1091816 1181718 942203
36545 942203 549507 -38124 -1092820 -2276288 -2719017 -2218998 -1481787 -960827 -432216
36536 -432216 53141 -61475 -669467 -746099 70385 708592 333713 -173809 485320 1948364
36526 1948364 2648659 2009123 975982 438254 246790 16554 -59337 316163 845489
36517 845489 927490 424450 -161727 -201463 436303 1149193 1058218 -77896 -1474059 -2098568
36507 -2098568 -1752141 -1070608 -576877 -182828 337305 853397 1096601 1093226 1129459 1358035
36497 1358035 1542873 1206291 160259 -1018383 -1340200 -556521 332576 252870 -483913
36488 -483913 -627056 167332 858017 641262 114504 218546 766140 835718 165575 -650826
36478 -650826 -1055756 -861561 30280 1426700 2508265 2510217 1715325 1070875 908631 792662
36468 792662 503643 252095 -66145 -790896 -1532899 -1387336 -458384 -79805 -946306 -2001528
36458 -2001528 -1901988 -772361 242061 450256 -97546 -1084183 -1876751 -1665691 -524959
36449 -524959 250339 -271048 -1339190 -1706646 -1447012 -1445406 -1670409 -1348435 -556894 -215769
36439 -215769 -543690 -853767 -932607 -1308734 -1989942 -2243545 -1946062 -1903461 -2388048 -2526945
36429 -2526945 -1717094 -626229 -167406 -347125 -698032 -1041664 -1290863 -1265302 -1139660
36420 -1139660 -1244273 -1098726 219727 2235869 2991251 1761222 508881 1192340 2709087
36411 2709087 2392418 -304 -1856234 -1382159 183039 709926 25942 -442914 77282
36402 77282 987661 1455818 1310586 860853 498412 513673 824372 871866 231567 -618879
36392 -618879 -612149 601490 2030770 2382423 1510440 450805 152641 630203 1337962
36383 1337962 1825567 1835642 1271344 428372 -103219 -119920 -76169 -377465 -797850 -958823
36373 -958823 -919230 -811210 -395537 379010 839930 397050 -486284 -968455 -1129928 -1631094
36363 -1631094 -2338555 -2412902 -1712510 -1005528 -705477 -444224 -28794 211222 198946 226704
36353 226704 149711 -491995 -1404489 -1718412 -1400850 -1268351 -1402524 -955883 118523 670039
36343 670039 231889 -255226 -279770 -636482 -1535378 -1623542 -256460 902726 245783 -1234468
36333 -1234468 -1657567 -1265523 -1524224 -2167321 -1638381 -81006 632681 -30241 -496345
36324 -496345 170791 907621 781583 553419 1047664 1560505 1179088 503616 676796 1445125
36314 1445125 1521104 557109 -368793 -241824 713637 1477467 1330576 352390 -819204
36305 -819204 -1479141 -1245752 -266399 812429 1278094 1053229 827690 1112985 1414447
36296 1414447 1028323 407954 592580 1260266 881017 -695962 -1545418 -620258 354610
36287 354610 -366663 -1477453 -645813 1439812 1866780 53053 -1376930 -696386 619252
36278 619252 656816 -211535 -730129 -940712 -1336154 -1315508 -212417 1147885 1551316 1352973
36268 1352973 1824958 3026234 3751107 3388046 2570138 1981438 1572270 1124069 785530
36259 785530 741074 784111 497610 -198877 -736922 -340691 925634 1843830 1429070 408334
36249 408334 337963 1277890 1596125 426324 -995655 -1169489 -347977 227434 148433 -181175
36239 -181175 -628057 -1220139 -1453475 -838723 119976 427931 -121393 -926081 -1532624 -1861452
36229 -1861452 -1803961 -1375156 -1008048 -1022553 -1142824 -1163829 -1537218 -2461665 -2999173 -2216764
36219 -2216764 -786963 -215422 -714267 -1131613 -899969 -663252 -805274 -759013 -255730
36210 -255730 -1827 -390293 -575541 262682 1462715 1646369 543378 -787177 -1358254
36201 -1358254 -1163546 -742887 -441688 -233560 38972 362536 435475 -17627 -737946 -1017550
36191 -1017550 -519035 219982 374474 -247373 -1132762 -1738367 -1911280 -1740508 -1357043
36182 -1357043 -931337 -605663 -350257 -74414 82620 -191631 -921728 -1662224 -1976858
36173 -1976858 -1934161 -1870006 -1803399 -1495696 -1085854 -1124002 -1676261 -1879047 -968858 483814
36163 483814 1080834 377295 -540165 -533149 150142 434931 8291 -335243 110737 1007195
36153 1007195 1446727 1104207 619677 807252 1611771 2052494 1340660 -123204 -1204478
36144 -1204478 -1413537 -1330063 -1534236 -1723420 -1336006 -582620 -197851 -381341 -670731 -831686
36134 -831686 -1182262 -1877846 -2507930 -2722424 -2737908 -2819505 -2730461 -2245868 -1840498 -2118506
36124 -2118506 -2676547 -2358749 -831725 825957 1469846 1161593 592508 -71720 -923015
36115 -923015 -1389986 -756914 452013 794892 -84967 -863854 -475458 359084 317883 -643936
36105 -643936 -1563672 -1966168 -2001035 -1561199 -503407 442055 250934 -802830 -1291468
36096 -1291468 -642029 80328 -142644 -779503 -618464 519423 1647749 1839387 1051202
36087 1051202 -30900 -595996 -365426 120189 91221 -494618 -938751 -786976 -339299
36078 -339299 -64387 -46354 -205386 -541608 -924471 -1109076 -1142179 -1265743 -1311699 -805984
36068 -805984 180654 980351 1311985 1537355 1711820 1348258 577715 497401 1582839 2650557
36058 2650557 2369417 1089331 110121 -261701 -701401 -1307143 -1419888 -982933 -803156
36049 -803156 -1188149 -1424236 -1061167 -771996 -1277364 -2088720 -2107456 -1178685 -353718 -610483
36039 -610483 -1786070 -2886874 -3145948 -2589038 -1721382 -930814 -296095 170617 318744
36030 318744 -34737 -844072 -1667609 -1791698 -785336 857148 1879409 1456747 106069
36021 106069 -967316 -1264103 -1250803 -1397521 -1636299 -1812852 -2008508 -2238759 -2363587 -2393799
36011 -2393799 -2358638 -1910550 -785700 356217 470872 -354261 -920719 -700444 -471568
36002 -471568 -747065 -815629 -118955 564828 345755 -300339 -398772 -43162 84153 90138
35992 90138 488227 932939 669783 -40859 -241011 131899 213039 -253437 -544083 -251439
35982 -251439 122633 93472 -200435 -558351 -1086984 -1737393 -2092060 -1845580 -1105110 -218388
35972 -218388 364574 335724 65648 419602 1452235 1938188 1041935 -296656 -800838
35963 -800838 -900816 -1735261 -2679784 -1934666 407875 2002296 1492199 202192 -233483
35954 -233483 -149512 -583949 -1238475 -1168424 -495846 -10457 262157 826033 1557468 1918122
35944 1918122 1918726 1865272 1563333 789316 176673 549395 1568340 2045734 1516738 601351
35934 601351 -101059 -551352 -708589 -369928 234422 480203 251341 130221 379667 349401
35924 349401 -643422 -2224766 -3224837 -2907323 -1657631 -526839 -288006 -884473 -1614068
35915 -1614068 -1777419 -1209250 -321735 239272 44120 -771229 -1525643 -1564506 -929797 -294709
35905 -294709 -142952 -247073 -128752 214277 357885 127264 -126045 -27696 262447 234763
35895 234763 -234312 -583173 -242191 508677 767205 190803 -496890 -465604 194624 859268
35885 859268 1361083 1904835 2241825 1788717 630620 -357079 -580573 -268066 233052
35876 233052 955560 1765448 2041138 1470247 661853 370847 483472 376471 7439 -26158
35866 -26158 544467 1237287 1485160 1266170 861142 335298 -385698 -1065165 -1229269 -883817
35856 -883817 -819480 -1738735 -3165447 -3787333 -3027978 -1729313 -1019978 -1113587 -1608624 -2240812
35846 -2240812 -2653684 -2128505 -545225 861038 810209 -269667 -942971 -923972 -1172348
35837 -1172348 -1958284 -2401712 -2156288 -1988822 -2222168 -2122654 -1471881 -1216216 -1683623 -1656730
35827 -1656730 -367511 957621 928996 190379 221274 900305 979468 325017 -67766 94304
35817 94304 232116 312848 815225 1419859 1351785 970561 1341199 2155964 1886891 350493
35807 350493 -707797 -272916 391960 -172597 -1458305 -2075653 -1804273 -1285080 -627468
35798 -627468 305755 891304 399070 -692171 -1210489 -870265 -272074 409208 1550425
35789 1550425 2912167 3481240 2766689 1457749 539310 348708 596142 686614 -24537
35780 -24537 -1584308 -2949720 -2900349 -1634676 -686643 -968959 -1695354 -1670120 -848347 2230
35770 2230 466187 504987 -82816 -1229870 -1993624 -1483366 -304198 8638 -909590 -1820667
35760 -1820667 -1829591 -1570783 -1797141 -1901922 -959266 479860 942445 125774 -793425 -938237
35750 -938237 -645872 -397429 -8428 564518 592875 -425143 -1746131 -2180402 -1557996
35741 -1557996 -704222 -247260 -146974 -203393 -299575 -177968 352159 908739 823817 73697
35731 73697 -594486 -642357 -360345 -265118 -342589 -280509 -121708 -190515 -480473 -580119 -273424
35720 -273424 152458 354831 388498 458296 459448 166640 -198330 -89958 508332 817108
35710 817108 202927 -949945 -1737909 -1822096 -1498691 -963791 -240975 255713 -33557 -811058
35700 -811058 -982711 -86385 1091723 1767725 2199446 2774781 2851976 1600137 -407860
35691 -407860 -1613092 -1428489 -734714 -358974 -159845 55684 -174115 -1000634 -1408963
35682 -1408963 -362000 1511342 2349776 1255285 -688769 -1825563 -1748675 -1317768 -1282405
35673 -1282405 -1498491 -1468261 -1111329 -738583 -564449 -574555 -734549 -986683 -1064989 -660802
35663 -660802 108090 618484 275811 -934895 -2375851 -3092506 -2428694 -718436 711590
35654 711590 734675 -336827 -1194600 -1201100 -916003 -870837 -771893 -369628 -153803 -409035
35644 -409035 -436304 258857 735703 -115658 -1558419 -1786177 -595745 314998 -50374
35635 -50374 -688423 -508095 -55105 -332513 -1069940 -1354269 -1141439 -920455 -514080 483369
35625 483369 1463286 1335012 219755 -586965 -421271 80635 294091 485492 962491
35616 962491 1292918 994417 353542 -49070 -163088 -268542 -332721 -139772 151249 99874
35606 99874 -403914 -970668 -1155244 -867873 -378135 -48153 -39504 -245501 -522233 -828046
35596 -828046 -990400 -658812 75524 321931 -621761 -2048641 -2499879 -1706837 -861935
35587 -861935 -693896 -469972 446915 1270896 1115695 645518 1000666 1777735 1690205 844781
35577 844781 588999 1138430 1228481 485891 248931 1180632 1800842 709746 -1081805
35568 -1081805 -1631804 -951611 -699333 -1477884 -2165338 -1922446 -1324170 -1139142 -1192475 -970853
35558 -970853 -498443 -74584 284528 697510 1077945 1223766 993819 323394 -629184 -1349442
35548 -1349442 -1318494 -507669 682848 1769671 2237978 1745511 811088 743923 2021469
35539 2021469 3168881 2375044 35896 -1566337 -1212905 -111279 41858 -851744 -1766801
35530 -1766801 -2092925 -1872703 -1217673 -333607 264548 205884 -315566 -905656 -1353783 -1423078
35520 -1423078 -871674 -26897 319844 12596 -151268 312724 707603 187941 -948671
35511 -948671 -1672380 -1421660 -337106 1088747 1987374 1478079 -116449 -1088815 -346169
35502 -346169 999421 1130291 102005 -371113 549522 1880394 2453842 2215494 1610326
35493 1610326 824868 107263 -75318 289465 619241 650880 815605 1361886 1838168 1877963
35483 1877963 1788148 1841739 1669031 996914 396173 494957 852677 499212 -555826 -1214190
35473 -1214190 -792166 89020 389974 -112774 -836826 -1245057 -1260871 -1051497 -829561 -808549
35463 -808549 -974036 -889984 -123520 1030123 1653820 1292812 569485 336316 531884 423863
35453 423863 -200213 -775477 -927499 -980732 -1224328 -1287915 -700122 357029 1318180 1943463
$$ [...]
##END NTUPLES=NMR SPECTRUM
##END=
