##TITLE=31Pdec_PR182_SR
 D2O, 124 sc
 26.08.2021
##JCAMPDX= 6.0         $$ Bruker NMR JCAMP-DX V2.0
##DATA TYPE= NMR SPECTRUM
##DATA CLASS= NTUPLES
##ORIGIN= UXNMR, Bruker Analytische Messtechnik GmbH
##OWNER= root
$$ XWIN-NMR		Version 3.5
$$ Thu Aug 26 12:27:55 2021 Russian Standard Time (UT+4h)  she@DPX200
##.OBSERVE FREQUENCY= 81.013821
##.OBSERVE NUCLEUS= ^31P
##.ACQUISITION MODE= SIMULTANEOUS
##.ACQUISITION SCHEME= undefined
##.AVERAGES= 124
##.DIGITISER RES= 16
##SPECTROMETER/DATA SYSTEM= spect
##.PULSE SEQUENCE= zgpg30
##.SOLVENT NAME= CDCl3
##.SHIFT REFERENCE= (INTERNAL, CDCl3, 0, 248.564)
##AUDIT TRAIL= $$ (NUMBER, WHEN, WHO, WHERE, WHAT)
$$ ##TITLE= Audit trail, XWIN-NMR		Version 3.5
$$ ##JCAMPDX= 5.01
$$ ##ORIGIN= Bruker BioSpin GmbH
$$ ##OWNER= she
$$ F:/spectra/data/she/nmr/P31/1/pdata/1/auditp.txt
$$ ##AUDIT TRAIL=  $$ (NUMBER, WHEN, WHO, WHERE, WHAT)
(   1,<2021-08-26 12:26:40.12 +0400>,<she>,<DPX200>,
      <continue with go, POWCHK disabled, PULCHK disabled
       configuration hash MD5:
       00 E9 B6 7A A2 85 ED C7 34 08 36 98 17 FE 4E 26
       data hash MD5: 32K
       4C 12 B0 5F F0 08 F9 1E A3 DD E7 62 97 D0 E3 D3>)
(   2,<2021-08-26 12:26:45.10 +0400>,<she>,<DPX200>,
      <Start of raw data processing
       efp BC_mod = 2 LB = 1 FT_mod = 6 PKNL = 1 PHC0 = -7781.627 PHC1 = 177.6735 SI = 64K 
       data hash MD5: 64K
       55 A5 6C ED 22 E0 96 35 8F 76 C2 12 8F 98 38 A1>)
(   3,<2021-08-26 12:27:17.71 +0400>,<she>,<DPX200>,
      <pk PHC0 = 7.283492 PHC1 = -68.4 
       data hash MD5: 64K
       FA 74 2A BF 91 5F 33 75 BD DB 51 81 34 17 5D 67>)
(   4,<2021-08-26 12:27:21.20 +0400>,<she>,<DPX200>,
      <abs ABSG = 5 
       data hash MD5: 64K
       D8 A7 6C B6 A0 09 9D 8E F1 38 79 AB DA DD D2 92>)
$$ ##END=
$$ 
$$ hash MD5
$$ 4B 31 4C 67 F7 85 FB 3E B2 A6 DA DB 81 F1 7C 4A
##$RELAX= 
##$RELAX= 
##$RELAX= 
##$RELAX= 
##$RELAX= 
##$RELAX= 
##$RELAX= 
##$RELAX= 
$$ Bruker specific parameters
$$ --------------------------
##$DU= <F:/spectra>
##$EXPNO= 1
##$NAME= <P31>
##$PROCNO= 1
##$TYPE= <nmr>
##$USER= <she>
##$AMP= (0..31)
100 100 100 100 100 100 100 100 100 100 100 100 100 100 100 100 100 100 
100 100 100 100 100 100 100 100 100 100 100 100 100 100 
##$AQSEQ= 0
##$AQ_mod= 1
##$AUNM= <au_zg>
##$AUTOPOS= <>
##$BF1= 81.014009
##$BF2= 200.13
##$BF3= 200.13
##$BF4= 200.13
##$BF5= 200.13
##$BF6= 200.13
##$BF7= 200.13
##$BF8= 200.13
##$BYTORDA= 1
##$CFDGTYP= 0
##$CFRGTYP= 5
##$CHEMSTR= <none>
##$CNST= (0..31)
1 1 145 1 1 1 1 1 1 1 1 1 1 1 1 1 1 1 1 1 1 1 1 1 1 1 1 1 1 1 1 1 
##$CPDPRG= <waltz16>
##$CPDPRG1= <>
##$CPDPRG2= <waltz16>
##$CPDPRG3= <>
##$CPDPRG4= <mlev>
##$CPDPRG5= <mlev>
##$CPDPRG6= <mlev>
##$CPDPRG7= <mlev>
##$CPDPRG8= <mlev>
##$CPDPRGB= <>
##$CPDPRGT= <>
##$D= (0..31)
0 1 0 0 0 0 0 0 0 0 0 0.03 2e-05 3e-06 0 0 0 0 0 0 0 0 0 0 0 0 0 0 0 0 
0 0 
##$DATE= 1629966234
##$DBL= (0..7)
120 120 120 11 120 120 24 19 
##$DBP= (0..7)
150 150 150 150 150 150 150 150 
##$DBP07= 0
##$DBPNAM0= <>
##$DBPNAM1= <>
##$DBPNAM2= <>
$$ [...]
##$SUBNAM3= <"">
##$SUBNAM4= <"">
##$SUBNAM5= <"">
##$SUBNAM6= <"">
##$SUBNAM7= <"">
##$SUBNAM8= <"">
##$SUBNAM9= <"">
##$SW= 501.771253377433
##$SWIBOX= (0..15)
0 1 3 0 0 0 0 0 0 0 0 0 0 0 0 0 
##$SW_h= 40650.406504065
##$TD= 32768
##$TD0= 1
##$TE= 0
##$TE2= 300
##$TE3= 300
##$TEG= 300
##$TL= (0..7)
0 120 53 12 22 120 120 120 
##$TP= (0..7)
150 150 150 150 150 150 150 150 
##$TP07= 0
##$TPNAME0= <>
##$TPNAME1= <>
##$TPNAME2= <>
##$TPNAME3= <>
##$TPNAME4= <>
##$TPNAME5= <>
##$TPNAME6= <>
##$TPNAME7= <>
##$TPOAL= (0..7)
0.5 0.5 0.5 0.5 0.5 0.5 0.5 0.5 
##$TPOFFS= (0..7)
0 0 0 0 0 0 0 0 
##$TUNHIN= 0
##$TUNHOUT= 0
##$TUNXOUT= 0
##$USERA1= <user>
##$USERA2= <user>
##$USERA3= <user>
##$USERA4= <user>
##$USERA5= <user>
##$V9= 5
##$VALIST= <valist>
##$VCLIST= <CCCCCCCCCCCCCCC>
##$VD= 0
##$VDLIST= <DDDDDDDDDDDDDDD>
##$VPLIST= <PPPPPPPPPPPPPPP>
##$VTLIST= <TTTTTTTTTTTTTTT>
##$WBST= 1024
##$WBSW= 4
##$XGAIN= (0..3)
0 0 0 0 
##$XL= 0
##$YL= 0
##$YMAX_a= 6608
##$YMIN_a= -2703
##$ZGOPTNS= <>
##$ZL1= 120
##$ZL2= 120
##$ZL3= 120
##$ZL4= 120
##$ABSF1= 248.5645
##$ABSF2= -253.2056
##$ABSG= 5
##$ABSL= 3
##$ALPHA= 0
##$AQORDER= 0
##$ASSFAC= 0
##$ASSFACI= 0
##$ASSFACX= 0
##$ASSWID= 0
##$AUNMP= <proc_1d>
##$AZFE= 0.1
##$AZFW= 0.5
##$BCFW= 0
##$BC_mod= 2
##$BYTORDP= 0
##$COROFFS= 0
##$CY= -3
##$DATMOD= 1
##$DC= 0
##$DFILT= <>
##$DTYPP= 0
##$F1P= 0
##$F2P= 0
##$FCOR= 1
##$FTSIZE= 65536
##$FT_mod= 6
##$GAMMA= 0
##$GB= 0
##$INTBC= 1
##$INTSCL= 5.30512e-09
##$ISEN= 30
##$LB= 1
##$LEV0= 0
##$LPBIN= 0
##$MAXI= 10000
##$MC2= 0
##$MEAN= 0
##$ME_mod= 0
##$MI= 50
##$NCOEF= 0
##$NC_proc= -6
##$NLEV= 6
##$NOISF1= 182.463
##$NOISF2= 159.3651
##$NSP= 0
##$NTH_PI= 0
##$NZP= 0
##$OFFSET= 248.5645
##$PC= 4
##$PHC0= -7774.343
##$PHC1= 109.2735
##$PH_mod= 1
##$PKNL= yes
##$PPARMOD= 0
##$PSCAL= 0
##$PSIGN= 0
##$REVERSE= no
##$SF= 81.014009
##$SI= 65536
##$SIGF1= 159.3651
##$SIGF2= -187.1042
##$SINO= 113.3802
##$SIOLD= 16384
##$SREGLST= <1H.CDCl3>
##$SSB= 0
##$STSI= 65536
##$STSR= 0
##$SW_p= 40650.406504065
##$SYMM= 0
##$S_DEV= 0
##$TDeff= 32768
##$TDoff= 0
##$TI= <>
##$TILT= no
##$TM1= 0
##$TM2= 0
##$TOPLEV= 0
##$USERP1= <user>
##$USERP2= <user>
##$USERP3= <user>
##$USERP4= <user>
##$USERP5= <user>
##$WDW= 1
##$XDIM= 65536
##$YMAX_p= 338094664
##$YMIN_p= -61996385
$$ End of Bruker specific parameters
$$ ---------------------------------
##NTUPLES= NMR SPECTRUM
##VAR_NAME=  FREQUENCY,     SPECTRUM/REAL,   SPECTRUM/IMAG
##SYMBOL=    X,             R,               I
##VAR_TYPE=  INDEPENDENT,   DEPENDENT,       DEPENDENT
##VAR_FORM=  AFFN,          ASDF,            ASDF
##VAR_DIM=   65536,         65536,           65536
##UNITS=     HZ,            ARBITRARY UNITS, ARBITRARY UNITS
##FACTOR=    0.620285442955139, 1,           1
##FIRST=     20137.2065510759, 0,            0
##LAST=      -20513.1999529892, 0,           0
##MIN=       -20513.1999529892, -61996385,   0
##MAX=       20137.2065510759, 338094664,    0
$$ Real data points
##PAGE= N=1
##DATA TABLE= (X++(R..R)), XYDATA
$$ [...]
##PAGE= N=2
##DATA TABLE= (X++(I..I)), XYDATA
13122d178608j231355J017154J656382J395050K212804K535283K10030k118590
$$ -4178608 -5409963 -4392809 -2736427 -1341377 871427 3406710 3616740 1498150
13114A498150q28643J635043M91307k418013j375570K526504K451175k064459
$$ 1498150 669507 2304550 2795857 377844 -997726 1528778 3979953 1915494
13106A915494l626858L52153L132802M76674k253408j37217K579023N45757l012731
$$ 1915494 -1711364 -1359211 1773591 2250265 -3143 -140360 2438663 2984420 -28311
13097b8311k341555P80071J056217o63186J8J934414N61538l068508l403137J23522
$$ -28311 -2369866 -1589795 -533578 -1196764 -1196746 737668 1299206 -1769302 -5172439 -5048917
13087e048917K329040J080252j83779N85581J116003J94570Q4919J710015K490555
$$ -5048917 -2719877 -1639625 -1823404 -1237823 -121820 72750 157669 1867684 4358239
13078D358239R94384o62381r84878j572559l346423m058463j985415R30508K020021
$$ 4358239 5352623 4690242 3705364 2132805 -1213618 -5272081 -7257496 -6326988 -4306967
13069d306967J544710J247787J275554O65957m81389j082847n09793J003883K548688
$$ -4306967 -2762257 -1514470 -238916 427041 -54348 -1137195 -1646988 -643105 1905583
13060A905583K734736Q59880j807786l098994k448942j190228n04786m30603o46780
$$ 1905583 4640319 5500199 3692413 593419 -1855523 -3045751 -3550537 -3981140 -4627920
13051d627920p76435k19161Q67831J006425n25166j835791o95119K002692L297851
$$ -4627920 -5404355 -5623516 -4755685 -3749260 -4274426 -6110217 -6805336 -4802644 -1504793
13042a504793K174441K56868r47930j144047k02255J422168J855394J16690j481778
$$ -1504793 669648 926516 -21414 -1165461 -1367716 54452 1909846 2026536 544758
13033E44758l50988J784104J126262j823900k655060j74936J705919O39945m12336
$$ 544758 193770 1977874 3104136 1280236 -1374824 -1549760 156159 796104 383768
13024C83768J324738L413274K206667j179834k750926j564858j63649j78295p70736
$$ 383768 1708506 5121780 7328447 6148613 3397687 1832829 1669180 1490885 720149
13015G20149j036449j235752j546339j499793p75691N77124K305716L435589K570237
$$ 720149 -316300 -1552052 -3098391 -4598184 -5373875 -4796751 -2491035 944554 3514791
13006C514791o4831j980547j364743L57631O75650k54849k64363R00015R51918
$$ 3514791 3449960 1469413 104670 462301 1137951 883102 618739 1518754 2470672
12997B470672j096678k866966j830362R98302K448781J482986M8489l16992n39695
$$ 2470672 1373994 -1492972 -3323334 -2325032 123749 1606735 1655224 1338232 798537
12988G98537j698844k601719j622696K62972Q05817L05051J121788L124469L026576
$$ 798537 -900307 -3502026 -5124722 -4861750 -4055933 -3750882 -2629094 495375 3521951
12979C521951l07013l162239k080075J005079J868618J75918j065322q14471p13390
$$ 3521951 3214938 52699 -2027376 -1022297 846321 1022239 -43083 -857554 -1570944
12970a570944j052086j84667J665045J928527R7329r15558N13552J690154l76764
$$ -1570944 -2623030 -2807697 -1142652 785875 883204 -32354 481198 2171352 1794588
12961A794588m012784m586718m65764M739566O058990K396642k437981l929687
$$ 1794588 -2218196 -6804914 -7270678 -2531112 3527878 5924520 3486539 -443148
12953d43148j793966K87369j1617p19929N97879K441612J792848o23000j242142
$$ -443148 -2237114 -1949745 -1961362 -2681291 -2083412 358200 2151048 1528048 285906
12944B85906O71884K063867J030177q48221j779891k003264j805212m89355J468987
$$ 285906 957790 3021657 4051834 3203613 1423722 -579542 -2384754 -2874109 -1405122
12935a405122K130546J157258M25469N76027L1592j350840j152078J177494K250719
$$ -1405122 725424 1882682 2308151 2884178 2915770 1564930 412852 1590346 3841065
12926C841065j42350k850604j708500K065239L514205Q83494k568547l426611
$$ 3841065 3698715 848111 -860389 1204850 4719055 5602549 3034002 -392609
12918c92609j790614K30087J271892J159867K42392o96093o33912P15704K217298
$$ -392609 -2183223 -1953136 -681244 478623 721015 24922 -608990 106714 2324012
12909B324012K133024N0799k190220k341823o75155K40223o87218j365278p5342
$$ 2324012 4457036 4507835 2317615 -24208 -699363 -459140 -1146358 -2511636 -2586978
12900b586978J367174O22083p98588K38220K907946L267367O02134j362401l93375
$$ -2586978 -1219804 -597721 -1396309 -1158089 1749857 5017224 5619358 4256957 3863582
12891C863582J178680P70287p17815j326315j107119q66968n04214l00728j341668
$$ 3863582 5042262 5812549 5094734 3768419 2661300 1794332 1290118 989390 -352278
12882c52278l093817l119576p33251J618932K115152K009856K696397L007708
$$ -352278 -3446095 -6565671 -7298922 -5679990 -3564838 -1554982 1141415 4149123
12874D149123J397863j374480l419802l697306j895217J327259L365463J896072
$$ 4149123 5546986 4172506 752704 -2944602 -4839819 -3512560 -147097 1748975
12866A748975j237000j734146Q77593K617461J537409J55717M8415o96153k433031
$$ 1748975 511975 -1222171 -344578 2272883 3810292 3966009 4014424 3318271 885240
12857H85240j992800J120726K193727j060269l799269j720968J849529K037228
$$ 885240 -1107560 13166 2206893 1146624 -2652645 -4373613 -2524084 -486856
12849d86856N22658J155732K092448k14377k896398q70395L311530K590871k684192
$$ -486856 35802 1191534 3283982 3069605 173207 -697188 2614342 5205213 2521021
12840B521021m788375q95668L112770K677072O03424M58279P88058n70020j940073
$$ 2521021 -2267354 -3163022 -50252 2626820 3230244 3688523 4476581 3906561 1966488
12831A966488j307707j52782m39013j152004o52708M28292R51932J240296J461187
$$ 1966488 658781 505999 66986 -1085018 -1737726 -1309434 -357502 882794 2343981
12822B343981P46661n60868o26012N47077N55609j198378k006921l25084J462775
$$ 2343981 3090642 2529774 1903762 2450839 3006448 1808070 -198851 -523935 938840
12813I38840Q89608q63107j445111j068119j253240j779654j315651J93116J691686
$$ 938840 1828448 965341 -479770 -1547889 -2801129 -4580783 -5896434 -5703318 -4011632
12804d011632K555267K610137J730838M81883p602L67157M54270k31181p54467
$$ -4011632 -1456365 1153772 2884610 3366493 3358891 3726048 4180318 3949137 3194670
12795C194670l95309M27809J136637J323089J47770k553431m575954l250766N82911
$$ 3194670 2799361 3227170 4363807 5686896 5834666 3281235 -1294719 -4545485 -3962574
12786c962574L045524K235762J96855q52778j403113k413889k799173j162863
$$ -3962574 -917050 1318712 1515567 662789 -740324 -3154213 -5953386 -7116249
12778g116249J574816L091191K357519L92611r47798n13418R85274J454581N8874
$$ -7116249 -5541433 -2450242 -92723 299888 -647910 -1161328 -176054 1278527 1337401
12769A337401j283838n74130J115976J375012L01179k05478j02734p73347j551236
$$ 1337401 53563 -520567 595409 1970421 2271600 2066122 1963388 1190041 -361195
12760c61195n54810J218901Q71925j113007j164854J065433J642499q77791k679315
$$ -361195 -916005 302896 1174821 61814 -1103040 -37607 1604892 727101 -1952214
12751a952214j144354P55275j60705j833985r45396J193973J211889m57317p99306
$$ -1952214 -3096568 -2341293 -2501998 -4335983 -5281379 -4087406 -2875517 -3332834 -4132140
12742d132140M40776R47860K57931N2087O94134R75158Q39851J186707J386097
$$ -4132140 -3691364 -2743504 -2485573 -2433486 -1739352 -764194 75657 1262364 2648461
12733B648461R9150j706969j635634K28841J231826K98929o24377k9060P96412
$$ 2648461 2747611 1040642 -594992 -366151 865675 1164604 540227 511167 1307579
12724A307579J54029j190408j124411P68219K651757K659954P80387j501451k816212
$$ 1307579 1461608 271200 -853211 -84992 2566765 5226719 6007106 4505655 1689443
12715A689443k806043j730787J0722J608086J891915N90455q92633r30483M06834
$$ 1689443 -1116600 -2847387 -2836665 -1228579 663336 1253791 361158 -569325 -162491
12706a62491J738511K097555J260485p35067k929636l284601j127624J118199
$$ -162491 1576020 3673575 4934060 4198993 1269357 -2015244 -3142868 -2024669
12698b024669Q96051o59176n21154J382866K320672J330240J40051m21005j222541
$$ -2024669 -1128618 -1787794 -2308948 -926082 1394590 2724830 2864881 2443876 1221335
12689A221335j840587p40738J033313N88227j573306j632828R23729J805696q31046
$$ 1221335 -619252 -1359990 -326677 261550 -1311756 -2944584 -2020855 -215159 -1046205
12680a046205k842324r69934J698959J245913n26303O2088J818958J216846r94288
$$ -1046205 -3888529 -4858463 -3159504 -1913591 -2439894 -2377806 -558848 657998 -336290
12671c36290j316201J43887L89158m77138N04884L126576L466444J24484l383047
$$ -336290 -1652491 -1508604 -1119446 -1596584 -1091700 2034876 5501320 5625804 2242757
12662B242757l661264j428420O59140J334162Q02944k57836q89510n68765k497
$$ 2242757 -1418507 -2846927 -2187787 -853625 -50681 -308517 -1198027 -1766792 -1769289
12653a769289O937l7688N09216Q83597L18797j87574M25457J133562O63792Q010
$$ -1769289 -1762352 -1800040 -1290824 -407227 -88430 -276004 149453 1283015 1946807 1954817
12643A954817N05949R72806k79672k038003k078882j053597r28659r58935P34539
$$ 1954817 2460766 3433572 3153900 1115897 -962985 -2016582 -2945241 -3904176 -3169637
12634c169637K751666K124497k71585q29405N77797O28675j019577r08445J511933
$$ -3169637 -417971 1706526 1434941 605536 1183333 1812008 792431 -116014 1395919
12625A395919K020905j273540m158377k772529N41152J456811J57943k85484O95438
$$ 1395919 3416824 2143284 -2015093 -4787622 -4246470 -2789659 -2631716 -2917200 -2221762
12616b221762J306456J019252N43094l49495j797629k032493K65435K928303K782047
$$ -2221762 -915306 103946 647040 297545 -1500084 -3532577 -3267142 -338839 2443208
12607B443208L44174j089652n07623o6498r12819j395276k92492R58584P20932
$$ 2443208 2787382 1697730 1190107 1123609 210790 -1184486 -1476978 -518394 202538
12598B02538k06104j70230M60504R199j394376j433275J031438L668581L199251
$$ 202538 -3566 -173796 286708 295907 -1098469 -2531744 -1500306 2168275 5367526
12589E367526k84334l221214l117582j404565o61118p49805J21910J653304J711947
$$ 5367526 5083192 1861978 -1255604 -2660169 -3321287 -4071092 -3949182 -2295878 -583931
12580e83931K08230m12640O90311J187752k80305j313983L58194K552730J629925
$$ -583931 -375701 -788341 -98030 1089722 809417 -504566 -146372 2406358 4036283
12571D036283j487534k230771O66755L022872J341585k193155l210029j259932
$$ 4036283 2548749 317978 984733 4007605 5349190 3156035 -53994 -1313926
12563a313926N69628P73980P33540J099923L95039j698366k687662r36780J356561
$$ -1313926 -744298 29682 763222 1863145 2258184 559818 -2127844 -3064624 -1708063
12554a708063J406874K20617N43047J693853N09263k591532k968917J173872N070291
$$ -1708063 -301189 -80572 462475 2156328 2665591 74059 -2894858 -1720986 3349305
12545C349305L681616j214081l832136k375696k11003J24675j28723M40085O09020
$$ 3349305 7030921 5816840 1984704 -390992 -601995 -477320 -606043 -165958 443062
12536D43062q65887k373831j471160J425355L351058K483995J19574j178892n07037
$$ 443062 -422825 -2796656 -4267816 -2842461 508597 2992592 3112166 1933274 1426237
12527A426237P55624Q83532l01740j745542k674520k843768j746686P76057L019822
$$ 1426237 2181861 3065393 2763653 1018111 -1656409 -4500177 -6246863 -5470806 -2450984
12518b450984K550059k65658j898816l20154J925891J411417j105930k098179
$$ -2450984 99075 -166583 -2065399 -2385553 -459662 951755 -154175 -2252354
12510b252354p04790M78631n7977o18114M17664J847761J720581L75845k69592
$$ -2252354 -2957144 -2478513 -2536490 -3154604 -2736940 -889179 831402 1207247 937655
12501I37655M50816J306703J068713k7034r10721j169950j303162j431050o21300
$$ 937655 1388471 2695174 3763887 3736853 2826132 1656182 353020 -1078030 -1699330
12492a699330J516899L200526K236379n76665j992574q69443K31405p95584k369087
$$ -1699330 -182431 3018095 5254474 4677809 2685235 1815792 2047197 1251613 -1117474
12483a117474k089157n53440J66367J4611K48117P59602P98347R97371J975600
$$ -1117474 -3206631 -3760071 -3593704 -3579093 -3330976 -2571374 -1773027 -775656 1199944
12474A199944K299267O82917j179586j022818J99248K32227l09929M92962J540201
$$ 1199944 3499211 4182128 3002542 1979724 2178972 2411199 2101270 2594232 4134433
12465D134433L11293k174228k639411j177633p50407j468413o60954J319414J081270
$$ 4134433 4445726 2271498 -367913 -1545546 -2295953 -3764366 -4425320 -3105906 -2024636
12456b024636j322626j784548O83124K152500R74525M88423J964881J431785k644240
$$ -2024636 -3347262 -5131810 -4448686 -2296186 -1321661 -833238 1131643 2563428 -80812
12447h0812m914396j483245L007743K684438o9092O07251L615770L092398j127974
$$ -80812 -4995208 -6478453 -3470710 -786272 -855364 -248113 3367657 6460055 5332081
12438E332081l198116r37796J486857J163076J16712P1166n24984k249013k653217
$$ 5332081 2133965 1196169 2683026 3846102 3962814 4033980 3508996 1259983 -1393234
12429a393234q10523N37024j54975k68807K225145M570623L150485q61622l139313
$$ -1393234 -2203757 -1666733 -1821708 -2090515 134630 4705253 7855738 6994116 3854803
12420C854803k013569K93335J375058J013833J13042o97658j104091r15568j88186
$$ 3854803 1841234 2134569 3509627 4523460 4636502 3938844 2834753 1919185 1730999
12411A730999P53106J344328R82670k15113j062946o14034L79307M15271n68414
$$ 1730999 2484105 3828433 4811103 4595990 3533044 2919010 3298317 3713588 3145174
12402C145174j302385j324558j406075j775011j631373p56118M9421N34058J318505
$$ 3145174 1842789 518231 -887844 -2662855 -4294228 -5050346 -5000925 -4466867 -3148362
12393c148362K144712J623155m38254k159391k105519j162171p40098n89790J49871
$$ -3148362 -1003650 619505 181251 -1978140 -4083659 -5245830 -5985928 -6575718 -6425847
12384f425847R92791R48937N28595J081892K407545K669291Q83634j727617l179862
$$ -6425847 -5433056 -4484119 -3955524 -2873632 -466087 2203204 3086838 1359221 -1820641
12375a820641k660201q06145J132429K046271J542047L36708k00753N72346J661219
$$ -1820641 -4480842 -5286987 -4154558 -2108287 -566240 -229532 -430285 142061 1803280
12366A803280J357930o83236k663765k480995k42225J772784J812987M76598o14795
$$ 1803280 3161210 2477974 -185791 -2666786 -2909011 -1136227 676760 1153358 538563
12357E38563r72155j082706r01564J7528J141484J270303M19304n8171L44960
$$ 538563 -433592 -1516298 -2417862 -2400334 -1258850 11453 430757 372586 717546
12348G17546M40557n33414j329332n17320J087912J434360K33780p33340m24849
$$ 717546 1158103 624689 -704643 -1221963 -134051 1300309 1534089 800749 375900
12339C75900P377o70562j540049p93297J343972K516390J322267p54420j264144
$$ 375900 383277 -287285 -1827334 -2620631 -1276659 1239731 2561998 1807578 543434
12330E43434J50681J625021J619793M73785o49272j245842j368171q95336J86399
$$ 543434 694115 2319136 3938929 4412714 3763442 2517600 1149429 254093 440492
12321D40492J116922Q72345n45193j898593k017274r83129J63010O42681N97576
$$ 440492 1557414 2429759 1884566 -14027 -2031301 -3014430 -2851420 -2208739 -1611163
12312a611163O04537Q48817R94132P43180J94990l89032p99036p37119K0126R74115
$$ -1611163 -1006626 -157809 836323 1579503 1774493 1385461 586425 -150694 -130568 843547
12302H43547R90815k99706j598457j299878L70626J442942N32864j579634k839315
$$ 843547 1834362 1534656 -63801 -1363679 -993053 449889 982753 -596881 -3436196
12293c436196j928891N54823K527388K292126M49770o10419K49740J321814O59542
$$ -3436196 -5365087 -4810264 -2282876 9250 459020 -151399 98341 1420155 2079697
12284B079697q02803o99811R14518J676172P17182m33057j090753k404963l993262
$$ 2079697 1276894 577083 1491601 3167773 3884955 3451898 2361145 -43818 -4037080
12275d037080k953104J478609N102049L729257q68644l308225j728713Q30217
$$ -4037080 -6990184 -5511575 -409526 3319731 2451087 -857138 -2585851 -1755634
12267a755634J639207J299644J126775O96508o77059k131374k285423r21640J037707
$$ -1755634 -116427 1183217 2309992 3006500 2329441 198067 -2087356 -3008996 -1971289
12258a971289K275808J757709p3895j002297L98625K212928J409492j482460k755613
$$ -1971289 304519 2062228 1988333 986036 1384661 3597589 5007081 3524621 769008
12249G69008j133115K28994j076799k663810j237672J835579K429639m982j767583
$$ 769008 -364107 -135113 -1211912 -3875722 -5113394 -3277815 -848176 -853158 -2620741
12240b620741o43624J164227R35058n99981j064617k81405o4552j049837j788203
$$ -2620741 -3264365 -2100138 -1165080 -1765061 -2829678 -3111083 -3175635 -4225472 -6013675
12231f013675r38320J094673K860521L193835J837658k63408j279251k23487J441255
$$ -6013675 -6951995 -5857322 -2996801 197034 2034692 1771284 492033 268546 1709801
12222A709801J156400j304882l107832j998557O22965J814642J256140J066935
$$ 1709801 2866201 1561319 -1546513 -3545070 -2922105 -1107463 148677 1215612
12214A215612J781421J305778j142300k687051o72957K748039K922725p17740
$$ 1215612 2997033 4302811 3160511 473460 -199497 2548542 5471267 4753527
12206D753527l446958j602440K406297L495986P26772j977863j628188J12833
$$ 4753527 1306569 -295871 2110426 5606412 6333184 4355321 2727133 2839966
12198B839966J34927j355824j564726K33181J404461o9934k501460k915343j148122
$$ 2839966 2974893 1619069 54343 287524 1691985 1622051 -879409 -3794752 -4942874
12189d942874N08503J059468J792142L257375L656460J557565j459540k643085
$$ -4942874 -4434371 -3374903 -1582761 1674614 5331074 6888639 5429099 2786014
12181B786014j609246k71124J94197L44134M79091k57211k001386l073180k077231
$$ 2786014 1176768 905644 1099841 1443975 1923066 1665855 -335531 -3408711 -5485942
12172e485942n0028R30060O13572M86877J114621J378161O58180k3121P8150J281
$$ -5485942 -5535970 -4605910 -3992338 -3505461 -2390840 -1012679 -354499 -377620 -299470 -298189
12162b98189j023051j671384n08739J137946Q04578j011937j271081P72546K249235
$$ -298189 -1321240 -2992624 -3501363 -2363417 -1558839 -2570776 -3841857 -3069311 -820076
12153h20076J318665p16L78274R86611j44559j378231j93331J822106J136701
$$ -820076 498589 497873 876147 1862758 1718199 339968 146637 1968743 3105444
12144C105444j451344j566666J478416L109283O34652k560016k415435j2353J101796
$$ 3105444 1654100 87434 1565850 4675133 5309785 2749769 334334 321981 1423777
12135A423777M77435K38981R43465J220419M09775j026452k673958l659228k445265
$$ 1423777 1901212 2140193 3083658 4304077 4713852 3687400 1013442 -2645786 -5091051
12126e091051O63841K538395J287100n31131J91718J841043O24549k836270m036925
$$ -5091051 -4427210 -1888815 -601715 -1132846 -941128 899915 1524464 -1311806 -5348731
12117e348731j571867J050133J371898J252787K406949K860803P16036j825919
$$ -5348731 -6920598 -5870465 -4498567 -3245780 -838831 2021972 2738008 912089
12109I12089j706796o3287k51752k053987j881137J184038L388575J800154j187870
$$ 912089 -794707 -857994 -1109746 -3163733 -5044870 -3860832 -472257 1327897 140027
12100A40027j312590J361742K729263P49851j807819j740397P9201O93126k29833
$$ 140027 -1172563 189179 2918442 3668293 1860474 120077 199278 892404 662571
12091F62571n58174K36531M37565l29503j90465J298354J805318K81995p44826
$$ 662571 104397 340928 778493 448990 258525 1556879 3362197 3644192 2899366
12082B899366N91751J827204j2957l225458l901140j948135m54502p8217J310908
$$ 2899366 3491117 5318321 5305364 2079906 -1821234 -3769369 -4223871 -4302088 -2991180
12073b991180L560487L584219O64895j898013j847103p81582l37159N11716K190411
$$ -2991180 569307 4153526 4818421 2920408 1073305 291723 -45436 466280 2656691
12064B656691K358949j43438k429020j823628k00958o05968k022608j420767Q52880
$$ 2656691 5015640 4872202 2443182 619554 418596 -187372 -2209980 -3630747 -2777867
12055b777867J909005J318257J060313J221307J23189j449120p52123J619652
$$ -2777867 -868862 449395 1509708 2731015 2854204 1405084 652961 2272613
12047B272613J621365j582965l425306r32965K228268J347617j993600k736983
$$ 2272613 3893978 2311013 -1114293 -2047258 181010 1528627 -464973 -3201956
12039c201956m12046P78821o48319j308796P14533K237635L47419k303972j313445
$$ -3201956 -3614002 -2835181 -3483500 -4792296 -4077763 -1840128 -1492709 -3796681 -5110126
12030e110126K540513M250423J762399j593887k233275n61268J030040J598483
$$ -5110126 -2569613 1680810 3443209 1849322 -383953 -945221 84819 1683302
12022A683302J334252k761k130557l156002j707059O72662J385939M50585Q3618
$$ 1683302 3017554 3014793 884236 -2271766 -3978825 -3306163 -1920224 -1469639 -1386021
12013a386021R32852J257472K30807m98576K95956J151286L16961j204328j214790
$$ -1386021 -453169 804303 1035110 536534 832490 1983776 2300737 1096409 -118381
12004a18381N2470L34170q32732j229722L55283J780598N07886k491595l783598
$$ -118381 -65911 268259 -564473 -1794195 -1438912 341686 849572 -1642023 -5425621
11995e425621j928107R94147K405062K048307J165665L34693o81747j714253k036171
$$ -5425621 -7353728 -6359581 -3954519 -1906212 -740547 -405854 -1087601 -2801854 -4838025
11986d838025j275863K23846J765628K598652K328335J486549J079432J095865
$$ -4838025 -6113888 -5890042 -4124414 -1525762 802573 2289122 3368554 4464419
11978D464419L72909j364390k519975j840131m10055J10708O0601N92327J060305
$$ 4464419 4837328 3472938 952963 -887168 -1297223 -1186515 -1125914 -533587 526718
11969E26718K18322p46309M55175L001055L501941J198288r17161j119044j354774
$$ 526718 745040 -1269 453906 3454961 6956902 8155190 7238029 6118985 4764211
11960D764211k943218l597016j350879J691392K567189J774791J250607N49469
$$ 4764211 1820993 -1776023 -3126902 -1435510 1131679 2906470 4157077 4706546
11952D706546j372840k747665j423644Q37970O84707j242330j301846J095435
$$ 4706546 3333706 586041 -837603 367 685074 -557256 -1859102 -763667
11944g63667K685045J646723k61319j210284j285034n92281J026431J992785L67394
$$ -763667 1921378 3568101 3306782 2096498 811464 219183 1245614 3238399 3605793
11935C605793k276062k184299O68237K078155J30631k010068j515601P5171N16163
$$ 3605793 1329731 -854568 -186331 1891824 2022455 12387 -1503214 -1428043 -911880
11926i11880N96581J401847J395483n07361k009796j039494L93083l94371j879367
$$ -911880 -315299 1086548 2482031 1974670 -35126 -1074620 -681537 -1075908 -2955275
11917b955275r54440J401862J527930p82737j997612o67029O21600q9104j090664
$$ -2955275 -3909715 -2507853 -979923 -1762660 -3760272 -4427301 -3805701 -3894805 -4985469
11908d985469j66937J850809K508313J132837p44372j510011q49881N82949J997134
$$ -4985469 -5152406 -3301597 -793284 339553 -404819 -1914830 -2764711 -2181762 -184628
11899a84628K785709K367629M29083k028252k597554p9619K973787K585464j230447
$$ -184628 2601081 4968710 5397793 3369541 771987 692368 3666155 6251619 5021172
11890E021172l904360k387801Q44951J814414N09700l49263Q3970O23184R95413
$$ 5021172 1116812 -1270989 -426038 1388376 1898076 1548813 1632783 2255967 3251380
11881C251380J579608J243259j126831l623943l335149r40358K65152k80397O5819
$$ 3251380 4830988 6074247 4947416 1323473 -2011676 -2952034 -2686882 -2967279 -2901460
11872b901460J996469K788705J109070o47311n61046j72075j096124j898524r64487
$$ -2901460 -904991 1883714 2992784 2345473 1784427 1612352 516228 -1382296 -2346783
11863b346783L04452J27436j49840J523056L708543L246875K82622j874632j608289
$$ -2346783 -2042331 -1914895 -2064735 -541679 3166864 6413739 6696361 4821729 3213440
11854C213440n81159l26342j89357N95030J198443P04134l32690q39460o33530
$$ 3213440 2632281 2305939 2116582 2711612 3910055 4614189 4281499 3442039 2808509
11845B808509k33840j72474p85836j768133j916321m45921J515224K086739J196001
$$ 2808509 2574669 2402195 1616359 -151774 -2068095 -2514016 -998792 1087947 2283948
11836B283948L95454J96510l92665j390962j264833K55848J085562l3728j330512
$$ 2283948 2679402 2875912 2483247 1092285 -172548 83300 1168862 1135134 -195378
11827a95378q20506N50458Q13483L87674Q60455J537588L77074k042029k706861
$$ -195378 -1015884 -465426 348057 735731 1596186 3133774 3510848 1468819 -1238042
11818a238042o57568J622037K009257J270129Q31304N81424J76091J89753M59793
$$ -1238042 -1895610 -273573 1735684 3005813 3837117 4418541 4594632 4784385 5244178
11809E244178n32985k913161m110485k310162O58132K065886K115085K433377
$$ 5244178 4711193 1798032 -2312453 -4622615 -3964483 -1898597 216488 2649865
11801B649865K409934L80511k383848k585462p4379J313691p03884l300920k490059
$$ 2649865 5059799 5440310 3056462 471000 396621 1710312 1006428 -2294492 -4784551
11792d784551J192315L295980J280789k243266k806570L39140L266582K395340
$$ -4784551 -3592236 -296256 984533 -1258733 -4065303 -3726163 -459581 1935759
11784A935759q17630j938438K45824K273704J407015n20444n97225N07685L37335
$$ 1935759 1118129 -820309 -574485 1699219 3106234 2585790 1988565 2496250 2833585
11775B833585q83348j104343n84086j393441l207665l282282q38665J813140K884072
$$ 2833585 1950237 845894 261808 -1131633 -4339298 -7621580 -8460245 -6647105 -3763033
11766c763033K789172K000093M55468n37058P17936K772435K084771j429293l611769
$$ -3763033 -973861 1026232 1481700 944642 1662578 4435013 6519784 5090491 1478722
11757A478722k200919K3094R0096q96346p83955k14178n18688p18783K79775J045389
$$ 1478722 -722197 -699103 -609007 -1505353 -2289308 -2503486 -3022174 -3740957 -3461182 -2415793
11747b415793K89037k29991J223119K619593J177856j704880k450923r24929k3210
$$ -2415793 -2126756 -2356747 -1133628 1485965 2663821 958941 -1491982 -2416911 -2440121
11738b440121m40924l2723J635167K149791N03239r70733l20687J025716O84907
$$ -2440121 -2881045 -2913768 -1278601 871190 1374429 403696 83009 1108725 1793632
11729A793632j071805j867295n03311J688189K653825J962984R06820L81233l94186
$$ 1793632 721827 -1145468 -1648779 39410 2693235 4656219 5563039 5944272 5550086
11720E550086k101148l232383j888544O85049J187661p09483j639714M6616J635246
$$ 5550086 3448938 216555 -1671989 -986940 200721 -508762 -2148476 -2101860 -466614
11711d66614P40465q51722p26673O8528k04128j67737J738741L141880J079231
$$ -466614 273851 -577871 -1304544 -1236016 -1440144 -1607881 130860 3272740 4351971
11702D351971k439389k922969j88067J935846J766755J096465R86992O78632K97919
$$ 4351971 1912582 -1010387 -1198454 737392 2504147 3600612 4587604 5266236 5564155
11693E564155N04373N9155k069761l273405q48828K200079P86057l501618m031120
$$ 5564155 6068528 6127683 4057922 784517 -64311 2135768 2921825 -579793 -4610913
11684d610913J66382K688376L74240j877884J0359K638864J705565p95808j021766
$$ -4610913 -4444531 -1756155 -1381915 -3259799 -3249440 -610576 1094989 299181 -722585
11675g22585K9323m37546j316170j85249J702537J894026J209022J256634P23226
$$ -722585 -693262 -1130808 -2446978 -2632227 -929690 964336 2173358 3429992 4153218
11666D153218j248124j545168J757493M255818J371498l438795l588875p7107
$$ 4153218 2905094 1359926 3117419 7373237 8744735 5305940 1717065 1639958
11658A639958N24781k482206l041808O22713K663640k98124l420309j842974J684011
$$ 1639958 2164739 -317467 -3359275 -2736562 -72922 -371046 -3791355 -5634329 -3950318
11649c950318K113789J95256Q1005K080145K834692J040544j215679k102119j872791
$$ -3950318 -1836529 -1641273 -1560268 519877 3354569 4395113 3179434 1077315 -795476
11640g95476j396978j045579p95113k31309R31472J852708J445561N01074Q37243
$$ -795476 -2192454 -3238033 -4033146 -4264455 -3332983 -1480275 -34714 466360 1303603
11631A303603J954528J272886j482717l220249k133293k50173L60502O21934J524402
$$ 1303603 3258131 4531017 3048300 -171949 -2305242 -2555415 -2194913 -1572979 -48577
11622d8577J550811k14234j583252r97332o20390k110994k513938J057524N320090
$$ -48577 1502234 1288000 -295252 -1292584 -1912974 -4023968 -6537906 -5480382 -160292
11613a60292M814923L36680k307047j125437L24177j171O0044J348661J032975
$$ -160292 4654631 4991311 2684264 1558827 1883004 1881833 1941877 3290538 4323513
11604D323513j870912l655904j607642J572835K187162Q51301R0544k55996j571867
$$ 4323513 2452601 -1203303 -2810945 -1238110 949052 1800353 1890897 1634901 63034
11595F3034k811660k059757j26349Q04259Q36633J489060K232263J117724j685719
$$ 63034 -2748626 -4808383 -4934732 -4130473 -3293840 -1804780 427483 1545207 -140512
11586a40512l819402l878645k285917L47861L242842M441505K568681n11501j400654
$$ -140512 -3959914 -7838559 -10124476 -9776615 -6533773 -2092268 476413 -35088 -1435742
11577a435742L20642J683780P33638j012612j216635J56504J399698J445341P31841
$$ -1435742 -1115100 568680 1302318 289706 -926929 -770425 629273 2074614 2806455
11568B806455L29589O94065J067807L35399j289964k250693j820908j071657q33169
$$ 2806455 3136044 3830109 4897916 5233315 3943351 1692658 -128250 -1199907 -2033076
11559b033076l07066R26053J321463j70410j694928j069470N86624O70350n47688
$$ -2033076 -2340142 -1414089 -92626 -263036 -1957964 -3027434 -2440810 -1770460 -2318148
11550b318148o35900N96152R50275J4929j22174J104350J437525k95268j897494
$$ -2318148 -2954048 -2357896 -1407621 -1392692 -1514866 -410516 1027009 731741 -1165753
11541a165753j010178J516652K927640J829261p58425k551204j983313m7277M61900
$$ -1165753 -2175931 -659279 2268361 4097622 3339197 787993 -1195320 -1242597 -780697
11532g80697j124079j708448R19471L761870K712852o46800j354744O68935O99504
$$ -780697 -1904776 -3613224 -2693753 1068117 3780969 3134169 1779425 2448360 3147864
11523C147864k024979k353555J692406M388932R23639m728661n544567j278751
$$ 3147864 1122885 -1230670 461736 4850668 5774307 1045646 -4498921 -5777672
11515e777672K554544K882259J340024J2851o45978m54835N00371J121924Q40538
$$ -5777672 -3223128 -340869 999155 1012006 366028 -88807 411564 1533488 2374026
11506B374026O27431P65223o9792j628276j225637J371609J976362j538761m657569
$$ 2374026 3001457 3766680 3696888 2068612 842975 2214584 4190946 2652185 -2005384
11497b005384k725526J491771K266094j0206m87870J419795J776828k59250j281727
$$ -2005384 -4730910 -3239139 -973045 -983251 -1471121 -51326 1725502 1466252 184525
11488A84525k38155Q3755j142549j375979p6302J89619q06249r2704K369946K527184
$$ 184525 -53630 30125 -1112424 -2488403 -2564705 -2375086 -3181335 -3274039 -904093 1623091
11478A623091n83178k268855J24748K441510O42862k304462j393546K194067L227031
$$ 1623091 1039913 -1228942 -1104194 1337316 1980178 -324284 -1717830 476237 3703268
11469C703268O27692j700069j363304j24601Q6027n4773N89538J398088J115040
$$ 3703268 4330960 2630891 1267587 1142986 1229013 1174240 1763778 3161866 4276906
11460D276906l10047j792471k202603j145569O71441J792569J264336m00373j676303
$$ 4276906 3966859 2174388 -28215 -1173784 -502343 1290226 2554562 2154189 477886
11451D77886j343417N12089K435686K752403J218299p98890k052172k444388j946579
$$ 477886 -865531 -353442 2082244 4834647 6052946 5254056 3201884 757496 -1189083
11442a189083j36813K099363K403057L33685j108666J62668J571896j64400l249825
$$ -1189083 -1325896 773467 3176524 3510209 2401543 2564211 4136107 3971707 721882
11433G21882l257426j50674J940125J452755P98266R01185k14779k357865k170182
$$ 721882 -2535544 -2686218 -746093 706662 1504928 2406113 2191334 -166531 -2336713
11424b336713Q48230K452802L73795j845646q17372J310748J084049n36020p49160
$$ -2336713 -1488483 964319 1338114 -507532 -1324904 -14156 1069893 533873 -215287
11415b15287l2736m48489j308204o63845P60032R40156K66549L52713O32956m25577
$$ -215287 -248023 -696512 -2004716 -2668561 -1908529 -968373 -701824 -349111 283845 -141732
11405a41732k024062k168492q80502O16550K331200M092059L633088j97015l913814
$$ -141732 -2165794 -4334286 -5214788 -4598238 -2267038 1825021 5458109 5261094 1347280
11396A347280l218682P00496K859854J718958L07874L79775J83268j178932j647477
$$ 1347280 -1871402 -1170906 1688948 3407906 3715780 4095555 4278823 3099891 1452414
11387A452414j59478R71879k07748j989418j704447L11853J642856J284310K40088
$$ 1452414 1292936 2264815 2057067 67649 -1636798 -1324945 317911 1602221 1842309
11378A842309n36650j063834j400850j022798N24855K612379L474929J798206
$$ 1842309 1305659 241825 -1159025 -2181823 -1656968 955411 4430340 6228546
11370F228546j336514l007600j797284L30402O54736p42303j591102q19759N34296
$$ 6228546 4892032 1884432 87148 417550 1072286 329983 -1261119 -2080878 -1546582
11361a546582J336938J392287P36568k57615l42151J085487K210727Q26805j984421
$$ -1546582 -209644 1182643 1919211 1661596 1319445 2404932 4615659 5442464 3458043
11352C458043k875281j265112l09933j730328k826298q77869K134023K402577
$$ 3458043 582762 -682350 -992283 -2722611 -5548909 -6426778 -4292755 -1890178
11344a890178K46546n16566J330443K741885J534514l94689p28602n20775j599197
$$ -1890178 -1643632 -2160198 -829755 1912130 3446644 3051955 2323353 1802578 203381
11335B03381k526010p37545K500713L241967Q42650j177114r60945q74329k475537
$$ 203381 -2322629 -3060174 -559461 2682506 3525156 2348042 1387097 512768 -1962769
11326a962769l022995j41336L318089L098273n367j746946r60602o0085Q108N72625
$$ -1962769 -4985764 -5127100 -1809011 1289262 1283895 -463051 -1423653 -1483738 -1475630 -903005
11316i03005J276427K19270j484329k88733L384894M315593K75007l944946l396806
$$ -903005 373422 592692 -891637 -1180370 2204524 6520117 6795124 2850178 -546628
11307e46628N0578J351647j95918j314485o64205q5760o31961j058479m27223
$$ -546628 -496050 855597 659679 -654806 -1319011 -1404771 -2036732 -3095211 -3522434
11298c522434N18641R48587R69556P77776K06441o67283j347229j359335m99914
$$ -3522434 -3003793 -2055206 -1085650 -307874 -101433 -768716 -2115945 -3475280 -3975194
11289c975194R11538J869763J594745O85735L33285N08073K92783k78230m52146
$$ -3975194 -3063656 -1193893 400852 1086587 1419872 1927945 2220728 1942498 1490352
11280A490352m14659o00487J0252K147140L520585J491915j909348k109377O30530
$$ 1490352 1075693 475206 485458 2632598 6153183 7645098 5735750 3626373 4256903
11271D256903J136074k202019m481977k224203J200322J501883j04286m85497
$$ 4256903 5392977 3190958 -1291019 -3515222 -2314900 -813017 -917303 -1402800
11263a402800j98567r60965j337502K66764J624148M88813p58839P34159K522968
$$ -1402800 -1601367 -2562332 -3899834 -3633070 -2008922 -1520109 -2278948 -1544789 978179
11254I78179P58502k656737k674049Q26086L254336K487462N49174r17890j865689
$$ 978179 1736681 -920056 -3594105 -2768019 486317 2973779 3522953 2605063 739374
11245G39374j490984N18545J503364o46202k962655j516906J653190J599830j050354
$$ 739374 -751610 -233065 1270299 624097 -2338558 -3855464 -2202274 -602444 -1652798
11236a652798j331062J155391J739811p41900k094241n26286O58454k28591m97837
$$ -1652798 -2983860 -1828469 -88658 -830558 -2924799 -3451085 -2792631 -3021222 -3519059
11227c519059Q96064R78596j081496j587570R90187K821912J470616J08884J271658
$$ -3519059 -2622995 -1644399 -2725895 -4313465 -3323278 -501366 969250 1078134 2349792
11218B349792J971990m71420k766954j004639K372994K435840l88405j724643
$$ 2349792 4321782 3850362 1083408 78769 2451763 4887603 4499198 2774555
11210B774555m65421N07569k99520j289278j003195K64755J647214K123911P65329
$$ 2774555 2309134 2816703 2517183 1227905 224710 489465 2136679 4260590 5025919
11201E025919j473358j861294J84998J489997j64984k246537j467990Q55339J222816
$$ 5025919 3552561 1691267 1876265 3366262 3201278 954741 -513249 342090 1564906
11192A564906k14722n02747N94205M02636j514298k270764m25599J757349K004399
$$ 1564906 1350184 847437 1441642 1844278 329980 -1940784 -2366383 -609034 1395365
11183A395365J037607M33722o3367j241830k171031j379794M65775J032265m39918
$$ 1395365 2432972 2866694 2803327 1561497 -609534 -1989328 -1523553 -491288 -931206
11174i31206j934870j381768O26939K036113K316127K334000J716965p85574l714426
$$ -931206 -2866076 -4247844 -3620905 -1584792 731335 3065335 4782300 3996726 282300
11165B82300l174451J203348M006998J234260l225282k974984J260499L147726
$$ 282300 -2892151 -1688803 2318195 3552455 327173 -2647811 -1387312 1760414
11157A760414P44256j509943r73959j83501n97653K27552K558801K190264j943134
$$ 1760414 2504670 994727 20768 -162733 -760386 -532834 2025967 4216231 2273097
11148B273097m050591l40721L920665K182234l116553m804598k116920k58460
$$ 2273097 -1777494 -2118215 1802450 3984684 868131 -3936467 -6053387 -6311847
11140f311847q64230m30631K126439L364067J698986M5543O21902J908006K157496
$$ -6311847 -7176077 -7606708 -5480269 -2116202 -417216 -371673 250229 2158235 4315731
11131D315731J775484J054130n37266j842033p43732J648291J633858j139170
$$ 4315731 6091215 7145345 6608079 4766046 4022314 5670605 7304463 6165293
11123F165293k691347j200104R0798j195123k198961J50761L420404L175834k53953
$$ 6165293 3473946 2273842 2364640 1169517 -1029444 -878683 2541721 5717555 5463602
11114E463602k753085k631930j791415j472949p69816N60184J196354P88130O78769
$$ 5463602 2710517 78587 -1712828 -3185777 -3955593 -3395409 -2199055 -1410925 -732156
11105g32156J370934J574189N69488n48418q82950j051258j387609o96220J574275
$$ -732156 638778 2212967 2782455 2234037 1351087 299829 -1087780 -1784000 -209725
11096b09725L299361J887441j940145m425749l060044O70266L193950K616899
$$ -209725 3089636 4977077 3036932 -1388817 -4448861 -3778595 -584645 2032254
11088B032254J30260j716043j560684j42949R68142J134610P79701J57416q77324
$$ 2032254 2162514 446471 -1114213 -1257162 -289020 845590 1625291 1782707 905383
11079I05383j694683j012673Q84372J613295j0810j597005m36311K009031J998405
$$ 905383 -789300 -1801973 -917601 695694 684884 -912121 -1348432 660599 2659004
11070B659004n73222j858503j25088J769112J354594J23953r6964n95638k463688
$$ 2659004 2085782 227279 102191 1871303 3225897 3349850 3252886 2657248 193560
11061A93560l210421o43583K537875K448210K31668j86013J082894O78185j256181
$$ 193560 -3016861 -3660444 -1122569 1325641 1557309 1371296 2454190 3132375 1876194
11052A876194r62790J943549L130526N92269k189750k153391r61822r15071r11676
$$ 1876194 913404 2856953 5987479 6579748 4389998 2236607 1274785 359714 -551962
11043e51962N09397J798085J241939J01851p4657l36794j570677j851620J32444
$$ -551962 -42565 1755520 2997459 3099310 3024653 2687859 1117182 -734438 -601994
11034f01994J815889N99963j490162r67845J361961K082804J005383P22905J216267
$$ -601994 1213895 1813858 323696 -644149 717812 2800616 3805999 4528904 5745171
11025E745171k51531l643209n059470k370589J596711L034753J655935j83532
$$ 5745171 5493640 1850431 -3209039 -5579628 -3982917 -948164 707771 524239
11017E24239p07941K11165J514566J504967n64221k824688k419007N38039K491144
$$ 524239 -183702 27463 1542029 3046996 2482775 -341913 -2760920 -2222881 268263
11008B68263R56151k235352l531620k031886L20538J769186K087904J490084K02176
$$ 268263 1224414 -1010938 -4542558 -6574444 -6253906 -4484720 -2396816 -906732 -704556
10999g04556p83651l30481R29355R15476p78546j728425j93804J727151R55179
$$ -704556 -1488207 -1818688 -889333 26143 -752403 -2480828 -2674632 -947481 7698
10990G698j456562j440333J642361L513348J465411j491091j732641o84489j344299
$$ 7698 -1448864 -2889197 -1246836 2266512 3731923 2240832 508191 -176298 -1520597
10981a520597k187679O8695L487649L006871q65791k116603R84399K939089L69178
$$ -1520597 -3708276 -3639581 -151932 2854939 1989148 -127455 856944 3796033 4165211
10972D165211k321822p78821J741461L24004k721209j753377K310122L294786
$$ 4165211 1843389 1064568 2806029 3130033 408824 -1344553 965569 4260355
10964D260355r3506k542048j077044Q30914K5783j203923Q9211K064057J402347
$$ 4260355 4166849 1624801 547757 1378671 1404454 200531 289742 2353799 3756146
10955C756146q76382j143683P59732J287733r77064k814589j077678K449413L153805
$$ 3756146 2879764 1736081 2495813 3783546 2806482 -8107 -1085785 1363628 4517433
10946D517433j94954l618195l046456L82470J980290n6763k246494q22911K840061
$$ 4517433 4322479 704284 -2342172 -1959702 20588 -36175 -2282669 -3105580 -265519
10937b65519M022716J144374k135944j982601N96681J611269j70871j866592j133290
$$ -265519 3757197 4901571 2765627 783026 1379707 2990976 2820105 953513 -179777
10928a79777M11088J97831q44962J04665K539933K811282J00598j807262n81880
$$ -179777 231311 429142 -415820 -311155 2228778 5040060 5140658 3333396 2751516
10919B751516P97306o05442k158193r6309L297893K733454j242385k791612k77109
$$ 2751516 3548822 2943380 785187 688878 3986771 6720225 5477840 2686228 2409119
10910B409119J310505r64221l107059j163670K202215K340083p2420r80226L68809
$$ 2409119 3719624 2755403 -351656 -1515326 686889 3026972 2954552 1974326 2343135
10901B343135J268889O41746O9250J91472l55872k008051k850510j058820K412766
$$ 2343135 3612024 4253770 4323020 4514492 4158620 2150569 -699941 -1758761 654005
10892F54005M286976K219209k177637m308711j830561K046788K641445J53454
$$ 654005 4940981 7160190 4982553 673842 -1156719 890069 3531514 3684968
10884C684968j319405m56089k7198j169343j291405O21063J392489r26579l199679
$$ 3684968 2365563 1909474 1882276 712933 -578472 42591 1435080 508501 -2691178
10875b691178k078981P10924J499262K86089k84917N85274J558871J662447O47587
$$ -2691178 -4770159 -4059235 -2559973 -2273884 -2558801 -1973527 -414656 1247791 1895378
10866A895378j320094k546746q90205K374751K989897l7548k403709j167681P95035
$$ 1895378 575284 -1971462 -2861667 -486916 2502981 2465433 61724 -1105957 -310922
10857c10922J97012j199406n91089N63866L667l79599J657963L319627R75711
$$ -310922 -113910 -1313316 -1904405 -1340539 -1336872 -1716471 -58508 3261119 4236830
10848D236830l004405l677909j517437p05742j306531J07510L008951L072088
$$ 4236830 1232425 -2445484 -3962921 -4668663 -5975194 -5867684 -2858733 213355
10840B13355o3866j712899J93491K199018J506261j44502n20441k75264l92382
$$ 213355 149489 -1563410 -1369919 829099 2335360 2190858 1670417 1395153 1002771
10831A002771r3561Q69630J016874k36724j416260j466164r50586k66633Q34971
$$ 1002771 909210 1778840 2795714 2558990 1142730 -323434 -1274020 -1540653 -705682
10822g05682J728642J458614P13644O36504K33794j848855l651358j954093K095733
$$ -705682 1022960 2481574 3195218 3831722 4065516 2216661 -1434697 -3388790 -1293057
10813a293057L655062J118394j661343j235640J065460K209817J715831R06460
$$ -1293057 2362005 3480399 1819056 583416 1648876 3858693 5574524 6480984
10805F480984L19310k49963o69793q13798r67760j225914j315584j079765l63612
$$ 6480984 6800294 6550331 5880538 5066740 4098980 2873066 1557482 477717 114105
10796A14105R76299K040910J146619j486434k922527j302786J235340J674947
$$ 114105 1090404 3131314 4277933 2791499 -131028 -1433814 -198474 1476473
10788A476473L78401l67318k55332l98989m61622M47330J315044P33118m31592
$$ 1476473 1854874 1487556 1232224 833235 371613 818943 2133987 2867105 2435513
10779B435513p10023o99173j164343o70661J516037K638528N54443j872987j068735
$$ 2435513 1725490 1026317 -138026 -808687 707350 3345878 3900321 2027334 958599
10770I58599J038412L68528j959796j673212Q36874J290634o13734q42875J328959
$$ 958599 1997011 2365539 405743 -1267469 -430595 860039 246305 -596570 732389
10761G32389J957964l26606j945994q15041M67238k24699j196876p57066j3001
$$ 732389 2690353 2363747 417753 -397288 69950 -154749 -1351625 -2108691 -2121692
10752b121692o305R7389N29016K56113k71241N46866J823685R80633j329232j555343
$$ -2121692 -2127997 -2030608 -1501592 -1245479 -1516720 -969854 853831 1834464 505232 -1050111
10742a050111Q13892K299126J305904J79755K76778o6978j095189j59244L095782
$$ -1050111 -236219 2062907 3368811 3548566 3825344 3758366 2663177 2503933 5599715
10733E599715M640620J879078k199647l385609j685605M7502L30655l23639j050834
$$ 5599715 10240335 12119413 9919766 6534157 4848552 4896054 5226709 4903070 3852236
10724C852236j220886o90933r4466K93135J330339K898016K602857o24135l547975
$$ 3852236 2631350 1940417 1845951 2139086 3469425 6367441 8970298 8346163 4798188
10715D798188k954334r62835j447850l098827j705644J937627K827358J91808
$$ 4798188 1843854 881019 -566831 -3665658 -5371302 -3433675 -606317 -414509
10707d14509j324148M79274K414073J942207N82968M229k95131l58500N74094
$$ -414509 -1738657 -1259383 1154690 3096897 3679865 3684094 3388963 3030463 3604557
10698C604557J306903J12678j349447m76044Q83647o30360k768403o65072L798850
$$ 3604557 4911460 5024138 3674691 3198647 4082294 3451934 683531 18459 3817309
10689C817309L836721q61979l331927j025152P51704q16995j470858J104587K505694
$$ 3817309 7654030 6792051 3460124 2434972 3186676 2369681 898823 2003410 4509104
10680D509104Q0760j942603m81494Q06125j028294k295502L09756L174470K045053
$$ 4509104 4589864 2647261 2165767 2971892 1943598 -351904 -42148 3132322 5177375
10671E177375o89349o83852J139891J408895K39450m11394o87634j167675q31783
$$ 5177375 4488026 3804174 4944065 6352960 6592410 6181016 5493382 4325707 3493924
10662C493924K30884M5257r99688M3302K579169K078857j823848l585295j153893
$$ 3493924 3724808 3770065 2770377 2813679 5392848 7471705 5647857 2062562 908669
10653I08669K47146k249125l460105N32661M698763L270312o40699q20334J784338
$$ 908669 1155815 -1093310 -4553415 -4020754 678009 3948321 3307622 2487288 4271626
10644D271626J983577l76614j293148j83933j20376j950751l266204k280597N66479
$$ 4271626 6255203 5878589 4585441 4401508 4281132 2330381 -935823 -3216420 -2649941
10635b649941L481627L960406J076043j894743r13412K262261K219810r32942
$$ -2649941 831686 4792092 5868135 3973392 3059980 5322241 7542051 6609109
10627F609109j460582J663284K538823r01159k747975J46125K126666j060780
$$ 6609109 5148527 6811811 9350634 8449475 5701500 5847625 7974291 6913511
10619F913511m326039k073251K324920K935056Q48037L59973J075866N15648k61229
$$ 6913511 2587472 514221 2839141 5774197 6622234 6982207 8058073 8573721 8312492
10610H312492L33533M17745j159246j600065K49730P91038j387402j916972J273423
$$ 8312492 8646025 9063770 7904524 6304459 6554189 7345227 5957825 4040853 5314276
10601E314276L279297P64429k060583j387772j71064r45799m06025K729335L001127
$$ 5314276 8593573 9358002 7297419 5909647 5738583 4792784 4386759 7116094 10117221
10592A0117221j775416m538266o17219L488189J316604k406967j067878J959810
$$ 10117221 8341805 3803539 3186320 6674509 7991113 5584146 4516268 6476078
10584F476078Q31116j358722N94506L014227K59804l843415k603644J336426J312537
$$ 6476078 7307194 5948472 6542978 9557205 9817009 5973594 3369950 4706376 6018913
10575F018913j314194j160446M00591q54887k355787L91308M017908K712206j159196
$$ 6018913 4704719 3544273 3944864 3089977 734190 1125498 5143406 7855612 6696416
10566F696416j726258p7772l83682q00527J916744M066641J162318k901024k453191
$$ 6696416 4970158 4892386 4508704 3708177 5624921 9691562 10853880 7952856 5499665
10557E499665r1223o75049j733359M00550J853743j238447l789352p81304K617403
$$ 5499665 5408442 4733393 3000034 3400584 5254327 4015880 226528 -554776 2062627
10548B062627P07238j552121J507128M307633N89041l414375R9666N564731M139964
$$ 2062627 2769865 1217744 2724872 7032505 7621546 4207171 4306837 9871568 14011532
10539A4011532m26877m93629N31596k908738m817227R30896N839740P90370n767795
$$ 14011532 13584655 13091026 13622622 10713884 5896657 6827553 12667293 13457663 7689868
10530G689868k080140N189332L357150k758236j018778M408061K029107l828074
$$ 7689868 5609728 10799060 14156210 11397974 10379196 14787257 16816364 12988290
10522A2988290j947791K886302l92829n904994j798787N320911K488829l564017
$$ 12988290 11040499 13926801 13533972 7628978 5830191 11151102 13639931 10075914
10514A0075914N05344O874576J151158p254105j406910Q735283L310883q256109
$$ 10075914 10581258 17455834 18606992 11352887 9945977 18681260 21992143 13736034
10506A3736034l590095R003274N507361o534726k094724J0674561N002481r179899
$$ 13736034 10145939 19149213 24656574 18121848 16027124 26701685 31704166 22524267
10498B2524267j497455J6202885Q094659j1935815P673K7875122J5199746j9738966
$$ 22524267 21026812 37229697 45324356 33388541 33396214 61271336 76471082 56732116
10490E6732116K546250O6002103M1214812j07492650k17171862j37567887M4339405
$$ 56732116 59278366 125280469 166495281 59002631 -158169231 -295737118 -251397713
10483b51397713J22869586N6125630j4765506p45667L3599940J8352183j1062408
$$ -251397713 -128528127 -72402497 -87168003 -87913670 -54313730 -35961547 -47023955
10476d7023955k739488J8460258J0697476p746489k819094J0522700L842425r038670
$$ -47023955 -49763443 -31303185 -20605709 -28352198 -31171292 -20648592 -16806167 -25844837
10468b5844837k494281J0878384O586434n551029l295379N787665K541199n846079
$$ -25844837 -28339118 -17460734 -10874300 -16425329 -19720708 -13933043 -11391844 -17237923
10460a7237923k137444O222921K473458o250140k872358O940670O021275k608184
$$ -17237923 -19375367 -13152446 -10678988 -16929128 -19801486 -12860816 -6839541 -9447725
10452i447725l342726K906502L298344j691263j608199K404775J226012l057169
$$ -9447725 -12790451 -9883949 -6585605 -8276868 -9885067 -7480292 -6254280 -9311449
10444i311449j369319M260782M587995J12368j662544o74125j665818k802640
$$ -9311449 -10680768 -6419986 -1831991 -1719623 -3382167 -4056292 -5722110 -8524750
10436h524750k25155K082668n90489l278299O4608M634203L150572j143832j426578
$$ -8524750 -8749905 -6667237 -7257726 -10536025 -10471417 -5837214 -2686642 -3830474 -5257052
10427e257052J93377j391880l276019r03358J835058L0024k106120N10393L213305
$$ -5257052 -5063675 -6455555 -9731574 -10634932 -8799874 -8769850 -10875970 -10365577 -7152272
10418g152272M60568k653917L49510M379731J746581l056753r80168N045935M946812
$$ -7152272 -6691704 -9345621 -8996111 -4616380 -2869799 -5926552 -6906720 -1860785 3086027
10409C086027j282537m420212j492688J578692J287414R4369l57607j005496j404715
$$ 3086027 1803490 -2616722 -4109410 -2530718 -1243304 -1148935 -1506542 -2512038 -3916753
10400c916753o45362j66262n29217P51495L531909K995997j569623l220483J217780
$$ -3916753 -4562115 -4728377 -5257594 -4506099 -974190 2021807 452184 -2768299 -1550519
10391a550519M341578L88775m238098j832155L321874K992396p92465r31795J273651
$$ -1550519 2791059 3179834 -1058264 -2890419 431455 3423851 2631386 1699591 2973242
10382B973242l57472m359473m256501o09166M51153j556970j710087O59575J671272
$$ 2973242 2615770 -1743703 -6000204 -6609370 -6158217 -7715187 -9425274 -8765699 -7094427
10373g094427P60022P29326J518197J033141J47437M96147J52593k401798l700063
$$ -7094427 -6334405 -5605079 -4086882 -3053741 -2906304 -2410157 -2257564 -4659362 -8359425
10364h359425r03057K301393J813373K69619J317941K175756n74683l297151j603026
$$ -8359425 -9262482 -6961089 -5147716 -4878097 -3560156 -1384400 -1959083 -5256234 -6859260
10355f859260J054036k78150k472560l06769L169522K140776q52176K71045L370321
$$ -6859260 -5805224 -6083374 -8555934 -8862703 -5693181 -3552405 -4404581 -4133536 -763215
10346g63215K031731k150134k376771Q44832J116372j741589j954383R28468J666837
$$ -763215 1268516 -881618 -3258389 -2413557 -1297185 -3038774 -4993157 -4064689 -2397852
10337b397852k46971k9559K543370K521014n82292j795896l7831K69922k157744
$$ -2397852 -2644823 -2674382 -131012 2390002 1807710 11814 -26017 243905 -1913839
10328a913839l314426j395380Q65258J992993L104841L386374R93286j839430
$$ -1913839 -5228265 -6623645 -5758387 -3765394 -660553 2725821 3719107 1879677
10320A879677j366984O85950k69626l118147k707058O95170J685334p21483j910406
$$ 1879677 512693 1198643 929017 -2189130 -4896188 -4201018 -2515684 -3237167 -5147573
10311e147573l36312N45379l03256J27778K031366J682674j315645k522588r8612
$$ -5147573 -5483885 -4938506 -5241762 -5113984 -3082618 -1399944 -2715589 -5238177 -5336789
10302e336789K341370J894811l3236j447361k051546j196175J578593L731805
$$ -5336789 -2995419 -1100608 -1133844 -2581205 -4632751 -5828926 -4250333 -518528
10294e18528K260004j127954k115581l75213Q41163N86528M42464J64099j398552
$$ -518528 1741476 613522 -1502059 -1877272 -1036109 -449581 -7117 156982 -1241570
10285a241570k462878r97586N56026q67596k656348o41122K901852K728039j55639
$$ -1241570 -3704448 -4702034 -4146008 -5013604 -7669952 -8311074 -5409222 -2681183 -2836822
10276b836822p61523M39526q73255l388807j816492K620706L150276q12442k617540
$$ -2836822 -3598345 -3158819 -4032074 -7420881 -9237373 -6616667 -3466391 -4278833 -6896373
10267f896373k2453J751288J90253p28794Q85809J569905L27539Q78688L335105
$$ -6896373 -6918826 -5167538 -4977285 -5706079 -4820270 -3250365 -2922826 -2044138 1290967
10258A290967K495183k295567m378342p77453K528992Q42719j843190q29887J356949
$$ 1290967 3786150 1490583 -2887759 -3665212 -1136220 -293501 -2136691 -2966578 -1609629
10249a609629P97263n65684M64418J905853O75438j407375j143733L79116N36419
$$ -1609629 -812366 -1378050 -913632 992221 1667659 260284 -883449 -504333 32086
10240C2086K7756N16188P53741p50754k277258j888940q86382q76399n74679J064990
$$ 32086 59842 576030 1329771 579017 -1698241 -3587181 -4473563 -5349962 -5924641 -4859651
10230d859651J776334k70883k503369j526433J557809K978375J739996M5322m86205
$$ -4859651 -3083317 -3354200 -5857569 -7384002 -5826193 -2847818 -1107822 -1062500 -1548705
10221a548705k37730Q2031M13074P93189R08901K38446j194975j979460n38025
$$ -1548705 -1786435 -1704404 -1291330 -498141 410760 649206 -545769 -2525229 -3063254
10212c063254J932873K003725p79488k219988K27773K987500K154496k274L76448
$$ -3063254 -1130381 873344 93856 -2126132 -1898359 1089141 3243637 3241363 3617811
10203C617811J341353r38175l902308k240270K104216K197553k288667m462975
$$ 3617811 4959164 4020989 118681 -2121589 -17373 2180180 -108487 -4571462
10195d571462j500771J933698K458206J941397J467087n68536k830314j510537
$$ -4571462 -6072233 -4138535 -1680329 261068 1728155 1159619 -1670695 -3181232
10187c181232J995173J934652j733215k665295O04651J894826j376986l488214
$$ -3181232 -1186059 748593 -984622 -3649917 -3045266 -1150440 -2527426 -6015640
10179f015640p27043K468993K051575P05323J140616J077333n36719k70690K298658
$$ -6015640 -6742683 -4273690 -2222115 -1516792 -376176 701157 164438 -106252 2192406
10170B192406K041163k093144l536558N72065L542638O87030k457820n73005J822742
$$ 2192406 4233569 2140425 -1396133 -824068 2718570 3405600 947780 374775 2197517
10161B197517n41842l501931j605777J300760l30786k538953Q97354N838144L942498
$$ 2197517 1655675 -1846256 -3452033 -2151273 -2482059 -5021012 -4123658 1714486 5656984
10152E656984k828856n355025k054049O25368L90659J004616K942822K302766
$$ 5656984 2828128 -2526897 -4580946 -3955578 -3564919 -2560303 382519 2685285
10144B685285q87969k192671q09725j85332p94871Q6087J857773J368744l59017
$$ 2685285 1797316 -395355 -1205080 -1390412 -2185283 -2099196 -241423 1127321 768304
10135G68304L34146K239637J059634k060782j988294Q30183Q94392k082824k450013
$$ 768304 1102450 3342087 4401721 2340939 352645 1182828 2077220 -5604 -2455617
10126b455617P66689J679585j766677l747461o50152K818660J980317l45571K62935
$$ -2455617 -1688928 -9343 -1776020 -5523481 -6173633 -3354973 -1374656 -1720227 -1457292
10117a457292K206082J544889r32672j587118j00663P54635j48963j272485j109905
$$ -1457292 748790 2293679 1361007 -226111 -326774 427861 278898 -993587 -2103492
10108b103492L45362J930934J974559r1150k335500k329734n60494M42894J51464
$$ -2103492 -1758130 172804 2147363 2056213 -279287 -2609021 -3169515 -2726621 -2575157
10099b575157K62641R99379O80363o22112o25503J073324J914744O04518p80572
$$ -2575157 -2312516 -1313137 -632774 -1254886 -1880389 -807065 1107679 1712197 931625
10090I31625l89664N74240L20460o17682p39980j47455j28538j113757k067517
$$ 931625 541961 1116201 1436661 818979 78999 -68456 -196994 -1310751 -3378268
10081c378268j574688M99651K209010J430653q33160j044780J606171L150116
$$ -3378268 -4952956 -4453305 -2244295 -813642 -1646802 -2691582 -1085411 2064705
10073B064705N40269l266199l510680p38407N79112r24221k385985j864518k27811
$$ 2064705 2604974 -661225 -4171905 -4910312 -4331200 -5255421 -7641406 -9505924 -9733735
10064i733735J700990L675054L974519J033418k899780l718148j087250J610495
$$ -9733735 -8032745 -4357691 -383172 650246 -2249534 -5967682 -7054932 -5444437
10056e444437K552848K614610J786740p77599l183657k247711R71823J950541
$$ -5444437 -2891589 -276979 1509761 732162 -2451495 -4699206 -3727383 -1776842
10048a776842k87785j830467m97769J218246J207157P53438P56563j74844j813517
$$ -1776842 -2064627 -3895094 -4392863 -3174617 -1967460 -1214022 -457459 -632303 -2445820
10039b445820j387223J031434J203401k132120l775642R5861M949971M001570
$$ -2445820 -3833043 -2801609 -1598208 -3730328 -7505970 -7410109 -2460138 1541432
10031A541432j645372m612574j695944K660839L515413J464670L0104K19461J11074
$$ 1541432 -103940 -4716514 -6412458 -3751619 -236206 1228464 1258568 1478029 1589103
10022A589103j322203k204899l27183L147770M209062J024376l014586l190057
$$ 1589103 266900 -1937999 -2265182 882588 5091650 6116026 3101440 -88617
10014h8617L67290K833055J030562k805449m283085j944650J784590L460627J841490
$$ -88617 278673 3111728 4142290 1336841 -2946244 -4890894 -3106304 354323 2195813
10005B195813r66496j681973J64433J473930L2816k039204j602038N07363J123391
$$ 2195813 1229317 -452656 -288223 1185707 1218523 -820681 -2422719 -1915356 -791965
9996g91965J62846L63503K025059K297461K33861j462253q84674L57503K45707
$$ -791965 -629119 -265616 1759443 4056904 4290765 2828512 1943838 2301341 2547048
9987B547048p92475j487018j606955j060439N29826K333906K538732Q45505j152118
$$ 2547048 1754573 267555 -1339400 -2399839 -1870013 463893 3002625 3848130 2696012
9978B696012k312068k625886j848936k4195J009221l47939k211802j335110J738606
$$ 2696012 383944 -2241942 -4090878 -4115073 -3105852 -3453791 -5665593 -7000703 -5262097
9969e262097L255100J932812K35185j64291j95000l34106K56275J114742Q76683
$$ -5262097 -2006997 -74185 161000 -3291 -198291 -532397 -276122 838620 1715303
9960A715303L58348J132268J466289j276057m626926l577506O95538J748533j427216
$$ 1715303 2073651 3205919 4672208 3396151 -1230775 -4808281 -4112743 -2364210 -3791426
9951c791426k472220J228163L788581J176504j735185o371K780576J518480j131257
$$ -3791426 -6263646 -5035483 -1246902 -70398 -1805583 -1811954 968622 2487102 1355845
9942A355845j25888K354883R78360k799097l329896q02826k27657j815238q04576
$$ 1355845 1229957 3584840 4563200 1764103 -1565793 -2368619 -2596276 -4411514 -5216090
9933e216090L171900M553363R76335k975288l194471j410450o75447l99115J103384
$$ -5216090 -2044190 2509173 3485508 510220 -2684251 -4094701 -4770148 -5169263 -4065879
9924d065879K627384J782398j085046k939175j531228J975845L801770J586552
$$ -4065879 -1438495 343903 -741143 -3680318 -5211546 -3235701 566069 2152621
9916B152621k206854k813067K61737K206242Q1838k703381k063979L98168Q83530
$$ 2152621 -54233 -2867300 -2605563 -399321 -317483 -3020864 -5084843 -4686675 -3803145
9907c803145n0183N29146J945586J401350l40378k81659J063470O87664j094804
$$ -3803145 -3853328 -3324182 -1378596 22754 -317624 -599283 464187 1151851 57047
9898E7047j248579K54743O15833m10269m97048M03945K93613m82343j93804J9262
$$ 57047 -1191532 -936789 -320956 -731225 -1228273 -824328 -530715 -1013058 -1206862 -1187600
9888a187600j646642k760782l07196K586833J117651j763748M55095N329401M126633
$$ -1187600 -2834242 -5595024 -5902220 -3315387 -2197736 -3961484 -3506389 1823012 5949645
9879E949645k544814m358425P76165K230706l992579n833768M661401J4660089
$$ 5949645 3404831 -953594 -177429 2053277 -1939302 -7773070 -3111669 11548420
9871A1548420Q495450o878887j1284025j431290O012545J203396o130539m880901
$$ 11548420 20043870 13164983 1880958 449668 6462213 7665609 1535070 -3345831
9863c345831J231195L094887P11344n30105k80860j184826j705428P89507L311517
$$ -3345831 -2114636 980251 1691595 1161490 880630 -304196 -2009624 -1220117 2091400
9854B091400J225192l265319l669275P73946M118144K790109j92580j107456n64221
$$ 2091400 3316592 51273 -3618002 -2844056 1274088 4064197 3871617 2764161 2199940
9845B199940o85014j194053q67658k33613l05509l63350O41896J598057N44952
$$ 2199940 1514926 320873 -546785 -780398 -1085907 -1449257 -807361 790696 1335648
9836A335648j882669k641527m60544K033622J683893q69494k068101l78650J688088
$$ 1335648 -547021 -3188548 -3649092 -1615470 68423 -801071 -2869172 -3247822 -1559734
9827a559734J269490r04250j893211p84894N65840P46024M98116P12909P43103
$$ -1559734 -290244 -1194494 -3087705 -3872599 -3306759 -2560735 -2062619 -1349710 -606607
9818f06607o7812o95867R2874J471413J510408J09272p51961N1408J143272P36635
$$ -606607 -674419 -1370286 -1277412 194001 1704409 1813681 1061720 1113128 2256400 2993035
9808B993035p73481j492355p04207M45925Q45897O81819M85661J59389l27676
$$ 2993035 2219554 727199 22992 468917 1314814 1996633 2482294 2641683 2314007
9799B314007l66192J19325r2961j664402k856983j499822J478679K728640J060888
$$ 2314007 1947815 2067140 1974179 309777 -2547206 -4047028 -2568349 160291 1221179
9790A221179r26845q02025K81637j75063j959326k484123n11622K283238L332098
$$ 1221179 294334 -507691 -226054 -401117 -2360443 -4844566 -5356188 -3072950 259148
9781B59148J628960j538338l555782k776745l95691R32469O41705O20417J465713
$$ 259148 1888108 349770 -3206012 -5982757 -6378448 -5445979 -4804274 -4183857 -2718144
9772b718144J171952p91794j318348J387239L657695J453552k653910k892665
$$ -2718144 -1546192 -2337986 -3656334 -2269095 1388600 2842152 188242 -2704423
9764b704423N68513J958089n80542k291789j89456K179136J320281m89500r638
$$ -2704423 -2135910 -177821 -758363 -3050152 -3239608 -1060472 259809 -229691 -239329
9755b39329J257105O62988l85454L29170R82926p46055k527378j338180M31971
$$ -239329 1017776 1680764 1295310 1624480 2607406 1861351 -666027 -2004207 -1572236
9746a572236r18928k882189o13168L518989K649263k666415m275325L55396L817824
$$ -1572236 -2491164 -5373353 -5986521 -2467532 181731 -2484684 -6760009 -6404613 -2586789
9737b586789R99063k969923k103466P78229M14883j213648N72943L567306K167934
$$ -2586789 -1587726 -4557649 -6661115 -5882886 -5468003 -6681651 -6108708 -2541402 -373468
9728c73468k257227l019014R18889L604705J916056n98772p19128K25350O74491
$$ -373468 -2630695 -5649709 -4730820 -1126115 789941 191169 -527959 -302609 371882
9719C71882J351819J667898o20464m064906l603881J298974M241674J153264l289126
$$ 371882 1723701 3391599 2771135 -1293771 -4897652 -3598678 642996 1796260 -1492866
9710a492866k916245Q81487K581803J361824O54224J180887L78126k063700l334857
$$ -1492866 -4409111 -3527624 -945821 416003 1070227 2251114 2629240 565540 -2769317
9701b769317k191634k84533J154086K168825J933261k93567k231826q18064K404139
$$ -2769317 -4960951 -5245484 -4091398 -1922573 10688 -282879 -2514705 -3332769 -928630
9692i28630K565372j053177l421049j330710J870434J852203k05363l60306J522799
$$ -928630 1636742 583565 -2837484 -4168194 -2297760 -445557 -650920 -1011226 511573
9683E11573K110734K80684j444870j120254J12424L95810k53310o71019l65463
$$ 511573 2622307 2902991 1458121 337867 450291 846101 592791 -78228 -443691
9674d43691K89469P83640P27376m3991j111007j546281p50306Q45655K094875
$$ -443691 -154222 629418 1356794 1312803 201796 -1344485 -2094791 -1249136 845739
9665H45739K206903J432619N49446j53651q13107r78428J39924J819459J711359
$$ 845739 3052642 4485261 5034707 4881056 4067949 3089521 3229445 5048904 6760263
9656F760263r62436l410681k629097K00958J387747K46333m18596N02690O62261
$$ 6760263 5797827 2387146 -241951 -40993 1346754 1593087 1174491 1677181 2339442
9647B339442j027634j820174K42994K448493J394721j657644k941540j769941
$$ 2339442 1311808 -508366 -265372 2183121 3577842 1920198 -1021342 -2791283
9639b791283l28369N58651J568663J933093M77192j054768J982K181192J421799
$$ -2791283 -3119652 -2561001 -992338 940755 1417947 363179 365161 2546353 3968152
9630C968152k067862l456552r99631J003287o56970k768522j104426K622529L589375
$$ 3968152 1900290 -1556262 -2555893 -1552606 -2209576 -4978098 -6082524 -3459995 129380
9621A29380J220036p09560q0987J417859J728929P88168m84700j211747q74985
$$ 129380 1349416 639856 558869 1976728 3705657 4493825 4009125 2797378 1922393
9612A922393l18344j333517l478703l286276O75119M147723K463371k144285l244786
$$ 1922393 1604049 270532 -3208171 -6494447 -5819328 -1671605 791766 -1352519 -4597305
9603d597305L73113L138677J172891k664255l898352k222559K04967K494656M226761
$$ -4597305 -4224192 -1085515 87376 -2576879 -6475231 -8697790 -8492823 -5998167 -1771406
9594a771406L920748J319689r98651r87800j62023p66271j924945j392470N42228
$$ -1771406 2149342 3469031 2470380 1482580 1320557 554286 -1370659 -2763129 -2220901
9585b220901J814900J968248J953151J606442J51707j530252j817411r97165n91169
$$ -2220901 -406001 1562247 3515398 5121840 5273547 3743295 1925884 928719 337550
9576C37550p00628m63339l45885j220067j864592n18015J472195J010963j610720
$$ 337550 -363078 -826417 -1172302 -2392369 -4256961 -4774976 -3302781 -2291818 -3902538
9567c902538k576790l28025K092664J929252O04574O07940J380307J018810o3286
$$ -3902538 -6479328 -6807353 -4714689 -2785437 -2180863 -1572923 -192616 826194 762908
9558G62908j78108L10639k95372j694366j855120n07616L20351l47586j013983
$$ 762908 584800 895439 600067 -1094299 -2949419 -3457035 -3136684 -3484270 -4498253
9549d498253n39581j61006j090526j835133k24382K649932L206699N53230j654954
$$ -4498253 -5037834 -5198840 -6289366 -8124499 -8348881 -5698949 -2492250 -1939020 -3593974
9540c593974k00150K829362K905682j67968j888793N2267K219352Q60708k230161
$$ -3593974 -3794124 -964762 1940920 1772952 -115841 -63574 2155778 3016486 786325
9531G86325k610534Q2437K235902K140799J583410J532706M97912j722551k593258
$$ 786325 -1824209 -1741772 494130 2634929 4218339 5751045 6248957 4526406 1933148
9522A933148j052112K34119p99672k058496r28370J145816J149218m19185p51416
$$ 1933148 881036 1115155 315483 -1743013 -2671383 -1525567 -376349 -795534 -1546950
9513a546950K65863L07322o53609q0906K231370L074032R95458j012114r0008
$$ -1546950 -1281087 -973765 -1627374 -1708280 523090 3597122 4592580 3580466 3490458
9504C490458K108363K184874L1720j681660j698896j099224p62489m98537m44224
$$ 3490458 5598821 7783695 7815415 6133755 4434859 3335635 2573146 2074609 1630385
9495A630385r82338j284927j74475J415742J187086q37504j869223o41074M19828
$$ 1630385 648047 -636880 -811355 604387 1791473 953969 -915254 -1556328 -1136500
9486a136500q20387k341536r43089K350095L298503O56818j989472j402564J162691
$$ -1136500 -1956887 -4298423 -5241512 -2891417 407086 1063904 -925568 -2328132 -1165441
9477a165441K401586J251517r01114k427543k188802K04059L056549L223688J38650
$$ -1165441 1236145 2487662 1586548 -840995 -3029797 -2825738 230811 3454499 3593149
9468C593149k489811j467892J087420R08224j805739k890092r07218R97824N81891
$$ 3593149 1103338 -364554 722866 1631090 -174649 -3064741 -3971959 -2974135 -2392244
9459b392244l70577M3287O60442K06717L8590J208907J773367J98385j131488
$$ -2392244 -2762821 -2719534 -2059092 -1852375 -1813785 -604878 1168489 1366874 235386
9450B35386M58503K790327J607402k502124m413350j835345J723561K370685O98732
$$ 235386 693889 3484216 5091618 2589494 -1823856 -3659201 -1935640 435045 1133777
9441A133777m26030k18202j2939n65811j184940q98783M74836J895620J596349
$$ 1133777 707747 489545 476606 -89205 -1274145 -2172928 -1698092 197528 1793877
9432A793877r16263l391226k932375K44360K868598K719170P71001j133873k445918
$$ 1793877 877614 -2513612 -5445987 -5201627 -2333029 386141 1157142 23269 -2422649
9423b422649k850267j512831J011047K223242R98830l23325O69005K606158K473402
$$ -2422649 -5272916 -6785747 -5774700 -3551458 -2552628 -2875953 -2206948 399210 2872612
9414B872612L74929q48195j98056M31892q8190n18052q4738m8700j044448j389078
$$ 2872612 3247541 2399346 2201290 2633182 2544992 2026940 1942202 1893502 849054 -540024
9404e40024M8473J404362O17426r40140m59455J587401J914552l33451k007682
$$ -540024 -491551 912811 1530237 590097 130642 1718043 3632595 3299144 1291462
9395A291462p47247J429120J343995n34273j133853L74453J573772O89805j003829
$$ 1291462 544215 1973335 3317330 2783057 1649204 2023657 3597429 4287234 3283405
9386C283405j490312q13059l36894m91885o29868m33502k17307j00399J35759
$$ 3283405 1793093 980034 643140 151255 -478613 -912115 -1129422 -1229821 -1094062
9377a094062M10932K60274n44574j602980k059473j163733R08653K748284K902289
$$ -1094062 -683130 -422856 -967430 -2570410 -4629883 -5793616 -4884963 -2136679 765610
9368G65610J558632K87047o5428j89505p05593j064009p88401n01311o65684n35546
$$ 765610 2324242 2611289 2545861 2356356 1650763 586754 -201647 -702958 -1368642 -1904188
9358a904188L98918J117370O51184k21185m58765o29801j316994j055045J441903
$$ -1904188 -1505270 -387900 263284 42099 -416666 -1046467 -2363461 -3418506 -1976603
9349a976603M029980L374751M6112k078935j569691q68981j357782j095574Q82927
$$ -1976603 2053377 5428128 5474240 3395305 1825614 956633 -401149 -1496723 -613796
9340f13796J976532L38377j531293o60854J568335J831501n960j536656j797257
$$ -613796 1362736 1701113 169820 -491034 1077301 2908802 2902842 1366186 -431071
9331d31071j240172M93893L093554L594137J49006l579096k650235J343270K159349
$$ -431071 -1671243 -1177350 1916204 5510341 5659347 2080251 -569984 773286 2932635
9322B932635j387150l631200j296797J599346R24907j056120m80942J326982Q36155
$$ 2932635 1545485 -2085715 -3382512 -1783166 -858259 -1914379 -2395321 -1068339 -232184
9313b32184j179853j338077K54663O98347k18887j60811Q48216M62070j165031
$$ -232184 -1412037 -2750114 -2495451 -1797104 -2015991 -2176802 -1328586 -866516 -2031547
9304b031547j234859O04641J455150L30342j44593J380981K408144R44950j046466
$$ -2031547 -3266406 -2661765 -1206615 -876273 -1020866 360115 2768259 3713209 2666743
9295B666743j055999o2466m32846j864172k148463o96356R92778J557243Q40717
$$ 2666743 1610744 1548278 1115432 -748740 -2897203 -3593559 -2600781 -1043538 -202821
9286b02821m21010q54276M53336K212567J885787o57452k439455j604325o0464
$$ -202821 -623831 -1478107 -1024771 1187796 3073583 2416131 -23324 -1627649 -1688113
9277a688113r7561p22783J41143J801446K086439J055763L74636J7882j269791
$$ -1688113 -1785674 -2508457 -2367314 -565868 1520571 2576334 2950970 2968852 1699061
9268A699061k849550k682205q04926N85870N85466L92565N65550K61411m15947
$$ 1699061 -1150489 -3832694 -4637620 -4051750 -3466284 -3073719 -2508169 -2246758 -2662705
9259b662705q6452J191925J499291K72721n24277L76263J453860R88282k52823
$$ -2662705 -2749157 -1557232 -57941 214780 -309497 66766 1520626 2508908 2256085
9250B256085o08023k41451m74334j416563j885933j150277L85257J763221K013880
$$ 2256085 1648062 1406611 932277 -484286 -2370219 -3520496 -3135239 -1372018 641862
9241F41862P93295q41412j073821N04657K055636J578994o65037k473623k160861
$$ 641862 1435157 593745 -480076 24581 2080217 3659211 2994174 520551 -1640310
9232a640310k96688R34089J54309j424773j387303L99344J145331p91512k888759
$$ -1640310 -1936998 -1002909 -848600 -2273373 -3660676 -3261332 -2116001 -2907513 -5796272
9223e796272j820256J462925L097586K086172J109731J508480J405353j77088
$$ -5796272 -7616528 -6153603 -3056017 -969845 139886 1648366 3053719 2876631
9215B876631j253546p35344o89573k270076k748485J72313L778258L787415N43685
$$ 2876631 1623085 887741 198168 -2071908 -4820393 -4648080 -869822 2917593 3461278
9206C461278j968790k076853j590082j590786q61617J058120K386630J674062
$$ 3461278 1492488 -584365 -2174447 -3765233 -4626850 -3568730 -1182100 491962
9198D91962k40723j622859j653725m70816J210603K260576K034165J109845L14485
$$ 491962 251239 -1371620 -3025345 -3496161 -2285558 -24982 2009183 3119028 3433513
9189C433513l82907j025428q27698L22692P50436o35824k004036j058247J083434
$$ 3433513 3050606 2025178 1197480 1520172 2270608 1634784 -369252 -1427499 -344065
9180c44065J313034o35704j836439p24524J013829J632119J532943J363346N32782
$$ -344065 968969 333265 -1503174 -2227698 -1213869 418250 1951193 3314539 3847321
9171C847321j067697k047586j615916r17814r86225j002047M3635J366554J517927
$$ 3847321 2779624 732038 -883878 -1801692 -2787917 -3789964 -3746329 -2379775 -861848
9162h61848N12995m15256n10785k9700L66047J74568m74281p57216k50059J63482
$$ -861848 -348853 -764109 -1274894 -1304594 -938547 -763979 -1238260 -1995476 -2245535 -2082053
9152b082053l83797r02924K24793K312325K792377R16846j140867j524071q72215
$$ -2082053 -2465850 -3368774 -3143981 -831656 1960721 2877567 1736700 212629 -659586
9143f59586m11829r9303J51866m20920j590255j468558N42505K049280R93871
$$ -659586 -1071415 -1170718 -1018852 -1439772 -3030027 -4498585 -3956080 -1906800 -912929
9134i12929j023598j150312L88024J081043L42423k7629O48418Q71761q5615p32578
$$ -912929 -1936527 -3086839 -2698815 -1617772 -1275349 -1302978 -654560 217201 131586 -600992
9124f00992R8620J260369J187589L46902K54862Q78514O29928j088778k647249
$$ -600992 -502372 757997 1945586 2292488 2547350 3425864 4055792 2967014 319765
9115C19765k145058j5202J228761K7890k149115k489164k92451K221003K714160
$$ 319765 -1825293 -1840495 -611734 -583844 -2732959 -5222123 -5514574 -3293571 -579411
9106e79411J385829K71500N79178J477594J358529j52453j553116j060909R05261
$$ -579411 806418 1077918 1657096 3134690 4493219 4340766 2787650 1726741 2632002
9097B632002J576058p44311l744325l546775j23204K168534M83224k480598k393548
$$ 2632002 4208060 3463749 -280576 -3827351 -3950555 -1782021 -1298797 -3779395 -6172943
9088f172943N77349K351923Q76601j451003j594020L48377K148312K486704J765602
$$ -6172943 -5595594 -3243671 -2367070 -3818073 -5412093 -5063716 -2915404 -428700 1336902
9079A336902Q95896L53753K6449n68391j596427k333580j882254m98822O13043
$$ 1336902 2232798 2586551 2613000 2044609 448182 -1885398 -3767652 -4266474 -3653431
9070c653431R16500R17655P17608m38473k376345l080040j052118K114802L246087
$$ -3653431 -2736931 -1819276 -1101668 -1540141 -3916486 -6996526 -8048644 -5933842 -2687755
9061b687755J594133l27398k94839R29622J445485J197404J300618J326640k90294
$$ -2687755 -1093622 -1421020 -1715859 -786237 659248 1856652 3157270 4483910 4193616
9052D193616l016494l887212j555295J389207J928165Q11880Q62134K143718J879343
$$ 4193616 1177122 -2710090 -4265385 -2876178 -948013 -136133 726001 2869719 4749062
9043D749062p45598k795724j851413M30660R86743j59143m65686Q96668J894348
$$ 4749062 4003464 1207740 -643673 -213013 773730 614587 148901 1045569 2939917
9034B939917R00735r30520j462500m54272N00562L16694m50063q42478q89214
$$ 2939917 3840652 2910132 1447632 993360 1493922 1810616 1360553 518075 -371139
9025c71139j113783j219617l58137J191483J799760O80363o74032l97330J118723
$$ -371139 -1484922 -2704539 -3062676 -1871193 -71433 608930 -65102 -462432 656291
9016F56291J897577J191775K213r23585j696696j851327m94387J512792J707844
$$ 656291 2553868 3745643 3747856 2824271 1127575 -723752 -1218139 294653 2002497
9007B002497n09310k516273k020050k06829M44329k8719L28895J900882K930530
$$ 2002497 1493187 -1023086 -3043136 -3249965 -2805636 -2834355 -2505460 -604578 2325952
8998B325952K220515N06246r14045j475761j284489r02263r94016j267174m53043
$$ 2325952 4546467 5052713 4138668 2662907 1378418 476155 -517861 -1785035 -2238078
8989b238078J530342K533954J079064q51440m61548J202286N23091k691711m192181
$$ -2238078 -707736 1826218 2905282 2053842 1592294 2794580 3317671 625960 -3566221
8980c566221j557927J980642K347939L84982l73001M01367Q1225j620724j852976
$$ -3566221 -5124148 -3143506 -795567 -410585 -783586 -382219 -300994 -1921718 -3774694
8971c774694K88184J722743J85740k013950j509136J080397K498368J788836P46922
$$ -3774694 -3486510 -1763767 -1578027 -3591977 -5101113 -4020716 -1522348 266488 1013410
8962A013410J86113q57043k070427j434707J090555K489735J017421r87197p41336
$$ 1013410 1199523 342480 -1727947 -3162654 -2072099 417636 1435057 447860 -293476
8953b93476P87159R07279m18202j199147j102878j312554j509436k94335J712559
$$ -293476 493683 1400962 982760 -216387 -1319265 -2631819 -4141255 -4435590 -2723031
8944b723031K415656J764526J498602J506027J12987j836392j438142Q87636J080399
$$ -2723031 -307375 1457151 2955753 4461780 4574767 2738375 1300233 2187869 3268268
8935C268268j769387l100667j73620K926087J568555k051061k695929k78859J104387
$$ 3268268 1498881 -1601786 -1775406 1150681 2719236 668175 -2027754 -2306613 -1202226
8926a202226L72758J10478R91010J011187J23752M90598J809259J323178q41710
$$ -1202226 -829468 -718990 272020 1283207 1406959 1897557 3706816 5029994 4188284
8917D188284j233878R12934K014667J18963k026986j976262j274598j579592j201195
$$ 4188284 2954406 3867340 5882007 6000970 3973984 1997722 723124 -856468 -2057663
8908b057663J306729L610013L115675J158461K65977j44538j771701l415773k753950
$$ -2057663 -750934 2859079 5974754 7133215 7399192 7254654 5482953 2067180 -686770
8899f86770m89960P93613N47471j58288j297131k722488k144361J694580N254676
$$ -686770 -1176730 -383117 164354 6066 -1291065 -4013553 -6157914 -4463334 791342
8890G91342M107398k55673k257035n13524Q21742n64670j789181m67477J158936
$$ 791342 4898740 4643067 2386032 1872508 2694250 2129580 340399 -127078 1031858
8881A031858N01334r74174p70390L69809M54296o1293J40907Q7528j576845l099132
$$ 1031858 1533192 559018 -211372 158437 612733 551440 692347 779875 -796970 -3896102
8871c896102j681023J746527L276302J485590q60274r43707P65542J975096J454810
$$ -3896102 -5577125 -3830598 -554296 931294 71020 -872687 -107145 1867951 3322761
8862C322761k84068j866427k063100p93833O99155J221205P45526l53734j995340
$$ 3322761 3038693 1172266 -890834 -1684667 -985512 235693 981219 627485 -1367855
8853a367855l244805k142772J305419L525674J624413j854664j967552J280295
$$ -1367855 -4612660 -6755432 -5450013 -1924339 -299926 -2154590 -4122142 -2841847
8845b841847K818528L82698k025776o55613K165388K207376K08559P6545J900267
$$ -2841847 -23319 359379 -1666397 -2322010 -156622 2050754 2259313 2335858 4236125
8836D236125J704092j736304m372097k745315J085309K845682J919867J116112
$$ 4236125 5940217 4203913 -168184 -2913499 -1828190 1017492 2937359 4053471
8828D053471J769682K091400O01115j332548j724069j153228j727932l361483
$$ 4053471 5823153 7914553 8515668 7183120 5459051 4305823 2577891 -783592
8820g83592l340661l43504L056975L593984J684486L12031K54731o39736l089894
$$ -783592 -4124253 -4467757 -1410782 2183202 3867688 4179719 4434450 3794714 704820
8811G04820m388236k319890J346467L325512K971559J862667Q19109k72049q58977
$$ 704820 -3683416 -6003306 -4656839 -1331327 1640232 3502899 4322008 4049959 3190982
8802C190982m52428r4401p23835j021630M44064J880729M40995k665395l103365
$$ 3190982 2738554 2644153 1920318 898688 1342752 3223481 3664476 999081 -2104284
8793b104284m0937K076639N4382l206799l019231M04910K679347J446531j046583
$$ -2104284 -2145221 -68582 -14200 -3220999 -6240230 -5835320 -3155973 -1709442 -2756025
8784b756025j487818M83635K359472J917674k05739j242697J70675J895936J042406
$$ -2756025 -4243843 -3760208 -1400736 516938 311199 -931498 -760823 1135113 2177519
8775B177519j737019k884761r78571J425698J791951Q16738J85058l97884j788732
$$ 2177519 440500 -2444261 -3422832 -1997134 -205183 611555 796613 398729 -1390003
8766a390003k959760k440005r41076k08430j43220P42625K604461L967637L773985
$$ -1390003 -4349763 -6789768 -7730844 -7939274 -8082494 -7339869 -4735408 -767771 3006214
8757C006214K191103o7951j898272k133073j097946p27069j630664j568962J046199
$$ 3006214 5197317 5129366 3231094 1098021 75 -726994 -2357658 -3926620 -2880421
8748b880421L706499K806374q66728k956775j613536O44081J521392J927854L012747
$$ -2880421 826078 3632452 2765724 -191051 -1804587 -1160506 360886 2288740 5301487
8739E301487L273367R53589k515994l928054k426043k96089J84723p71598j334175
$$ 5301487 8574854 9528443 7012449 3084395 658352 362263 546986 -224612 -1558787
8730a558787m45711J095502J610403K96033j966100l357598k538094L73396L633550
$$ -1558787 -2004498 -908996 701407 997440 -968660 -4326258 -6864352 -6490956 -2857406
8721b857406M801815K754285r19692l283757l037991j328147L36605J506343J931291
$$ -2857406 1944409 4698694 3779002 495245 -2542746 -3870893 -3534288 -2027945 -96654
8712i6654J225005J76616M29898J750818J699214n67043k475188j933759n77576
$$ -96654 1128351 1304967 1734865 3485683 5184897 4617854 2142666 208907 -368669
8703c68669n32851m52637J624991L486356J387331l326236n029674j631437K765042
$$ -368669 -901520 -1354157 270834 3757190 5144521 1818285 -3211389 -4842826 -2077784
8694b077784L999960K638840J092603k88567j914240k625108j323918P90198J715038
$$ -2077784 1922176 4561016 5653619 5365052 3450812 825704 -498214 291984 2007022
8685B007022J109743j78194j608639k613958k232676n18882Q69287P21095j64382
$$ 2007022 3116765 2938571 1329932 -1284026 -3516702 -4035584 -3166297 -2445202 -2609584
8676b609584m32657J4888O15413J316331K100830K335756J514337o1527j765894
$$ -2609584 -3042241 -3027353 -2411940 -1095609 1005221 3340977 4855314 4793787 3027893
8667C027893k979043k925876j436559J80149N01055M1023J86485N16039l70347
$$ 3027893 48850 -2877026 -4313585 -4133436 -3632381 -3591358 -3404873 -2888834 -3259181
8658c259181j618602q59768J504009K268660O55679j68394J440235K411791P4952
$$ -3259181 -4877783 -5737551 -4233542 -1964882 -1309203 -1477597 -37362 2374429 2449381
8649B449381k802735j860150K072097M040724J924073j297617k164836o67574
$$ 2449381 -353354 -2213504 -141407 3899317 5823390 4525773 2360937 1693363
8641A693363R10636R33126m27103j719203j641663n62963j79401j096842j800961
$$ 1693363 2603999 3537125 3110022 1390819 -250844 -813807 -993208 -2090050 -3891011
8632c891011r61798M76969Q31531K09554q036N71791J077589Q86686K82563o7488
$$ -3891011 -4852809 -4375840 -3544309 -3334755 -3342791 -2771000 -1693411 -806725 -524162 -591650
8622e91650L08787J087730J025725m57928j710482p33893J326518J190041j479942
$$ -591650 -282863 804867 1830592 1372664 -337818 -1071711 254807 1444848 -35094
8613c5094l074947j459218P90444O71180o68555l68284J546372K943666L008534
$$ -35094 -3110041 -4569259 -3778815 -3107635 -3776190 -4144474 -2598102 345564 3354098
8604C354098K065113j25560k975393l834320j311965J768321J926427k4545r28880
$$ 3354098 5419211 5293651 2318258 -1516062 -2828027 -1059706 866721 842176 -86704
8595h6704n75723j125114k361047j757255R55707L115185L135294J888844J69957
$$ -86704 -662427 -1787541 -4148588 -5905843 -4950136 -1834951 1300343 3189187 3359144
8586C359144j865451k746488p07591K871551M228288K083101r28936k089313j331381
$$ 3359144 1493693 -1252795 -1960386 911165 5139453 7222554 6293618 4204305 2872924
8577B872924J5552O82554l50400k617648l413664r81670K120043K025545o54785
$$ 2872924 2888476 3571030 3220630 602982 -2810682 -3792352 -1672309 353236 -301549
8568c01549j788963j38120J384951J063475N40878Q18417M57267q87234j211571
$$ -301549 -2090512 -2228632 -843681 219794 760672 1579089 2036356 1149122 -62449
8559f2449Q651N76887l16324o52829J70906r8660j785891j576326J653811L740612
$$ -62449 -53798 523089 206765 -446064 -275158 -373818 -2159709 -3736035 -2082224 1658388
8549A658388J562808j522937q94494J958407K126984q95860l060882k266988m52732
$$ 1658388 3221196 1698259 803765 2762172 4889156 3993296 932414 -1334574 -1787306
8540a787306M26320N77261M85983Q4371o6568O54368J321291P10010l46327k07118
$$ -1787306 -1360986 -783725 -297742 -213371 -279939 374429 1695720 2405730 2059403 1852285
8530A852285O11649K78907j066616j529848o83743L265j13028j45548K49096L53335
$$ 1852285 2463934 2742841 1676225 146377 -537366 -534101 -647129 -792677 -543581 -190246
8520a90246R3365J92361M77480j8425j103240j400655m75976O31994J098300J025487
$$ -190246 -96881 95480 572960 554535 -548705 -1949360 -2425336 -1793342 -695042 330445
8510C30445N11563m82307j369269j420303q58205k59897N71360J685083J740097
$$ 330445 842008 359701 -1009568 -2429871 -3288076 -3547973 -2976613 -1291530 448567
8501D48567l51131l069838l726664k018582r9761O95566J040226J574478J920978
$$ 448567 97436 -2972402 -6699066 -8717648 -8817409 -8121843 -7081617 -5507139 -3586161
8492c586161J988519K204193K121199P38045j438055k509085j747501l26351P00120
$$ -3586161 -1597642 606551 2727750 3465795 2027740 -481345 -2228846 -2555197 -1855077
8483a855077J302337J245380Q3400j257301j065196M40063J112017J75271p59413
$$ -1855077 -552740 692640 776040 -481261 -1546457 -1106394 5623 180894 -578519
8474e78519o91390o88953j180419m47306K260510M336430K971152p50958l237802
$$ -578519 -1269909 -1958862 -3139281 -3586587 -1326077 3010353 5981505 5230547 1992745
8465A992745k886849j083079M66845J221284J063269J11945p61010p79841m88701
$$ 1992745 -894104 -1977183 -1510338 -289054 774215 886160 125150 -654691 -1143392
8456a143392p75138j093826l07253J014038J076946k18348q23175L65504J731166
$$ -1143392 -1918530 -3012356 -3319609 -2305571 -1228625 -1446973 -2270148 -1904644 -173478
8447a73478J345057k38826j009030m42355J61028J3574n9025P35058J600357J163780
$$ -173478 1171579 932753 -76277 -518632 -357604 -344030 -403055 332003 1932360 3096140
8437C096140m86888j721828j330357J40280J218903J148511L43316m26508q69179
$$ 3096140 2609252 887424 -442933 -302653 916250 2064761 2408077 1981569 1112390
8428A112390j259254j876441k311046j539593P37723K924837K759815K05896j966547
$$ 1112390 -146864 -2023305 -4334351 -5873944 -5136221 -2211384 548431 754327 -1212220
8419a212220j439925P33613J765081R10281j01194o4507K80137J10807q7281K16085
$$ -1212220 -2652145 -1918532 -153451 756830 655636 591129 871266 982073 894792 1110877
8409A110877M65798R7945m73416q28880j319972j961495j810551n95712K56649
$$ 1110877 1576675 1674620 1201204 372324 -947648 -2909143 -4719694 -5315406 -5058757
8400e058757l52027j202097m66478J391207K286608J596742O40635K92408J28788
$$ -5058757 -5410784 -6612881 -7079359 -5688152 -3401544 -1804802 -1164167 -871759 -742971
8391g42971N5356O80182J539366J018796r43501j945124l87877J817983J664144
$$ -742971 -687615 -7433 1531933 2550729 1607228 -337896 -725773 1092210 2756354
8382B756354p49357k404880j478444O09962J515055P85961k88024o05004k48714
$$ 2756354 2006997 -397883 -1876327 -1266365 248690 1034651 746627 141623 -107091
8373a07091m0656n63443j393002j319499J45553J636382J262101p88623k117594
$$ -107091 -147747 -711190 -2104192 -3423691 -3278138 -1641756 -379655 -1168278 -3285872
8364c285872j160378P45256J329247N24160J61600Q95710J169885k19234j908938
$$ -3285872 -4446250 -3700994 -2371747 -1847587 -1685987 -790277 379608 160374 -1748564
8355a748564j536890R72662K912553J906105j164522l011425j683572J173975
$$ -1748564 -3285454 -2312792 599761 2505866 1341344 -1670081 -3353653 -2179678
8347b179678K307564P26220j383905j732866o24913L15027Q80767J926572K830593
$$ -2179678 127886 854106 -529799 -2262665 -2887578 -2572551 -1691784 234788 3065381
8338C065381J745837j076409k580257j024989J075573L18349k517140l432649
$$ 3065381 4811218 3734809 1154552 129563 1205136 1523485 -993655 -4426304
8330d426304q89071K249486K940378J585573K94783k47388m69654k01505O40908
$$ -4426304 -5315375 -3065889 -125511 1460062 1754845 1507457 1037803 836298 1477206
8321A477206Q17036n68603j881914p91922J990466L240464J678330n49888j477741
$$ 1477206 2294242 1725639 -156275 -948197 1042269 4282733 5961063 5411175 3933434
8312C933434j840234k640505k620955m50785K187638K429655M87062n49128P86440
$$ 3933434 2093200 -547305 -3168260 -3619045 -1431407 998248 1485310 936182 1722622
8303A722622K370188J645504j082180l339420l194628o51998K501237L723307
$$ 1722622 4092810 5738314 4656134 1316714 -1877914 -2529912 -28675 3694632
8295C694632J796128j517087k995709j701322j7724l25186j957533k490963j003118
$$ 3694632 5490760 3973673 977964 -723358 -741082 -1066268 -3023801 -5514764 -6517882
8286f517882J155015K228932J738932O73147N23295J623189K365493J099639j233935
$$ -6517882 -5362867 -3133935 -1395003 -721856 -198561 1424628 3790121 4889760 3655825
8277C655825k090331j152078p55643j638891j271677J559914L539220J501373
$$ 3655825 1565494 413416 -342227 -1981118 -3252795 -1692881 1846339 3347712
8269C347712k016244k119680R32637K324630M49741j010766K58812J426238l02857
$$ 3347712 1331468 -788212 144425 2469055 2918796 1908030 2166842 3593080 3290223
8260C290223k842307k742014n50616O88139J91880m93803n99222l06170Q56780
$$ 3290223 447916 -2294098 -2844714 -2156575 -1964695 -2458498 -3057720 -3363890 -2507110
8251b507110K853266L526669J219259j873370k199861j75539M58320j376531k419750
$$ -2507110 346156 3872825 5092084 3218714 1018853 843314 1301634 -74897 -2494647
8242b494647l77501K415887K503528L9148k116316k387592j484972m69693J90468
$$ -2494647 -2872148 -456261 2047267 2086415 -29901 -2417493 -3902465 -4372158 -4181690
8233d181690J21185p13081j357400p31590Q19924J797818J406901L95399K4751
$$ -4181690 -4060505 -4773586 -6130986 -6862576 -6042652 -4244834 -2837933 -2442534 -2417783
8224b417783Q08962K198210K916544J803101q48224k825452j960912J013848K648400
$$ -2417783 -1608821 589389 3505933 5309034 4460810 1635358 -325554 688294 3336694
8215C336694P86560k381086k760752L46335L165025K266970j185420l310784k352049
$$ 3336694 4123254 1742168 -1018584 -672249 2492776 4759746 3574326 263542 -2088507
8206b088507J27373K075147K804854K180749K59102j660425j632924K43419J350109
$$ -2088507 -1961134 114013 2918867 5099616 5358718 3698293 2065369 2308788 3658897
8197C658897k8912k165006k191387L1201J887720J387849p22239k141491j480377
$$ 3658897 3629985 1464979 -726408 -695207 1192513 2580362 1858123 -283368 -1763745
8188a763745M68559J633226R93486k24526l56993K56980J22045n64349j70193
$$ -1763745 -1295186 338040 1331526 1107000 750007 1006987 1129032 564683 394490
8179C94490J163791J304525j55344r34245j20365M7373j501881k005954M06249
$$ 394490 1558281 2862806 2707462 1773217 1652852 1700225 198344 -1807610 -1401361
8170a401361K587456J144612j350073j56176L293000K948626k012934n176510
$$ -1401361 1186095 2330707 980634 824458 4117458 7066084 5053150 -123360
8162a23360k430071K045830K398135o62156k138052l74365J671857J464525k55425
$$ -123360 -2553431 -507601 1890534 1228378 -909674 -1284039 387818 1852343 1596918
8153A596918j416290j099243M1988O51326J18563m70381L07618J812678J904499
$$ 1596918 180628 -918615 -876627 -225301 -106738 -577119 -269501 1543177 3447676
8144C447676K05222j237445j166749p24110r02077q16124J34104P40733K58112
$$ 3447676 3652898 2415453 1248704 524594 -377483 -1193607 -1059503 -318770 -60658
8135f0658k1491P86818J328079M93397m96010n40455q20528k056059k043583R22218
$$ -60658 -82149 704669 2032748 2526145 2030135 1489680 669152 -1386907 -3430490 -2508272
8125b508272M147858L653237n1746k775050k383899m30028J256355K185943J765724
$$ -2508272 1639586 5292823 5241077 2466027 82128 -347900 908455 3094398 4860122
8116D860122m13708k746705k948211j249639L00294J243447K447117L025429J170954
$$ 4860122 4446414 1699709 -1248502 -2498141 -2197847 -954400 1492717 4518146 5689100
8107E689100j972830l066296j625702n69494j094360j027680N40433J129482o51507
$$ 5689100 3716270 649974 -975728 -1545222 -2639582 -3667262 -3126829 -1997347 -2648854
8098b648854k238638j203033R68132J740111J301706Q60001k5995j528890j635606
$$ -2648854 -4887492 -6090525 -5122393 -3382282 -2080576 -1220575 -1246570 -2775460 -4411066
8089d411066O14469K352011Q91006j553578j107250J415705J792177p56173k477823
$$ -4411066 -3796597 -1444586 -553580 -2107158 -3214408 -1798703 -6526 -762699 -3240522
8080c240522j063916J370856K158056J448856M91899n39393j553779j666073o83471
$$ -3240522 -4304438 -2933582 -775526 673330 1165229 625836 -927943 -2594016 -3277487
8071c277487K81988O46891J114601J870835J860549P12632l90478o87566r93552
$$ -3277487 -2995499 -2348608 -1234007 636828 2497377 3210009 2819531 2131965 1138413
8062A138413j885651k333050j306553N04311J665214J710656J087948L29452r6406
$$ 1138413 -747238 -3080288 -4386841 -3882530 -2217316 -506660 581288 910740 814334
8053H14334K4250K52399J40142J69257Q53659J336165O70785K9884J161459K870978
$$ 814334 838584 1090983 1231125 1400382 2254041 3590206 4260991 4290875 5452334 8323312
8043H323312K165242p76024k363775j334667p80645k544754l676192j576850R74851
$$ 8323312 10488554 9712530 7348755 6014088 5233443 2688689 -987503 -2564353 -1589502
8034a589502J08327k546676k304143J118456L379754K181644k43016j335927j006531
$$ -1589502 -1481175 -4027851 -6331994 -5213538 -1833784 347860 104844 -1231083 -2237614
8025b237614L6476J250660J322608m69458j964941o19523J885610J513553j557874
$$ -2237614 -2201138 -950478 372130 -97328 -2062269 -2681792 -796182 717371 -840503
8016h40503k774159m04277J862628J131051n55233o26005j71696p46242q99867
$$ -840503 -3614662 -4018939 -2156311 -1025260 -1580493 -2206498 -2378194 -3124436 -4024303
8007d024303O80542J959880J059043j32691M05131O44636j685461l848463j777591
$$ -4024303 -3343761 -1383881 -324838 -457529 -52398 592238 -1093223 -4941686 -6719277
7998f719277K785184M245872J487140j054441o90397K42371o36909k017849j825055
$$ -6719277 -3934093 311779 1798919 744478 54081 296452 -340457 -2358306 -4183361
7989d183361l84614R98253J880515J842125L38166j595511j935277p54106j71000
$$ -4183361 -4567975 -3569722 -1689207 152918 491084 -1104427 -3039704 -3793810 -3964810
7980c964810o10019p6814J912124K891273J457255k66097o8024J094550J334807
$$ -3964810 -4574829 -4651643 -2739519 151754 1609009 1342912 1274888 2369438 3704245
7971C704245Q78258O10362j62338j937298k903904j428856P43621P05769j064545
$$ 3704245 4582503 5192865 5030527 3093229 189325 -1239531 -495910 209859 -854686
7962h54686j327250R61523L096215K541052J91680j268568q24307K07501L28065
$$ -854686 -2181936 -1220413 1875802 4416854 4608534 3339966 2515659 2723160 3051225
7953C051225l39206n61850J28544P14100J70793r41670j266837o62663k30994
$$ 3051225 2712019 2150169 2278713 2992813 3163606 2221936 955099 292436 61442
7944F1442m68717p50531p22657p57473p94464k32694O85344R17155M30327L63097
$$ 61442 -407275 -1157806 -1880463 -2637936 -3432400 -3665094 -2979750 -2062595 -1632268 -1269171
7934a269171R56102J062010K37647n23288p41631j109578j465528m04015J965727
$$ -1269171 -313069 748941 986588 463300 -278331 -1387909 -2853437 -3257452 -1291725
7925a291725L207254K037438M35586M64138J017207j12512k561054m017063l353854
$$ -1291725 1915529 3952967 4388553 4852691 5869898 5757386 3196332 -820731 -4174585
7916d174585j268381J079352K470468J996199N30783L04720J611363J983923L14730
$$ -4174585 -5442966 -4363614 -1893146 103053 633836 938556 2549919 4533842 4848572
7907D848572q18188N89596K066591M06703k902071l954021k508701j494624j493793
$$ 4848572 4030384 4619980 6686571 7093274 4191203 237182 -2271519 -3766143 -5259936
7898e259936l65724J881807K536992J074707K38816J103156J122104j152387l006096
$$ -5259936 -5625660 -3743853 -1206861 -132154 106662 1209818 2331922 1179535 -1826561
7889a826561j563614J786871L370963J934049n61427j708567r01565L87065Q0512
$$ -1826561 -3390175 -1603304 1767659 3701708 3140281 1431714 530149 917214 997726
7880I97726j838952k549224j3426L311676L151255m71099l139772k395934n24371
$$ 997726 -841226 -3390450 -3403876 -92200 3059055 2587956 -551816 -2947750 -3472121
7871c472121k5403q8778O59613J371552J174316J112840J576001P50841j787886
$$ -3472121 -3497524 -3586302 -2926689 -1555137 -380821 732019 2308020 3058861 1270975
7862A270975k935134o01881K331105K190123K46797J50158J492092P41961k153848
$$ 1270975 -1664159 -2266040 65065 2255188 2501985 2652143 4144235 4886196 2732348
7853B732348l106465m23619K383184J865725p58714k181089j501249j12124R14115
$$ 2732348 -374117 -797736 1585448 3451173 2692459 511370 -989879 -1102003 -187888
7844a87888J256644N31815j014427j845269q62897P03158O67916j045186k171292
$$ -187888 1068756 1600571 586144 -1259125 -2122022 -1418864 -750948 -1796134 -3967426
7835c967426j216551M55778N64373p46766r29964J269023L537590K835472k26697
$$ -3967426 -5183977 -4728199 -4163826 -4910592 -5840556 -4571533 -1033943 1801529 1574832
7826A574832j924463n36752J356037Q77301r38171j124342L84067P44614j128441
$$ 1574832 -349631 -886383 469654 1346955 408784 -715558 -331491 413123 -715318
7817g15318k668631j395418J467483K634193R61066j439438j920041m2518K351635
$$ -715318 -3383949 -4779367 -3311884 -677691 283375 -1156063 -3076104 -3118622 -766987
7808g66987L043060J327428j416199k854216j795127N73914J792778P30608j184171
$$ -766987 2276073 3603501 2187302 -666914 -2462041 -1888127 -95349 635259 -548912
$$ [...]
##END NTUPLES=NMR SPECTRUM
##END=
