##TITLE=31Pdec_PR182_15
 D2O, 24 sc
 15.11.2021
##JCAMPDX= 6.0         $$ Bruker NMR JCAMP-DX V2.0
##DATA TYPE= NMR SPECTRUM
##DATA CLASS= NTUPLES
##ORIGIN= UXNMR, Bruker Analytische Messtechnik GmbH
##OWNER= root
$$ XWIN-NMR		Version 3.5
$$ Mon Nov 15 12:49:11 2021 Russian Standard Time (UT+4h)  she@DPX200
##.OBSERVE FREQUENCY= 81.013821
##.OBSERVE NUCLEUS= ^31P
##.ACQUISITION MODE= SIMULTANEOUS
##.ACQUISITION SCHEME= undefined
##.AVERAGES= 24
##.DIGITISER RES= 16
##SPECTROMETER/DATA SYSTEM= spect
##.PULSE SEQUENCE= zgpg30
##.SOLVENT NAME= D2O
##.SHIFT REFERENCE= (INTERNAL, D2O, 0, 248.564)
##AUDIT TRAIL= $$ (NUMBER, WHEN, WHO, WHERE, WHAT)
$$ ##TITLE= Audit trail, XWIN-NMR		Version 3.5
$$ ##JCAMPDX= 5.01
$$ ##ORIGIN= Bruker BioSpin GmbH
$$ ##OWNER= she
$$ F:/spectra/data/she/nmr/P31/1/pdata/1/auditp.txt
$$ ##AUDIT TRAIL=  $$ (NUMBER, WHEN, WHO, WHERE, WHAT)
(   1,<2021-11-15 12:47:48.78 +0400>,<she>,<DPX200>,
      <created by zg, POWCHK disabled, PULCHK disabled
       configuration hash MD5:
       00 E9 B6 7A A2 85 ED C7 34 08 36 98 17 FE 4E 26
       data hash MD5: 32K
       2B DF 77 94 14 0A 31 8C E3 D2 12 E4 1D 5B AA 85>)
(   2,<2021-11-15 12:47:53.28 +0400>,<she>,<DPX200>,
      <Start of raw data processing
       efp BC_mod = 2 LB = 1 FT_mod = 6 PKNL = 1 PHC0 = -9074.719 PHC1 = -194.7305 SI = 64K 
       data hash MD5: 64K
       4E A2 4E 8A 90 B4 38 28 6C E9 4A 30 9C 79 8D 0A>)
(   3,<2021-11-15 12:48:23.15 +0400>,<she>,<DPX200>,
      <pk PHC0 = -113.9367 PHC1 = 251.4 
       data hash MD5: 64K
       73 79 B8 92 21 D3 47 53 3D CC D6 D6 52 AF 3B A3>)
(   4,<2021-11-15 12:48:26.29 +0400>,<she>,<DPX200>,
      <abs ABSG = 5 
       data hash MD5: 64K
       38 2D 1A 20 4D 32 D7 3B D5 AE 49 E2 56 38 50 64>)
$$ ##END=
$$ 
$$ hash MD5
$$ F4 46 B5 BC 85 E9 7C AF 69 D6 BC DB 3A A7 F3 5B
##$RELAX= 
##$RELAX= 
##$RELAX= 
##$RELAX= 
##$RELAX= 
##$RELAX= 
##$RELAX= 
##$RELAX= 
$$ Bruker specific parameters
$$ --------------------------
##$DU= <F:/spectra>
##$EXPNO= 1
##$NAME= <P31>
##$PROCNO= 1
##$TYPE= <nmr>
##$USER= <she>
##$AMP= (0..31)
100 100 100 100 100 100 100 100 100 100 100 100 100 100 100 100 100 100 
100 100 100 100 100 100 100 100 100 100 100 100 100 100 
##$AQSEQ= 0
##$AQ_mod= 1
##$AUNM= <au_zg>
##$AUTOPOS= <>
##$BF1= 81.014009
##$BF2= 200.13
##$BF3= 200.13
##$BF4= 200.13
##$BF5= 200.13
##$BF6= 200.13
##$BF7= 200.13
##$BF8= 200.13
##$BYTORDA= 1
##$CFDGTYP= 0
##$CFRGTYP= 5
##$CHEMSTR= <none>
##$CNST= (0..31)
1 1 145 1 1 1 1 1 1 1 1 1 1 1 1 1 1 1 1 1 1 1 1 1 1 1 1 1 1 1 1 1 
##$CPDPRG= <waltz16>
##$CPDPRG1= <>
##$CPDPRG2= <waltz16>
##$CPDPRG3= <>
##$CPDPRG4= <mlev>
##$CPDPRG5= <mlev>
##$CPDPRG6= <mlev>
##$CPDPRG7= <mlev>
##$CPDPRG8= <mlev>
##$CPDPRGB= <>
##$CPDPRGT= <>
##$D= (0..31)
0 1 0 0 0 0 0 0 0 0 0 0.03 2e-05 3e-06 0 0 0 0 0 0 0 0 0 0 0 0 0 0 0 0 
0 0 
##$DATE= 1636966068
##$DBL= (0..7)
120 120 120 11 120 120 24 19 
##$DBP= (0..7)
150 150 150 150 150 150 150 150 
##$DBP07= 0
##$DBPNAM0= <>
##$DBPNAM1= <>
##$DBPNAM2= <>
$$ [...]
##$SUBNAM3= <"">
##$SUBNAM4= <"">
##$SUBNAM5= <"">
##$SUBNAM6= <"">
##$SUBNAM7= <"">
##$SUBNAM8= <"">
##$SUBNAM9= <"">
##$SW= 501.771253377433
##$SWIBOX= (0..15)
0 1 3 0 0 0 0 0 0 0 0 0 0 0 0 0 
##$SW_h= 40650.406504065
##$TD= 32768
##$TD0= 1
##$TE= 0
##$TE2= 300
##$TE3= 300
##$TEG= 300
##$TL= (0..7)
0 120 53 12 22 120 120 120 
##$TP= (0..7)
150 150 150 150 150 150 150 150 
##$TP07= 0
##$TPNAME0= <>
##$TPNAME1= <>
##$TPNAME2= <>
##$TPNAME3= <>
##$TPNAME4= <>
##$TPNAME5= <>
##$TPNAME6= <>
##$TPNAME7= <>
##$TPOAL= (0..7)
0.5 0.5 0.5 0.5 0.5 0.5 0.5 0.5 
##$TPOFFS= (0..7)
0 0 0 0 0 0 0 0 
##$TUNHIN= 0
##$TUNHOUT= 0
##$TUNXOUT= 0
##$USERA1= <user>
##$USERA2= <user>
##$USERA3= <user>
##$USERA4= <user>
##$USERA5= <user>
##$V9= 5
##$VALIST= <valist>
##$VCLIST= <CCCCCCCCCCCCCCC>
##$VD= 0
##$VDLIST= <DDDDDDDDDDDDDDD>
##$VPLIST= <PPPPPPPPPPPPPPP>
##$VTLIST= <TTTTTTTTTTTTTTT>
##$WBST= 1024
##$WBSW= 4
##$XGAIN= (0..3)
0 0 0 0 
##$XL= 0
##$YL= 0
##$YMAX_a= 1413
##$YMIN_a= -2460
##$ZGOPTNS= <>
##$ZL1= 120
##$ZL2= 120
##$ZL3= 120
##$ZL4= 120
##$ABSF1= 248.5645
##$ABSF2= -253.2056
##$ABSG= 5
##$ABSL= 3
##$ALPHA= 0
##$AQORDER= 0
##$ASSFAC= 0
##$ASSFACI= 0
##$ASSFACX= 0
##$ASSWID= 0
##$AUNMP= <proc_1d>
##$AZFE= 0.1
##$AZFW= 0.5
##$BCFW= 0
##$BC_mod= 2
##$BYTORDP= 0
##$COROFFS= 0
##$CY= -3
##$DATMOD= 1
##$DC= 0
##$DFILT= <>
##$DTYPP= 0
##$F1P= 0
##$F2P= 0
##$FCOR= 1
##$FTSIZE= 65536
##$FT_mod= 6
##$GAMMA= 0
##$GB= 0
##$INTBC= 1
##$INTSCL= 5.30512e-09
##$ISEN= 30
##$LB= 1
##$LEV0= 0
##$LPBIN= 0
##$MAXI= 10000
##$MC2= 0
##$MEAN= 0
##$ME_mod= 0
##$MI= 50
##$NCOEF= 0
##$NC_proc= -8
##$NLEV= 6
##$NOISF1= 182.463
##$NOISF2= 159.3651
##$NSP= 0
##$NTH_PI= 0
##$NZP= 0
##$OFFSET= 248.5645
##$PC= 4
##$PHC0= -9188.655
##$PHC1= 56.66949
##$PH_mod= 1
##$PKNL= yes
##$PPARMOD= 0
##$PSCAL= 0
##$PSIGN= 0
##$REVERSE= no
##$SF= 81.014009
##$SI= 65536
##$SIGF1= 159.3651
##$SIGF2= -187.1042
##$SINO= 113.3802
##$SIOLD= 16384
##$SREGLST= <1H.CDCl3>
##$SSB= 0
##$STSI= 65536
##$STSR= 0
##$SW_p= 40650.406504065
##$SYMM= 0
##$S_DEV= 0
##$TDeff= 32768
##$TDoff= 0
##$TI= <>
##$TILT= no
##$TM1= 0
##$TM2= 0
##$TOPLEV= 0
##$USERP1= <user>
##$USERP2= <user>
##$USERP3= <user>
##$USERP4= <user>
##$USERP5= <user>
##$WDW= 1
##$XDIM= 65536
##$YMAX_p= 182550040
##$YMIN_p= -395221867
$$ End of Bruker specific parameters
$$ ---------------------------------
##NTUPLES= NMR SPECTRUM
##VAR_NAME=  FREQUENCY,     SPECTRUM/REAL,   SPECTRUM/IMAG
##SYMBOL=    X,             R,               I
##VAR_TYPE=  INDEPENDENT,   DEPENDENT,       DEPENDENT
##VAR_FORM=  AFFN,          ASDF,            ASDF
##VAR_DIM=   65536,         65536,           65536
##UNITS=     HZ,            ARBITRARY UNITS, ARBITRARY UNITS
##FACTOR=    0.620285442955139, 1,           1
##FIRST=     20137.2065510759, 0,            0
##LAST=      -20513.1999529892, 0,           0
##MIN=       -20513.1999529892, -395221867,  0
##MAX=       20137.2065510759, 182550040,    0
$$ Real data points
##PAGE= N=1
##DATA TABLE= (X++(R..R)), XYDATA
$$ [...]
13023A276153K038151m575155m849150J276269L748045o46865l584712k63228
13015e580492K792902K31181k604033J03499L921169K244261j986626j875833
13007b753972J403186J713297n29263L62207M305126N021546P11205l063673k377017
12998D792642L1843L56685j331546l277582m314380k898010J402624M798459K831120
12989B391855k223203l324678O01902K492003j507069n318181k451164L604213
12981e734322N118852K116242Q71358K518242J610984l425755o526125l675758
12973g126282M01269Q309k316621n86089L957327M284711r85546m866470k421125
12964i650517K385250L567133J644993O84968P81333p77182l049863k257401J394606
$$ plain form
13023 1276153 3314304 -1260851 -6110001 -4833732 -1085687 -1732552 -5317264 -5580492
13015 -5580492 -2787590 -2556409 -5160442 -5056943 -1135774 1108487 -878139 -2753972
13007 -2753972 -1350786 362511 -166752 195455 4500581 9522127 10233332 7169659 4792642
12998 4792642 4824485 5181170 3849624 572042 -3742338 -6640348 -5237724 -439265 2391855
12989 2391855 168652 -3156026 -2554124 -62121 -1569190 -6887371 -9338535 -5734322
12981 -5734322 -615470 1500772 2372130 4890372 6501356 3075601 -3450524 -7126282
12973 -7126282 -6725013 -6716704 -9033325 -9619414 -5662087 -1377376 -2362922 -7229392 -9650517
12964 -9650517 -7265267 -3698134 -2053141 -1368173 -586840 -1364022 -4413885 -6671286 -5276680
12955e276680L353101J860350L81288J473210K841399J655240j061889k780289
12947B445730l020161k276378l67115J816849J779342q55098k714648j335990
12939d527469J081903J225907n32003j746219j887719j589463j88501K465008
12931e698556L663235J106113k802057l599620q03007K094797K824133K189366
12923a025596J368197O16089L20890N89984L46188p78332r61690O46844J216166
12914B338740j564448m432827k538929K616524M712430J965364q11318m19105
12906A866431L71017j050084k139475m4080K773242K135758j327166l525132l060496
12897c999985j950122j099525Q49832L800477M824139K017475k424966m700539
$$ plain form
12955 -5276680 -1923579 -63229 318059 1791269 4632668 6287908 5226019 2445730
12947 2445730 -574431 -2850809 -3217924 -1401075 378267 -476831 -3191479 -4527469
12939 -4527469 -3445566 -2219659 -2751662 -4497881 -6385600 -7975063 -8163564 -5698556
12931 -5698556 -2035321 -929208 -3731265 -7330885 -8133892 -6039095 -3214962 -1025596
12923 -1025596 342601 958690 1279580 1869564 2215752 1437420 475730 1122574 2338740
12914 2338740 774292 -3658535 -6197464 -3580940 1131490 3096854 2285536 1866431
12906 1866431 2237448 1187364 -952111 -996191 1777051 3912809 2585643 -939489 -3999985
12897 -3999985 -5950107 -7049632 -6199800 -2399323 2424816 4442291 2017325 -2683214
12889b683214l751680j498402M78733K312414L670051K698278r63665l847604
12881c585089k314996K031774L937929J689841j014479j361518j292804k750680
12873d660022l353954p14558K326004J592542j526233k127971O05793K948256
12865d910143L105124L009399L450488K318461j179336m547040n520776m406303
12857h680126k122640R57175L439502L204265L30953k451028k775588n25871K681435
12848e941923M121350J707599k451593k729770K308494O004873K457258l918246
12840A558042m555694M940J679949j276880j932515K399733N126306K014428j619059
12831C399250q38799L24107k759523n634673j980103M641890N407566j64701l943114
$$ plain form
12889 -2683214 -6434894 -7933296 -7454563 -5142149 -1472098 1226180 262515 -3585089
12881 -3585089 -5900085 -3868311 69618 1759459 744980 -616538 -1909342 -4660022
12873 -4660022 -8013976 -8728534 -6402530 -4809988 -6336221 -8464192 -7858399 -4910143
12865 -4910143 -1805019 1204380 4654868 6973329 5793993 1246953 -4273823 -8680126
12857 -8680126 -10802766 -9845591 -6406089 -3201824 -2870871 -5321899 -8097487 -8623358 -5941923
12848 -5941923 -1820573 -112974 -2564567 -5294337 -2985843 3019030 5476288 1558042
12840 1558042 -2997652 -2992712 -1312763 -2589643 -4522158 -2122425 3003881 5018309 3399250
12831 3399250 2560451 2884558 125035 -5509638 -7489741 -2847851 2559715 2395014 -1548100
12822a548100j668465K053866J983629q33122k197352n53165K153206K991319
12814B381816O28706l061974m261556j447872K575507M203761L054805J073371
12806E146564m05769j005575o94361m14768j297172k180807p09732K110563K251114
12797B800057q63448k644596n19687J875873R84322q51963m4648J945469J749287
12788D430666Q9375j82117P84881J036211L65267j103880m300881p306144m778828
12779a0965450L615376R242988N485912k020147l795222p75529q38169m258129
12771d308370l611171K373128N900065K962332p02456J48095K508994J805824
12763G076441p43228j969386k131023k093547l18597K955271L308810j269874
$$ plain form
12822 -1548100 -3216565 -1162699 820930 -12192 -2209544 -2762709 -609503 2381816
12814 2381816 3010522 -51452 -4313008 -5760880 -3185373 1018388 4073193 5146564
12806 5146564 4740795 3735220 3040859 2626091 1328919 -851888 -1561620 548943 2800057
12797 2800057 1936609 -707987 -1227674 648199 1632521 780558 735910 2681379 4430666
12788 4430666 4520041 4337924 5122805 6159016 6524283 5420403 1119522 -6186622 -10965450
12779 -10965450 -7350074 1892914 7378826 5358679 1563457 787928 -50241 -4308370
12771 -4308370 -7919541 -5546413 353652 3315984 2613528 2761623 5270617 7076441
12763 7076441 6333213 4363827 2232804 139257 -179340 2775931 6084741 4814867
12755D814867n447800l450528K132587M008459Q57805j432822P90206L703169
12747E975943K357698j657239k812331l51885L66701l410750o331550k493014
12739h356427M449026N317167r33879n258209k218626K307103J567204j471293
12731d597934p34093K038715J357675j610974j718902L40734J38084j028354J443123
12722d371926N151182L271463k851030m492956l9738K174284j915962n631225
12714h705908l412915N52761R10509r5074J584954M211640M376249K942063J702432
12705D066711m47884l392566l503131j2491K135215L71416p86569J857165L681342
12696C969208L24069l984457l335339m9912N2710k067137j230610K248728L411728
$$ plain form
12755 4814867 -632933 -4083461 -1950874 2057585 2915390 1482568 2272774 5975943
12747 5975943 8333641 6676402 3864071 3512186 3878887 468137 -5863413 -8356427
12739 -8356427 -3907401 1409766 475887 -4782322 -7000948 -4693845 -3126641 -4597934
12731 -4597934 -5332027 -3293312 -1935637 -3546611 -5265513 -4924779 -4786695 -5815049 -4371926
12722 -4371926 779256 4050719 1199689 -3293267 -3333005 -1158721 -3074683 -8705908
12714 -8705908 -12118823 -11566062 -10655553 -10750627 -9165673 -4954033 -577784 2364279 4066711
12705 4066711 3618827 226261 -3276870 -3289361 -1154146 -782730 -1569299 287866 3969208
12696 3969208 4293277 308820 -3026519 -3076431 -3023721 -5090858 -6321468 -4072740 -661012
12687f61012J336242k63681O3908L62348K4695P1894k38017j948102k881900m95744
12677d629369L214370M320934K754031J010150o47469k880489l698389j528727
12669b084958M97938j110265l873087l091600M20904K452204K766710L615513
12661d06641L279966j067707n654160l884256K469368M629580K29869l373011
12653c776992j284068J966562J289422p08598O22986L762815L881567L07727l412066
12644B649355m494744k681141P61614L266015K360601j132614l296370j819066
12636d386350J629079M247333M577591K013406k526753n176871k672990K076315
12628b19240K742830j225039l651452j406160J161892M82609n6874L031892N932500
$$ plain form
12687 -661012 675230 411549 475457 837805 862500 934394 696377 -1251725 -4133625 -4629369
12677 -4629369 -1414999 2905935 5659966 6670116 6022647 3142158 -556231 -2084958
12669 -2084958 -1587020 -2697285 -6570372 -9661972 -9241068 -6788864 -4022154 -406641
12661 -406641 2873325 1805618 -3848542 -7732798 -5263430 -633850 -403981 -3776992
12653 -3776992 -5061060 -3094498 -1805076 -2513674 -1890688 1872127 5753694 6061421 2649355
12644 2649355 -1845389 -4526530 -3764916 -498901 1861700 729086 -2567284 -4386350
12636 -4386350 -2757271 1490062 6067653 8081059 5554306 377435 -2295555 -219240
12628 -219240 2523590 1298551 -2352901 -3759061 -2597169 -2114560 -2171434 860458 6792958
12619F792958L191253l112805o336149m833400k295111m26507K156126M459007
12611d04628L112079j380156l955035j998572J533471L319406L534606K904020
12603F665191M95642k962932l716409m15674K421427M95414l290217k824783J614427
12594a517914L396223l10453l970897j890221L420023N144994J699433k277752
12586C693436l253199k373721j509383j93946J965997L355346K847979J601507
12578F134016N96775r71184k975117k958585n1433K415266J394415j099451j337192
12569A147510M9704k51779j788934p02456L296590N243006J818035l803533o034637
12560a026494l263095J438050L945734K303786j768262l793361r35300M029151
$$ plain form
12619 6792958 9984211 6871406 535257 -4298143 -6593254 -7019761 -4863635 -404628
12611 -404628 2707451 1327295 -2627740 -4626312 -3092841 226565 3761171 6665191
12603 6665191 7160833 4197901 481492 65818 2487245 2982659 -307558 -3132341 -1517914
12594 -1517914 1878309 1567856 -2403041 -4293262 -873239 4271755 5971188 3693436
12586 3693436 440237 -1933484 -3442867 -3636813 -1670816 1684530 4532509 6134016
12578 6134016 6730791 5759607 2784490 -174095 -225528 2189738 3584153 2484702 1147510
12569 1147510 1197214 945435 -843499 -1545955 1750635 6993641 8811676 5008143 -1026494
12560 -1026494 -4289589 -2851539 1094195 3397981 1629719 -2163642 -3098942 930209
12552I30209N374703J446808l569975n316757l629872n07991K726836M629193
12544B083154L404232k02971k580587k092442j486961k997254m028548j146409
12536i047786L943795O242091L910469n27087m130570n232767k554036L247676
12528d148215P742323O591711J280042k746980l455268l484259m091418l143705
12520e455769m32543N36566j267777j648860J586690L572115j80635n319745m265999
12511a2875957K161120O004165M134559J348302R23922j2137l127181m291859
12503e735066p70542L009683K199305p18926n96573J877738K416787P58917k80485
12494B160838q84015k715944l356818M59975N248739M280122j375833l459393
$$ plain form
12552 930209 6304912 7751720 4181745 -1135012 -4764884 -5272875 -2546039 2083154
12544 2083154 5487386 5284415 2703828 611386 -875575 -3872829 -7901377 -9047786
12536 -9047786 -5103991 1138100 5048569 4521482 390912 -4841855 -7395891 -4148215
12528 -4148215 3594108 10185819 11465861 8718881 5263613 1779354 -2312064 -5455769
12520 -5455769 -5888312 -5351746 -6619523 -8268383 -6681693 -3109578 -3290213 -8609958 -12875957
12511 -12875957 -10714837 -4710672 -576113 772189 1696111 1683974 -1443207 -5735066
12503 -5735066 -6505608 -3495925 -1296620 -2015546 -2612119 -734381 1682406 2441323 2160838
12494 2160838 1276823 -1439121 -4795939 -4335964 912775 5192897 3817064 357671
12486C57671P35401M510474L018171J16807J00797L20313k479562m911085k527773
12477g58786K029424K948461J0835k440135k644833k082537j168300N97654J840120
12468a668097J042578n01063r25183o99956k49435J887453M977977M542906n21715
12459G885465m009912j337309K449157O79235l580553k920936J329486J590007
12451B084640k429148l605816o01343L2744l447824m246710N19979M034852J616544
12442f042082j006568K044672O153704L859943k538678m606694p79174K331461
12434e83416O09070k442224k022950J356496L352408J592357j403444j129845
12426f71548K938999N632074K539739l230250m757286j099900J756577J34008
$$ plain form
12486 357671 1093072 5603546 8621717 8738524 8839321 9159634 6680072 1768987 -758786
12477 -758786 1270638 4219099 4229934 1789799 -855034 -2937571 -4105871 -3508217 -1668097
12468 -1668097 -625519 -1126582 -2051765 -2751721 -3001156 -1113703 3864274 8407180 7885465
12459 7885465 3875553 2538244 4987401 5666636 2086083 -834853 494633 2084640
12451 2084640 -344508 -3950324 -4551667 -4518923 -7966747 -12213457 -11693478 -7658626 -6042082
12442 -6042082 -7048650 -5003978 1149726 5009669 2470991 -2135703 -2914877 -583416
12434 -583416 25654 -2416570 -4439520 -3083024 269384 1861741 458297 -671548
12426 -671548 2267451 7899525 10439264 7209014 2451728 1351828 3108405 3242413
12418C242413k826923l348012k043506n55942J390048K962511J600116j712567
12410a291862j964714J905680M164577J098582l029727l137875p72419M34730
12402b593028J081791K264390J215707k869164m071625J645118P792393N803915
12394A0269497j612935m783419k049459m22776k324788k273477J793956L790964
12386B387563k36682m996208l916352J366060M252857K225224j447612k778773
12378c143923q55388K075813K699726j0540l161271l254173p16729J101367P29490
12369d535628l72499q24858m39230Q55502K242020J470144j646228l098887j50582
12360f500246L306479K134819j367523p59289L771426N502774K194743r16971
$$ plain form
12418 3242413 415490 -2932522 -4976028 -5531970 -4141922 -1179411 420705 -1291862
12410 -1291862 -3256576 -1350896 2813681 3912263 882536 -2255339 -3027758 -2593028
12402 -2593028 -1511237 753153 1968860 -900304 -4971929 -3326811 4465582 10269497
12394 10269497 8656562 3873143 1823684 1400908 -923880 -3197357 -1403401 2387563
12386 2387563 2150881 -2845327 -6761679 -5395619 -1142762 1082462 -365150 -3143923
12378 -3143923 -3999311 -1923498 776228 765688 -2395583 -5649756 -6366485 -5265118 -4535628
12369 -4535628 -4908127 -5732985 -6172215 -5316713 -3074693 -1604549 -3250777 -6349664 -6500246
12360 -6500246 -3193767 -1058948 -2426471 -3185760 585666 6088440 8283183 7366212
12352G366212o28401l87662k614218l816976j337698J490693J376477N69311J667326
12343C685064K205893l83987k990007j573252J870062K545567K38993j600758
12335C997575j758103j554150j395866j181733j843595k723902n10209M985618
12327a984365P671133L186003l390752m271417m97342O96729j912392k470370
12319b972773J013703L397449J790541J08956J177856J644699r53903k550046
12311B656482N12154M018587J806512m145413o173003k005888K754700L221529
12303B645660R41695j04652R90512K408820K608289J160678j563203m057179m295086
12294G35534j911329R47109J729001Q7178j781872j076817K840173O871209O306012
$$ plain form
12352 7366212 6737811 6350149 3735931 -81045 -1418743 71950 1448427 2017738 3685064
12343 3685064 5890957 5506970 2516963 943711 2813773 5359340 5598333 3997575
12335 3997575 2239472 685322 -710544 -1892277 -3735872 -6459774 -6969983 -1984365
12327 -1984365 5686768 8872771 5482019 1210602 713260 1409989 -502403 -2972773
12319 -2972773 -1959070 1438379 3228920 3337876 4515732 6160431 5206528 2656482
12311 2656482 3168636 7187223 8993735 4848322 -1324681 -3330569 -575869 2645660
12303 2645660 3587355 3482703 4473215 6882035 9490324 10651002 9087799 5030620 735534
12294 735534 -1175795 -228686 1500315 1587493 -194379 -1271196 1568977 8440186 14746198
12285A4746198J21573o500169p204328k031497K490161J458262k766129m526303
12277d212232k160438J109669K179424J127344m29579j508850j761189j082727
12269f738578P8450J124087K225519L707949M619504L550084J078198m54437k25638
12260H965138p7085j294913k146875n13717K229340K267350j737820o490548p418358
12251f217488l464016J879082M157639K449076p3436l14932J004839J109198m11755
12242A18207j539428j825750k944573m534922l499344N58473L204464J622236
12234h840637n81430P91589L377812K374230r87739j759793l24890j312803l721889
12225a0985550r93301O939662J0618853M694989l283738m094377j68616K89147
$$ plain form
12285 14746198 14867771 8367602 1163274 -868223 1621938 3080200 314071 -4212232
12277 -4212232 -6372670 -5263001 -3083577 -1956233 -2385812 -3894662 -5655851 -6738578
12269 -6738578 -6660128 -5536041 -3310522 397427 5016931 8567015 9645213 9190776 8965138
12260 8965138 8888053 7593140 5446265 4932548 7161888 9429238 7691418 1200870 -6217488
12251 -6217488 -9681504 -7802422 -3644783 -1195707 -1269143 -1584075 -579236 529962 118207
12242 118207 -1421221 -3246971 -6191544 -10726466 -14225810 -13667337 -10462873 -8840637
12234 -8840637 -9422067 -8630478 -5252666 -2878436 -3866175 -5625968 -5950858 -7263661 -10985550
12225 -10985550 -11978851 -5039189 5579664 10274653 6990915 2896538 2727922 3017069
12217C017069k625894j951177L086800N382428J655017k897277l499166j874201
12209B93599q55510L99779K497553K827492K36537k009333j495711o25109j887442
12200f18145l414981k896760j735732j426533j16617K901194L907431J180767
12192b219376j49858L712810O903171K273823n567010o055800J91706J926225
12184A015691m095161p576951j951254M873947M208367M54889J684324M908122
12176C521974K389689l235264k905378K776644M215774q81673m208350j408253
12168B65163J698450P04342m10447J343969J624340j972824l310223J877852O598288
12159H418910K706488n342152o750974p51293L434045J453061j279676j65770
$$ plain form
12217 3017069 391175 -1560002 1526798 6909226 8564243 5666966 2167800 293599
12209 293599 -561911 -162132 2335421 5162913 5399450 3390117 1894406 1269297 -618145
12200 -618145 -4033126 -6929886 -8665618 -10092151 -10208768 -7307574 -3400143 -2219376
12192 -2219376 -2369234 1343576 8246747 10520570 4953560 -1102240 -910534 1015691
12184 1015691 -3079470 -10656421 -12607675 -7733728 -3525361 -3070472 -1386148 3521974
12176 3521974 5911663 2676399 -228979 2547665 6763439 5881766 1673416 265163
12168 265163 1963613 2667955 2257508 3601477 5225817 3252993 -57230 1820622 8418910
12159 8418910 11125398 5783246 -967728 -1719021 1715024 3168085 1888409 1722639
12151A722639K087784K028694J152533J501229J159591j842421m923516m120260
12143a233727K46828M066907M457056K213407j43914j328816k050539l017812
12135C209390k928298j62501L512492L985444Q49235j222974L85703J790026q23363
12126H595154m271794l501514j86846N17618p45624O62529L663417K346091k947633
12117D131398m389518J029587O118436M222479j560501m300928k647443J44944
12109B748454J824259J630085p34730l186399k329951R19794J504796j658536
12101G17772l554831j784216m60232j661214q37602L858951N822728Q68197l887377
12092i17824j009505M399732L421533j205170p15996L141756J329537m925308
$$ plain form
12151 1722639 3810423 5839117 6991650 8492879 9652470 7810049 2886533 -1233727
12143 -1233727 -986899 3080008 7537064 9750471 9606557 8277741 6227202 3209390
12135 3209390 281092 118591 3631083 7616527 8465762 7242788 7628491 9418517 8595154
12126 8595154 4323360 821846 635000 1152618 406994 1069523 4732940 7079031 4131398
12117 4131398 -258120 771467 6889903 11112382 9551881 5250953 2603510 2748454
12109 2748454 4572713 6202798 5468068 2281669 -48282 871512 2376308 717772
12101 717772 -2837059 -4621275 -5081507 -6742721 -7580323 -3721372 2101356 2969553 -917824
12092 -917824 -1927329 2472403 5893936 4688766 3972770 7114526 8444063 3518755
12084C518755n017548J929819M323851j951097n910517l36298N652528K328342
12076D537835m162676k823315L624580M382155r33959l044924L49932J925042
12068C854670j039481k077423J969498M627571J000561l364512j487862L411399
12060F894421L039766k682652n548047j818092K382917Q35401l364559k851636
12052c112481K645114N765462K250888l215704m203716j261704N17109j91324
12044h06356j42133J943928L247560J912107k00626j140230j455806j713891j043867
12035F00686K50623K05565r85279m63206K011936K515594n19169k646617k31231
12026G38902L065548J701152k831985m303205j309708J409935R67696J3783J313453
$$ plain form
12084 3518755 -1498793 431026 4754877 2803780 -3106737 -3443035 2209493 4537835
12076 4537835 375159 -2448156 1176424 5558579 4624620 1579696 1929628 3854670
12068 3854670 2815189 737766 2707264 7334835 8335396 4970884 3483022 6894421
12060 6894421 9934187 7251535 1703488 -114604 2268313 3103714 -260845 -3112481
12052 -3112481 -467367 5298095 7548983 4333279 129563 -1132141 -615032 -806356
12044 -806356 -948489 995439 4242999 6155106 5954480 4814250 3358444 1644553 600686
12035 600686 851309 1056874 71595 -391611 1620325 4135919 3616750 970133 738902
12026 738902 3804450 5505602 2673617 -1629588 -2939296 -1529361 -561665 -547882 765571
12017G65571L201781K516537p73738l716374l713713q98235J960037K087344j02129
12008A327081j646695j541481k013083l694255l142394J509847N928047N274993
12000B002060J660766M07769J312578J26524k913038l452610j417756j140404
11992c414111k529712n51397M517488N138788j286369o615852l990830J694925
11984g037070K346291m95089K47397M489265N496882J338399k592240k521451
11976A272384p07719j07677m54252p29466q92296l97127J161946K013103N68735
11967A727631j102966m49895M83831j414669l332460q2832N933286O476902K70655
11958H509483m431449k725885N8754j238809k680797O51504M552019K130795m189128
$$ plain form
12017 765571 3967352 6483889 5710151 1993777 -1719936 -2618171 -658134 1429210 1327081
12008 1327081 -319614 -1861095 -3874178 -7568433 -10710827 -9200980 -3272933 2002060
12000 2002060 3662826 4070595 5383173 5509697 2596659 -855951 -2273707 -3414111
11992 -3414111 -5943823 -6495220 -1977732 3161056 1874687 -4741165 -8731995 -7037070
11984 -7037070 -4690779 -5185868 -4938471 -449206 5047676 6386075 3793835 1272384
11976 1272384 564665 456988 2736 -726730 -1619026 -2016153 -854207 1158896 1727631
11967 1727631 624665 174770 658601 -756068 -4088528 -4171360 1761926 8238828 8509483
11958 8509483 4078034 1352149 1410903 172094 -2508703 -1857199 2694820 4825615 636487
11949F36487n943596j473542K881672L372724K587753K402174Q14848k433597
11941B844923l551791p45052K278422J624054j552163l447050k437716K56042
11933d730331K382326J992228q76985l376289k882732n28508R62851J799338L557779
11924a700323M406405J408356k834049k457521J901394K885327j777935m901237
11916c069583j354033L435690K460140j711210k141452R01985J771051k99680
11908g092j101439N1763j76087j710771q05159K514227L827492J831960j52829
11899D272065q03404k060318k982373Q5153N368869N592321p16018n402749k630558
11890G22988K374821K173185j469060j951845R23765J717687j079098l311348
$$ plain form
11949 636487 -5307109 -6780651 -3898979 -526255 2061498 4463672 5278520 2844923
11941 2844923 -706868 -1451920 826502 2450556 898393 -2548657 -4986373 -4730331
11933 -4730331 -2348005 -355777 -1232762 -4609051 -7491783 -8020291 -7057440 -5258102 -1700323
11924 -1700323 2706082 4114438 1280389 -1177132 724262 3609589 1831654 -3069583
11916 -3069583 -4423616 -987926 1472214 -238996 -2380448 -1478463 292588 -7092
11908 -7092 -1108531 -1056768 -1232855 -2943626 -3748785 -1234558 2592934 4424894 4272065
11899 4272065 3468661 1408343 -1574030 -1488877 3879992 9472313 8756295 3353546 722988
11890 722988 3097809 5270994 3801934 1850089 2773854 4491541 3412443 101095
11882A01095k220061M25420K002094J539302q01327l194817k513120J324338L589800
11873B52724J302869j379134M77015L849160K347109k425279k556894K899403
11865D766973N229102n62640p621780p360250j532221J853500N42587o81530J101050
11856d265209L081230K265125J29525r5849J951745L822780L700828K178290P36701
11847A3505166l53311j729345k906437k152641P06816K781348J159929l291200
11839G720325o882107p170068m433603j99755L425963M048427J508372n92826
11831b575272R28294L719586K701825k144232n139828k928303J119285K245359
11823b073286L35282j525780j410328O38566L414083M375552J527380k865373
$$ plain form
11882 101095 -2118966 -1693546 308548 1847850 1046523 -2148294 -4661414 -3337076 252724
11873 252724 1555593 176459 653474 4502634 6849743 4424464 1867570 4766973
11865 4766973 9996075 9433435 1811655 -5548595 -7080816 -5227316 -4684729 -5366259 -4265209
11856 -4265209 -1183979 1081146 1210671 1114822 3066567 6889347 10590175 12768465 13505166
11847 13505166 13151855 11422510 8516073 6363432 7070248 9851596 11011525 7720325
11839 7720325 838218 -6331850 -10765453 -10965208 -7539245 -3490818 -1982446 -2575272
11831 -2575272 -1646978 2072608 4774433 2630201 -2509627 -5437930 -4318645 -2073286
11823 -2073286 -1738004 -3263784 -4674112 -4035546 -621463 3754089 5281469 2416096
11815B416096l696987p1244K746184R46385k245150k219682m38829j286720m050075
11806g900022l747564P99505M976163N004166K393673O88585R58498J847681J963325
11797F984010J058175j15688q25452j611653l426847m894870k929629J974920
11789c787034M148321J29516m919989l381225L533495O806826K452004l011927
11781A969987k459799K062532L757842J193402j417127j903958k336149l633715
11773b766985l352898n35456J571877M98334j058006L88694K673286R25385l747746
11764e403515m471213Q02251M821958J421526m458420l591781L498460P149542
11756b31192K945641k510681k314675J504479L246045J963037n8071k254388m182400
$$ plain form
11815 2416096 -1280891 -1352135 1394049 2340434 95284 -2124398 -2563227 -3849947 -7900022
11806 -7900022 -11647586 -10848081 -5871918 -867752 1525921 2214506 3173004 5020685 6984010
11797 6984010 8042185 7926497 7101045 5489392 2062545 -2832325 -5761954 -3787034
11789 -3787034 361287 490803 -4429186 -7810411 -4276916 2529910 4981914 1969987
11781 1969987 -489812 1572720 5330562 6523964 5106837 3202879 866730 -2766985
11773 -2766985 -6119883 -6655339 -5083462 -4585128 -5643134 -5254440 -2581154 -1655769 -5403515
11764 -5403515 -9874728 -9072477 -4250519 -2828993 -7287413 -10879194 -7380734 -231192
11756 -231192 2714449 203768 -2110907 -606428 2639617 4602654 4544583 2290195 -1892205
11747a892205l231336Q61907L203250Q95186j190216J798071N351148K244516
11739H040321m591927n589642J41875L388863j43589l676531j505162K257136
11731a678656K227439P43470J773358K646813n81329m551668l339689J556546
11723a203716L718858K121517J257610K057929N33693l918746o115364l139116
11715d687335J053833J822865n2932j325483j303765p79492O51557K663562K328837
11706C71647j872481o011612m945488J85886L056820J080887j159886P85360M456475
11697d052392M506238R78506j034689N63335J985093R7217k404670j470853J558626
11688G26411J807350j705700m646275l680670o46062Q57929L29268K366J247681
$$ plain form
11747 -1892205 -5123541 -4261634 -1058384 -163198 -1353414 444657 5795805 8040321
11739 8040321 3448394 -2141248 -1999373 1389490 1245901 -2430630 -3935792 -1678656
11731 -1678656 548783 1292253 3065611 5712424 5131095 579427 -2760262 -1203716
11723 -1203716 2515142 4636659 5894269 7952198 8485891 4567145 -1548219 -4687335
11715 -4687335 -3633502 -1810637 -1863569 -3189052 -4492817 -5272309 -4620752 -1957190 371647
11706 371647 -1500834 -7512446 -12457934 -12272048 -9215228 -8134341 -9294227 -8508867 -4052392
11697 -4052392 453846 1432352 397663 960998 2946091 3043308 638638 -832215 726411
11688 726411 2533761 828061 -3818214 -7498884 -8144946 -7287017 -6957749 -6955383 -5707702
11679e707702L025914L303712J193814j840561k968330j202053P75487k32438
11671c652157l236085m021645j122517K157956K934535K864630M594127O501659
11663G020503M625836r08444n003579l993705l40439P79351j806826m009138j939060
11654e575501L052539N956341M032128l86246l172880k893677j125682K65336
11646A52358O45494K68133r1462K97342Q88247K90124r88140k47056K885013M110337
11636H210390K31333m750143m276816Q96167L360146J83828k956120j179931K150089
11627A868943J599641j707218k992082j715383o40864M59051L628540O390130
11619F890758L532047l930014p922320l856071L076253N213266J894726j893946
$$ plain form
11679 -5707702 -2681788 621924 1815738 -24823 -2993153 -4195206 -3419719 -3652157
11671 -3652157 -6888242 -10909887 -12032404 -9874448 -6939913 -4075283 518844 7020503
11663 7020503 11646339 10737895 5734316 1740611 1400172 2179523 372697 -3636441 -5575501
11654 -5575501 -2522962 3433379 7465507 7079261 3906381 1012704 -112978 152358
11646 152358 797852 1065985 974523 1271865 2160112 2450236 1462096 1215040 4100053 8210390
11636 8210390 8441723 3691580 -585236 310931 3671077 3854905 898785 -281146 1868943
11627 1868943 3468584 1761366 -1230716 -2946099 -3586963 -3127912 500628 6890758
11619 6890758 10422805 6492791 -1429529 -5285600 -2209347 3003919 4898645 3004699
11611C004699k901838j499432J310420M173464M081125m92199n573376n472034
11603c369171q27530J991603M82381o09096J906792L442503n93140n595769l682307
11594f853734L687416P180954L337904j461704k132740j536966k696764k515275
11586b990909J300681L956609J005122l327583k562542J621286L056381J515728
11578C574773J226928J828675k69957l290501k176903J414430P37465m155704
11570a110794n863069k222076N31188l56688O23017N888201Q463121L259669l576060
11561E636509l865948M50197J799529j231333l797456l167021q96039J120275
11553c951287J990287J298999M02795J337683K472322o2140m685987m683495P76483
$$ plain form
11611 3004699 102861 -1396571 -86151 4087313 8168438 7676239 2102863 -3369171
11603 -3369171 -4196701 -2205098 -1722717 -2331813 -425021 3017482 2424342 -3171427 -6853734
11594 -6853734 -3166318 4014636 7352540 5890836 3758096 2221130 -475634 -2990909
11586 -2990909 -1690228 2266381 3271503 -56080 -2618622 -997336 2059045 3574773
11578 3574773 4801701 6630376 6360419 3069918 893015 2307445 3044910 -1110794
11570 -1110794 -6973863 -9195939 -8664751 -9021439 -8398422 -2510221 5952900 9212569 5636509
11561 5636509 1770561 2220758 4020287 2788954 -1008502 -4175523 -5071562 -3951287
11553 -3951287 -1961000 -662001 -259206 1078477 3550799 3488659 -1197328 -5880823 -5104340
11544e104340L688906j48511l879432j270162K739904J333533k037054n00528
11536e177684L726258M223545K297913K889557L311441j779217p741311n358848
11528c608346K925139N466683l6698l584425J18990M341383L013276p54072k756668
11519E125262m094716n334036l511377R51124K846507J240157J372434M328107
11511B923462M200281n48588k808663R49662L896958O17511l518751k139963J308903
11502D880812P65568j707178j154672N06222q90366k512418O21227N389846M644687
11493A0543728r13756l896026j885530L55976j67438j072063k48837J164714K022005
11484E902773K403321J635227o42888k211203j207273J17523j038420k689222
$$ plain form
11544 -5104340 -1415434 -1563945 -5443377 -6713539 -3973635 -2640102 -4677156 -5177684
11536 -5177684 -1451426 2772119 5070032 7959589 11271030 9491813 1750502 -3608346
11528 -3608346 -683207 4783476 4746778 1162353 1281343 5622726 8636002 7881930 5125262
11519 5125262 1030546 -4303490 -7814867 -6863743 -4017236 -2777079 -1404645 2923462
11511 2923462 7123743 6575155 3766492 4716154 8613112 9230623 5711872 3571909 4880812
11502 4880812 5646380 3939202 2784530 3290752 2400386 -112032 509195 5899041 10543728
11493 10543728 9629972 5733946 3848416 4204392 4036954 2964891 2716054 3880768 5902773
11484 5902773 8306094 9941321 9298433 7087230 5879957 5997480 4959060 2269838
11476B269838j381286J148182N48452k330272k594178L43665K082292J020046
11468A106739K83084R36943k23708m012523n887642k789686J774304K999939J450764
11459d361786P77762J594945J644835N61182M93816J934338K138041r04831m779193
11450i00891n029307r63546L035476L038155N53510j90482J453712K304062R33234
11441D233923n36137q42119j508739k836130k372808J87549R84894j777205l749892
11432h216664q63182L821549M708929K145835O93298J131024L64722j723561j667863
11423C94087J001141K319944L59779j723341r68308J004548J094671o41444j654598
11414A186479n98023J216987J473934m34535k212632j216370J449865J799858
$$ plain form
11476 2269838 888552 2036734 2585186 254914 -2339264 -1995599 86693 1106739
11468 1106739 1389823 2326766 2103058 -1909465 -7797107 -10586793 -8812489 -5812550 -4361786
11459 -4361786 -3584024 -1989079 -344244 216938 710754 2645092 4783133 3878302 -900891
11450 -900891 -5930198 -6893744 -3858268 -820113 -266603 -457085 996627 3300689 4233923
11441 4233923 3697786 2855667 1346928 -1489202 -3862010 -3674461 -2689567 -4466772 -8216664
11432 -8216664 -9079846 -5258297 -549368 1596467 2289765 3420789 3785511 2061950 394087
11423 394087 1395228 3715172 4074951 2351610 1383302 2387850 3482521 2841077 1186479
11414 1186479 588456 1805443 3279377 2844842 632210 -584160 865705 2665563
11406B665563q48951j976335J222315M725976L568381n39689k632136k646878
11398C538246l931112n601976l502714J789236M906910L949305K190295J168939
11390D507129q80691k874705r38182L415274L264907k252424m621603R74176O978512
11381G572393M575743l003194o324418m018639k256011k963402k036468J364241
11373g089755K732135P24898p9817K513236L937667L27740m959754o341164l522078
11364a1756892L5270K852081N128989N055903O02938n464256p046741k267701
11356a2860409L806390N414572K402627j290389k890822k181583L42083L477130
11348c780401M364417J063911l699632m736485j247642J875716J125993r08474
$$ plain form
11406 2665563 1816612 -159723 1062592 5788568 9356949 8817260 6185124 3538246
11398 3538246 -392866 -5994842 -9497556 -7708320 -2801410 1147895 3338190 4507129
11390 4507129 3626438 751733 -186449 3228825 6493732 4241308 -380295 593881 7572393
11381 7572393 12148136 9144942 2820524 -1198115 -3454126 -6417528 -8453996 -7089755
11373 -7089755 -4357620 -3632722 -3712539 -1199303 2738364 3066104 -1893650 -8234814 -11756892
11364 -11756892 -11721622 -8869541 -3740552 1315351 1918289 -3545967 -10592708 -12860409
11356 -12860409 -9054019 -3639447 -1236820 -2527209 -5418031 -7599614 -7257531 -3780401
11348 -3780401 584016 1647927 -2051705 -6788190 -8035832 -6160116 -5034123 -5942597
11340e942597n62489Q29776P0722j531159l36760K630835K922369O07252N15044
11331g97007L475974M023917m75395m766167l853973n08738N49751P60736L401258
11322A810356N364184J456676n270266o361149j090026K068325j002963l623252
11314f648115L47813O131879N374138j042563m654258j606742L292490M228219
11306E422861Q24886l432035n153280k886247J754466M386552K049152k727778
11298B38577m529127j526007L213273O214504O154175K599933l461370p504832
11290A399126m748845K640597O105819J334970n491996n824539k3406M147748
11282d60526K562615r68376j629373n9436K02782j371614j935414R5735K491217
$$ plain form
11340 -5942597 -6505086 -5675310 -5604588 -7135747 -7472507 -4841672 -1919303 -1312051 -797007
11331 -797007 2678967 6702884 6227489 1461322 -2392651 -2901389 -2351638 -1590902 1810356
11322 1810356 7174540 8631216 3360950 -3000199 -4090225 -2021900 -3024863 -6648115
11314 -6648115 -6300302 -168423 5205715 4163152 -491106 -2097848 1194642 5422861
11306 5422861 6247747 2815712 -2337568 -5223815 -3469349 917203 2966355 238577
11298 238577 -4290550 -5816557 -2603284 3611220 9765395 12365328 8903958 1399126
11290 1399126 -3349719 -709122 5396697 6731667 1239671 -4584868 -4608274 -460526
11282 -460526 2102089 1133713 -495660 -555096 -352314 -1723928 -3659342 -3563607 -1072390
11273a072390K006984j324460l937751k989568J90925J965516R76044p85129j237238
11264f207067n58484N762j85502j068294j718652l75015L149342N509282L594959
11255B146331j948J30320L409615L282927j874481m758681m79988M737709K960381
11246I552185k796902l818994J54477J722772r25644j771876J465493L288379
11238F869890L28124l310807l797838k922198k207451P35700N662943O699028
11230H057391J231010m353561l529610J044902K791999R33884j034031k208351
11222B933633l321612k650022P54080K918478L44446l349305k554897J288058
11214c637141K557337R77771R21439K692254K206770q99623k187086p0638K017353
$$ plain form
11273 -1072390 934594 -389866 -4327617 -7317185 -7126260 -5160744 -4184700 -4969829 -6207067
11264 -6207067 -6765551 -6759789 -6945291 -8013585 -9732237 -10107252 -6957910 -1448628 2146331
11255 2146331 2144383 2274703 5684318 8967245 7092764 2334083 1854095 6591804 9552185
11246 9552185 6755283 2936289 3090766 4813538 3887894 2116018 3581511 6869890
11238 6869890 7198014 3887207 89369 -2832829 -5040280 -4304580 1358363 8057391
11230 8057391 9288401 4934840 1405230 2450132 5242131 6176015 5141984 2933633
11222 2933633 -387979 -3038001 -2283921 634557 979003 -2370302 -4925199 -3637141
11214 -3637141 -1079804 -102033 819406 3511660 5718430 4818807 2631721 2561083 4578436
11205D578436K018268J628549J310289q31752l638032k546836K809699O084945
11197A1413566K528229m321577p407421m576076L88397K859008J546616q59985
11189A570757n89087K280134L001208j012827m925109l010042J686839J398317
11181D00190l418253m059424J907935N620913P94013o109283o129656r67972K065658
11172i895879K423783M356843O477830L502575k921055n058353j475561N70729
11164b019088k711072n665694l129035J269048K093614J263711L607370P419856
11156B128710O746704J269399k973850k710343j236037j902992l009189j576053
11148c263651J609319L586336L395389K104171M10667j477982k798622l013350
$$ plain form
11205 4578436 6596704 8225253 9535542 8703790 5065758 2518922 5328621 11413566
11197 11413566 13941795 9620218 2212797 -2363279 -1974882 884126 2430742 1570757
11189 1570757 981670 3261804 6263012 5250185 325076 -2684966 -998127 400190
11181 400190 -3018063 -7077487 -5169552 451361 1245374 -4863909 -10993565 -11961537 -9895879
11172 -9895879 -7472096 -3115253 3362577 6865152 3944097 -1114256 -2589817 -2019088
11164 -2019088 -4730160 -10395854 -13524889 -12255841 -10162227 -8898516 -5291146 2128710
11156 2128710 8875414 10144813 7170963 4460620 3224583 1321591 -1687598 -3263651
11148 -3263651 -1654332 1932004 5327393 7431564 7842231 6364249 3565627 552277
11140E52277k709146k295766j054895J072419K289553J348909l24763q96424q68442
11131b886278j163915l20231K961548N778727L886721j480391m117853j271083
11123A387245K525370J986599k006934m648311l767812j226153P09096J623767
11115c417133K096744K475702K516747J613442j33180j187039l00823J168017
11107D832477P07368j452152k322431n24469J887718K672518J851137J35872k251701
11098E536337m148765l705855j320454L64437L85344M66608J338683J597515J226808
11089A740658K143388L760809K536657j906664m818250l186818p8849Q51178N13434
11080A555543O63711m4932k168711k445266O23758K787561P80022j630313j24653
$$ plain form
11140 552277 -2156869 -4452635 -5507530 -4435111 -2145558 -796649 -1121412 -2017836 -2886278
11131 -2886278 -4050193 -4370424 -1408876 4369851 8256572 6776181 2658328 1387245
11123 1387245 3912615 5899214 3892280 -756031 -4523843 -5749996 -5040900 -3417133
11115 -3417133 -1320389 1155313 3672060 5285502 5152322 3965283 3664460 4832477
11107 4832477 5539845 4087693 1765262 1240793 3128511 5801029 7652166 7788038 5536337
11098 5536337 1387572 -2318283 -3638737 -3274300 -2888956 -2422348 -1083665 513850 1740658
11089 1740658 3884046 7644855 10181512 8274848 3456598 269780 190931 1042109 1555543
11080 1555543 2219254 2174322 5611 -2439655 -1815897 971664 1751686 121373 -3280
11071c280K341105J072327j323285M13455L680152J291507n959004r039332l722194
11062a1248549L728266N532492J181070m074069m904692K50015O990826P613297
11054E068656L04384o508249m478241K763399N119313R86484j985565n0368K148314
11045C368127J024639q98180j255481j315636j277609O17004K740782J244475
11037D248121k182196j696309K229940K625027j725016l676161o87835Q0340n013421
11028e797510p954450j816077O876193P622618J521580k040978l524K296950J396843
11019B101645k86232k42733Q17803J661117J982380J261644o33577k385790k913633
11010A362624k584628j421780J052662K990093J382456k250791k414346J664440
$$ plain form
11071 -3280 2337825 3410152 2086867 2500322 6180474 7471981 1512977 -7526355 -11248549
11062 -11248549 -7520283 -1987791 -806721 -4880790 -9785482 -9535467 -2544641 5068656
11054 5068656 5373040 -1135209 -5613450 -2850051 2269262 3255746 1270181 1219813 3368127
11045 3368127 4392766 3494586 2239105 923469 -354140 262864 3003646 4248121
11037 4248121 2065925 369616 2599556 5224583 3499567 -176594 -864429 -784089 -5797510
11028 -5797510 -13751960 -15568037 -8691844 -1069226 452354 -1588624 -1592148 704802 2101645
11019 2101645 1815413 1572680 2390483 4051600 6033980 7295624 6662047 4276257 1362624
11010 1362624 -1222004 -2643784 -1591122 1398971 2781427 530636 -1883710 -219270
11002b19270L606140l48204n054207m577079r70064N68868K50345J183298K518312
10993c041861J622267j00710K79663J631525J380520Q91200K516826M094871K363039
10984A1637340o50014p56285J023006L63363k804848m654828m057570l114914
10976c014750k237337j36594K226758K734004K097236K138862J748279n38133
10968E018325j968184P10439M617135L986948q93393m151355l311759j694895
10960B313261j624624j237119O99507J890584M03033k028521k275948M75752L781509
10951B397434L841514l92359m445553k885028K288292L076598k194592m985502
10943c299196M9660N438457K620963l710900l578239J400828J660264l051281
$$ plain form
11002 -219270 3386870 3038666 -2015541 -6592620 -7562684 -6993816 -6743471 -5560173 -3041861
10993 -3041861 -1419594 -1520304 -1240641 390884 1771404 2662604 5179430 9274301 11637340
10984 11637340 10987326 10231041 11254047 11617410 8812562 4157734 100164 -3014750
10976 -3014750 -5252087 -5388681 -3161923 -427919 1669317 3808179 5556458 5018325
10968 5018325 3050141 3760580 8377715 12364663 11471270 7319915 4008156 2313261
10960 2313261 688637 -548482 151025 2041609 2444642 416121 -1859827 -1384075 2397434
10951 2397434 6238948 5846589 1401036 -1483992 804300 3880898 1686306 -3299196
10943 -3299196 -3249536 2188921 4809884 1098984 -2479255 -1078427 581837 -2469444
10935b469444l945386P8199N19838m132047m509659K490957O662618J611277l725453
10926g419100M9631P131581O724053N66051j808179M54007K89702l172747l541747
10917g26748L52425K134001n05512j813652J348725L436561m56050n758124m756541
10908f744915K122757P098336N465427L36705l016230l504848l321625l283734
10900d848127j919565J036606K896755J468851j230926j325674J210489K249706
10892d61885k73089k989321k022241J300036K670268J112348l92096R644Q52772
10883a93564O72027K80379M94424L37374o39886n67250J700993L495913J523768
10874G104178k662729m081494j450318J086636P32293K48074K343440L835935
$$ plain form
10935 -2469444 -6414830 -6336631 -5816793 -9948840 -14458499 -11967542 -5304924 -3693647 -7419100
10926 -7419100 -7369469 -237888 6486165 7052216 5244037 5698044 5987746 2814999 -726748
10917 -726748 -374323 1759678 1254166 -559486 789239 4225800 3769750 -1988374 -6744915
10908 -6744915 -4622158 2476178 7941605 8278310 5262080 1757232 -1564393 -4848127
10900 -4848127 -6767692 -5731086 -2834331 -1365480 -2596406 -3922080 -2711591 -461885
10892 -461885 -734974 -3724295 -5746536 -4446500 -1776232 -663884 -1055980 -1046336 -193564
10883 -193564 478463 758842 1253266 1590640 950754 383504 2084497 5580410 7104178
10874 7104178 4441449 359955 -1090363 -3727 728566 976640 3320080 7156015
10866G156015M27147n222037o374744k436376K58038j287980k347139J050098
10858h776978N358646N367075J979962n33388j273442j817252j640957N35622
10850h00712K987872L151528J721144O35281o45394k736178l175065n80556J130488
10841A688408j486483m414097j964516K914866K518003k564141l618001K103975
10833d821986O863256M799604J32176j291208r56627k619453m473624k728434
10825e096296J225546L124077K327282J052143j89706j845122k487383r52169
10817b841628R36416J358496J487249K082166P91909k840466l832383R78359N818669
10808C938787L326711l546766n253448k99220K756835r13246n387833m015441
$$ plain form
10866 7156015 7583162 2361125 -4013619 -6449995 -6191957 -7479937 -9827076 -8776978
10858 -8776978 -3418332 1948743 3928705 3395317 2121875 304623 -1336334 -800712
10850 -800712 2187160 5338688 7059832 7695113 7049719 4313541 1138476 557920 1688408
10841 1688408 201925 -4212172 -6176688 -3261822 -743819 -3307960 -6925961 -4821986
10833 -4821986 2041270 6840874 6973050 5681842 4725215 2105762 -2367862 -5096296
10825 -5096296 -3870750 -746673 1580609 2632752 2443046 597924 -1889459 -2841628
10817 -2841628 -1905212 -546716 940533 3022699 3814608 974142 -2858241 -1879882 3938787
10808 3938787 7265498 3718732 -1534716 -1833936 922899 9653 -5378180 -9393621
10800i393621J149032M475620M977986M128058R15563m701180p628850l778593
10792i855985K394610L353648m20283j941104P55062K512880R93127M64819L140030
10783A396804M439788J185458k210302j267255O29697j405181m132359j175831
10775b539181N040475N459821j556160p026079m336635K059014M539352K780976
10767D421583J563860K405374K587933M19626k778760m987619m965016k518319
10759c851338M81068Q47531j829892l386226j26788N336761O434244J074561m958320
10750B1601m679385J288087N016190J221576n391936n936569M20921N073301K308355
10741f57859k775863k869031N06615J266780p1901J768247N819776N377675j67479
$$ plain form
10800 -9393621 -8244589 -3768969 1209017 5337075 6252638 1551458 -6077392 -9855985
10792 -9855985 -7461375 -4107727 -4528010 -6469114 -5714052 -3201172 -2208045 -1743226 1396804
10783 1396804 5836592 7022050 4811748 3544493 4174190 2769009 -1363350 -2539181
10775 -2539181 2501294 7961115 6404955 -621124 -4957759 -2898745 1640607 4421583
10767 4421583 5985443 8390817 10978750 11398376 8619616 3631997 -1333019 -3851338
10759 -3851338 -3370270 -2522739 -4352631 -7738857 -7865645 -2528884 3905360 4979921 21601
10750 21601 -4657784 -3369697 1646493 2868069 -2523867 -8460436 -8039515 -2966214 -657859
10741 -657859 -3433722 -6302753 -5796138 -4529358 -4601259 -2833012 2986764 8364439 8196960
10732H196960l471728j131319J535450N20264p73601N63632J229423j136470k610007
10723B922604k89719J924761N30556j204149K4249J041013j115151k510707M02702
10714A726159L025735K67941l629171j913613K699106K568595j682984k526167
10706E35601J594152M214807J536665k902601m645680l000411N67091L384786
10698A284410K117141k627291m606929k50419M736345L445290j437040k621249
10690D0258k76922l1972j779543n46081K923794K723233j226136k589066L16760
10681d45675K208211P05226m61427L95800K02269j614705j418584J053129J384923
10672B009167j115119j630928J149361K137420j082871l877656k790837j128314
$$ plain form
10732 8196960 4725232 3593913 5129363 5649627 4876026 5439658 6669081 5532611 2922604
10723 2922604 2632885 4557646 5088202 3884053 3908302 4949315 3834164 1323457 1726159
10714 1726159 4751894 5019835 1390664 -522949 2176157 4744752 3061768 535601
10706 535601 2129753 6344560 7881225 4978624 332944 -2667467 -2100376 1284410
10698 1284410 3401551 774260 -3832669 -4083088 653257 4098547 2661507 40258
10690 40258 -236664 -268636 -2048179 -2594260 329534 3052767 1826631 -762435 -445675
10681 -445675 1762536 2467762 2006335 2402135 2604404 989699 -428885 624244 2009167
10672 2009167 894048 -736880 412481 2549901 1467030 -2410626 -5201463 -6329777
10664f329777k276799l605466j419684K864570N477980N454416M009995K054522
10656F229757M70592n9014n88386k359674l854561k901626p57700J50335Q74804
10647b795473L111021L935333O9708m592282l671956Q49173J388225k233639k479096
10638f418986K418420N082225J707591j774445k66952K596944J937745n71467
10630D711075j412988j327697j955780j904525m13609N5535j417106j650440J091408
10621d224127L559155K629538j37915j607150j050695O15627J997435J096869
10613B878737k006929k995922J127375N688767M115752j290672k455865J253479
10605F314722K350547j409690l049141J374804N796853L802266k162226n657902
$$ plain form
10664 -6329777 -8606576 -12212042 -13631726 -10767156 -5289176 165240 4175235 6229757
10656 6229757 6700349 6641335 6052949 3693275 -161286 -3062912 -3820612 -3670277 -2795473
10647 -2795473 315548 4250881 4320589 -271693 -3943649 -3094476 -1706251 -3939890 -6418986
10638 -6418986 -4000566 1081659 2789250 1014805 747853 3344797 5282542 4711075
10630 4711075 3298087 1970390 14610 -1889915 -2303524 -2247989 -3665095 -5315535 -4224127
10621 -4224127 -664972 1964566 1826651 219501 -831194 -215567 1781868 2878737
10613 2878737 871808 -2124114 -996739 4692028 8807780 7517108 5061243 6314722
10605 6314722 8665269 7255579 4206438 5581242 11378095 15180361 13018135 7360233
10597G360233m558536j028720J895579J515922k102616m180154q17571L998645
10589B082782L382474j440108k891424O98718L134308R37185k466439l652847
10581b15351k536300Q98848N414432N593278j171116p165543l988315L185792
10573A5725K909301l695915n272817K56930L694263J826969J006097K652066J109463
10564D502082k493020m19896N612580N042839k562948o141631l088840k401250
10556a950084n052072j137541Q844538J0713021J182736n009725m68916L156852
10548A0278809j949328o070834j985361J596781j411085k169786M136637O505180
10540H931013j071999o077315N39070P224831K304810n732398m514419J660593
$$ plain form
10597 7360233 2801697 1772977 3668556 5184478 3081862 -1098292 -1915863 2082782
10589 2082782 5465256 4025148 1133724 1832442 4966750 5903935 3437496 -215351
10581 -215351 -2751651 -1852803 3561629 9154907 7983791 818248 -3170067 15725
10573 15725 2925026 -770889 -6043706 -5786776 -2092513 -265544 740553 3392619 4502082
10564 4502082 2009062 1589166 7201746 12244585 9681637 3540006 451166 -1950084
10556 -1950084 -7002156 -8139697 704841 11417862 12600598 7590873 7121957 10278809
10548 10278809 8329481 2258647 273286 1870067 458982 -1710804 2425833 8931013
10540 8931013 7859014 1781699 2320769 9545600 11850410 6118012 1603593 3264186
10532C264186L254470K396735L664360K811478j867685k356490K831611K366402
10524A6365067o481687r577552r32238N510344J666768p12995M519772M478087
10516A4835566n304776p837138L521384R675387J084678l504693N521481P741832
10508B5733721o516915j2797110J496914Q841118o999342j5326414N472553K2377353
10500B2281878N996190j2965868j122853J2762793m357144j8134758Q687519L2016551
10492D5164308K334650k6074481J6330184N6693085l3418008j98242407k21367542
10485c58580211l6641656J51785492J49863683K8460448k3202967K1340060M3954233
10478b3020918M768824j9143830N840015K0436768n128907k1299214J281436K0918347
$$ plain form
10532 3264186 6518656 8915391 12579751 15391229 13523544 11167054 13998665 16365067
10524 16365067 9883380 305828 -626410 4883934 6550702 5837707 10357479 14835566
10516 14835566 9530790 1693652 5215036 14890423 15975101 12470408 17991889 25733721
10508 25733721 19216806 6419696 7916610 16757728 9758386 -5568028 -95475 22281878
10500 22281878 28278068 15312200 14189347 26952140 22594996 4460238 13147757 45164308
10492 45164308 47498958 21424477 37754661 94447746 61029738 -137212669 -358580211
10485 -358580211 -395221867 -243436375 -93572692 -65112244 -88315211 -66975151 -23020918
10478 -23020918 -18252094 -37395924 -31555909 -11119141 -16248048 -37547262 -36265826 -15347479
10470a5347479O179765j2445259n992146N063477m24115m773987O858992J4145815
10462f734937J776265r867172k738434P078845K077906n485162m94622O631784
10454g755527K714783l174529n728L471636j756976n453266J742753Q464309K536787
10445G84242o681554m757548L838518N782003O09853l249283l903448m177126
10437a1754343l117416J24763J903039J055991J723486M124422K621156k937223
10429f256125n121001j651936J524736K301653M481868O051594M23246q192081
10421f438046p070921L716925R251066L647427j561708J041903K838703k913491
10413B511858q134030m950337R55189K119660J389266K737447K311812k053261
$$ plain form
10470 -15347479 -9167714 -21612973 -27605119 -22541642 -22965757 -27739744 -20880752 -6734937
10462 -6734937 -4958672 -14825844 -17564278 -10485433 -8407527 -13892689 -14387311 -7755527
10454 -7755527 -5040744 -8215273 -8221001 -4749365 -6506341 -11959607 -10216854 -1752545 784242
10445 784242 -5897312 -10654860 -6816342 -1034339 -424486 -3673769 -7577217 -11754343
10437 -11754343 -14871759 -14746996 -12843957 -11787966 -10064480 -5940058 -3318902 -6256125
10429 -6256125 -11377126 -13029062 -11504326 -9202673 -4720805 1330789 1754035 -6438046
10421 -6438046 -13508967 -9792042 -540976 3106451 1544743 2586646 5425349 2511858
10413 2511858 -5622172 -10572509 -9617320 -7497660 -6108394 -3370947 -1059135 -3112396
10405c112396l900451L73225L971205J870734k83668K448541M763650J302537
10397G433377l558319m160215k644939k434485j656149O11232P84875j026976
10389f651599O93596N351497M332082l766787q211079l114012L107503K830488
10381e428311J077367L415589M566672l38894m440592o76267M955395L351093
10373F482052k626130m374588j773303l11794k33030J165772J914878l98773j928039
10364b082955J135765M648552L080590j181740k825083k465580l010772k877772
10356e578995l74484R54094j184812k116546J432305L871857O1751m542234k577260
10347a0054324K278843J521265l483888l912346J855966O175016M109908q99914
$$ plain form
10405 -3112396 -7012847 -6639622 -2668417 -797683 -1081351 1367190 6130840 7433377
10397 7433377 3875058 -285157 -2930096 -5364581 -7020730 -6409498 -5624623 -6651599
10389 -6651599 -5958003 -606506 3725576 -41211 -8252290 -11366302 -8258799 -5428311
10381 -5428311 -4350944 -935355 3631317 3292423 -1148169 -1824436 3130959 6482052
10373 6482052 3855922 -518666 -2291969 -2603763 -2836793 -1671021 243857 -154916 -2082955
10364 -2082955 -947190 3701362 6781952 5600212 2775129 309549 -2701223 -5578995
10356 -5578995 -5953479 -4999385 -6184197 -8300743 -6868438 -2996581 -2934830 -7477064 -10054324
10347 -10054324 -7775481 -6254216 -9738104 -13650450 -11794484 -5619468 -1509560 -2409474
10339b409474l525580k392874N67010K173298K54309l224572l621616k57795K516366
10330i920928K733408L259944M435038K064509l416723m638457M07543L138991
10322a936675j463093n182214k64581O498879M904200j242163j116423M256124
10314D454054M376677k305641o351472l370144O07487R55362L44974P66644k79594
10305h01653k893037k788329Q08061K732030J99484l009917l287416k075888j442815
10296a2559480l78045J640823K256858M50340p64622J160088M050337M023809
10288a19892Q76731j832280j242579J744485L863773L428420K057017J611160
10280A0386835P83274k431013n751025m625107L77801L446683K233769Q91867
$$ plain form
10339 -2409474 -5935054 -8327928 -7760918 -5587620 -5333311 -8557883 -12179499 -12437294 -9920928
10330 -9920928 -7187520 -3927576 507462 2571971 -844752 -5483209 -5075666 -1936675
10322 -1936675 -3399768 -8581982 -8846563 -2347684 2556516 1314353 197930 4454054
10314 4454054 8830731 6525090 173618 -3196526 -2589039 -1633677 -1288703 -522059 -801653
10305 -801653 -3694690 -6483019 -5674958 -2942928 -2743444 -5753361 -9040777 -11116665 -12559480
10296 -12559480 -12937525 -11296702 -9039844 -8589504 -9354126 -8194038 -4143701 -119892
10288 -119892 756839 -1075441 -2318020 -573535 3290238 6718658 8775675 10386835
10280 10386835 11170109 8739096 2988071 -1637036 -1259235 2187448 4421217 5313084
10272E313084K015876K010119j502525m018640j494419K093752J019909k751953
10264B685203l332672p27347K43849j405640k104007m38742J327936J681493J017547
10255a052380m18214j717421n62859K688818L234875j192498n146926k972210
10247g138815K002976K524606j175276k591774J10368K153221P85506j366774
10239d695962k075413k220881j926427K27683L103153L290071O07201j236519
10231d927094m76081M06841o58155j994936q92925K661346N713629M725684q19116
10222C739193o177314n262863J353375N767868K766490l429504n971346m471517
10214a1685618k550432p71458J960243L671596K514560J501267L415745M324093
$$ plain form
10272 5313084 7328960 9339079 7836554 3817914 2323495 4417247 5437156 2685203
10264 2685203 -647469 -1374816 -1130967 -2536607 -4640614 -5079356 -3751420 -2069927 -1052380
10255 -1052380 -1470594 -3188015 -3750874 -1062056 2172819 980321 -4166605 -7138815
10247 -7138815 -5135839 -2611233 -3786509 -6378283 -6267915 -4114694 -3329188 -4695962
10239 -4695962 -6771375 -8992256 -10918683 -10691000 -7587847 -4297776 -3690575 -4927094
10231 -4927094 -5403175 -4996334 -5654489 -7649425 -8542350 -5881004 -167375 4558309 3739193
10222 3739193 -2438121 -7700984 -6347609 -579741 2186749 -1242755 -7214101 -11685618
10214 -11685618 -14236050 -15007508 -13047265 -9375669 -6861109 -5359842 -1944097 2379996
10206B379996l53117o378558n938418k63535K274644k34684j247872K131452M762962
10197b867130L300457J464808K146122K075082j418005m769809l870756n21443
10189d460674R50126j36515j377927j103126P83651L185485L659901P35991k885471
10180f48559k799093Q71820L373224K032730p02570j566714j49696K196113L594888
10171F202143J762120l380876p436624n853113j76344L947286M113191K252586
10163A430369j0264j913970j237835K554376M640501J097526l225222j223339
10155B112142M039942L416371k795626n118092j464219l74470m501162m668940
10147i354054L313787R249045N071012j179826O71983N239899J525508p124705
$$ plain form
10206 2379996 2026879 -4351679 -10290097 -10553632 -8278988 -8513672 -9761544 -7630092 -2867130
10197 -2867130 433327 1898135 4044257 6119339 4701334 -68475 -3939231 -4460674
10189 -4460674 -3510548 -3647063 -5024990 -6128116 -5344465 -2158980 1500921 2236912 -648559
10180 -648559 -3447652 -2575832 797392 2830122 2127552 560838 411142 2607255 6202143
10171 6202143 7964263 4583387 -2853237 -8706350 -8882694 -4935408 -822217 1430369
10163 1430369 1420105 -493865 -1731700 822676 5463177 6560703 3335481 2112142
10155 2112142 6152084 9568455 6772829 1654737 190518 -183952 -4685114 -9354054
10147 -9354054 -6040267 3208778 8279790 7099964 7771947 13011846 14537354 7412649
10139G412649q363002j835035R12668l464727n309677N92193O478524N212907
10131A636500J023745N49744K273956J651302k98156m03364M3635j278469j949350
10122C249543R06733L821092J339010m658778o770014k838536J437954J623146
10114a889850M10372J814684M182652K995972j898330n939398n920959l066494
10106i311351j20752J639368J906128N62992j220842j095807J598241M311965
10098a730058M075520Q82638k700332m101617k150152K139568M994150K674787
10090D084504l097579n442773j183845L729362K363776k415682k031354M067387
10082G3796O883501J638803m980889n321767j572186l74947k000278j719028J412221
$$ plain form
10139 7412649 -950353 -2785388 -1872720 -5337447 -10647124 -10054931 -3576407 1636500
10131 1636500 2660245 3209989 5483945 7135247 6837091 6433727 6477362 5198893 3249543
10122 3249543 4156276 7977368 9316378 4657600 -2112414 -4950950 -3512996 -1889850
10114 -1889850 -1479478 335206 4517858 7513830 5615500 -323898 -6244857 -9311351
10106 -9311351 -9432103 -7792735 -5886607 -5323615 -6544457 -7640264 -6042023 -1730058
10098 -1730058 2345462 3228100 527768 -3573849 -5724001 -3584433 1409717 4084504
10090 4084504 986925 -4455848 -5639693 -1910331 453445 -1962237 -3993591 73796
10082 73796 6957297 8596100 3615211 -1706556 -3278742 -3653689 -5653967 -7372995 -5960774
10073e960774L989507M544805M120279K087127k245622m974778j572884M538914
10065D526574M768091k013744p017937m380523Q41609J800844J06421O51532J804473
10056A087340j033726n373273m305495J454081L387004j248974m459183l17562
10048a0809788N034771K944743l771688m998106J016169N277300K073505k962831
10040f195925k339814K255568L831520R86955j268011j81644J129736l60251k636605
10031d778471k115245P68143K573539K338564K668125M598936M511967p69749
10023I795809p317467p255752K30799N964004K632031m572823n319447N07184
10015e335662L184360j013969l992129L19710N324825K333201m877135n585082
$$ plain form
10073 -5960774 -1971267 2573538 6693817 8780944 6535322 1560544 -12340 4526574
10065 4526574 9294665 7280921 262984 -4117539 -3275930 -1475086 -1368665 -717133 1087340
10056 1087340 53614 -5319659 -9625154 -8171073 -4784069 -6033043 -10492226 -10809788
10048 -10809788 -5775017 -2830274 -6601962 -11600068 -10583899 -5306599 -3233094 -6195925
10040 -6195925 -8535739 -6280171 -2448651 -1461696 -2729707 -2911351 -1781615 -2141866 -4778471
10031 -4778471 -6893716 -6125573 -3552034 -1213470 1454655 6053591 10565558 9795809
10023 9795809 2478342 -4777410 -4546611 1417393 4049424 -523399 -5842846 -5335662
10015 -5335662 -2151302 -3165271 -7157400 -6837690 -1512865 820336 -4056799 -9641881
10007i641881J319884O325497M043045n81426k032842j385532p83286J359942
9999a376599N185847N853584O32662n195453n215427j234976M7799k468866l157696
9990f929125J310294O965069P796621K813741l424750n646309k679750J662724
9982A868515K750758M91939j035511J47928J031231r38678k875997q42112L210934
9973C809007L901142P10065j644342j214393j407340l973017n111478j971977
9965f902333J647110P51942k921118l644874m66921K232079K280755K200846L389761
9956a432753L167305j21457l382738l186098p16022P65813P96627Q80974J016443
9947b211906M15579q8927L00858m327k146707l439668j053859K422362K138865
$$ plain form
10007 -9641881 -8321997 -1996500 2046545 1465119 -567723 -1953255 -2736541 -1376599
9999 -1376599 3809248 9662832 10295494 5100041 -115386 -1350362 -1302563 -3771429 -6929125
9990 -6929125 -5618831 1346238 9142859 11956600 8531850 2885541 205791 1868515
9982 1868515 4619273 5111212 4075701 4223629 5254860 4316182 1440185 598073 3809007
9973 3809007 7710149 8420214 6775872 5561479 4154139 181122 -4930356 -6902333
9965 -6902333 -5255223 -4503281 -7424399 -11069273 -11536194 -9304115 -7023360 -4822514 -1432753
9956 -1432753 1734552 1613095 -1769643 -4955741 -5671763 -4905950 -4109323 -3228349 -2211906
9947 -2211906 -1796327 -1885254 -1584396 -1588723 -3735430 -7175098 -8228957 -5806595 -3667730
9938c667730j119626j907074Q36610J955074j075713l638204j499775K467091
9930g649347L317564J618559J217553K333933J788851j309453m232154m414774
9922g329268j822712J639746L224097J418562j501670j339365K079599M065799
9914D34788K093791m82310n95627n69793k787661m017508q53223L138250K488931
9905a150362r18739j037141J934871K196909j410294l723266k165280J06809R07030
9896e259463J741608K486870M24381l426120l800213M97615M115063L540410J618481
9887A938632R56422l99723l139488l433072j38303J326182k073031m449911l75367
9878i787659M723877K195857n374021o985021L46836P335663O285139J073172
$$ plain form
9938 -3667730 -4787356 -6694430 -5857820 -3902746 -4978459 -8616663 -10116438 -7649347
9930 -7649347 -4331783 -2713224 -1495671 838262 2627113 1317660 -2914494 -7329268
9922 -7329268 -9151980 -7512234 -4288137 -2869575 -4371245 -5710610 -3631011 434788
9914 434788 2528579 2046269 1450642 880849 -1906812 -5924320 -6777543 -3639293 -1150362
9905 -1150362 -2069101 -3106242 -1171371 1025538 -384756 -4108022 -6273302 -6166493 -5259463
9896 -5259463 -3517855 -1030985 -606604 -4032724 -7832937 -7335322 -3220259 320151 1938632
9887 1938632 2895054 2495331 -644157 -4077229 -4215532 -2889350 -4962381 -9412292 -9787659
9878 -9787659 -5063782 -2867925 -8241946 -15226967 -14880131 -7544468 -1259329 -186157
9870a86157m82869J971371K900855L86823j697356n32587J359042M67867j970613
9861B216376j747813J571364L298642M39270l349048k832431R37110K278541m31562
9852B380449k820696j882670r7481k05480o16169Q45680K452548J535510q27079
9843G64612j667710o03712P45685J863914K678563J639381k007313n154034l563972
9834e304586K387543P231092O029156o22947o904767o758310R1762O881024O631116
9825I661083L49639m550024m147743j894595j354504n98122K664442N226483K790357
9816H147016k863626o198947n334551k527930P66350M368946O197737L714188
9808F269183j487593m587123l325022j2597J946312J143075j347326k467176J74046
$$ plain form
9870 -186157 -669026 1302345 4203200 4590023 2892667 2360080 3719122 4186989 2216376
9861 2216376 468563 2039927 5338569 5777839 2428791 -403640 533470 2812011 2380449
9852 2380449 -440247 -2322917 -2420398 -2625878 -3242047 -2396367 56181 1591691 764612
9843 764612 -903098 -1506810 -761125 1102789 3781352 5420733 3413420 -1740614 -5304586
9834 -5304586 -2917043 4314049 10343205 9720258 2815491 -3942819 -3851057 3029967 9661083
9825 9661083 10010722 5460698 1312955 -581640 -1936144 -2534266 130176 5356659 8147016
9816 8147016 5283390 -915557 -6250108 -8778038 -8011688 -3642742 2554995 6269183
9808 6269183 4781590 194467 -3130555 -3143152 -1196840 -53765 -1401091 -3868267 -3694221
9799c694221M115892L409659k854118p049666k729696N404146P325038J486788
9791E413822l862508k603481K541835N876904N496113K709762o42731k738698
9783A2191018k965703l046750m026424l306252J042681M669961J770607n074453
9775A254685o918134j178808M688862M244042j6043k719328l174549k941234j508293
9766h268800R84920J349611j563371l246639K00275N441417O358355K551952j253770
9757B553950k218956j336142m7931P90693j86466l023438m537055j964425K413261
9748g556509L911881J864423k99934p47830r82339j785882j436124Q11234K633734
9739c587346J869849k25002q26704N20333J627842J050989Q6039N18305J403116
$$ plain form
9799 -3694221 421671 3831330 977212 -6072454 -8802150 -3398004 3927034 5413822
9791 5413822 1551314 -1052167 1489668 7366572 12862685 15572447 14929716 12191018
9783 12191018 9225315 6178565 2152141 -1154111 -111430 4558531 6329138 1254685
9775 1254685 -5663449 -6842257 -2153395 2090647 2074604 -644724 -3819273 -6760507 -8268800
9766 -8268800 -7283880 -5934269 -7497640 -10744279 -10544004 -5102587 1255768 3807720 2553950
9757 2553950 334994 -1001148 -1049079 -258386 -444852 -3468290 -8005345 -9969770 -7556509
9748 -7556509 -3644628 -1780205 -2080139 -2827969 -3810308 -5596190 -7032314 -6221080 -3587346
9739 -3587346 -1717497 -1942499 -2769203 -2248870 -621028 429961 516000 1034305 2437421
9730B437421Q3178l268094m604672j431364K877313L343854N18961o88138J317678
9721E86137K980287J842351j46289q13420o84900j75257J468268K673653J98154
9712G928984m423797m888210J59240L655732Q81407k857024j496808J258683r40366
9703g22159m767119k427588L943182M641999j401191m504895k37449L714774R90106
9694g70340l172957j510347L343692M066144L28741k233344j350909K30915L98859
9685f69546m04370j325461j077020K058573O469966O461279k95239p528979p732619
9676d043416k258012J423422M12249j639580j716126k59863K426358O108405P143049
9667G596486J956291n326077n993989O19695N067749J649837l195090j757741
$$ plain form
9730 2437421 2520599 -747495 -5352167 -6783531 -3906218 -562364 -43403 -731541 586137
9721 586137 3566424 5408775 5262486 4449066 3764166 3588909 5057177 7730830 7928984
9712 7928984 3505187 -1383023 -1223783 2431949 3313356 456332 -1040476 218207 -722159
9703 -722159 -5489278 -7916866 -3973684 668315 -732876 -5237771 -5475220 -1760446 -770340
9694 -770340 -3943297 -5453644 -2109952 1956192 2284933 51589 -1299320 -1068405 -669546
9685 -669546 -1073916 -2399377 -3476397 -1417824 5052142 11513421 11218182 3689203 -4043416
9676 -4043416 -6301428 -4878006 -4465757 -6105337 -7821463 -8081326 -5654968 453437 7596486
9667 7596486 9552777 4226700 -1767289 -1147594 3920155 5569992 2374902 617161
9659F17161K566850J700105l122267l583479J140790K501473k882008o598785
9651g660160j577736O014719N841109p14174l232039J007286L339368j338882
9643A679491n844663k592205L669573L457640k072187l417462J404357L957716
9635B42260j90338m339404k256090J921920J756386p14988j25137J812199L5197
9626a857995l377043k146198K535147L250604p56227k094285J588051L120735
9618B62789j428744n016483j029847N328531N040029q53817l960818j740259O15536
9609b783083Q9814n20404O60207J162137p39013k689269k042631N87041K917568
9600c357633L394721J539388j444031k571808l96735K250105J914631m05841j733201
$$ plain form
9659 617161 3184011 4884116 1761849 -1821630 -680840 1820633 -1061375 -7660160
9651 -7660160 -9237896 -3223177 2617932 1903758 -1328281 -320995 3018373 1679491
9643 1679491 -4165172 -6757377 -3087804 369836 -1702351 -5119813 -3715456 242260
9635 242260 51922 -4287482 -6543572 -4621652 -2865266 -3580254 -3705391 -1893192 -1857995
9626 -1857995 -5235038 -7381236 -4846089 -1595485 -2351712 -4445997 -2857946 262789
9618 262789 -1165955 -6182438 -7212285 -1883754 3156275 2302458 -1658360 -3398619 -2783083
9609 -2783083 -2693269 -3213673 -2553466 -1391329 -2130342 -4819611 -6862242 -6275201 -3357633
9600 -3357633 37088 1576476 132445 -2439363 -2836098 -585993 1328638 922797 -810404
9591h10404k785666n615255o976487j569408P498712R781873K058490n859892
9583d278037m597543K383269N896585M388044K447539P45372l197586o549729
9575b762086l399758M270911P089866J906426l394584k103674J877925J674588
9567E159614j947062l678240k512024r57193R02624L678869L816037j862755q152331
9558e552461o309185K609956P566207L076555l063283k080803K808746K535813
9550A591545l462609p045286l803962J825701M376222L953967L113674J971738
9542B520990o99117m217941o149639m529211N84877O224371P651343L066561l052260
9533A399974m466376r72685J887470R19541j397964k396824k810825k921288n64129
$$ plain form
9591 -810404 -3596070 -9211325 -16187812 -17757220 -10258508 -476635 1581855 -4278037
9583 -4278037 -8875580 -6492311 -595726 3792318 6239857 6985229 3787643 -2762086
9575 -2762086 -6161844 -1890933 5198933 7105359 3710775 1607101 3485026 5159614
9567 5159614 3212552 -465688 -2977712 -3934905 -3032281 646588 4462625 2599870 -5552461
9558 -5552461 -11861646 -9251690 -1685483 1391072 -1672211 -3753014 -944268 1591545
9550 1591545 -1871064 -8916350 -12720312 -10894611 -6518389 -2564422 549252 2520990
9542 2520990 1821873 -2396068 -8545707 -13074918 -12490041 -6265670 1385673 4452234 1399974
9533 1399974 -3066402 -4039087 -2151617 -1232076 -2630040 -5026864 -7837689 -10758977 -11323106
9524a1323106L639709M281312q14370n080875j800528N222470O721187J685966
9516B531765k005454n59392O82513k365104n048659k042757L014516K776571k148543
9507e164544m061722o8207L798729K169639j685888j429387K485550L800803K51956
9498I6929l031257j405615K488889L181967N81197r01231j02018o29152l906191
9489c626482n872038l254605R35646J844969j43786q43283J044051K903672L059667
9480c952189K517423J755732m49769l981662o052213m391891p5789L862813N476442
9471e291103M897606L176773Q49333k132990m820024m621652l97164M173077L851317
9462c14827n97798k363938J609268N451462L008318k679120m223017j043115R92634
$$ plain form
9524 -11323106 -7683397 -3402085 -4216455 -9297330 -11097858 -5875388 845799 2531765
9516 2531765 526311 -33081 649432 -1715672 -6764331 -8807088 -5792572 -3016001 -5164544
9507 -5164544 -9226266 -9294473 -5495744 -3326105 -5011993 -6441380 -3955830 -155027 96929
9498 96929 -2934328 -4339943 -1851054 1330913 1912110 1010879 908861 279709 -3626482
9489 -3626482 -9498520 -12753125 -11817479 -9972510 -10116296 -10959579 -9915528 -7011856 -3952189
9480 -3952189 -1434766 320966 -128803 -4110465 -10162678 -14554569 -14630358 -10767545 -5291103
9471 -5291103 -393497 2783276 3632609 1499619 -3320405 -7942057 -8339221 -4166144 -314827
9462 -314827 -912625 -3276563 -1667295 3784167 6792485 4113365 -109652 -1152767 -160133
9453a60133o55368k662314k551264j376524L83305L307167N114801K675958j541508
9444B534120j734578J751630K538927q29180k257516Q90540K821587j98616k840290
9435B676624m08811K205908p43083m630469j542237N713942P059271P87493m405121
9426F713517l367195r67195k225970m230040k286898J702900K232467j525738
9418c954152m880618l960101J21061L252161K868983L47533q02098Q67095L066153
9409c073983K964387Q85444o08220l43391M93043M83214l61145p59901O30894
9400C10342L287117M095866P32595m014633m624651n54744K556058J336719n77566
9391B547103L21818Q69252k607002o055617l061967M127537O918615K887633j784693
$$ plain form
9453 -160133 -815501 -3477815 -6029079 -7405603 -7022298 -3715131 1399670 4075628 2534120
9444 2534120 799542 2551172 5090099 4260919 2003403 2893943 5715530 5516914 2676624
9435 2676624 2267813 4473721 3730638 -899831 -2442068 3271874 10331145 11118638 6713517
9426 6713517 3346322 2379127 153157 -4076883 -6363781 -4660881 -2428414 -3954152
9418 -3954152 -8834770 -12794871 -12673810 -9421649 -6552666 -6205133 -7007231 -6140136 -3073983
9409 -3073983 -109596 775848 167628 -175763 317280 800494 439349 -320552 310342
9400 310342 3597459 7693325 8425920 4411287 -213364 -768108 1787950 3124669 2547103
9391 2547103 2868921 3738173 1131171 -4924446 -7986413 -3858876 3059739 5947372 4162679
9382D162679k645941j951885j867703m00935K834391L593412j20926l661711k662224
9373b720843K81054M89120j305053j468809j99096j22372l78459J942800N316044
9364A834386M673858n25051m412385k830480J030342J977108K93086j41983R04831
9355B803712k23433l841856m687441J56183N092794K817245m541769p206325j294677
9346a0925567N630599N463177M35859j812939J86884J589564M68475J18511K067793
9337C222356L200874J371292j354623k906866l957818m399975j804039L579690
9329c049109O379197K615056m009272o211177k029596L558534M888332Q97385
9321C039350m876067p323521l694817L451498Q010578O691084K481078J19129
$$ plain form
9382 4162679 1516738 -435147 -2302850 -2703785 130606 3724018 3603092 -58619 -2720843
9373 -2720843 -2439789 -1950669 -3255722 -4724531 -4923627 -5045999 -5424458 -3481658 1834386
9364 1834386 6508244 5983193 1570808 -1259672 -229330 1747778 2040864 1898881 2803712
9355 2803712 2580279 -1261577 -5949018 -5792835 -700041 2117204 -2424565 -9630890 -10925567
9346 -10925567 -5294968 168209 604068 -1208871 -1021987 567577 1036052 1154563 3222356
9337 3222356 6423230 7794522 6439899 3533033 -424785 -4824760 -6628799 -3049109
9329 -3049109 3330088 5945144 1935872 -4275305 -6304901 -2746367 2141965 3039350
9321 3039350 -1836717 -9160238 -12855055 -9403557 -1392979 5298105 7779183 7898312
9313G898312j19191j320045l830126m156653p62022K415772Q17459l959742n499372
9304h515608j110486M012913L536906j237347l413000p56532J542622J87252k65681
9295f018961M296964Q528143M777379l619019n784729N4930L677249o63672n302825
9286e4541k619597K098983L64370m255706k228515M655635N137370k569219o715199
9277f186419n32380O813004M650962k988633m804540J86630K945968k13762k943980
9268c073150m34412L282805K924826N4847r25768o9794j80197r77670j35911J490363
9258A955939O61247k531365m218356k662517o58328o22183p91159J320911M294692
9249c251119M733253K549524J139839K196683L076483O15705m091468o627696
$$ plain form
9313 7898312 7779121 6459076 2628950 -1527703 -2289725 126047 943506 -3016236 -8515608
9304 -8515608 -9626094 -5613181 -2076275 -3313622 -6726622 -7483154 -5940532 -5753280 -6018961
9295 -6018961 -1721997 6806146 11583525 7964506 2179777 2234707 5911956 5248284 -54541
9286 -54541 -2674138 -575155 -210785 -4466491 -6695006 -2039371 3097999 528780 -6186419
9277 -6186419 -6718799 94205 4745167 1756534 -3048006 -2861376 84592 -129170 -3073150
9268 -3073150 -3507562 -224757 2700069 2754916 1829148 1759354 1579157 601487 465576 1955939
9258 1955939 2617186 85821 -4132535 -6795052 -7453380 -8075563 -8866722 -7545811 -3251119
9249 -3251119 1482134 4031658 5171497 7368180 10444663 11060368 6968900 341204
9241C41204m624054l99398K402921L160004L482277L248095N88112l745040n588352
9232a134231l104332j90910q79679k965207j650350K299917L553760Q52611j293032
9223d511453l76783O05788n46937j176018R07360L128509K863035J833181J838397
9214D565079O78744l013042n249679k497055J769359K315695O05819J325174L255297
9205C755391J313135l657045n047489o68193M339979N641316M311000K225937
9197A2214031r29785m402656n571145m073935k158605l05443K487695M128780
9189A388937J409097l064457k990423J484205L371069L85367j505123Q45368J992978
9180C317018j856618n269700k867385J124966L36495k779460j840610K327657
$$ plain form
9241 341204 -4282850 -4682248 -2279327 880677 4362954 7611049 8199161 4454121 -1134231
9232 -1134231 -4238563 -4429473 -5309152 -8274359 -9924709 -7624792 -4071032 -3218421 -4511453
9223 -4511453 -4888236 -4282448 -4829385 -6005403 -5098043 -1969534 893501 2726682 4565079
9214 4565079 5243823 2230781 -3018898 -5515953 -3746594 -1430899 -825080 500094 3755391
9205 3755391 5068526 1411481 -3636008 -4304201 35778 5677094 9988094 12214031
9197 12214031 11284246 6881590 1310445 -2763490 -4922095 -5227538 -2739843 1388937
9189 1388937 2798034 -266423 -3256846 -1772641 1598428 1983795 478672 1324040 3317018
9180 3317018 1460400 -3809300 -6676685 -5551719 -5215224 -7994684 -9835294 -7507637
9172g507637M121874L102723K770104K260160j600786n752502l882996K433863
9164d055197M840656J175368j721046l7013J228991j830238m647666k242917J836866
9155e452196J300342k489630k873759J476632M821687L068620j156611l257254
9147d562169k428585q18586L16124J306057K211413K386601J789755J281183J217731
9138B699524P14232r72673k858314k937489m87330K920767M779755L778314Q47989
9129H484775j739298k848483l816194n763675n951496n02319P853144R837193
9121E553647J854121o545883m600548L657700N000222k541958o666756p48058
9113e037513N686956L048049l010227k401470K175314J328784l548080k817274
$$ plain form
9172 -7507637 -3385763 -283040 2487064 4747224 3146438 -2606064 -6489060 -4055197
9164 -4055197 785459 1960827 239781 202768 1431759 -398479 -5046145 -7289062 -5452196
9155 -5452196 -4151854 -6641484 -9515243 -8038611 -3216924 -148304 -1304915 -4562169
9147 -4562169 -6990754 -7809340 -7493216 -6187159 -3975746 -1589145 200610 1481793 2699524
9138 2699524 3413756 2441083 -417231 -3354720 -3842050 -921283 3858472 7636786 8484775
9129 8484775 6745477 3896994 80800 -5682875 -11634371 -12136690 -4283546 5553647
9121 5553647 7407768 861885 -3738663 -80963 4919259 2377301 -4289455 -5037513
9113 -5037513 649443 3697492 687265 -1714205 461109 1789893 -1758187 -4575461
9105d575461L662086N292260j643129p764090n538761L15194K323159J212343
9097f716399J479280K914212K743448J481770J274868J728976J365692L12236
9089F584083j090575k961432l372661L29928N787000O580956J527250k773110
9081A0611439j948518j90093k144808m789373l430237m22317p38667k818961j441838
9072g313373K791010M301457J635632r85349o62500J415889L563269M646349K644605
9063A2036989k388185n401659k488888J703047L1546m871214l429281N090751
9055B83106R624716L676762m684067n132021L24958K666779O7296j930409j223159
9046C673961j276933l151822l253222q0147L076325L745873L310581K737655L46975
$$ plain form
9105 -4575461 -913375 4378885 2735756 -5028334 -10567095 -10251901 -7928742 -6716399
9097 -6716399 -5237119 -2322907 420541 1902311 3177179 4906155 6271847 6584083
9089 6584083 5493508 2532076 -840585 -510657 5276343 11857299 13384549 10611439
9081 10611439 8662921 8472828 6328020 1538647 -1891590 -2313907 -3052574 -5871535 -7313373
9072 -7313373 -4522363 -220906 1414726 429377 -233123 1182766 4746035 9392384 12036989
9063 12036989 9648804 4247145 1758257 3461304 3492850 -1378364 -4807645 283106
9055 283106 9907822 13584584 8900517 3768496 4093454 6760233 6827529 4897120 3673961
9046 3673961 2397028 -754794 -4008016 -4088163 -1011838 2734035 6044616 8782271 9129246
9037I129246l655844m945892r89836L925797L541382k097497o758507n847188
9029g698339j188686K097303J281909j836548l039266K82153O081875Q796563
9021D776964M970913k180693n542142k104378L425867M380573J16147m020026
9013C823225m118411j949445p83117l02753J311984K610974P47631k573678k333184
9004c566774J563236K869701j287973m812098j731407L835697L854571o38376
8996H6577j411778K972263M704816K08013l461715m25767M048721K224150l751306
8987E193974o053411l373020o95769J99636J650900L068062J323616k029764j837878
8978b553654J676261K511025j186462m051701k467518L22304R20289J149667L086767
$$ plain form
9037 9129246 5473402 527510 -462326 3463471 7004853 4907356 -1851151 -7698339
9029 -7698339 -8887025 -6789722 -5507813 -7344361 -10383627 -10101474 -4019599 4776964
9021 4776964 9747877 7567184 2025042 -79336 3346531 7727104 7843251 3823225
9013 3823225 -295186 -2244631 -3027748 -3330501 -2018517 592457 1340088 -1233590 -3566774
9004 -3566774 -2003538 866163 -421810 -5233908 -6965315 -3129618 724953 86577
8996 86577 -1325201 1647062 6351878 6559891 3098176 2672409 6721130 8945280 5193974
8987 5193974 -859437 -4232457 -4928226 -4728590 -3077690 -9628 1313988 -715776 -2553654
8978 -2553654 -877393 1633632 447170 -3604531 -6072049 -5749745 -4829456 -3679789 -593022
8969e93022M278923J974934k138962m759339m726929j856177L246670O319884
8961A745982K434869n504933q049999k539957K396552M81617k506632J77489L782890
8952g582122O99254n031495l816787L000913N504832K090105Q56340M004676M217828
8943C943544q26214l235310R22690L951232k51017n487550l824127J678520L628894
8934E00662K613788L321032M067732N15352m062709k872225K096660K333526l132826
8925E380992o226337l356808l16664q91532l64582M570825P919677L570764l755668
8916F530667m917389l2212K600849l13610l288593k114273N2937m86240j476107
8907c443971M13460K816440J400104k211449k225315K220502N459506L774246
$$ plain form
8969 -593022 3685901 5660835 3521873 -1237466 -5964395 -7820572 -4573902 1745982
8961 1745982 4180851 -1324082 -9374081 -11914038 -9517486 -9035869 -11542501 -11365012 -7582122
8952 -7582122 -6882868 -11914363 -15731150 -12730237 -7225405 -5135300 -4278960 -274284 3943544
8943 3943544 3117330 -117980 804710 4755942 4504925 -982625 -4806752 -3128232 500662
8934 500662 3114450 6435482 10503214 11018566 6955857 4083632 6180292 8513818 5380992
8925 5380992 -845345 -4202153 -4518817 -5410349 -5774931 -1204106 6715571 10286335 6530667
8916 6530667 1613278 1581066 4181915 3868305 579712 -1534561 -1481624 -1967864 -3443971
8907 -3443971 -3030511 -214071 1186033 -1025416 -3250731 -1030229 4429277 8203523
8899H203523K58138j137273j767564m552707p351298n274043J351829O236141
8891d033254N150769R78054p59896J322805L978212L812117N43017l290006m726164
8882B975654l053957n32509K31493n42876n80891P36464J494649M86085q60636
8873C53476q48129M018J15065r22018k379262l336809k648171M18781M316181
8864d926868N712810L423241K62422p71718n00433j458823l266749l140262m34493
8855e100873K422887L596329L461649K206061q31404m154482l887111Q36087M939290
8846C488433L395401j506453k989120O67773L967441K450339j472872l385007
8838D615935l486351m351048m945141k107603K944592M908316J930626j751553
$$ plain form
8899 8203523 8461661 7324388 5556824 1004117 -6347181 -11621224 -10269395 -4033254
8891 -4033254 1117515 2095569 1335673 2658478 6636690 10448807 10991824 7701818 2975654
8882 2975654 -78303 -610812 -379319 -922195 -1503086 -766622 728027 1214112 353476
8873 353476 -494653 -490635 -375570 -1297588 -3676850 -7013659 -9661830 -9243049 -4926868
8864 -4926868 785942 4209183 4471605 3699887 3199454 1740631 -1526118 -4666380 -5100873
8855 -5100873 -2677986 918343 4379992 6586053 5754649 1600167 -2286944 -1450857 3488433
8846 3488433 6883834 5377381 2388261 3056034 7023475 9473814 8000942 4615935
8838 4615935 1129584 -3221464 -8166605 -10274208 -7329616 -2421300 -490674 -2242227
8830b242227k288856j197343j476804k362559j289349J265909K394273J102661
8822f094295p12783j022517N39961K854052L885423K333335j52482l67075J548052
8813B811671J440318k466683n803221m075539N15136K664194J952352J927526
8805a034246K711811P21899l971154n985697k273744L171300M674419J656443
8797c28969k052202l087434r95567K194218L690668K773271J851477K702726K861340
8788I609528o12909m873463m104947J172405L654708n7169m281510l058413J205398
8779a346372K399241j67375k449220k576652j852105o49541J605830L213430J687993
8770a34771j521932j984636J384065M493561L782284Q39306n08287K40129Q6907
$$ plain form
8830 -2242227 -4531083 -5728426 -7205230 -9567789 -10857138 -9591229 -7196956 -6094295
8822 -6094295 -6807078 -7829595 -7289634 -4435582 -550159 1783176 1630694 1263619 2811671
8813 2811671 4251989 1785306 -4017915 -8093454 -7578318 -4914124 -2961772 -1034246
8805 -1034246 1677565 2399464 -1571690 -7557387 -9831131 -6659831 -1985412 -328969
8797 -328969 -2381171 -5468605 -6464172 -4269954 -579286 2193985 4045462 6748188 9609528
8788 9609528 8996619 4123156 18209 1190614 4845322 4788153 506643 -2551770 -1346372
8779 -1346372 1052869 885494 -1563726 -4140378 -5992483 -6642024 -5036194 -1822764 -134771
8770 -134771 -1656703 -3641339 -2257274 2236287 6018571 6857877 6349590 6589719 6676626
8761F676626k404023m334422k437845J454568K063291j627305m105469j419073
8753f133652K293492J184838k433259j494879L893372O160396K645589n49973
8745E565924J31640l36954n087263p463638j467509O667028O752276j9005l901463
8736H41036j964280l25114j890248k245980P36594K512087K41499k047631n32039
8727d674076K223890K068039n54199k779419l686295l342856j069633K451779
8719i362770M366554L302296J167914p7785k86233R80103M088119N924376K285314
8710A2387888m397430n842340K42500N362137K231048m241886m692918M58634
8702A507633K728687o63844l402553r42022K887175K706231o60568k687738j792212
$$ plain form
8761 6676626 4272603 -61819 -2499664 -1045096 1018195 -609110 -4714579 -6133652
8753 -6133652 -3840160 -2655322 -5088581 -6583460 -2690088 3470308 6115897 5565924
8745 5565924 5697564 5360610 273347 -7190291 -8657800 -1990772 4761504 4742499 841036
8736 841036 -1123244 -1448358 -3338606 -5584586 -4847992 -2335905 -2094406 -4142037 -4674076
8727 -4674076 -2450186 -382147 -936346 -3715765 -7402060 -10744916 -11814549 -9362770
8719 -9362770 -4996216 -1693920 -526006 -603791 -890024 90079 4178198 10102574 12387888
8710 12387888 7990458 2148118 2390618 7752755 9983803 5741917 1048999 1507633
8702 1507633 4236320 3572476 169923 -772099 2115076 4821307 4160739 1473001 -319211
8693c19211j90752p638r88843j432162l22570J163901P22973j633695k661149
8684e669146m36788J961418O86181k409425k124709J695013L571915J282716m26354
8675a869179K033047M466086J260868n140082p016289k316430K815127K895998
8667b870854l54903k021579p55657J052350J546655J095948O33159M86832P22128
8658d65921J209069J320091N46517n68999r56673n70217n87413j656331k610042
8649d339919j764816O65821K450509K034283M51517k98316q896n3873q66841j415227
8639c145758j299509j441542k007258j505576Q94708L685763M875659M139954
8631D196441K090371q19569l351539l563972j638911l81539p64808K26941M208120
$$ plain form
8693 -319211 -509963 -517601 -1506444 -2938606 -3261176 -2097275 -1374302 -3007997 -5669146
8684 -5669146 -6105934 -4144516 -3458335 -5867760 -7992469 -6297456 -2725541 -1442825 -1869179
8675 -1869179 163868 4629954 5890822 750740 -6265549 -8581979 -5766852 -2870854
8667 -2870854 -3225757 -5247336 -6002993 -4950643 -3403988 -2308040 -1674881 -1188049 -465921
8658 -465921 743148 2063239 2609756 2040757 1084084 513867 -73546 -1729877 -4339919
8649 -4339919 -6104735 -5438914 -2988405 -954122 -502605 -800921 -809817 -863690 -1730531 -3145758
8639 -3145758 -4445267 -5886809 -7894067 -9399643 -8504935 -4819172 56487 4196441
8631 4196441 6286812 5467243 2115704 -1448268 -3087179 -3468718 -4233526 -4006585 201535
8622B01535O986378M238824r66951k324990k89647o86930l749059l101115K433212
8613B741257M965277l1204n546563l860223J217738J153237l204810l733647J274216
8604e024722N003265L383776q5945j752885k427460k827549j206070K045551L145792
8595B53753P12424k080821k951408l064204k545832P45451N514453O060335O41583
8586C285734m462931l476727Q81941K512112R63842J40996R55067P43720j391286
8577A52468l226554k834240k79928L108761M894301K809088j783302m070358j952872
8568c182636Q21373O11000m65045J074879L257644J671265k628730m099341j198142
8559d137733J524830N75431j779840j550481J385393L483217J836777k517854
$$ plain form
8622 201535 7187913 11426737 10459786 8134796 7845149 7158219 3409160 308045 2741257
8613 2741257 7706534 7675330 2128767 -1731456 -513718 639519 -2565291 -6298938 -5024722
8604 -5024722 -21457 3362319 3276374 1523489 -903971 -3731520 -4937590 -2892039 253753
8595 253753 966177 -1114644 -4066052 -7130256 -9676088 -8930637 -3416184 2644151 3285734
8586 3285734 -1177197 -4653924 -3771983 -1259871 -296029 -155033 800034 1543754 152468
8577 152468 -3074086 -5908326 -6188254 -3079493 1814808 4623896 2840594 -1229764 -3182636
8568 -3182636 -2361263 -1750263 -2215308 -1140429 2117215 3788480 1159750 -2939591 -4137733
8559 -4137733 -2612903 -2037472 -3817312 -5367793 -3982400 -499183 1337594 -1180260
8551a180260n113269k600578K741956N134913K865848L41132N58847J22645l968148
8542a096914p024423k903006N075321P318845J703058l640038k579041J298109
8534a848089K095772K74005m36305O3493n36791j759055j125141J262583K789634
8525G80106K345165J249072M56540o39893k370433l552384k838092o91730N98255
8516d663394n76754k558789j699183K606959N796507L516838k023801m496521
8508d098138j955809J081225Q80438m32546N70966K603105K054058n28577p44088
8499e69366K747498N369214K545009l675919o518856k711324L460751N302129
8491E949136J348437l824168n476587l152848N30058L019586L161859J581613
$$ plain form
8551 -1180260 -6293529 -8894107 -6152151 -1017238 1848610 2189742 2748589 2871234 -1096914
8542 -1096914 -8121337 -11024343 -5949022 1369823 3072881 -567157 -3146198 -1848089
8534 -1848089 247683 521688 85383 148876 -387915 -2146970 -3272111 -2009528 780106
8525 780106 3125271 4374343 4830883 4190990 1820557 -1731827 -4569919 -5261649 -4663394
8516 -4663394 -5240148 -7798937 -9498120 -6891161 -1094654 2422184 398383 -4098138
8508 -4098138 -6053947 -4972722 -4092284 -4524830 -3953864 -1350759 703299 174722 -569366
8499 -569366 2178132 7547346 10092355 6416436 -102420 -2813744 647007 5949136
8491 5949136 7297573 3473405 -2003182 -5156030 -4625972 -1606386 1555473 3137086
8483C137086M65205J045152J171262j860431n985905n924260j046174L079408
8475e918657L032102K079099L111555K980755q55982l607080k77233M759632L712440
8466I016631k014500m296184j682173l98740k158978j579992K358738K889341
8458B134143k436868n945649j993026L458219K525013k186301k872375Q44797
8450f472047L002313J811698R13283J596562J151822j149210k548865j745838
8442c440282n10975l1951K61615K00709r15526j683436q042K792220L169345J040873
8432H74550L55960K749315M248169O98053n824324q922169n627484K82475L474629
8423g690826L475626L489691L850564J056139m948048p432044j764930N916310
$$ plain form
8483 3137086 3602291 4647443 5818705 3958274 -2027631 -7951891 -8998065 -5918657
8475 -5918657 -2886555 -807456 2304099 5284854 4428872 821792 544559 5304191 9016631
8466 9016631 7002131 2705947 1023774 625034 -1533944 -3113936 -755198 2134143
8458 2134143 -302725 -6248374 -8241400 -4783181 -2258168 -4444469 -7316844 -6472047
8450 -6472047 -3469734 -1658036 -744753 851809 2003631 854421 -1694444 -3440282
8442 -3440282 -3951257 -3983208 -3721593 -3520884 -4436410 -6119846 -6127888 -3335668 -166323 874550
8432 874550 1230510 3979825 8227994 8926047 3101723 -5820446 -11447930 -11165455 -7690826
8423 -7690826 -4215200 -725509 3125055 4181194 -766854 -8198898 -9963828 -4047518
8415d047518O012006k60033k467930K677603O238379J724656m644544m646639
8407E85980r29257q01383l259557j924589K767991M272941J258137j126751r84683
8398a41171j759167l875821k972286J466025L638931P21399k301840q40363K293281
8389c771012K362887J16769r45256o31950n55711K62200L263369N881813M158384
8380A0141493r21928l981733k285765J157195K095176m2541k656386l465989k266255
8371b226733k29162J387842J975817J612811O02836r12895k643067l418928j524272
8362e375751L031557O618060M593725k497823p466846m551557K402498M551667
8354A305530N57867j792046J650443M199347q76151q360534p842640P04345O843546
$$ plain form
8415 -4047518 1964488 1704455 -763475 1914128 8152507 9877163 5232619 585980
8407 585980 -343277 -1144660 -4404217 -6328806 -3560815 712126 1970263 843512 -141171
8398 -141171 -1900338 -5776159 -8748445 -7282420 -3643489 -2922090 -5223930 -6064293 -3771012
8389 -3771012 -1408125 -1291356 -2236612 -2868562 -3424273 -3162073 101296 5983109 10141493
8380 10141493 9219565 5237832 2952067 4109262 6204438 6161897 3505511 39522 -2226733
8371 -2226733 -2455895 -1068053 907764 2520575 3123411 2210516 -432551 -3851479 -5375751
8362 -5375751 -2344194 4273866 8867591 6369768 -1097078 -5648635 -3246137 1305530
8354 1305530 1863397 71351 1721794 5921141 5044990 -3315544 -11158184 -10453839 -3610293
8345c610293M681974m41790j885352p02672j043646k347717j136101K418282M289331
8336B22016K263695j077240j518866J472213L338192k13776o319475o913971J86486
8327h560726O569463M355264k163691l207698J287458K618553j450730l286742
8319c838849P43207L880939J209364j610325J352745N635972M242470n01020j875741
8310I238762m22642j305758l711971k467944J825419L378310R09463j565939k725882
8301C151818m383483m755681l36467N452264M999766r65922l374443M66751K514140
8292B768743j659476m730303l76501N354334M115542j007441j911509K53140j466715
8283A339814n748632m556043K031358M583811k18283l959461l30948N140073M942747
$$ plain form
8345 -3610293 1071681 629891 -1255461 -1958133 -3001779 -5349496 -6485597 -4067315 222016
8336 222016 2485711 1408471 -110395 1361818 4700010 4486234 -1833241 -8747212 -8560726
8327 -8560726 -1991263 2364001 200310 -3007388 -1719930 898623 -552107 -3838849
8319 -3838849 -3095642 785297 1994661 384336 1737081 7373053 11615523 11114503 9238762
8310 9238762 8816120 7510362 3798391 1330447 3155866 6534176 7443639 5877700 3151818
8301 3151818 -1231665 -5987346 -6323813 -871549 4128217 3162295 -212148 254603 2768743
8292 2768743 1109267 -3621036 -3997537 1356797 5472339 4464898 2553389 2806529 1339814
8283 1339814 -4408818 -8964861 -6933503 -2349692 -2567975 -6527436 -6858384 -1718311 3224436
8274C224436J077986k75583O71001k44249k548259k692484j181686p82245j15071
8265b866154L252775N382202N55009p291925p621929N52744N678142Q53635n773401
8256g278902m439404J195506J798567j529954n28752M373424M220876k367147
8248d555786n682563q13639M082054J163361m786251n015020m31973K164877K127691
8239a1747249L657251N750278L456253j846158l111079O87341K677449r6j403244
8230a879254K102554M377718m68331p121587o178202J601577O510071L980047
8222B924593m62664r95689Q15999P08537j290151k267584j597947j096309j537980
8213d799195j817877r96466O10299K073216K617874K203665J768859K145183K600315
$$ plain form
8274 3224436 4302422 4026839 4697840 4453591 1905332 -787152 -1968838 -2751083 -2866154
8265 -2866154 386621 5768823 6323832 -968093 -8590022 -8037278 -2359136 -1505501 -7278902
8256 -7278902 -11718306 -10522800 -8724233 -10254187 -10782939 -6409515 -2188639 -4555786
8248 -4555786 -10238349 -11051988 -6969934 -5806573 -10592824 -15607844 -16039817 -13874940 -11747249
8239 -11747249 -8089998 -2339720 1116533 -729625 -3840704 -3153363 -475914 -476010 -1879254
8230 -1879254 223300 4601018 4132687 -2988900 -9167102 -7565525 -1055454 2924593
8222 2924593 2461929 1466240 2282239 2990776 1700625 -566959 -2164906 -3261215 -4799195
8213 -4799195 -6617072 -7613538 -7003239 -4930023 -2312149 -108484 1660375 3805558 6405873
8204F405873J625987p10738k658834l178344k758132j722451J06931J658152J127508
8195a04048p96921r92222J368263L041468J703700l12966j39778O60438q87135
8186C540799l421591l177451m88581N13568j454778l077545j757771J469727M749188
8177c104435O902287N825204L43156n462771n306691J54049L049297j44786l105320
8168h50010n1367M566965L189803k770999n584355l068359o742Q68700J599128
8159b107236K868197K416882L41442n45833m95995k513085n367692m003792J306424
8150h100688L652850L01842k581795k46196K822023J184927j843975k27603L746349
8141a292266K849907l036314o421576l331013K095300M729059M283690K887098
$$ plain form
8204 6405873 8031860 7321122 4662288 1483944 -1274188 -2996639 -2889708 -1231556 -104048
8195 -104048 -900969 -1893191 -524928 2516540 4220240 3907274 3767496 4427934 3540799
8186 3540799 119208 -3058243 -3546824 -3033256 -4488034 -7565579 -9323350 -7853623 -3104435
8177 -3104435 3797852 9623056 9966212 4503441 -803250 -649201 2400096 2255310 -850010
8168 -850010 -901377 3665588 6855391 4084392 -1499963 -4568322 -4575064 -3706364 -2107236
8159 -2107236 760961 3177843 3519285 2973452 2477457 -35628 -5403320 -9407112 -8100688
8150 -8100688 -4447838 -4145996 -6727791 -6973987 -4151964 -2967037 -4811012 -5038615 -1292266
8141 -1292266 1557641 -1478673 -7900249 -11231262 -9135962 -4406903 -123213 2763885
8133B763885J619195P94229K13693j385003m166933n157984k044764K003847J927522
8124c432313j461613k541016L42281K850086K232188J075699J649479K084969
8116B799760R01919L04291J645712K036101p47483l692199k952894J21382J432225
8107A848814L51169m14236M44806J735114K189483J167223j655576m699658m370813
8098c403674N15258N759407O253837K176603k023566l422066k552483r29031L03810
8089B678095J40254j262464k165941j710677j145798r33874N03505K770577K070838
8080I44515k433166m989476j349669L416498K180974k378920j898569L430409
8072c077404M939550L83436k094577J830109N005684J263954l696810k004351
$$ plain form
8133 2763885 4383080 5177309 5391002 4005999 -160934 -5318918 -7363682 -5359835 -3432313
8124 -3432313 -4893926 -7434942 -7092661 -4242575 -2010387 -934688 714791 2799760
8116 2799760 3701679 4005970 5651682 7687783 6940300 3248101 295207 416589 1848814
8107 1848814 2199983 1785747 2230553 3965667 6155150 7322373 5666797 967139 -3403674
8098 -3403674 -2888416 2870991 9124828 11301431 9277865 5855799 3303316 2374285 2678095
8089 2678095 2818349 1555885 -610056 -2320733 -3466531 -4400405 -3896900 -1126323 944515
8080 944515 -1488651 -6478127 -7827796 -4411298 -2230324 -4609244 -6507813 -3077404
8072 -3077404 1862146 2245582 151005 1981114 6986798 8250752 4553942 2549591
8064B549591K985152K516193l018471n357986j953646J328414Q02631m84473l580
8055f36175J35924j383981j967716l05392N98601j230778k717493m68627L787457
8046d188180N850322M718333K511865N03691j705018l774373l964130j321246
8038a368736K529410M281782J954495k680022n405567m072715p29063J731228
8030c759188L083836L949761K919654q54271l988918k527633J433858J917861
8022B174960j967605m693413l024697l24889J17060K97313K308557L137107j56043
8013b131650l903823k570242K141618L251590q39112l702619l60638N428712O205668
8004C519504L38933o407266p747909l045932L278300O741190O244372L336758
$$ plain form
8064 2549591 5534743 8050936 5032465 -325521 -2279167 -950753 -148122 -632595 -636175
8055 -636175 -500251 -1884232 -3851948 -4157340 -3558739 -4789517 -7507010 -7975637 -4188180
8046 -4188180 1662142 6380475 8892340 9396031 7691013 3916640 -47490 -1368736
8038 -1368736 1160674 5442456 7396951 4716929 -688638 -4761353 -5490416 -3759188
8030 -3759188 -675352 3274409 6194063 5339792 1350874 -1176759 257099 2174960
8022 2174960 207355 -4486058 -7510755 -7835644 -7718584 -7421271 -5112714 -1975607 -2131650
8013 -2131650 -6035473 -8605715 -6464097 -3212507 -4051619 -7754238 -8114876 -2686164 3519504
8004 3519504 3858437 -2548829 -10296738 -13342670 -10064370 -3323180 2921192 6257950
7996F257950j38203k742684l207434j461699O07652J308439J455879K337665K429941
7987F847506l42654l652082k807361J652980L766051J346945n02189J503960K368471
7978A0181627k723124q470089n936924L419287Q606095M151143l255309n013635
7970I59071j118881K596869K796241N74507j772388k620589j404919O89469J658861
7961B358241J222326P07975J45931j780146m239108m045381n05794K615639K122506
7952a397811k56075r78897J21611O89849K71518N83391J860339K063518L40946
7943C298389j191200n50574Q39069R4504k341768k460325J517466N403931M026904
7934H636396j276094m148164k229369R5510n89506j675276n42891k47792l686153
$$ plain form
7996 6257950 6119747 3377063 169629 -1292070 -684418 624021 2079900 4417565 6847506
7987 6847506 6504852 2852770 45409 1698389 5464440 6811385 6309196 7813156 10181627
7978 10181627 7458503 -1011586 -6948510 -3529223 5076872 9228015 5972706 959071
7970 959071 -159810 2437059 5233300 5807807 4035419 1414830 9911 699380 2358241
7961 2358241 3580567 4288542 4434473 2654327 -1584781 -5630162 -6135956 -3520317 -1397811
7952 -1397811 -1653886 -2632783 -2511172 -1821323 -1549805 -966414 893925 2957443 3298389
7943 3298389 2107189 1556615 2395684 2490188 148420 -2311905 -794439 4609492 8636396
7934 8636396 7360302 3212138 982769 1078279 488773 -1186503 -1729394 -1977186 -5663339
7925e663339o486985k945052L749644N343901J310632r00458J417614K592154
7917a581889j96362j476374K218792N078060J442255m258600m435917j84845J635873
7908a759007l92867j991836j951222l050894m818020l065920K434309O448123
7900h147334O005914L834172K246373n82259n162491o678718j192810P109868
7892b567285R927059N247338o13281j882171l08803j011880m167123m991893j709581
7883b077620J187795L7190j656323J356741O762893O974843L82635o155403p264581
$$ plain form
7925 -5663339 -12150324 -15095376 -11345732 -6001831 -4691199 -5591657 -4174043 -1581889
7917 -1581889 -1778251 -3254625 -1035833 4042227 5484482 1225882 -3210035 -3394880 -1759007
7908 -1759007 -2151874 -4143710 -6094932 -9145826 -13963846 -17029766 -14595457 -8147334
7900 -8147334 -2141420 1692752 3939125 3356866 -1805625 -8484343 -9677153 -2567285
7892 -2567285 7359774 12607112 11993831 10111660 9802857 8790977 4623854 -368039 -2077620
7883 -2077620 -889825 -852635 -2508958 -1152217 5610676 12585519 12968154 6812751 -451830
$$ [...]
##END NTUPLES=NMR SPECTRUM
##END=
