##TITLE=31Pdec_PR182-17
 D2O, 24 sc
 18.11.2021
##JCAMPDX= 6.0         $$ Bruker NMR JCAMP-DX V2.0
##DATA TYPE= NMR SPECTRUM
##DATA CLASS= NTUPLES
##ORIGIN= UXNMR, Bruker Analytische Messtechnik GmbH
##OWNER= root
$$ XWIN-NMR		Version 3.5
$$ Thu Nov 18 11:16:04 2021 Russian Standard Time (UT+4h)  she@DPX200
##.OBSERVE FREQUENCY= 81.013821
##.OBSERVE NUCLEUS= ^31P
##.ACQUISITION MODE= SIMULTANEOUS
##.ACQUISITION SCHEME= undefined
##.AVERAGES= 24
##.DIGITISER RES= 16
##SPECTROMETER/DATA SYSTEM= spect
##.PULSE SEQUENCE= zgpg30
##.SOLVENT NAME= CDCl3
##.SHIFT REFERENCE= (INTERNAL, CDCl3, 0, 248.564)
##AUDIT TRAIL= $$ (NUMBER, WHEN, WHO, WHERE, WHAT)
$$ ##TITLE= Audit trail, XWIN-NMR		Version 3.5
$$ ##JCAMPDX= 5.01
$$ ##ORIGIN= Bruker BioSpin GmbH
$$ ##OWNER= she
$$ F:/spectra/data/she/nmr/P31/1/pdata/1/auditp.txt
$$ ##AUDIT TRAIL=  $$ (NUMBER, WHEN, WHO, WHERE, WHAT)
(   1,<2021-11-18 11:14:36.95 +0400>,<she>,<DPX200>,
      <created by zg, POWCHK disabled, PULCHK disabled
       configuration hash MD5:
       00 E9 B6 7A A2 85 ED C7 34 08 36 98 17 FE 4E 26
       data hash MD5: 32K
       D2 E8 26 53 5A 2C 71 52 AD 51 DA 58 2D 4F 7D A7>)
(   2,<2021-11-18 11:14:56.92 +0400>,<she>,<DPX200>,
      <Start of raw data processing
       efp BC_mod = 2 LB = 1 FT_mod = 6 PKNL = 1 PHC0 = -9191.083 PHC1 = 105.0695 SI = 64K 
       data hash MD5: 64K
       A1 F3 14 B5 99 77 6D 23 AC EC 5D 97 7E 51 E2 C7>)
(   3,<2021-11-18 11:15:26.51 +0400>,<she>,<DPX200>,
      <pk PHC0 = -71.68282 PHC1 = 103 
       data hash MD5: 64K
       A9 1E 9D 56 E1 E4 A5 C0 D2 43 DA 97 8C C8 77 E8>)
(   4,<2021-11-18 11:15:30.29 +0400>,<she>,<DPX200>,
      <abs ABSG = 5 
       data hash MD5: 64K
       30 CA 35 46 F2 77 1A FF E5 E3 F8 CE 81 0C 56 97>)
$$ ##END=
$$ 
$$ hash MD5
$$ 54 F7 5F F4 77 BC 74 68 EE 0E 11 AD D1 1C BB BF
##$RELAX= 
##$RELAX= 
##$RELAX= 
##$RELAX= 
##$RELAX= 
##$RELAX= 
##$RELAX= 
##$RELAX= 
$$ Bruker specific parameters
$$ --------------------------
##$DU= <F:/spectra>
##$EXPNO= 1
##$NAME= <P31>
##$PROCNO= 1
##$TYPE= <nmr>
##$USER= <she>
##$AMP= (0..31)
100 100 100 100 100 100 100 100 100 100 100 100 100 100 100 100 100 100 
100 100 100 100 100 100 100 100 100 100 100 100 100 100 
##$AQSEQ= 0
##$AQ_mod= 1
##$AUNM= <au_zg>
##$AUTOPOS= <>
##$BF1= 81.014009
##$BF2= 200.13
##$BF3= 200.13
##$BF4= 200.13
##$BF5= 200.13
##$BF6= 200.13
##$BF7= 200.13
##$BF8= 200.13
##$BYTORDA= 1
##$CFDGTYP= 0
##$CFRGTYP= 5
##$CHEMSTR= <none>
##$CNST= (0..31)
1 1 145 1 1 1 1 1 1 1 1 1 1 1 1 1 1 1 1 1 1 1 1 1 1 1 1 1 1 1 1 1 
##$CPDPRG= <waltz16>
##$CPDPRG1= <>
##$CPDPRG2= <waltz16>
##$CPDPRG3= <>
##$CPDPRG4= <mlev>
##$CPDPRG5= <mlev>
##$CPDPRG6= <mlev>
##$CPDPRG7= <mlev>
##$CPDPRG8= <mlev>
##$CPDPRGB= <>
##$CPDPRGT= <>
##$D= (0..31)
0 1 0 0 0 0 0 0 0 0 0 0.03 2e-05 3e-06 0 0 0 0 0 0 0 0 0 0 0 0 0 0 0 0 
0 0 
##$DATE= 1637219676
##$DBL= (0..7)
120 120 120 11 120 120 24 19 
##$DBP= (0..7)
150 150 150 150 150 150 150 150 
##$DBP07= 0
##$DBPNAM0= <>
##$DBPNAM1= <>
##$DBPNAM2= <>
$$ [...]
##$SUBNAM3= <"">
##$SUBNAM4= <"">
##$SUBNAM5= <"">
##$SUBNAM6= <"">
##$SUBNAM7= <"">
##$SUBNAM8= <"">
##$SUBNAM9= <"">
##$SW= 501.771253377433
##$SWIBOX= (0..15)
0 1 3 0 0 0 0 0 0 0 0 0 0 0 0 0 
##$SW_h= 40650.406504065
##$TD= 32768
##$TD0= 1
##$TE= 0
##$TE2= 300
##$TE3= 300
##$TEG= 300
##$TL= (0..7)
0 120 53 12 22 120 120 120 
##$TP= (0..7)
150 150 150 150 150 150 150 150 
##$TP07= 0
##$TPNAME0= <>
##$TPNAME1= <>
##$TPNAME2= <>
##$TPNAME3= <>
##$TPNAME4= <>
##$TPNAME5= <>
##$TPNAME6= <>
##$TPNAME7= <>
##$TPOAL= (0..7)
0.5 0.5 0.5 0.5 0.5 0.5 0.5 0.5 
##$TPOFFS= (0..7)
0 0 0 0 0 0 0 0 
##$TUNHIN= 0
##$TUNHOUT= 0
##$TUNXOUT= 0
##$USERA1= <user>
##$USERA2= <user>
##$USERA3= <user>
##$USERA4= <user>
##$USERA5= <user>
##$V9= 5
##$VALIST= <valist>
##$VCLIST= <CCCCCCCCCCCCCCC>
##$VD= 0
##$VDLIST= <DDDDDDDDDDDDDDD>
##$VPLIST= <PPPPPPPPPPPPPPP>
##$VTLIST= <TTTTTTTTTTTTTTT>
##$WBST= 1024
##$WBSW= 4
##$XGAIN= (0..3)
0 0 0 0 
##$XL= 0
##$YL= 0
##$YMAX_a= 1737
##$YMIN_a= -1067
##$ZGOPTNS= <>
##$ZL1= 120
##$ZL2= 120
##$ZL3= 120
##$ZL4= 120
##$ABSF1= 248.5645
##$ABSF2= -253.2056
##$ABSG= 5
##$ABSL= 3
##$ALPHA= 0
##$AQORDER= 0
##$ASSFAC= 0
##$ASSFACI= 0
##$ASSFACX= 0
##$ASSWID= 0
##$AUNMP= <proc_1d>
##$AZFE= 0.1
##$AZFW= 0.5
##$BCFW= 0
##$BC_mod= 2
##$BYTORDP= 0
##$COROFFS= 0
##$CY= -3
##$DATMOD= 1
##$DC= 0
##$DFILT= <>
##$DTYPP= 0
##$F1P= 0
##$F2P= 0
##$FCOR= 1
##$FTSIZE= 65536
##$FT_mod= 6
##$GAMMA= 0
##$GB= 0
##$INTBC= 1
##$INTSCL= 5.30512e-09
##$ISEN= 30
##$LB= 1
##$LEV0= 0
##$LPBIN= 0
##$MAXI= 10000
##$MC2= 0
##$MEAN= 0
##$ME_mod= 0
##$MI= 50
##$NCOEF= 0
##$NC_proc= -8
##$NLEV= 6
##$NOISF1= 182.463
##$NOISF2= 159.3651
##$NSP= 0
##$NTH_PI= 0
##$NZP= 0
##$OFFSET= 248.5645
##$PC= 4
##$PHC0= -9262.766
##$PHC1= 208.0695
##$PH_mod= 1
##$PKNL= yes
##$PPARMOD= 0
##$PSCAL= 0
##$PSIGN= 0
##$REVERSE= no
##$SF= 81.014009
##$SI= 65536
##$SIGF1= 159.3651
##$SIGF2= -187.1042
##$SINO= 113.3802
##$SIOLD= 16384
##$SREGLST= <1H.CDCl3>
##$SSB= 0
##$STSI= 65536
##$STSR= 0
##$SW_p= 40650.406504065
##$SYMM= 0
##$S_DEV= 0
##$TDeff= 32768
##$TDoff= 0
##$TI= <>
##$TILT= no
##$TM1= 0
##$TM2= 0
##$TOPLEV= 0
##$USERP1= <user>
##$USERP2= <user>
##$USERP3= <user>
##$USERP4= <user>
##$USERP5= <user>
##$WDW= 1
##$XDIM= 65536
##$YMAX_p= 210754051
##$YMIN_p= -185541312
$$ End of Bruker specific parameters
$$ ---------------------------------
##NTUPLES= NMR SPECTRUM
##VAR_NAME=  FREQUENCY,     SPECTRUM/REAL,   SPECTRUM/IMAG
##SYMBOL=    X,             R,               I
##VAR_TYPE=  INDEPENDENT,   DEPENDENT,       DEPENDENT
##VAR_FORM=  AFFN,          ASDF,            ASDF
##VAR_DIM=   65536,         65536,           65536
##UNITS=     HZ,            ARBITRARY UNITS, ARBITRARY UNITS
##FACTOR=    0.620285442955139, 1,           1
##FIRST=     20137.2065510759, 0,            0
##LAST=      -20513.1999529892, 0,           0
##MIN=       -20513.1999529892, -185541312,  0
##MAX=       20137.2065510759, 210754051,    0
$$ Real data points
##PAGE= N=1
##DATA TABLE= (X++(R..R)), XYDATA
$$ [...]
43201C393762j914144k127395l24549J705409R10294j675165j952582J031898
43193i52472L500120K239964j297726l374470k598051q76153n95056j849338k446732
43184h249914m64236L275756N647885M358445K97869l340337l851208j079082
43176c404822K415737L249607M51808k921902k696338J367931M752055L323366
43168F537442j773372n482824m408941J6339L513507L217018R6570k365674j930130
43159b580065J15472R43819j967o14931L84455J437619O04887j515119k788102
43150d013932k432145j336009j86811J023420J859549J483904J44870o48291J8929
43141d086516J288079J713107R66378j77230j046594j555902j627219q54051Q98209
$$ y = [3393762, 1479618, -647777, -972326, 733083, 1643377, -31788, -1984370, -952472, 2547648, 4787612, 3489886, 115416, -2482635, -3358788, -3953844, -5803182, -8249914, -8714150, -5438394, 209491, 4567936, 4865805, 1525468, -2325740, -3404822, -989085, 2260522, 2712330, -209572, -2905910, -1537979, 3214076, 6537442, 4764070, -718754, -5127695, -5111356, -1597849, 1619169, 1715739, -649935, -2580065, -2464593, -1520774, -1522741, -2137672, -1753217, -315598, 289289, -1225830, -4013932, -6446077, -7782086, -7968897, -6945477, -5085928, -3602024, -3457154, -4105445, -4086516, -2798437, -1085330, -118952, -296182, -1342776, -2898678, -4525897, -5379948, -4481739]
43132d481739K845274L660167K567036k2533k739881l874607k272191J412611
43124b905863M398174L967839N64814k327675k121254R6655J547755J206946j03399
43115D323992j729099l262109l518284j804491K80712P51327N14549J877527L974846
43106A408970L294312n43638l406339k704870j031888j225025j489873Q52277
43098d846074L757667L290059K88235p58747J181886K606375J641625M46404M16936
43089H024366m00941l109678n046391l636969k89439J915435K002546O17953j596121
43080a519239l064575j522889K373090M480656K857452Q73802J366803J338432
43072G183532k573341o484473l953175K966411N026682p61889o356152m463710
$$ y = [-4481739, -1636465, 2023702, 4590738, 4568205, 1828324, -2046283, -4318474, -2905863, 1492311, 5460150, 6024964, 3697289, 1576035, 1672690, 3220445, 4427391, 4323992, 2594893, -667216, -4185500, -5989991, -5709279, -4957952, -4443403, -2565876, 1408970, 4703282, 4159644, 753305, -1951565, -2983453, -4208478, -5698351, -4846074, -1088407, 2201652, 2489887, 1731140, 2913026, 5519401, 7161026, 7607430, 8024366, 7623425, 4513747, -532644, -4169613, -4459052, -2543617, -541071, 76882, -1519239, -4583814, -6106703, -3733613, 747043, 3604495, 4478297, 5845100, 7183532, 4610191, -1874282, -5827457, -2861046, 2165636, 1403747, -4952405, -9416115]
43064i416115J369939L274016O68670o90346J592784M057151L711840J447159
43056F015098j083197l437705m532778k817084M85420J660779n18717k893014
43048g121198k418311j1860J657036J826089J313812P11322Q55323K981168N994519
43039E787900N588807o09676q112480r552883l744755K758467M088375J603588
43031b192657N2608L96456J1888j650604j959761K0728J415022P9308j642414
43022e469426m11293K635513L159807l2640l079302k346722Q58062K513274J212269
43013i60458p86409j190328k56896N72572Q56055P98210j68860k577024m757728
43004h470866l665829Q75060M589714L776538P03374O13096L683274M493500Q54777
$$ y = [-9416115, -8046176, -4772160, -4103490, -4793836, -3201052, 856099, 4567939, 6015098, 4931901, 1494196, -3038582, -5855666, -5370246, -3709467, -4228184, -7121198, -9539509, -9551369, -7894333, -6068244, -4754432, -4043110, -3187787, -206619, 5787900, 11376707, 10767031, 2654551, -6898332, -10643087, -7884620, -3796245, -2192657, -2140049, -1743593, -1731705, -3382309, -5342070, -5321342, -3906320, -3827012, -5469426, -5880719, -3245206, -85399, -118039, -3197341, -5544063, -4686001, -2172727, -960458, -1746867, -2937195, -3194091, -2621519, -1765464, -967254, -1136114, -3713138, -8470866, -12136695, -11261635, -6671921, -2895383, -2192009, -1578913, 2104361, 6597861, 7452638]
42995G452638j990385K98652L271910J67786o659376q319163k720493K621800
42987e876631K472685O50873J613334K796358P73441j217724J085246M313593
42979F611175K304224l118089m386527k72943K366774l40479m017369m047938
42971d901172k249770k095083k478237m31385L347095N542742M762894K175541
42963C672625p10450k680029k746473j293795j10509j99869q18986j031641m27873
42954f347000J547183M382611M904035M99917n768296p411031k812778K880947
42946h124412N204896M874961L354212k34307m635045m694284J152395O321756
42938C220172M436913j554122m263522k497321p72192q49661n12651O82088R48010
$$ y = [7452638, 5462253, 5760905, 9032815, 9200601, 2541225, -5777938, -8498431, -5876631, -3403946, -2753073, -1139739, 1656619, 2430060, 1212336, 2297582, 6611175, 8915399, 5797310, 1410783, 1137840, 3504614, 3164135, -853234, -4901172, -7150942, -9246025, -11724262, -12155647, -8808552, -3265810, 1497084, 3672625, 2962175, 282146, -2464327, -3758122, -3868631, -4068500, -4887486, -5919127, -6347000, -4799817, -417206, 4486829, 4986746, -781550, -8192581, -11005359, -8124412, -2919516, 1955445, 5309657, 5075350, 440305, -4253979, -3101584, 3220172, 7657085, 6102963, 1839441, -657880, -1430072, -2279733, -2792384, -2110296, -1162286]
42929a162286P37963J604663J570961j926778n394774k960548L376257N221595
42921A067053O59482k757901m36043K392643N62470k298369j100489J373267n7115
42912e95002l162021k098778K195237L573801R90327o08919P03411J327880o03438
42903A722498k085592r21891J082802K297616L520811M355320K392671j852211
42895A0512024m019749k416972q26708j979195k903624m75174K722098K656033
42887C268733N15703J07555J228355R28509n01392l56906P16204n79925l910190
42878A416646n199061l261877j156803Q111K854775P299640Q190552L036364k856423
42869A0331924l718392j850874l128697o674057n825741R23313O605354N411617
$$ y = [-1162286, -424323, 1180340, 2751301, 824523, -4570251, -7530799, -4154542, 1067053, 1726535, -1031366, -1467409, 925234, 1487704, -810665, -1911154, -537887, -595002, -3757023, -5855801, -3660564, -86763, 903564, 294645, 998056, 2325936, 1722498, -363094, -1284985, -202183, 2095433, 5616244, 9971564, 12364235, 10512024, 6492275, 4075303, 3248595, 1269400, -1634224, -2109398, 612700, 3268733, 3784436, 3891991, 5120346, 6048855, 5547463, 5190557, 5906761, 5326836, 1416646, -3782415, -7044292, -8201095, -8192984, -5338209, 1961431, 10151983, 13188347, 10331924, 6613532, 4762658, 1633961, -5040096, -10865837, -9942524, -3337170, 2074447]
42861B074447M44594j516666O25722K394497J364071p095M21530N79536k012223
42852D368413n146023m422830k09525K115071Q3985j919555K28743L153309J143148
42843f05264l777528l937813J815385N637476K780754j182729J45261L714650
42835D590192K816186j616748l239202j066857l6735j834129k784114j127165
42827d298572N53817J014693K010749L229704J968563p61704m24680K799547K851457
42818H943574k198937n880941l239620J346633J535177j283082j782335R5521
42810b464010L40810j541999k440696j387185M8267J553868L242494K786147j277598
42801a139902m858095k645968L603953O751353M061681j45610j880852j955388
$$ y = [2074447, 2519041, 1002375, 1628097, 4022594, 5386665, 5379570, 5801100, 6380636, 4368413, -777610, -5200440, -5409965, -3294894, -3210909, -5130464, -4901721, -1748412, -605264, -4382792, -8320605, -6505220, -867744, 1913010, 730281, 875542, 4590192, 7406378, 5789630, 2550428, 1483571, 1446836, -387293, -3171407, -4298572, -3744755, -2730062, -719313, 2510391, 4478954, 3717250, 3292570, 6092117, 8943574, 6744637, 863696, -2375924, -1029291, 505886, -777196, -2559531, -2464010, -2123200, -3665199, -6105895, -7493080, -7444813, -5890945, -2648451, 137696, -1139902, -5997997, -8643965, -5040012, 1711341, 5773022, 5627412, 3746560, 1791172]
42793A791172j963327j044540J213472K773075K333093J329620Q67846l26099
42785F974312k888945m495948k962435J80277J505079J11384j532924q01015K081417
42776a828798M203970K984506q46717l752924l272774m81889J990415K903504
42768A899293K300383L41902j944357k448814o54746R81012M61114o77743j59875
42759I8169J107598R34403r4818R3243J130316J119735K39347j76788q55746k964572
42749F30887m525148k805903O49919J981823J248412J740748L488680K953006
42741E362424l52416k431042j292451J52279n39404j556097n21947J705447K874142
42732C400935K109169k18679k626070k449876R49150L468461J186107k746460
$$ y = [1791172, -172155, -1216695, -3223, 2769852, 5102945, 6432565, 7300411, 6974312, 4085367, -410581, -3373016, -3192739, -1687660, -1576276, -3109200, -3910215, -1828798, 2375172, 5359678, 4512961, 760037, -2512737, -2994626, -1004211, 1899293, 4199676, 4541578, 2597221, 148407, -506339, 474673, 935787, 258044, 98169, 1205767, 2140170, 2045352, 2138595, 3268911, 4388646, 4627993, 4451205, 3595459, 630887, -3894261, -6700164, -6050245, -4068422, -2820010, -1079262, 2409418, 5362424, 5010008, 2578966, 1286515, 1438794, 899390, -656707, -1178654, 526793, 3400935, 5510104, 5291425, 2665355, 215479, 1164629, 4633090, 5819197, 3072737]
42724C072737j957241K582255L026530k931750p715015n057396J412228M922425
42716b645227M657906L347966J386440j243074j869913M77024J505538k094451
42708C522209o335366n318223K2245L880685L823236K093020Q82561Q62323K285015
42699E717705L572878J498987l394441n183636q79471L802908K576924j757227
42691E954627k639536q20228j694755m249665k342868L448963N019889m64449
42683B211978n630456l990969J212294L206572J009956j616135k261190j071492
42675f929442J035950K342133J058879j709111k228957R45520M817706N933908
42667E266586L899221J55132l606071n055109k823895N23297Q42981j246265o30731
$$ y = [3072737, 1115496, 3697751, 6724281, 3792531, -3922484, -8979880, -7567652, -2645227, 2012679, 5360645, 6747085, 5504011, 3634098, 4111122, 5616660, 3522209, -2813157, -8131380, -8109135, -4228450, -405214, 1687806, 2570367, 3432690, 5717705, 9290583, 10789570, 7395129, 2211493, 1332022, 5134930, 7711854, 5954627, 3315091, 2494863, 800108, -3449557, -5792425, -2343462, 2676427, 2211978, -3418478, -7409447, -6197153, -2990581, -1980625, -3596760, -5857950, -6929442, -5893492, -3551359, -2492480, -4201591, -6430548, -5485028, -667322, 5266586, 9165807, 9320939, 5714868, 659759, -2164136, -1640839, -797858, -2044123, -2674854]
42658b674854M141132P616458N005543j150714n137472n358884l891500j810174
42650c260465Q51744K412318J021678j796390k416909Q7038K771561K564778l21601
42641A913752k774335j992678J245607K781491J6110l896716l617563P01562L298950
42632b323820J406383p58952O64376K527238L9741m625400n097230p58845K247453
42623f679056M32026k259555j113883K422650L642013J489870q13037o42923J398135
42614b123760L089138K604953n46620m514509n497732j542168M033050N566436
42606A068788K016421j694745j549521L52493k0313j999345j874481L35168P93640
42597b571895j387302k451240m66772J518328J300776J622000M629613O609838
$$ y = [-2674854, 1466278, 9082736, 14088279, 12937565, 7800093, 2441209, -1450291, -3260465, -2408721, 3597, 1025275, -771115, -3188024, -3100986, -329425, 2235353, 1913752, -860583, -2853261, -1607654, 1173837, 1189947, -2706769, -6324332, -5622770, -2323820, -917437, -1676389, -1012013, 1515225, 1554966, -3070434, -8167664, -8926509, -6679056, -6247030, -8506585, -9620468, -7197818, -3555805, -2065935, -2878972, -3521895, -2123760, 965378, 3570331, 3023711, -1490798, -6988530, -8530698, -4497648, 1068788, 3085209, 1390464, -159057, 193436, 173123, -1826222, -3700703, -3365535, -2571895, -3959197, -6410437, -6877209, -5358881, -4058105, -2436105, 2193508, 8803346]
42589H803346L468151j670184k397267J069878K204730j687280n564155m276411
42581d9192N77785L465717J498261l319773o317484m205685J223636M198875K077528
42572h50332n96255J187758M624684L241034k365556n172523k978125j075764
42564c985079k274402k472389O71025K583138L3005k480962l46764L207507L125395
42555a939526J155595J452514K110506j060756n604512n481095j157268J347224
42547i177318N14310O15223L070932M191507K486946J200334J923159J984105
42539F809198P3809j345290j214723j871393l768505l771043j116182N17223l41183
42530f028089o1292K816799L506027q56307m556242j397097M760929N198634l04320
$$ y = [8803346, 12271497, 10601313, 8204046, 9273924, 11478654, 9791374, 4227219, -49192, 528593, 3994310, 5492571, 2172798, -4144686, -8350371, -7126735, -2927860, -850332, -1446587, -258829, 4365855, 7606889, 5241333, 68810, -2909315, -3985079, -6259481, -8731870, -8060845, -5477707, -5444702, -7925664, -8272428, -5064921, -1939526, -783931, 668583, 2779089, 1718333, -3886179, -9367274, -10524542, -9177318, -8663008, -8047785, -4976853, -785346, 1701600, 2901934, 4825093, 6809198, 6883007, 5537717, 4322994, 2451601, -1316904, -5087947, -6204129, -5686906, -6028089, -6089381, -3272582, 233445, -622862, -5179104, -6576201, -1815272, 3383362, 3079042]
42521C079042l432789l48672L199700J670818k135183k331720J404397M494285
42513E599878L921026N61407l092068m789613l600892j292199j005750k738424
42505f436635k474589J699830N393310L777683m48451l17236M670852P077676
42497A2942440K398927m270377n939278l455997k553337m247338m183022o06594
42489i914576K872704L272204K013125J116673L4149j406455q19612K744733N593603
42480E506548L871447o77722l112628k158132p95774n95273K67488K536836L407112
42471H249902Q20802k546678k712518l76797N3007k472550l261660J227901O859982
42462E841391O305524n07621n271044k462920K904104K773457k192154m432032
$$ y = [3079042, -353747, -702419, 2497281, 4168099, 2032916, -298804, 1105593, 5599878, 9520904, 10082311, 6990243, 2200630, -1400262, -2692461, -3698211, -6436635, -8911224, -7211394, -1818084, 1959599, 1511148, 1193912, 5864764, 12942440, 15341367, 11070990, 5131712, 1675715, -877622, -5124960, -9307982, -9914576, -7041872, -3769668, -1756543, -639870, -605721, -2012176, -2831788, -87055, 5506548, 9377995, 8700273, 5587645, 3429513, 2633739, 2038466, 2305954, 4842790, 8249902, 9070704, 6524026, 3811508, 3434711, 3487718, 1015168, -2246492, -1018591, 5841391, 12146915, 11639294, 6368250, 3905330, 6809434, 9582891, 7390737, 2958705]
42454B958705j641199K59899k292651m193926j43657O166547P189856K417296
42446A0720870k022776k793581k186232k034278r23941J376023J931055o36756
42438C430384l271079k794224l18522R59309K68220o11726l41998O39928J006081
42429a033627j65349k174727k632637n7967L431178M066097J377775j115168p85671
42420I09904J011358J710775Q99994m56380j844437k697865k143081p00163j41705
42411c451600m67391K53422J652952M24917l543731m660219L79654N828985M172026
42402E89015k339040m706676q07979K253399N31642p96764K344395M925193J474649
42393C467834l607419k558722L015593M770462Q89811k366949k015486j918153
$$ y = [2958705, 1317506, 1577405, -715246, -4909172, -5052829, 1113718, 8303574, 10720870, 8698094, 5904513, 3718281, 1684003, 760062, 2136085, 4067140, 3430384, 159305, -2634919, -2953441, -1994132, -1725912, -2337638, -2679636, -2039708, -1033627, -1198976, -3373703, -6006340, -6064307, -2633129, 1432968, 2810743, 1695575, 909904, 1921262, 3632037, 4532031, 4075651, 2231214, -466651, -2609732, -3309895, -3451600, -3918991, -3665569, -2012617, -1587700, -5131431, -9791650, -9411996, -3583011, 589015, -1750025, -6456701, -7264680, -5011281, -4479639, -5276403, -2932008, 1993185, 3467834, -139585, -2698307, 317286, 5087748, 5977559, 3610610, 1595124, -323029]
42385c23029l460766j920427M048535P585007L859219j662278j772036J273019
42377G627244O99932k896720l262004J89098J654517o52604j779266R12382L522578
42368F015157K953346J777275K359138J931471k125245o594308o768190l418490
42360c869846r57324p88406p13347L66857J148370J023014J274188K708178M084726
42351D276410L527221P48773k241581k744379l64308K020019J596459p48287k119481
42342C950846k024868k136484k324458p78922J915545L029150K398363K356656
42334F385828K462051k17890m303678m019417J305728M238474R9071n301298m415272
42325c766403Q92111L587383K467134J465381J170512r91971l798012l202087
$$ y = [-323029, -3783795, -5704222, -1655687, 5929320, 9788539, 8126261, 6354225, 7627244, 8327176, 5430456, 2168452, 2357550, 4012067, 3359463, 1580197, 2492579, 6015157, 8968503, 10745778, 13104916, 15036387, 12911142, 6316834, -451356, -3869846, -4827170, -5615576, -6328923, -5962066, -4813696, -3790682, -2516494, 191684, 4276410, 7803631, 8552404, 6310823, 3566444, 3202136, 5222155, 6818614, 6070327, 3950846, 1925978, -210506, -2534964, -3313886, -1398341, 1630809, 4029172, 6385828, 8847879, 8629989, 4326311, 306894, 1612622, 5851096, 5950167, 648869, -3766403, -2874292, 713091, 3180225, 4645606, 5816118, 4824147, 1026135, -2175952]
42317b175952K23093J807570N95111K7521Q57048J28129k224649k454254J13574
42308c102809J552801K47468o23354P43578J927559J581123J783190K743492J004392
42299G857440l928439o597045l108781K810522N138059L146924J47910j703030
42291C763560j787102L30526L030846K586293j602275m916433l973936j516414
42283d084935j111223j126033J056364K802434O76957j827366J216956P112275
42275D715429O552312j964311q094284m004902M205758N541101l54606m361882
42267B234615k355391L9109j745409l727805j036397L157936K911394j64248L19486
42258c66710L995705L745855j740738m461801L085M526407J751562l742728l101782
$$ y = [-2175952, -1952859, -145289, 449822, 477343, 1334391, 1462520, -762129, -3216383, -3102809, -1550008, -1302540, -1925894, -1182316, 745243, 2326366, 4109556, 6853048, 7857440, 3929001, -2668044, -5776825, -2966303, 2171756, 5318680, 5466590, 3763560, 1976458, 2306984, 5337830, 7924123, 6321848, 1405415, -2568521, -4084935, -5196158, -6322191, -5265827, -2463393, -1786436, -3613802, -2396846, 4715429, 11267741, 9303430, 1209146, -2795756, 1410002, 6951103, 6596497, 2234615, -120776, -81667, -1827076, -5554881, -6591278, -3433342, -521948, -686196, -366710, 3628995, 7374850, 5634112, 1172311, 1175396, 5701803, 7453365, 3710637, 608855]
42249F08855K242992L701674J49363j457967P14053P23405l128059m386673j8735
42240h51092L860182K448179n00296j263116l127378p889458q737965o14335Q817537
42231g857742Q669860R15565l322348p27354J618238l57669k369008j181675J33066
42222d479067o84177n78972K507339N163658M152117J385308k06545j141167k342005
42213C776489k067134L86558J823685l6288k279533j448576O29164L00811j198472
42204a13296P5717L280776L396392m19594k853681p21678J855186N56m086655
42195D13723m541398q38965J989016J702727J712254L968326M453040k11548n575553
42186C071622m478506K175473N781274J862624l890043l875864J308719M689539
$$ y = [608855, 2851847, 6553521, 6702884, 5244917, 5958970, 6682375, 3554316, -832357, -851092, 3009090, 5457269, 4956973, 3693857, 566479, -7322979, -16060944, -16675279, -7857742, 812118, 1727683, -1594665, -2322019, -703781, -1061450, -3430458, -4612133, -4479067, -5163244, -5742216, -3234877, 1928781, 6080898, 7466206, 7259661, 6118494, 3776489, 1709355, 2095913, 3919598, 3883310, 1603777, 155201, 784365, 1085176, -113296, -37579, 3243197, 6639589, 6219995, 3366314, 2644636, 4499822, 4500378, 413723, -4127675, -4966640, -2977624, -1274897, 437357, 4405683, 8858723, 8647175, 3071622, -1406884, 768589, 6549863, 8412487, 4522444, 646580, 1955299, 6644838]
42178F644838K481974k044605l781874j817923N73568N02892j183889j428642
42170e3661O26790K276802J190859j168810k196122k305778l052378k674879J578113
42161e779064P006545P133259J250930l342467j462211K704282K392641j898166
42153H005749m220411k130600J045646J684071l16199k648962k886739l67630
42145a835075K560097K661632K66085j027400k27926o13264l423718m577959j246685
42136g464213K760422K785467N45737K81078J191558j92873k745010k403098M46568
42127d794364J637453M57250J38728J511611K050892J277530J416305K265753
42119E961158R16238k501023l824549r71528L063564M399193K097232k382693
$$ y = [6644838, 9126812, 7082207, 3300333, 1482410, 2055978, 2558870, 1374981, -53661, 573129, 2849931, 4040790, 2871980, 675858, -1629920, -4682298, -7357177, -5779064, 1227481, 8360740, 9611670, 6269203, 4806992, 7511274, 9903915, 8005749, 3785338, 1654738, 2700384, 4384455, 4068256, 1419294, -1467445, -1835075, 725022, 3386654, 3652739, 2625339, 2397413, 1784149, -1639569, -6217528, -7464213, -4703791, -1918324, -1372587, -1091509, 100049, -92824, -2837834, -5240932, -4794364, -3156911, -2699661, -2560933, -1049322, 1001570, 2279100, 3695405, 5961158, 6877396, 4376373, 551824, -419704, 2643860, 7043053, 9140285, 6757592]
42111F757592o085568n357973K30601N286114M325381m14967j770561K090916
42103E061535N567699M092694o20416m640470o213129n138914k272862l88498
42095d552361j315474k156289R65295N758023O047229J263917k591699k138525
42087A280116k99503L30628J051822K168360J253574j249314j121983K219680
42079E633380L705163Q67355k246983k499185k311599l306272k311128J683655
42071g85614L464549J04723k827767o170M426759L600814r09376k557985r04749
42062C605184r01823l087359k683316J641118N125248M119208O72009j352412
42054G137857r84651R862m51798k792639m875166m069607j105182N08351j41169
$$ y = [6757592, 672024, -4685949, -4455348, 830766, 5156147, 4741180, 2970619, 5061535, 10629234, 14721928, 14101512, 9461042, 3247913, -1891001, -4163863, -4552361, -5867835, -8024124, -7058829, -1300806, 4746423, 6010340, 3418641, 1280116, 980613, 1311241, 2363063, 4531423, 5784997, 4535683, 3413700, 5633380, 9338543, 10205898, 7958915, 5459730, 3148131, -158141, -2469269, -785614, 2678935, 2783658, -44109, -50279, 4376480, 7977294, 7067918, 4509933, 3605184, 2703361, -383998, -3067314, -1426196, 3699052, 7818260, 8490269, 7137857, 6153206, 6163068, 5711270, 2918631, -1956535, -6026142, -7131324, -6622973, -6764142]
42045f764142k83213P50570k80517l706654m087302J207164O004669L914476j773650
42036e018599l605967j390137l70986r36733J286829O138360P932803M329817
42028H365387n42276k678372k366022j340733p50921j879800m270150m113139
42020i576026M85124M449260K178013k826883k489831K712832M160037p20965
42012a628439m239365j259543K816586J700187j788803j493969K030871L728411
42004a34064K365593N49353q44683k570957l211179r51075J677690K9738n189859
41995h279443p157880j591329O689986Q724420K223328n350753n788064r2176
41987a0621911L704488J865551p63720O25718L294120K390950m52946j76440K680800
$$ y = [-6764142, -7047355, -6296785, -6577302, -10283956, -14371258, -13164094, -7159425, -3244949, -5018599, -8624566, -10014703, -10385689, -11322422, -10035593, -3897233, 4035570, 8365387, 7823111, 5144739, 2778717, 1437984, 687063, -1192737, -5462887, -9576026, -9090902, -4641642, -2463629, -5290512, -7780343, -5067511, -907474, -1628439, -5867804, -7127347, -4310761, -2610574, -4399377, -5893346, -3862475, -134064, 2231529, 2780882, 1936199, -634758, -3845937, -4797012, -3119322, -3089584, -8279443, -15437323, -17028652, -10338666, -1614246, 609082, -4741671, -10529735, -10621911, -6917423, -5051872, -5815592, -5189874, -1895754, 495196, 42250, -134190, 2546610]
41978B546610K917653l85839k765234k251285j638986k126186j324026Q97190
41970d130103J031421j456271k275276L52108K388640J046608n36447P05004K354083
41961e20233J232376j005132j276985k60049j12277l71392K00500Q43852J018441
41952b50899J928708L037348J321582k834902l998713n8568K960669k42257n440570
41943c577602n329624o65336K275649K197669K792947M114921K299926k224543
41935A884007m094197j709012L56341n90494j277196R77426L232438J910933j347710
41926f57464k415137n37224J532592J503527m71272k486159k405970m3083J911344
41917d068846J046296q91115j43755L007165M043638R90042k471219k516694k71196
$$ y = [2546610, 5464263, 5078424, 2313190, 61905, -1577081, -3703267, -5027293, -4130103, -3098682, -4554953, -6830229, -6478121, -4089481, -3042873, -3579320, -2874316, -520233, 712143, -292989, -1569974, -1830023, -1942300, -2313692, -2113192, -1269340, -250899, 1677809, 4715157, 6036739, 3201837, -796876, -855444, 2105225, 1862968, -3577602, -8907226, -9572562, -7296913, -5099244, -2306297, 1808624, 4108550, 1884007, -2210190, -3919202, -3562861, -4153355, -5430551, -4453125, -1220687, 690246, -657464, -3072601, -3609825, -2077233, -573706, -1044978, -3531137, -5937107, -5980190, -4068846, -3022550, -3913665, -4057420, -1050255, 2993383, 3983425, 1512206, -1004488, -1275684]
41908a275684J109382J244107J251826L68227k195936l729374q99293M134814
41900H069N066689J61033m427733k782879K350590L358285j276754m695506j605147
41891c843353L881469L967547j737625n645910k677728L183248M801186J177826
41883C106660k234770j173866K466941L686746O48220l264981l643607n31255
41875i39912J690058L38504j761072o07595K729103L742678J440775o71969o66272
41866E294298n41466j446935j428121L6294P3533k135211k638389Q07530L945914
41857A967447K365066j190136j297961J350158J680729j115364k820797j372854
41849d33712Q10438J635249J571559J046952n7078n39478M07070M61329k380318
$$ y = [-1275684, -166302, 1077805, 2329631, 2697858, 501922, -3227452, -4126745, 8069, 5074758, 5235791, 808058, -1974821, 375769, 3734054, 2457300, -2238206, -3843353, 38116, 4005663, 2268038, -3377872, -6055600, -2872352, 1928834, 3106660, 871890, -301976, 2164965, 5851711, 6499931, 3234950, -408657, -939912, 750146, 1088650, -672422, -1280017, 1449086, 5191764, 6632539, 5960570, 5294298, 4752832, 3305897, 1877776, 1914070, 1987603, -147608, -2785997, -1978467, 1967447, 4332513, 3142377, 1844416, 3194574, 4875303, 3759939, 939142, -433712, 376726, 2011975, 3583534, 4630486, 4573408, 4033930, 4441000, 4902329, 2522011]
41840B522011m904648k642641K312733L689207P48051j288797o66690j194785
41832a425559l567288k941757J687410L845890J21623l043396N94723O406215
41824A677861N783646o40291m607029k553907J269233K856101K572176J269802
41816G627592j409541l973168l541191n46572J256325L56495q40115o04402j95985
41807a870562n75017n66291L55244Q18404M93054J046435K583073K336007r46965
41798C673382m135737l897582j542174o27947j210953r6656L280394M900510J854736
41789B197973k521550k365629K440182N296416J736747l844357l851007J791041
41781H79816N443771K668270j920842k237387N09432R92567j509627k916015j448064
$$ y = [2522011, -2382637, -5025278, -2712545, 976662, 1724713, 435916, -230774, -1425559, -4992847, -7934604, -6247194, -2401304, -2279681, -5323077, -4728354, 1677861, 7461507, 6821216, 2214187, -339720, 929513, 3785614, 6357790, 7627592, 6218051, 2244883, -1296308, -1842880, -586555, -230060, -1070175, -1674577, -1870562, -2445579, -3011870, -2656626, -1838222, -1345168, -298733, 2284340, 4620347, 3673382, -462355, -4359937, -5902111, -6530058, -7741011, -7837667, -4557273, 343237, 2197973, -323577, -2689206, -249024, 5047392, 6784139, 2939782, -911225, 879816, 6323587, 8991857, 7071015, 4833628, 5343060, 6335627, 4826000, 1909985, 461921]
41772D61921K89850K17205p31901j351451j486486m34586K092120L475699J115738
41763C648109k130011q24194L979423M881291m63222m897646k757688J323725
41755B759787O17224k546557j848822J070865m80621n258747m748851K100083
41747h335639N463789n7199o286809m056285K815433M383609m6111k719058o25970
41738i464240J628585J433304J526297K634157J219036k782896l627186R12526
41730f520417M610632K188546k109940j412056K856145L974011J002568o35090
41722C954399J272283K721809Q28095j979318k812923k389314k239767k038667
41714b683403j673168k210214k912107j028225L317532N744769L651495J02397
$$ y = [461921, 751771, 968976, 237075, -1114376, -2600862, -3035448, -943328, 2532371, 3648109, 1518098, 693904, 4673327, 9554618, 9091396, 4193750, 1436062, 2759787, 3377011, 830454, -1018368, 52497, -428124, -5686871, -10435722, -8335639, -2871850, -2929049, -9215858, -13272143, -10456710, -6073101, -6119212, -8838270, -9464240, -7835655, -6402351, -4876054, -2241897, -1022861, -3805757, -7432943, -6520417, -1909785, 278761, -1831179, -3243235, -387090, 3586921, 4589489, 3954399, 5226682, 7948491, 8776586, 6797268, 3984345, 1595031, -644736, -2683403, -4356571, -6566785, -9478892, -10507117, -7189585, -1444816, 2206679, 2309076]
41706B309076j173413j115113k080230k616735j71146L271410L458485P09300
41698B591634o70190M03186M04843k087252l403935q03485K697566K719146k12940
41689A638573k283969k246189j885884j671598J0360K832655L393722k5735m038373
41680d276438m023250j95318K853558K351527K79810n56409n20733j171911j554476
41671f813640K85535L045804L151369L09802j586024m18765Q52314p58289l071578
41662e003472k150064J216510K601650P17504r77956K94801L111530M514522L353236
41653G678261K59759l061297l996123j360952J826621J200726k414812l189563
41645c057380J191287N367208L844225j029714l036167j286143j62288j455285
$$ y = [2309076, 1135663, 20550, -2059680, -4676415, -4847561, -1576151, 1882334, 2591634, 1921444, 2324630, 2729473, 642221, -2761714, -3565199, -867633, 1851513, 1638573, -645396, -2891585, -4777469, -6449067, -6438707, -3606052, -212330, -238065, -4276438, -8299688, -8495006, -5641448, -3289921, -3010111, -3566520, -4087253, -5259164, -6813640, -6528105, -3482301, -330932, -21130, -1607154, -2025919, -1173605, -1931894, -5003472, -7153536, -5937026, -3335376, -2617872, -3595828, -3301027, -189497, 4325025, 7678261, 7938020, 4876723, 880600, -480352, 1346269, 2546995, 132183, -3057380, -1866093, 3501115, 7345340, 6315626, 3279459, 1993316, 1831028, 375743]
41637C75743k221664o79570R92948J043996Q72856J613834J902575J008542N11131
41628E420391O84670r62177m690965n889611j363523M791914O191773K812297
41620F994769k10366o87607p70373j079314M45000L180645L180808l26571l047746
41611G679245k521607j835754l483697m509617j886313J548187J442190j065243
41603d632609j810155m09730P15823J797340M270491N554719J880328m161263
41595C204944n614171j283129K628856K210262N27018N13366L3330k327500k869278
41586b976302P43659L740360R75034m248967m444625J071708N570357M518561
41578D949785M50879j874288q85723J635743K642751J50019m061751n183270j474710
$$ y = [375743, -1845921, -2525491, -1532543, -488547, 384309, 1998143, 3900718, 4909260, 5420391, 6105061, 5142884, 451919, -5437692, -6801215, -2009301, 4182472, 6994769, 6784403, 6096796, 5326423, 4247109, 4692109, 7872754, 11053562, 10726991, 7679245, 5157638, 3321884, -161813, -4671430, -6557743, -5009556, -3567366, -4632609, -6442764, -6852494, -6136671, -4339331, -68840, 5485879, 7366207, 3204944, -2409227, -3692356, -1063500, 1146762, 1673780, 2187146, 2220476, -107024, -2976302, -2232643, 1507717, 2482751, -1766216, -6210841, -5139133, 431224, 4949785, 5400664, 3526376, 2640653, 4276396, 6919147, 7069166, 3007415, -2175855, -3650565]
41569c650565K415700J852412n21613R20761N068191N219970j72537m797319m108920
41560B226080j309063q54519j562640j47704K596141L480708J999604l8849j744835
41551D644923k781447j949004O61258K132345N85755j324230j96443K593130K994986
41542G361273O56464j028347q16836j228615l548902n083373l127311J061099
41534e754548M157346M734772L530809J255558j723145m062802l865452r92877
41526b720339K129148K873564J249479l42945j67706Q55604O41540j284996l252157
41517a8808l265651p70163K798447M610967K679799j463011l681775k294900l83224
41508a788319p60811j026501K282360O428319N257027q42101m432020k260195
$$ y = [-3650565, -1234865, 617547, 95934, 1016695, 6084886, 11304856, 11132319, 6335000, 2226080, 917017, 62498, -1500142, -1647846, 948295, 4429003, 6428607, 6389758, 4644923, 1863476, -85528, 575730, 2708075, 3293830, 1969600, 1773157, 4366287, 7361273, 8017737, 6989390, 6172554, 4943939, 1395037, -3688336, -6815647, -5754548, -1597202, 3137570, 6668379, 7923937, 6200792, 2137990, -1727462, -2720339, -591191, 2282373, 3531852, 3188907, 3021201, 3876805, 4518345, 3233349, -18808, -3284459, -4054622, -1256175, 3354792, 6034591, 4571580, 889805, -1405095, -1788319, -2549130, -3575631, -1293271, 5135048, 10392075, 9549974, 5117954, 2857759]
41500B857759j21366k816935n885194l192293K574528M373776K160889J595745
41492A546909L293696K109578k624271m689495j117236K659495J406216k212634
41484C72258k881010p82414L02880l92472p24197j55088J56809M26543J702895
41475a973796L179849L119641J649135O9123j517979l268672l553666r94290K174607
41466a116048K096286j259874l629362k138957J025378J894664n7048j620118
41458d805079k60416K621807L554000J622616j76664R65035L649863M315333K279403
41449A3765898q1309j658971l399578m502952k400079J846454K901733j042031
41441E429165m298496j740031L142924L571542k68245k571052j489410m90209
$$ y = [2857759, 2736393, -80542, -5965736, -9158029, -6583501, -2209725, -48836, 1546909, 4840605, 6950183, 4325912, -363583, -1480819, 1178676, 2584892, 372258, -2508752, -3291166, -2988286, -3380758, -4104955, -4260043, -4103234, -3676691, -1973796, 1206053, 4325694, 5974829, 6043952, 4525973, 1257301, -2296365, -3290655, -1116048, 980238, -279636, -3908998, -6047955, -5022577, -3127913, -3184961, -4805079, -5065495, -2443688, 1110312, 2732928, 2556264, 3521299, 7171162, 11486495, 13765898, 13684589, 12025618, 8626040, 4123088, 1723009, 3569463, 6471196, 5429165, 1130669, -609362, 2533562, 6105104, 5836859, 3265807, 1776397, 1286188]
41433A286188q94527j83780J707163J348695j392227k115519M04972J833623L90598
41424B385186M64018L997545N172101l35679o690486n908532j36221K265125j09829
41415A103228j329821N27054J024551j108804j321181J533425J934766k347605
41407A5613m879807p88988M214331K205672m184083n418070P50122O601278N869370
41398D385438R17653k849397l984959l962968l342475j831616J76862K062471
41390h428991L353809K972464K88803k651251k735890k97749J091541K52852R7408
41381f057004J932353K263825j305880m599747k232966L590958N315460Q41562
41373b51439l523452k446731J183257J655354o83838o26389L293314O205908L823720
$$ y = [1286188, 391661, 207881, 1915044, 3263739, 1871512, -244007, 160965, 1994588, 2385186, 2849204, 6846749, 12018850, 11683171, 4992685, -915847, -1052068, 1213057, 1103228, -226593, 300461, 1325012, 216208, -1104973, 428452, 2363218, 15613, -4864194, -5653182, -1438851, 766821, -3417262, -8835332, -8085210, -1483932, 4385438, 5303091, 2453694, -1531265, -5494233, -8836708, -10668324, -10491462, -8428991, -5075182, -2102718, -1813915, -4465166, -7201056, -7498805, -6407264, -6154412, -6057004, -4124651, -1860826, -3166706, -7766453, -9999419, -6408461, -1093001, -251439, -3774891, -6221622, -5038365, -3383011, -4066849, -4693238, -1399924, 4805984, 8629704]
41364H629704j546102m095536j853888J461291J575503j424372m059099m001509
41356e314008k116250k09926J457169L303912M233837K388458j668758m432313
41348b357879l364048j17151J709781J217937N76675R91237Q85714q98668k497879
41339c854281j783169o8840r6890j058894O57633N024300O604686J890119m556313
41330B758351n306072n7778M056681K324029j892067l074845j185950j59633j331686
41321c868970k271813j292984M12242J365018J766483K187701K350920K007027
41313B655624J573000J323173J066413Q23806P12556K97583n89545p91367N12475
41304G583718J426966p30489m773802n906498j983903L138645M502354K099388
$$ y = [8629704, 7083602, 2988066, 1134178, 2595469, 4170972, 2746600, -1312499, -5314008, -7430258, -7640184, -6183015, -2879103, 1354734, 3743192, 2074434, -2357879, -5721927, -5839078, -4129297, -2911360, -2334685, -1343448, -457734, -1356402, -3854281, -5637450, -5706290, -5803180, -6862074, -6204441, -1180141, 5424545, 7314664, 2758351, -2547721, -2605499, 1451182, 3775211, 1883144, -1191701, -2377651, -2537284, -3868970, -6140783, -7433767, -7021525, -5656507, -3890024, -1702323, 648597, 2655624, 4228624, 5551797, 6618210, 7442016, 8154572, 8452155, 7862610, 7071243, 7583718, 9010684, 8280195, 3506393, -2400105, -4384008, -1245363, 3256991, 5356379]
41296E356379l62454r77091r76331j400123j433940l17064J276996K308846K428701
41287E903919J727002N36797n15677j177874j959403k968680l104302j597767
41279c155985N21164J916962K810560L563654K760796o56468m339208m851713
41271a430238k610804r90918o39543J046589M015384M041088m29553m362769k923160
41262d283924J205357J937736j017231k302057N49864L933168M175037K188522
41254F386472N38332m74460j648071k501065k314896j733797j443693p69225P54967
41245c205436J869701J392938L25909L77282J302122J461195M13570o63329p78299
41236B495653n0874P61304N72452j455883m296824m874997j414260L480082N271352
$$ y = [5356379, 4993925, 4016834, 3040503, 1640380, 206440, -110624, 1166372, 3475218, 5903919, 7630921, 8167718, 7652041, 6474167, 4514764, 1546084, -1558218, -3155985, -2634821, -717859, 2092701, 5656355, 8417151, 7760683, 3421475, -1430238, -4041042, -5031960, -5671503, -4624914, -609530, 3431558, 3002005, -1360764, -4283924, -3078567, -1140831, -2158062, -4460119, -3910255, 22913, 4197950, 6386472, 6924804, 6450344, 4802273, 2301208, -13688, -1747485, -3191178, -3960403, -3205436, -1335735, 57203, 383112, 760394, 2062516, 3523711, 3937281, 3273952, 2495653, 2444779, 3206083, 3778535, 2322652, -1974172, -6849169, -8263429, -4783347, 488005]
41227D88005L072003M76127K92778J005266N880j926688k047165l62852K01776
41218A205130j503644k924928j764374M65425P89020q39067j723878l35983K015541
41209d616758L176789K108159p99573l533414l037293J620774O693315P064017
41201H676016K574826j746366k477661j543488j792117k528302k061766j364901
41193b263759j658442j086904K051269M865159L314621j193418l388734j639840
41185a000048P53379J284430M74138j249278l661452l861482P13769N848365L959951
41176C261772m163941q210953k446034N819813O842690J588619j916671p44917
41168C0378J330667J453139K71302j451868l181326k919107j9676K053991M54494
$$ y = [488005, 3560008, 4036135, 4328913, 5334179, 5340059, 3413371, 1366206, 1003354, 1205130, -298514, -3223442, -4987816, -4522391, -3733371, -4572438, -6296316, -6632299, -4616758, -1439969, 668190, -131383, -3664797, -6702090, -5081316, 1611999, 8676016, 11250842, 9504476, 7026815, 5483327, 3691210, 1162908, -898858, -2263759, -3922201, -5009105, -2957836, 1907323, 5221944, 4028526, 639792, -1000048, -246669, 1037761, 1511899, 262621, -3398831, -7260313, -6546544, -698179, 3261772, -902169, -9113122, -11559156, -5739343, 1103347, 2691966, 775295, 30378, 1361045, 2814184, 3085486, 1633618, -1547708, -4466815, -4486491, -2432500, -1978006]
41159a978006j855015o82403K213958K314543K18369j60216Q66278Q6563j500358
41150d76287n40052J099080j010404m411224k297560M169070O029963Q30411l295701
41141I7296j046280K424205J837463K44142J240908J448530k198434n201884l102720
41132d256774K46303k50331j664711R40306M695910L868197M1357j445325j124968
41123A049964k454951l200121M26914M370134K140506k814839j638956M285462
41115B164113M596761k511560o793484k882140J668100L47416j796986J093053
41107d114727M257575R11941m847422l912155L052796O442215K114835l350481
41099E54577k701060K806756O320226L987653j306957l743808j425300J190599
$$ y = [-1978006, -3833021, -4515424, -2301466, 13077, 231446, 71230, 937508, 1024071, -476287, -1016339, 82741, -927663, -5338887, -7636447, -3467377, 2562586, 3392997, 97296, -948984, 1475221, 3312684, 3556826, 4797734, 6246264, 4047830, -1154054, -4256774, -4010471, -4260802, -5925513, -4985207, -289297, 3578900, 3620257, 2174932, 1049964, -1404987, -4605108, -4178194, 191940, 2332446, -482393, -2121349, 2164113, 6760874, 4249314, -2544170, -5426310, -3758210, -3410794, -5207780, -4114727, 142848, 1054789, -3792633, -7704788, -4651992, 1790223, 3905058, 554577, -2146483, 660273, 6980499, 10968152, 9661195, 5917387, 4492087, 5682686]
41091E682686p95716n347382n781801o02109L984787L207105J49814k93908R34709
41082A138185J33418k161559k606663j143870m22624n16182P83048K948815K710906
41073H63474m80348k809868j083891L101941N267881K918675j873380m354602
41065A549882k150912J580117J847519j289555k736755k42672J962757J74493
41057F94874k254365j4129N166889O087131P9304p177106q504358k849453M350976
41048d420237O367507J127631o190020p602225j301006N642916O005292J259478
41040H89336k027580j959632j880611k578515p87725L541074N049644J059940
41032A305931l411449k805787Q00378J512433j035842j702208J512675M317674
$$ y = [5682686, 4886970, -460412, -6242213, -6844322, -2859535, 347570, 497384, 203476, 1138185, 1271603, -889956, -3496619, -4640489, -5063113, -5579295, -4796247, -1847432, 863474, 383126, -2426742, -3510633, -408692, 4859189, 7777864, 5904484, 1549882, -601030, 979087, 2826606, 1537051, -1199704, -1442376, 520381, 694874, -1559491, -1573620, 3593269, 9680400, 9759704, 2582598, -5921760, -8771213, -4420237, 1947270, 3074901, -3115119, -10717344, -12018350, -6375434, -370142, 889336, -1138244, -3097876, -4978487, -7557002, -8344727, -4803653, 245991, 1305931, -2105518, -4911305, -4110927, -2598494, -3634336, -5336544, -3823869, 493805]
41024D93805K938837m23043j641231r04191j228555k643927k256128J95408J448272
41015d020753N73176J137838M735940O587751K203388m561447n954453j484444
41007g83004J695967k35580k852433j361336K441966M140185K874798K22378l037498
40998C105443n585465m676605k41636L272528K614021K48652j12716Q39876N57847
40989B1945m77407n83812o53612j795601j956748O64372L428970L017199Q58954
40980B524260K19842N41444l42281j078784N23872K128849K49088k969812k673280
40971h76802N31577J823754L97856k45775N78109K08260j177188q26163K28181
40962F41809j704738n162182m409139P67370L711778J256982j802844j087411
$$ y = [493805, 3432642, 3009599, 1368368, 464177, -764378, -3408305, -5664433, -5469025, -4020753, -3447577, -2309739, 2426201, 9013952, 11217340, 6655893, 701440, -783004, 912963, 677383, -2175050, -3536386, -1094420, 3045765, 5920563, 6142941, 3105443, -2480022, -7156627, -7398263, -4125735, -1511714, -1263062, -1375778, -535902, 21945, -455462, -1039274, -1692886, -3488487, -5445235, -4780863, -1351893, 1665306, 2524260, 2744102, 3285546, 2943265, 1864481, 2388353, 4517202, 4766290, 1796478, -876802, -345225, 1478529, 1876385, 1630610, 2208719, 2416979, 1239791, 413628, 641809, -1062929, -6225111, -10634250, -9866880, -6155102, -4898120, -6700964, -7788375]
40954g788375J309671K060805J720642J552280P69355l67071P2896J240813R9735
40945F70751k081421n84457L690511L950442r64556l492022Q1788L056167J81576
40936D508779k882708J22680M238696J528620m826429n392542J69961L293585
40928G60642N28150k572467j821837N8124j82482j339338j197229K7216J178876
40919d560345J570199O47013q07317k71353K523976L454385p4029l792808k332714
40910c642993K228900L612990J119070m51602O32100J427511Q08716P46386R23594
40901G404672j353574n151335n967663k831480K29643P16140L82618Q47552J701599
40892d021828L188721N297730M563041j666081q010696o018186K779668P359466
$$ y = [-7788375, -6478704, -4417899, -2697257, -1144977, -375622, -742693, -669797, 571016, 670751, -1410670, -1995127, 1695384, 5645826, 4681270, 1189248, 1271036, 4327203, 4508779, 1626071, 1748751, 5987447, 7516067, 2689638, -2702904, -2532943, 760642, 1288792, -1283675, -3105512, -3047388, -3229870, -4569208, -5766437, -5739221, -4560345, -2990146, -2343133, -3150450, -3421803, -897827, 2556558, 2482529, -1310279, -3642993, -1414093, 2198897, 3317967, 2866365, 3498465, 4925976, 5734692, 6481078, 7404672, 6051098, 899763, -5067900, -7899380, -7669737, -6953597, -6570979, -5723427, -4021828, -833107, 4464623, 9027664, 7361583, -649113, -6667299, -3887631, 3471835]
40884C471835L001175k327655j221052K348164J277646l141629n008417l390240
40876d990173j071004J605728M735775M866685K07488l641762o53036N557381
40868F617082O225462J99869n447286o444842n017658k742807J882781P109187
40860B381788P112376R40367m179982k691589J408606J362439j893908j943253
40852B496844K557250N556196K310858m113238o990488m064299P00191K579399
40844A032713J199677m29470n43900l21049r18627j179138J57250J794503J812240
40835B604199R51921J046201J038622j734033o189020p473971l604946J557098
40827a1803929L957400M485271N699903O641926M756183Q11009k275681m098025
$$ y = [3471835, 6473010, 4145355, 2924303, 5272467, 6550113, 3408484, -1599933, -4990173, -6061177, -4455449, 280326, 5147011, 5354499, 1712737, 1059701, 6617082, 12842544, 13042413, 7595127, 1150285, -3867373, -6610180, -4727399, 2381788, 9494164, 10434531, 6254549, 3562960, 4971566, 6334005, 4440097, 2496844, 5054094, 10610290, 12921148, 8807910, 1817422, -2246877, -1546686, 1032713, 2232390, 1802920, 1259020, 937971, 19344, -1159794, -1002544, 791959, 2604199, 3556120, 4602321, 5640943, 3906910, -2282110, -9756081, -13361027, -11803929, -7846529, -3361258, 2338645, 8980571, 13736754, 14547763, 12272082, 8174057]
40819H174057n884111o008541j679355M557991N684384j65838n837202m455197
40811e613812J302131L773284J398524l42920J706838L863466K021735j939589
40803F169657l316689j549837m35128k065922l852494k602400P02240K441352
40795d509221J827253J875136L985847M703292R34208l887888l723026O59394
40787A864995K208894j207112k955281J214456M937539R67180n971014n189617
40779d129960L330825Q196539L172781m723136o522895k716641Q43247J925464
40771f23776J811093R93144k45172m28249K84915o47437l149551l077973R52847
40762d130159M019524K171007j356707j732893J19535P89497P56692J943858K634069
$$ y = [8174057, 2289946, -3718595, -5397950, -839959, 4844425, 4678587, -1158615, -5613812, -4311681, -538397, 860127, 517207, 2224045, 6087511, 8109246, 6169657, 2852968, 1303131, 868003, -1197919, -5050413, -7652813, -6950573, -4509221, -2681968, -806832, 3179015, 7882307, 8816515, 4928627, 1205601, 1864995, 4073889, 2866777, -88504, 1125952, 6063491, 7030671, 1059657, -4129960, -799135, 7397404, 10570185, 5847049, -675846, -3392487, -2549240, -623776, 1187317, 2180461, 1935289, 1507040, 1791955, 1144518, -2005033, -5083006, -4130159, -110635, 2060372, 703665, -1029228, -909693, -120196, 636496, 2580354, 5214423]
40753E214423O27151j808110j775047j131436k260468k360552J326565M441882
40745B274408J560503l810291l966732N18319K330071J00642k81991K883122M200871
40736E808922J172610k001580k678413l308492m474464k839495J300901K791367
40728d228644R13865J328972N184650N375426j301979p032365m573945J620566
40720b713454L229124N78849n77728L81499o1183j582987j025253P84344L07604
40711f79185j952634k088519P38893L538504M290854L352967J357314p17369j102770
40702F738055Q5247J56891j505728j739125M44760R71458k093642l821372m44023
40693a207479L258897J578621k049807j045178K225507L06801n459206n664949
$$ y = [5214423, 5841574, 4033464, 2258417, 1126981, -1133487, -3494039, -2167474, 2274408, 3834911, 24620, -3942112, -3423793, -1093722, -993080, -1275071, 1608051, 5808922, 6981532, 4979952, 2301539, -1006953, -5481417, -8320912, -7020011, -4228644, -3314779, -1985807, 3198843, 8574269, 7272290, 239925, -4334020, -2713454, 515670, 1094519, 516791, 898290, 837107, -745880, -1771133, -986789, -679185, -2631819, -4720338, -3981445, -442941, 3847913, 7200880, 8558194, 7840825, 6738055, 6823302, 6980193, 5474465, 3735340, 4180100, 5151558, 3057916, -763456, -1207479, 2051418, 3630039, 1580232, 535054, 2760561, 3067362, -2391844, -8056793]
40685h056793J985269Q315821O201155k7945k576992q26970O03872k66182j384811
40676C966424p64184J095283J932609Q8684k848873k930927N73606K888247N26993
40667D527862k638210j358666J871768P95155l420027l553074J225396L483569
40659I33773l900k865237M4086M372274L951498L31601j125783R7065O45365l56893
40649F023849r74871l48616Q56126K019792K102045M5064k512661k161286R01119
40640E950561K309865K38915j737151n50930K476442N798636R913365J2990498
40632C7390201J1457907Q775701J4802786K9305067L4608847J5726990j7176009
40625A34891490l8266930l5862042k1528672j0508447n632261l080156k245019
$$ y = [-8056793, -6071524, 2244297, 8445452, 8417507, 5840515, 5013545, 5617417, 5351235, 3966424, 3202240, 4297523, 6230132, 6318816, 3469943, 539016, 1112622, 4000869, 4527862, 1889652, 530986, 2402754, 3197909, -222118, -3775192, -2549796, 933773, 929873, -1935364, -1891278, 2480996, 6432494, 6764095, 5638312, 5735377, 6380742, 6023849, 5048978, 4700362, 5556488, 7576280, 9678325, 9723389, 7210728, 5049442, 5950561, 8260426, 8499341, 6762190, 6211260, 8687702, 14486338, 24399703, 37390201, 48848108, 57623809, 72426595, 101731662, 136340509, 152067499, 134891490, 96624560, 60762518, 39233846, 28725399, 23093138, 20012982, 17767963]
40618A7767963l574332m283706k374838j14975N31187J099940K040426N05706
40610A1597371l588381n087312j617714J552834j81375l119416k071431L67400
40602b148024j047267l914411j919678L457095M503965K51791j680795K077414
40594d19910N092138K089398k554010k595834K52713O03835j298621j375553L15403
40585A09559L10380j179462n71270K006761K122253j548220m548308l175918N55407
40576e918818K587993K083705P72279l90575j555876k438983k302169r81414O95646
40567g448212J170584m66315k368392r13124L996007O759939K977391l355336
40559C52542m731661j087807P49916j241869j124537L839169P054717L053413
$$ y = [17767963, 14193631, 9909925, 7535087, 7420112, 7951299, 9051239, 11091665, 11597371, 8008990, 2921678, 1303964, 2856798, 2675423, -443993, -2515424, -2148024, -3195291, -7109702, -9029380, -5572285, -1068320, -816529, -2497324, -419910, 4672228, 6761626, 4207616, 1611782, 1864495, 2468330, 1169709, -205844, 109559, 419939, -759523, -1330793, 675968, 2798221, 1250001, -3298307, -6474225, -5918818, -3330825, -1247120, -474841, -865416, -2421292, -4860275, -7162444, -8143858, -7448212, -6277628, -6743943, -9112335, -10025459, -6029452, 730487, 3707878, 352542, -4379119, -5466926, -4717010, -5958879, -7083416, -3244247, 3810470, 6863883]
40551F863883k783471k290487K637406L618823p41125l742284k143142l69697
40543A049906k013698m388369l959667j504614P64978K621317L867771K901461
40535f60915k83527k775666k475884n27906J271915K613885L150854J988691j14682
40526B186765j094618j000265j712218k674925j219785J791357J786532j854024
40518c791181l365630N94314M809035L132892j930097l334246l22219J616355
40510b590777M00003n9139K305844L727377J041248k851342l489287j362902m2318
40501b921293j10461O40255J792782j10281n186901p498239k195147O715345J0032078
40492A158138M647723k927535n344477k592423P84165K458597K539641N54726
$$ y = [6863883, 4080412, 1789925, 4427331, 8046154, 7305029, 3562745, 1419603, 1049906, -963792, -5352161, -9311828, -10816442, -10051464, -7430147, -3562376, -660915, -944442, -3720108, -6195992, -6723898, -5451983, -2838098, 312756, 2301447, 2186765, 1092147, 91882, -1620336, -4295261, -5515046, -3723689, -1937157, -3791181, -7156811, -6562497, -1753462, 1379430, -550667, -3884913, -4207132, -2590777, -2190774, -2249913, 55931, 3783308, 4824556, 1973214, -1516073, -2878975, -2921293, -3031754, -2391499, -598717, -708998, -5895899, -13394138, -15589285, -8873940, 1158138, 5805861, 2878326, -2466151, -5058574, -4274409, -1815812, 723829, 1278555]
40484A278555k792538l477513N19538L873649O91081m915212l532273M163512
40476d191201O719940n23104p514046n021593J451265J914893j837250j191211
40468a0192307L396805L894732k56918j267131K517316L579568p26627k915950
40460a970512R82846L433042j682950p326238l857407N153249P984592K045145
40452D761767l965251l883464p50426R18298J284210J504957N06075j785757k846757
40443d256348j560004J05953R68399K145360L427727K603219l6167j203309m76677
40434A718153j517977m954470n695675j103088L732496L820139K057949K989964
40426A047491L799034l38470n563399l754330L692686O684376J830646k959134
$$ y = [1278555, -1513983, -4991496, -4471958, -598309, 92772, -4822440, -8354713, -4191201, 2528739, 2005635, -5508411, -10530004, -9078739, -7163846, -9001096, -10192307, -6795502, -2900770, -3157688, -4424819, -1907503, 1672065, 945438, -1970512, -987666, 2445376, 762426, -6563812, -10421219, -5267970, 2716622, 4761767, 796516, -3086948, -3837374, -2919076, -1634866, -129909, 376166, -1409591, -4256348, -5816352, -5710399, -4742000, -2596640, 831087, 3434306, 3398139, 2194830, 1718153, 200176, -4754294, -10449969, -11553057, -7820561, -4000422, -1942473, 1047491, 4846525, 4508055, -1055344, -4809674, -1116988, 5567388, 7398034, 4438900]
40418D438900j773476J164089Q92298l589J486656J648595k519677n707908k615329
40409b989441J950673P00292l163315j235585M916524N621671m91047l883309
40401A426463J46420M283652J966320k389302j880915J772682K371876q03820
40393F893376l535089l576245j777633P81201K523314J205116k267870l141037
40385b894867M61698L789262K397434j070630j689910j06298j03068j355446p06245
40376a278070J239473R19558j617886k603719q85095O74961M10882n9569M53227
40367b746238Q81336N68627M63899R14875R65673K86835m63247j180084k091438
40358b399762k400380j258166N44288J769395K453123K545992Q44207k183139
$$ y = [4438900, 2665424, 3829513, 4721811, 4718222, 6204878, 7853473, 5333796, -374112, -2989441, -1038768, -338476, -3501791, -4737376, 179148, 5800819, 5309772, 1426463, 1572883, 5856535, 7822855, 5433553, 3552638, 5325320, 7697196, 6893376, 3358287, -217958, -1995591, -1214390, 1308924, 2514040, 246170, -2894867, -2433169, 1356093, 3753527, 2682897, 992987, 886689, 783621, -571825, -1278070, -38597, 880961, -736925, -3340644, -4225739, -3550778, -3139896, -3199465, -2746238, -1864902, -1296275, -832376, 82499, 1048172, 1335007, 871760, -308324, -2399762, -4800142, -6058308, -5514020, -3744625, -1291502, 1254490, 2098697, -84442]
40350h4442k987478J32115L099867J389373k765085l475755l8681K785393K512743
40341E68050J269506N15778q11030k318160j838511k7420J9776j287415j07949
40332d017375L430666M040906m5423l288323j416477J722721P14520k481113j909964
40323c249862K735883N654045L279261j635358m438465l601327q48926J294158
40315h10591J515222N39499N8598M96402P59279M04697K46602K32464r77385l173914
40305g09127l712718j148084K197743L083420J297957o65613o23001J494829L524654
40296D740060K618228j237358l843347j974564J004178m15343m173853k385275
40288e667274N406426Q892397J910746o852836n884677K094460M876720m50638
$$ y = [-84442, -3071920, -2939805, 160062, 1549435, -1215650, -4691405, -4730086, -1944693, 568050, 1837556, 2353334, 1542304, -775856, -2614367, -2641787, -2622011, -3909426, -4017375, -586709, 3454197, 3408774, 120451, -1296026, 426695, 1141215, -1339898, -3249862, -513979, 5140066, 8419327, 6783969, 2345504, -1255823, -2104749, -810591, 704631, 1244130, 1302728, 1799130, 2558409, 2963106, 3209708, 3442172, 2464787, -709127, -4421845, -5569929, -3372186, -288766, 1009191, 343578, -279423, 1215406, 4740060, 7358288, 6120930, 2277583, 303019, 1307197, 891854, -3281999, -5667274, -260848, 8631549, 10542295, 3689459, -2195218, -100758, 4775962, 4325324]
40280D325324m335851o60012M561976L727678j391806m209629k998675q05421
40272a786416L43647L55149j079296l352388l676052n90556K908798L029358M88049
40263c359707j012748l27687M44269P0752l23533J32148P65670J034793J195879
40254a380164R35864n40720k529976k913715j003389J431628K814432L591514
40246D05474M121391K722775j646197n821292m925531R45372N633017M342502
40238E777511m05086k922141k176523j420924j342709Q91763M960471N639756
40230I002118Q49159l630520k225065J656422R71323l549808m628992l17696L090720
40221A217661J427660j346035o29013J665151J762892N63132M33677j71987l159722
$$ y = [4325324, -10527, -670539, 3891437, 7619115, 6227309, 2017680, -980995, -1786416, -1442769, -1087620, -2166916, -5519304, -9195356, -9785912, -6877114, -3847756, -3359707, -4372455, -4700142, -4255873, -4185121, -4508654, -4376506, -3610836, -2576043, -1380164, -444300, -985020, -3514996, -6428711, -7432100, -6000472, -3186040, 405474, 4526865, 7249640, 5603443, -217849, -5143380, -4198008, 1435009, 5777511, 5372425, 2450284, 273761, -1147163, -2489872, -1598109, 3362362, 9002118, 9851277, 6220757, 3995692, 5652114, 6623437, 3073629, -1555363, -1873059, 1217661, 2645321, 1299286, 670273, 2335424, 4098316, 4661448, 5095125, 4923138, 1763416]
40212A763416n283893k551780K167560K659915p44833j855913Q55774J863653
40204a126101j533159m077690j074494L696134L660904p35537l282481j094576
40196e567000K498532L568235J989657q1439j073529o19589P14700J694348J463314
40187D587229M45396l38671l30450N36837J714854J577111j093118m431283m660973
40178a993068j243153J760852J380656n8104Q08011K693414K103223m95576j385183
40169C571072L82347J945176J411249k15275j871484l420161l679859j329929
40161c206864J774316J983879p42586k475844j159374Q57488J120088K39059m35579
40152b045417p64669k45661J903341L909319K613133j134319k481951K15657K685426
$$ y = [1763416, -3520477, -6072257, -3904697, -1244782, -1989615, -3845528, -2989754, -1126101, -2659260, -6736950, -7811444, -4115310, -454406, -1189943, -4472424, -5567000, -3068468, 499767, 2489424, 2407985, 1334456, 714867, 1429567, 3123915, 4587229, 5032625, 4693954, 4363504, 4900341, 6615195, 8192306, 7099188, 2667905, -1993068, -3236221, -1475369, -94713, -152817, 655194, 3348608, 5451831, 4956255, 3571072, 3953419, 5898595, 7309844, 7094569, 5223085, 1802924, -1876935, -3206864, -1432548, 551331, -191255, -2667099, -3826473, -2968985, -1848897, -1609838, -2045417, -2810086, -3055747, -1152406, 2756913, 5370046, 4235727, 1753776, 1969433, 4654859]
40143D654859J594887m71660j0431J738850J784846K61193j347592l188003m618217
40134C98732k846951J877686M002744N24938l187079j317094K793968K197588
40126D444532j837572k111885K016755L545311l40027l952606k675686O45215
40118b65963J774189J140780N09219r06374l358353m064270j385114J955545K843572
40109a756769J919578J241175Q03910j52968r82142r16630l45976N26653J919802
40100B256633K655142J082834j593596k322466j019731n25540j367724j141584
40092a976032K46778m2135k004184k061355K40003R33316p28852j04210M040892
40083a455779N650560J095637l920684l135366O26850J372856J1716P01610J788913
$$ y = [4654859, 6249746, 5778086, 5767655, 7506505, 9291351, 9552544, 8204952, 5016949, 398732, -2448219, -570533, 3432211, 3957149, 770070, -547024, 2246944, 4444532, 2606960, 495075, 2511830, 6057141, 5717114, 1764508, -911178, -265963, 1508226, 2649006, 3158225, 2251851, -1106502, -5170772, -6555886, -4600341, -1756769, 162809, 1403984, 2207894, 2054926, 1072784, 156154, -189822, 336831, 2256633, 4911775, 5994609, 4401013, 2078547, 1058816, 533276, -834448, -1976032, -1729254, -1771389, -3775573, -5836928, -5596925, -4663609, -5392461, -5496671, -1455779, 4194781, 5290418, 1369734, -1765632, -1138782, 234074, 245790, 947400, 2736313]
40074B736313p70036m224679k628515K202817K769547j588192l603712l12986
40066e419443K738675J703971L37724K120303L860090J802576j643372k194784
40058C305740m11923M41379p9669l64950l87494q98352j159533n80197m70778
40049f05777j403774j269126J031650K500321L04442l009799k850993J88785J205874
40040c908397j047667k070561J004277M501266L917834J162677J381444M151999
40032I092872L621020j692986n193913j970964K693644P07836n932992p481883
40024f157366j298501M139394K399740j936730k108467L82772P69853M02231K899128
40015e07946N229019J908109m186437m764115O42732L800364J030084j888373
$$ y = [2736313, 1966277, -2258402, -4886917, -2684100, 85447, -1502745, -5106457, -5419443, -2680768, -976797, -639073, 1481230, 5341320, 7143896, 5500524, 3305740, 2893817, 3335196, 3255527, 2890577, 2503083, 1604731, 445198, -134999, -605777, -2009551, -3278677, -2247027, 253294, 557736, -2452063, -5303056, -5114271, -3908397, -4956064, -7026625, -6022348, -1521082, 2396752, 3559429, 4940873, 9092872, 12713892, 11020906, 5826993, 3856029, 6549673, 7257509, 1324517, -6157366, -7455867, -3316473, -916733, -2853463, -4961930, -4579158, -3809305, -3407074, -507946, 4721073, 6629182, 2442745, -2321370, -1678638, 2121726, 3151810, 1263437]
40007A263437m29924J862665J128412j51173P29995O74632l190094o735641m426626
39998i274317J901716N673506M394742Q26073k283814l826544k740531N32187
39990d796982K515295P78962j948658j637539Q04758J374705l89443j154468M81758
39981c971612K272602K293342J053078m00747j427619j003826J122601K751898
39973B689717J559820j130641j732231N13097K504829J560138j465433l527951
39965I71345k345607J597414M751662L475971j124842l333566j70626L733355
39957G555106K212814l389653n958341k746287J232717Q29745k587438m073012
39949f924349j639264K310879M323288L052981M7486j863153j557030p29720j154670
$$ y = [1263437, 833513, 2696178, 3824590, 3673417, 4403412, 5078044, 1887950, -4847691, -9274317, -7372601, -1699095, 2695647, 3521720, 1237906, -2588638, -5329169, -4796982, -2281687, -1502725, -3451383, -5088922, -4284164, -2909459, -3298902, -4453370, -3971612, -1699010, 594332, 1647410, 1246663, -180956, -1184782, -62181, 2689717, 4249537, 3118896, 1386665, 1899762, 4404591, 5964729, 4499296, 971345, -1374262, 223152, 4974814, 8450785, 7325943, 3992377, 3821751, 7555106, 9767920, 6378267, 419926, -2326361, -1093644, -263899, -2851337, -6924349, -8563613, -6252734, -1929446, 1123535, 1171021, -692132, -2249162, -2978882, -4133552]
39940d133552j935003j143840J000263K749533L446582L165355J191148k192666
39932B147820l920851j820718J188731P97498j829626j889659Q39289J512139
39924b975377j265795k639134M47396M064309L635072P13374o81128o44792j712764
39915a058839l333868k705247L02179K953142L501792K245437j45524k575365
39907h16293l004505p07271J980079K488380J296003K40206n80643j580377j340546
39898b024967J223271L832746L379132M19216j979427k667866k479286j361785
39890a658966P19141J332366j463969m474403k675361K759815N040936J515313
39882A094872k364195j196418K790882L748156N04654k977657l592458j974873
$$ y = [-4133552, -6068555, -7212395, -6212132, -3462599, -16017, 3149338, 4340486, 2147820, -1773031, -3593749, -2405018, -1607520, -3437146, -5326805, -4487516, -2975377, -4241172, -6880306, -6432910, -2368601, 1266471, 1979845, 1298717, 653925, -1058839, -4392707, -7097954, -6795775, -3842633, -340841, 1904596, 1759072, -816293, -3820798, -4528069, -2547990, -59610, 1236393, 1476599, 895956, -684421, -2024967, -801696, 3031050, 6410182, 6829398, 4849971, 2182105, -297181, -1658966, -939825, 392541, -1071428, -5545831, -8221192, -5461377, -420441, 1094872, -1269323, -2465741, 325141, 4073297, 4577951, 1600294, -1992164, -3967037]
39874c967037p2358J333856K391516K970860K224900m99511l808736m277995l77115
39865d081620M178680M043850n63474l772534k127034J092964J533276j36321
39857A67787q73933o75467j279839j770095M3504K987203L604206J559936k2991
39848C740311J88093L2915j715651k817157j249242J253021J596528k57695j427191
39839f56068j64719J888418J968895J4626q76560J327495L771741J668073m330692
39830D611209p100761k113682N306449O198269k9806n149172l840705r9215L08105
39821a909309j532766r56053J911676K535663m01291k899397j836754Q46692J812141
39812b429398J056110O76809R99464O80765k20474l8004J420387J975543L61756
$$ y = [-3967037, -4039395, -2705539, -314023, 2656837, 4881737, 4382226, 573490, -3704505, -4081620, 97060, 4140910, 3577436, -195098, -2322132, -1229168, 304108, 167787, -706146, -1381613, -2661452, -4431547, -4388043, -1400840, 2203366, 3763302, 3740311, 3928404, 3961319, 2245668, -571489, -1820731, -567710, 1028818, 771123, -656068, -820787, 1067631, 3036526, 3051152, 2174592, 3502087, 7273828, 8941901, 4611209, -2489552, -4603234, 703215, 6901484, 6871678, 1722506, -2118199, -2217414, -1909309, -3442075, -4398128, -2486452, 49211, -352080, -3251477, -5088231, -4241539, -2429398, -1373288, -696479, 302985, 983750, 763276, 725272, 2145659, 4121202, 4482958]
39803D482958j390827n88511K181635L759747K617811K05550j883821l588730
39795E795812m511191l104219M20340K594201P54790k755130l360085n91970J369353
39786c388099l05259l358708l746470o64479L048413M449324L360852K021195
39778A416769K224665K935309J615058j675916l248893n07959L803638M562672
39770A1125343P28717l645860m535653j824789J603593K575229m5928l727355
39762B253297l979664Q0143L578069K296367j009650j140182Q07548o06572n267464
39753b988108o709888k240212L065253M556706L626148K545228M38833k147493
39745A46467j430516K502763L395263j252396m675167j504101K800928J051705
$$ y = [4482958, 3092131, 2503620, 4685255, 8445002, 11062813, 11268363, 9384542, 5795812, 1284621, -1819598, -1399258, 1194943, 1949733, -805397, -4165482, -4757452, -3388099, -3693358, -7052066, -10798536, -11463015, -8414602, -3965278, -604426, 1416769, 3641434, 6576743, 8191801, 6515885, 3266992, 2759033, 6562671, 11125343, 11854060, 8208200, 3672547, 1847758, 3451351, 6026580, 5980652, 2253297, -1726367, -1646224, 1931845, 4228212, 3218562, 2078380, 2885928, 2279356, -2988108, -9697996, -11938208, -8872955, -4316249, -690101, 1855127, 2293960, 146467, -1284049, 1218714, 4613977, 3361581, -1313586, -2817687, -16759, 1034946]
39737A034946l246114k160712K687647L267719o13717j666683J309388J872818
39729B485292j270017j481575L161076N347511Q93892m201883m236549k327879
39721a630132k476256j592662L200514O652668L299085k317645k280524J945171
39713D800219K533772j583070l928452j892351j3310j108755k094966o06423J018010
39704b875326R64095J311744L093285L077962p21553m383042l266976Q56203K385683
39695D42075R9559j800212p18592P48724j49817j426490K55921L462270L519841
39686D433279j20429k652493j495863m35326k786904m718440j058464N008002
39678c826638N392457k87155l528029l3862M037350K730807l65600N13824K875521
$$ y = [1034946, -2211168, -4371880, -1684233, 1583486, 969769, -696914, 612474, 2485292, 1215275, -266300, 2894776, 8242287, 9136179, 4934296, 697747, -1630132, -4106388, -5699050, -2498536, 4154132, 7453217, 5135572, 2855048, 4800219, 7333991, 5750921, 1822469, -69882, -83192, -1191947, -3286913, -3893336, -2875326, -1911231, -599487, 2493798, 5571760, 4850207, 467165, -2799811, -1943608, 442075, 541634, -1258578, -1977170, -1228446, -1378263, -2804753, -2548832, 913438, 4433279, 4312850, 1660357, 164494, -270832, -3057736, -7776176, -8834640, -3826638, 1565819, 1278664, -2249365, -2283227, 1754123, 4484930, 4119330, 4633154, 7508675]
39669G508675Q22076l775763l816837J030258L571689N98615k845366k397934
39661F95413m06382j74744m07135P65443J256461r33599k826337m97405M180190
39652A651905N516092J899988k334878l069540j079431L44036o0326r72435j227358
39643F68053j280689j783952j985650p26849J322055K010757P95408k27898M05962
39634h02803J008280l70372j993610n08463L496206N437387K894314j261121l142952
39625D756866k488137j245462o2618J208523J217541j446987m878692m964572
39617g903538p72377L452976L337319N212j540333P43482L301669K164768j512803
39608A276375l328953j656522J076934K589480L001553K648514J050349r38719
$$ y = [7508675, 8330751, 4554988, 738151, 1768409, 5340098, 5938713, 3093347, 695413, 289031, 114287, -292848, 472595, 1729056, 795457, -2030880, -2528285, 1651905, 7167997, 9067985, 6733107, 3663567, 2584136, 2928172, 2867846, 1895411, 668053, -612636, -2396588, -4382238, -5109087, -3787032, -1776275, -980867, -1208765, -802803, 205477, -164895, -2158505, -2666968, 829238, 6266625, 9160939, 7899818, 4756866, 2268729, 1023267, 960649, 2169172, 3386713, 1939726, -2938966, -7903538, -8675915, -5222939, -1885620, -1880408, -3420741, -2677259, 624410, 2789178, 1276375, -2052578, -3709100, -2632166, -42686, 2958867, 5607381, 6657730, 5719011]
39600E719011j324378o91415k025074m892070m236003J595759O090815L068239
39592C304884l583949n223215j266143R41939j431360k726072Q09449M435944
39584d738523K895917j158965j975682M29215J822381J330857J761609L554745
39576C921554L616655N25182k950118l542290j362847P75704P12710p85012r25713
39567a4175J335023K899773J33576n130166o741445k690030J687492J705406L67522
39558f447024K852607P179130O506859k73667o395827o462109k604458L29622
39550e314867J244691J767908K076327J027794j054362k237350j180983J540157
39542b130685L577849K173140k852947p208508n737825J030302O438203N410830
$$ y = [5719011, 4394633, 3703218, 1678144, -3213926, -7449929, -5854170, 236645, 3304884, -279065, -5502280, -6768423, -5826484, -7257844, -9983916, -9174467, -4738523, -1842606, -3001571, -4977253, -4548038, -2725657, -1394800, 366809, 3921554, 7538209, 8063391, 5113273, 1570983, 208136, 983840, 1696550, 911538, -14175, 1320848, 4220621, 4354197, -775969, -7517414, -10207444, -8519952, -6814546, -6447024, -3594417, 3584713, 10091572, 9817905, 3422078, -3040031, -5644489, -5314867, -4070176, -2302268, -225941, 801853, -252509, -2489859, -3670842, -2130685, 1447164, 3620304, 767357, -6441151, -12178976, -11148674, -4710471, 700359]
39534G00359K91336l032727k525701p04895K81876O56711N97752n81927k192449
39525f509665k023528L95576K693695L067760K652509K917434K808706Q54799
39517F857286j408142j191521Q15098P45371k667627n587886m135104L07549L268540
39508b996436L153805K105705J562472L67122j971735l254139j775077O32769
39500b175514J183823L50688O96595K233428K224262l593j438800k54027P10434
39491C527296j680793n030690m001190J673109O010573M769690P73412j046262
39483D995145n60618q76604k258569k142299l85028J53005j185536j301027J504159
39474b057372M387161M053523J159598j463228k503024k026574j12614K041632
$$ y = [700359, 991695, -2041032, -4566733, -5271628, -4989752, -4333041, -3735289, -4317216, -6509665, -8533193, -8137617, -5443922, -2376162, 276347, 3193781, 6002487, 6857286, 5449144, 4257623, 5072721, 5818092, 3150465, -2437421, -6572525, -6264976, -2996436, 157369, 2263074, 3825546, 4192668, 2220933, -1033206, -2808283, -2175514, -991691, -641003, 55592, 2289020, 4513282, 4509689, 3070889, 2816862, 3527296, 1846503, -3184187, -7185377, -5512268, 498305, 5267995, 6041407, 4995145, 4434527, 3557923, 1299354, -842945, -1227973, -1074968, -2260504, -3561531, -2057372, 2329789, 6383312, 7542910, 6079682, 3576658, 1550084, 1437470, 3479102]
39466C479102J907434r73931l357660k437302M42462K462776L062238K295827
39458F880946j170520o359637p505563r15372P643262Q703006J655988m668778
39450D263332m259097m57376J113713J35931n22735K32966J708009K908421K238167
39441G361331r37718l628748k392616L72498j003160n585962n677465Q04943N611721
39432e075176K676128k112797n84739M478405M393700j239719m627136k238524
39424d329858J424839K286050J427840Q17739N37463Q42650J786968J084965k502256
39415C376400m866517j723769L364545L491506j42038j03238L803134L193150
39407A0393173m165930q732231l702700L975363M441161n12229k211209Q49672
$$ y = [3479102, 5386536, 4412605, 1054945, -1382357, -939895, 1522881, 4585119, 6880946, 5710426, -649211, -8154774, -9070146, -1426884, 7276122, 8932110, 4263332, 4235, -453141, 660572, 796503, 273768, 506734, 2214743, 5123164, 7361331, 6423613, 2794865, 402249, 774747, -228413, -5814375, -11491840, -10686897, -5075176, -2399048, -4511845, -5096584, -618179, 3775521, 2535802, -2091334, -4329858, -2905019, -618969, 808871, 1626610, 2164073, 3006723, 4793691, 5878656, 3376400, -1490117, -3213886, 150659, 3642165, 3500127, 3396889, 7200023, 10393173, 6227243, -2504988, -6207688, -2232325, 2208836, 1696607, -514602, 335070]
39399C35070K884843J674632N63347O82301o40187l279802l225007M40176L235941
39390B671314J892661j343190k943973k772344k418362j925329m18883J861618
39382e396488L769639M316423K903923j38756k933234l418732j607095O67205
39374a837115J969533J987823Q23634o94978q71449N88835J139104j206936m028966
39365b130515l385979j75J460884l90549j581807N30580K847095J748306q60507
39356a762667q10818J367441J532741q36392j528806J360191L930027K597548
39348E849265j6889O02115K946316J191021n168053q958050n162432J454855K990766
39339d271086l48224j408164K478066N600979K913568k650566n087126l294334
$$ y = [335070, 3219913, 4894545, 5457892, 6140193, 5500006, 2220204, -1004803, -564627, 2671314, 4563975, 3220785, 276812, -2495532, -4913894, -6839223, -7258106, -5396488, -1626849, 2689574, 5593497, 5454741, 2521507, -897225, -2504320, -1837115, 132418, 2120241, 2943875, 2248897, 1377448, 1966283, 3105387, 1898451, -2130515, -5516494, -5516669, -4055785, -4446334, -6028141, -5497561, -2650466, -902160, -1762667, -2573485, -1206044, 326697, -509695, -2038501, -678310, 3251717, 5849265, 5832376, 6434491, 9380807, 10571828, 5403775, -3554275, -8716707, -7261852, -4271086, -4619310, -6027474, -3549408, 2051571, 4965139, 2314573, -2772553, -6066887]
39331f066887k97656K171642L948243L697330O82640k091453j204450J455960
39323B295369J062540k314110l502360p06332J325572q87740l469484j018958
39315g215503M731331O922675K913553k787708m894791k958304J08710K020378
39307a159659K168990Q62799p46033j212067o38294q48081k368429k611733O74532
39298e877975M939857M960607N0974m065543k602515J792221L054343K74849j978341
39289E48477j224565m6494n25829n63148J602438L225469J209223k319264k804988
39280h98681p5619J768500O04189j407064j795358p42330M08947R41070N34784
39271f61562o64673j479015q85488L92144J006371R58784Q11393K99004j94295
$$ y = [-6066887, -6364543, -4192901, -244658, 3452672, 4135312, 2043859, 839409, 2295369, 3357909, 1043799, -2458561, -3164893, -1839321, -2727061, -6196545, -7215503, -2484172, 4438503, 7352056, 4564348, -330443, -3288747, -3180037, -1159659, 1009331, 1872130, 1126097, -85970, -724264, -1572345, -3940774, -6552507, -5877975, -938118, 4022489, 4073463, 7920, -2594595, -802374, 2251969, 2526818, 548477, -676088, -722582, -1248411, -1811559, -209121, 3016348, 4225571, 1906307, -898681, -974300, 794200, 1398389, -8675, -1804033, -2546363, -2137416, -1196346, -661562, -1326235, -2805250, -3690738, -3298594, -2292223, -1333439, -522046, -223042, -417337]
39262d17337J213411M265102M440580j092599p297436o742871m15150L453638
39254b592662J632145l89000J119515J830685j847880m700782n38394O470936
39246I84563O582542j084330o887569m219910K167658M070619P84041j948167
39238D49447r11521J295823J491666M48937N77289J527324R87450q49865j069328
39229C947222P23882N45349l740294p448855m929813J467671L982259O59145k228907
39220g022341j80298L382772L702033J703656N38436m3239j322695j632781M38785
39211d35672K185946R31958r75375k18526J412948M11071j672727q91031J688588
39202B437180J702327o73659j332825j01532r28946l791848l625861Q65435M043185
$$ y = [-417337, 796074, 5061176, 9501756, 8409157, 1111721, -5631150, -6046300, -2592662, -960517, -1349517, -230002, 1600683, -247197, -4947979, -5486373, 984563, 7567105, 6482775, -404794, -4624704, -2457046, 1613573, 2397614, 449447, -462074, 833749, 2325415, 2774352, 3351641, 4878965, 5866415, 5016550, 3947222, 4671104, 5216453, 1476159, -5972696, -10902509, -9434838, -5452579, -4793434, -7022341, -7202639, -3819867, -117834, 1585822, 2124258, 2081019, 758324, -874457, -435672, 1750274, 2682232, 1706857, 1488331, 2901279, 3312350, 1639623, 748592, 2437180, 4139507, 3465848, 2133023, 2031491, 1102545, -2689303, -6315164, -5449729, -1406544]
39193a406544J912598j848121j986538R04478K849302K524220R94337j420923
39185B522809m098235m352320o77021L773545M541756J836875p9089Q58729J933065
39176F260114O90l786445n222653k412353J660729K800373R18026l34869O96918
39167E80530J281697p33065k689475j116491K360945L254437R81416j026025j248611
39158A645358j443905k142264j522990N36110J647933J048024M70185K24902j152868
39149f89515k516418m59705M219462N600464J048576l987436l191061K082860
39141B107227N248489L108985j326400l285443j203865J838518R89574m404368
39133C072717q278230m733141L115564O281417K269914j938219j010736J496756
$$ y = [-1406544, 506054, -1342067, -3328605, -2424127, 425175, 2949395, 3943732, 2522809, -1575426, -5927746, -6604767, -2831222, 1710534, 3547409, 3468320, 4327049, 6260114, 6260804, 2474359, -2748294, -5160647, -3499918, -699545, 218481, -116388, 580530, 1862227, 1129162, -1560313, -2676804, -315859, 2938578, 3919994, 2893969, 1645358, 201453, -1940811, -3463801, -2927691, -1279758, -231734, 238451, 463353, -689515, -3205933, -3665638, 553824, 6154288, 7202864, 3215428, 24367, 2107227, 7355716, 10464701, 9138301, 5852858, 4648993, 6487511, 7477085, 3072717, -5205513, -9938654, -6823090, -541673, 1728241, -209978, -1220714, 276042]
39125B76042O01203j909068j898432k56270j02794p14228J23835J167600N30029
39116b182083J07396J776658K625096j07653k680333j64591M614699M804546M39313
39107I233048j991255j80642J432416J60452j188301n84170k60793j639941k303207
39098B677607o80342P70373k20625j911361j465083R33557K813664K350336m34462
39089D833664l630118m424199k068355N89398O64595q77407j586228j852029k981114
39080a1331793k917691Q83275N466435N255206Q36754j308794J348258M072766
39072B304416L131189J218974J700750K818745J443588j528252l373979l965349
39064C750082m394819l746179p36964L123582M974948M115183K010453n9113j685105
$$ y = [276042, 877245, -1031823, -2930255, -3186525, -3289319, -4003547, -3879712, -2712112, -2182083, -2074687, -298029, 2327067, 2219414, -460919, -625510, 3989189, 8793735, 9233048, 7241793, 7061151, 8493567, 8654019, 7465718, 6881548, 6620755, 4980814, 2677607, 1997265, 2767638, 2547013, 635652, -829431, 104126, 2917790, 5268126, 4833664, 1203546, -3220653, -5289008, -4699610, -4035015, -4912422, -6498650, -8350679, -11331793, -14249484, -13366209, -7899774, -2644568, -1807814, -3116608, -1768350, 2304416, 5435605, 6654579, 8355329, 11174074, 12617662, 11089410, 7715431, 3750082, -644737, -4390916, -5127880, -2004298, 2970650, 7085833, 9096286, 9037173, 7352068]
39055G352068k664356k958792k768909k328373k228690l097241l661973r63552
39047a3319818M930815Q589909N576228o81915l331352j836811j138943k122980
39039c334867o81850L059045L178112j526005l773013O73306N146771K109878
39031D851377m939506p007620k883748Q35616O10232n60013K70169K321617M194474
39022b307402N500957N091587J966555j818645k933632j517642p17795j694033
39014A569950k551987k101057j197552l02263R75210J822853J048428O3480J422418
39005G49480L874672K880972k387283o417530m534155K81286J581169j262213
38997e233602k653354K21465L040312J531825j340488j99908L464956L376513
$$ y = [7352068, 4687712, 1728920, -1039989, -3368362, -5597052, -8694293, -12356266, -13319818, -8389003, 200906, 5777134, 5095219, 1763867, -72944, -1211887, -3334867, -4016717, -957672, 2220440, 694435, -3078578, -2405272, 2741499, 4851377, -88129, -7095749, -9979497, -9143881, -8533649, -9093662, -8823493, -6501876, -2307402, 3193555, 8285142, 10251697, 8433052, 5499420, 3981778, 3263983, 1569950, -982037, -3083094, -4280646, -4582909, -3607699, -1784846, -736418, -672938, 749480, 4624152, 7505124, 5117841, -1299689, -5833844, -5552558, -3971389, -5233602, -7886956, -7665491, -4625179, -3093354, -4433842, -4633750, -1168794, 2207719]
38989B207719p19326j913379K199637M640185M92168m249300k457030J921604
38981B122278R20407k976367j031952N338143N326319l103873q607764l863188
38973e875997L896436N297169J649580j174540k641424l963184k488324K504003
38965b796281N148991J787645j880764J702L512797K342673j174673j369351K34337
38956E807076p47224k040421L30106K583988l61570l617744K88683O486936L853065
38947A2582895n894529r600480l391762K466778J613911J85841K960435M394899
38939E317988K16936l561175j187889K644872J429353k074227j771704R78305
38931A992459R45727j184545o84625K455305L740778J605764r69946j433968k91170
$$ y = [2207719, 1488393, -424986, 1774651, 6414836, 6907004, 2657704, 200674, 2122278, 3042685, 66318, -965634, 4372509, 9698828, 6594955, -2012809, -5875997, -1979561, 3317608, 4967188, 3792648, 1151224, -2811960, -5300284, -2796281, 2352710, 4140355, 2259591, 2261293, 5774090, 8116763, 6942090, 5572739, 5807076, 5059852, 3019431, 3349537, 5933525, 5571955, 1954211, 2242894, 8729830, 12582895, 6688366, -2912114, -6303876, -3837098, -2223187, -2037346, 923089, 5317988, 5534924, 1973749, 785860, 3430732, 4860085, 2785858, 1014154, 1992459, 2938186, 1753641, 1069016, 3524321, 7265099, 8870863, 7900917, 6466949, 6175779]
38922F175779N29901l27159k080898j626707K441881N874566L327445l148664
38914A1166144o079189l512057q97457q26723O32853M549520N220500M21395l214649
38905G460337j197611P88459k743873o531863l380596K905471L376341j861637
38897a184972n124073l499441m11765K363926N145635N263564O63853l510241
38889b93514j142105L975065L117090l083853n719301k263880Q20108N72388J245469
38880b772533L672118K418270k883426m298595J359392O265317M131683l87946
38872G504280j378176j559513m522730n507219K90631O789565N141895j736149
38864E022584l677495N18667K498983r32508l500826j202704J476672J83477k438564
$$ y = [6175779, 6705680, 6378521, 4297623, 2670916, 5112797, 10987363, 14314808, 11166144, 5086955, 1574898, 677441, -149282, 483571, 5033091, 10253591, 10674986, 7460337, 6262726, 7051185, 4307312, -2224551, -5605147, -2699676, 676665, -1184972, -6309045, -9808486, -10220251, -7856325, -2710690, 2552874, 3216727, -293514, -1435619, 2539446, 5656536, 2572683, -3146618, -5410498, -4590390, -4018002, -2772533, 899585, 3317855, 434429, -3864166, -2504774, 3760543, 7892226, 7504280, 6126104, 4566591, 43861, -5463358, -5172727, 1616838, 6758733, 5022584, 1345089, 1863756, 4362739, 3430231, -70595, -1273299, 203373, 386850, -2051714]
38855b051714k259244J40060K232996L365924K952066k04941m128403m198088
38847d151344j96810K271720L36770j693536j16061J797153K72984j636824K64419
38838b851529K840421N59025m184641m189227N58926K866890N15186n60229K536801
38829a908377L912090j137861p267681o196666J601405Q001974P533255J972898
38821F511037l539986n142118k319168J740154L044770J636520J220891K840998
38813E993098K930177j32232k325188m90295K111698J404704o61153l38403Q31098
38804I323504n36123k595739j683669J02990j535820m253863k348811K449800
38796a077731K833894j504638k976550Q14292L124292L44289j579332J951123
$$ y = [-2051714, -4310958, -4170898, -1937902, 1428022, 4380088, 4175147, 46744, -4151344, -4348154, -2076434, -1739664, -3433200, -3549261, -1752108, -1479124, -3115948, -2851529, -11108, 547917, -3636724, -7825951, -7267025, -4400135, -3884949, -4445178, -1908377, 2003713, 865852, -6401829, -12598495, -10997090, -2995116, 4538139, 6511037, 2971051, -2171067, -4490235, -2750081, 294689, 1931209, 3152100, 5993098, 8923275, 8791043, 6465855, 5975560, 8087258, 9491962, 8830809, 8492406, 9323504, 8787381, 6191642, 4507973, 4610963, 3075143, -1178720, -3527531, -1077731, 1756163, 251525, -2725025, -1910733, 1213559, 1557848, -21484, 1929639]
38788A929639N574644K854683l133418n210938k883304q31374o75338p27500p28873
38779c831779r36315N52576M033762M870207j67496o002398n129798J358673N073935
38770a78633K057853k724340l132490P42351M174503L654031L5622k700930j795153
38761A32814Q96574J435362m14367j375078q00250j382883k563713j09779M818977
38752F37657M216865l788266q697102k411575P008708O678594j549758m858263
38744b763140M34092N413385M501069J987262J048600j547592o141769o532028
38736c600121o71215M240979K787058o90380o54259Q07246p3522j002520J107711
38727B250977K870581j31108m960228n607787k356020K153N95002K215184M420984
$$ y = [1929639, 7504283, 10358966, 7225548, 2014610, -868694, -1700068, -2375406, -3102906, -3831779, -4768094, -4215518, -181756, 4688451, 4520955, -1481443, -6611241, -5252568, -178633, 1879220, -845120, -3977610, -3235259, 939244, 4593275, 4628897, 1927967, 132814, 1029388, 2464750, 2050383, 675305, -124945, -1507828, -4071541, -4181320, 637657, 4854522, 1066256, -7630846, -10042421, -3033713, 3644881, 2095123, -2763140, -2329048, 3084337, 7585406, 9572668, 10621268, 9073676, 2931907, -3600121, -4271336, -30357, 2756701, 2066321, 1412062, 2219308, 2145786, 1143266, 2250977, 5121558, 4990450, 30222, -5577565, -7933585, -7931432, -7336430, -5121246, -700262]
38718g00262L737053K56139j985573j483357r57825j974015k490437j027981M64508
38709f161750k86900k317373k687164k00950L240838M804451L902960K721985
38701C016097K941834K960962M31483l236411m186804j943796K626J69553J080854
38692A236398L516526L705083m28479m568406l915477l96363Q28420n55519o78105
38683a255922J328978K191246L41022j776436j906687q34860j45802K4321P4890
38674a959250j53423p67460j357776j426269o28112R40957K259113K313622J832548
38665A053950K214709K473051J74469l790093n182831k859847r41614j883283
38657h741489k051462J781024O028967N670046K224211K82332o59407l818057
$$ y = [-700262, 3036791, 3292930, 1307357, -176000, -1133825, -3107840, -5598277, -6626258, -6161750, -6448650, -8766023, -11453187, -11654137, -8413299, -3608848, 294112, 3016097, 5957931, 8918893, 9350376, 6113965, 1927161, -16635, -14009, 155544, 1236398, 4752924, 8458007, 8029528, 3461122, -454355, -850718, -22298, -577817, -1255922, 73056, 2264302, 2605324, 828888, -1077799, -1912659, -2058461, -2034140, -1959250, -2112673, -2880133, -4237909, -5664178, -6292290, -5351333, -3092220, -778598, 1053950, 3268659, 5741710, 5916179, 2126086, -3056745, -5916592, -6858206, -8741489, -10792951, -9011927, -2982960, 2687086, 4911297, 5193629, 4534222, 716165]
38649G16165p009806n053512N59367K792495M09512k57756L189700M495166m41363
38640f00032n571389l506821L001086N130902P02021l511281j570453M370991
38632a554976P437974M038988k446449n432254k547009J662020J998677k35371
38624B921600k13841J698068L33914m610841o437500j907502K891900J826944
38616c497258j994277k086194J104012K489559J275907M74588K04165j211755
38608c241253j576192J947611N386813K342502m460669n328499J282580N448498
38600A801391J124310m502813k906764K499757K887280j849332m314809j861320
38592g122300J030500J540057J810730L070452L228609J588945L09080j78524
$$ y = [716165, -6293641, -11347153, -10787786, -7995291, -7585779, -7843535, -4653835, -158669, -600032, -6171421, -9678242, -6677156, -1546254, -844233, -4355514, -5925967, -1554976, 5882998, 9921986, 7475537, 2043283, -503726, 1158294, 3156971, 2921600, 2707759, 4405827, 4739741, 128900, -6308600, -8216102, -5324202, -3497258, -5491535, -7577729, -6473717, -3984158, -2708251, -2233663, -2029498, -3241253, -4817445, -2869834, 2516979, 4859481, 398812, -4929687, -3647107, 1801391, 2925701, -1577112, -4483876, -1984119, 903161, -946171, -5260980, -7122300, -6091800, -4551743, -2741013, 329439, 3558048, 5146993, 5456073, 5277549]
38584E277549k003788m692086m433902o40224J869654K49120j429109J367589
38576d435197N865971N563316l63487n917881o040739j732529K594557L754529
38568g11460J449403k073603l376412p85784L407050N093765K922781n54637k255535
38559C115568j556673K27012J782342K571178K599248K000251O91024j222559
38551A0207391k467061j333420J421763J967707j849195o087641m554935K428781
38543b66610O867609K981060m683405o775861j467265L329159J076370m302165
38535c241108m067176K762134P499635L422986n027921q035297k936564L413821
38527f209490M328657P84370k116557k209895r26823M86371J896652K553505J606076
$$ y = [5277549, 3273761, -1418325, -5852227, -6492451, -4622797, -4373677, -5802786, -4435197, 1430774, 6994090, 6630603, 712722, -5328017, -7060546, -4465989, -711460, 737943, -1335660, -4712072, -5497856, -2090806, 3002959, 5925740, 5371103, 3115568, 1558895, 1785907, 3568249, 6139427, 8738675, 10738926, 11429950, 10207391, 7740330, 6406910, 7828673, 9796380, 7947185, 1859544, -2695391, -266610, 6600999, 9582059, 4898654, -1877207, -3344472, -15313, 1061057, -3241108, -7308284, -4546150, 2953485, 6376471, 1348550, -6686747, -9623311, -6209490, -1880833, -1096463, -3213020, -5422915, -6349738, -5863367, -3966715, -1413210, 192866]
38518A92866J60453L39684K176873L318721J894214j649367n103563n655737j776067
38509f101923M020225N769544N18454o648801p705444j743784M008798L946765
38501c936166N82921p01041O51289J483328J006417J334667K736505K502691n72695
38492E087916l573709l044457M28991L010691K396056J48921r93005o51242l41295
38483B468867l50020O35581K378732K174911j075717m029192l030601K85646J132905
38474E91112j138863k018574J017538M321786L290070j186754m281144l445717
38466b850546m91494J446620Q40175j581274l339349k044331J801640M577084
38458a641475L453507k77908l067010l315520k201956j134789k35697P36971J402097
$$ y = [192866, 353319, 693003, 2869876, 6188597, 8082811, 6433444, 1329881, -4325856, -6101923, -2081698, 3687846, 4206300, -2442501, -10147945, -11891729, -7882931, -3936166, -3353245, -4054286, -3402997, -1919669, -913252, 421415, 3157920, 5660611, 5087916, 1514207, -1530250, -1101259, 1909432, 4305488, 4454409, 3461404, 2810162, 2468867, 2118847, 2754428, 5133160, 7308071, 6232354, 2203162, -827439, -541793, 591112, -547751, -2566325, -1548787, 2772999, 6063069, 4876315, 595171, -2850546, -3342040, -1895420, -1055245, -2636519, -5975868, -8020199, -6218559, -1641475, 1812032, 1534124, -1532886, -4848406, -7050362, -8185151, -8420848, -7683877, -6281780]
38449f281780J124233o9457j015847j23731K653787M807733L720637K91556j663609
38440C443522k39805K143775K136454l84657k770513k945260j175304N93127N57815
38431A359154q92390j170586Q74614K126280r14469n721782n625558P74128O772973
38422b417636O565151K541723J27546l00110j470976k663888j076551K016892
38414C322151K452822O1563j081546M65755J440375l91482k890025l335710j933792
38405a889889k17314R28849O59895j354718l009706j478509K243073L754459J300864
38396I37004j875003k546378j517666q82177n04496M36168J051450L87687n89444
38387e102855q70090j297495k406265k392729J39919L041567L148033R94222O2591
$$ y = [-6281780, -5157547, -5227004, -6242851, -6366582, -3712795, 1094938, 4815575, 5107131, 3443522, 3203717, 5347492, 7483946, 7099289, 4328776, 1383516, 208212, 801339, 1359154, 466764, -703822, 170792, 2297072, 1382603, -4339179, -9964737, -9190609, -2417636, 4147515, 6689238, 6816784, 6516674, 5045698, 2381810, 1305259, 3322151, 5774973, 5836536, 4754990, 5220745, 6661120, 6269638, 3379613, 43903, -1889889, -2107203, -1178354, -518459, -1873177, -4882883, -6361392, -4118319, -363860, 937004, -937999, -3484377, -5002043, -5884220, -6388716, -5952548, -4901098, -4513411, -5102855, -5972945, -7270440, -9676705, -12069434, -11929515, -8887948, -5739915, -4745693, -4683102]
38378d683102J599094K961360J677417j075862k266872j030832N33838M35766
38370a849193n06367P0595K389787L580340J375027k391270l797018j903391L32286
38361b699204M75540k35452P55107L451013N301617M299834R06524k665836m175695
38352E413448k713821O61512L424197L312278K71948l104851l716205j300219
38344B248287Q69264j35398k907871l637939j618400K82643R55158K703017N874194
38335D632955O476501K576591j260404p47669P50816k140606o793923n965057
38327b470796O0531L249291M76826k195759n27999Q73363k695918p068746n305281
38318a5604488J638451O570623N822475K039569j016133j807703k83746K313045
$$ y = [-4683102, -3084008, -122648, 1554769, 478907, -1787965, -2818797, -2284959, -1849193, -2355560, -2284965, 104822, 3685162, 5060189, 2668919, -1128099, -3031490, -2699204, -2223664, -2459116, -1704009, 1747004, 7048621, 11348455, 12254979, 9589143, 5413448, 2699627, 3361139, 6785336, 10097614, 10369562, 7264711, 3548506, 2248287, 3117551, 2982153, 74282, -3563657, -5182057, -4899414, -3944256, -1241239, 4632955, 11109456, 13686047, 12425643, 11677974, 12428790, 10288184, 3494261, -2470796, -2410265, 839026, 1315852, -879907, -1407906, -534543, -3230461, -10299207, -15604488, -13966037, -7395414, -1572939, 466630, -549503, -2357206, -2640952, -327907]
38310c27907L483097K001562m07975j589283j409914l70922J519595K873501J294142
38301G065896k311708l526025r31268J341857L84038j016695l60536n39530l817644
38292c711615n848435k251295L070472L499500K14162o56006J362091J749658
38284b571468L59543J082508K941332Q85133m062286m804117P0357L594548J961850
38275e42600j60562P57448J033052j963068l679781m75684L228420K410265q5483
38266E22007N12825J973501k09999l545863k378945J805533K327205j697396m240817
38257d931949k219032P77105J554195J639164K641510K716138L17938k372867
38249A22202k442698k72837J412855J063789l43726o95517P58364K009411N80516
$$ y = [-327907, 3155190, 5156752, 4748777, 3159494, 1749580, 1378658, 2898253, 5771754, 7065896, 4754188, 1228163, 296895, 1638752, 2022790, 1006095, 645559, 106029, -3711615, -9560050, -11811345, -8740873, -5241373, -5027211, -5683217, -4321126, -2571468, -2211925, -1129417, 1811915, 2697048, -1365238, -6169355, -6098998, -2504450, -542600, -703162, 54286, 1087338, -875730, -4555511, -5031195, -1802775, 607490, 522007, 1034832, 3008333, 2798334, -747529, -3126474, -1320941, 1006264, -691132, -4931949, -7150981, -6373876, -4819681, -3180517, -539007, 2177131, 2495069, 122202, -2320496, -2593333, -1180478, -116689, -460415, -1155932, -397568, 1611843, 2192359]
38240B192359k264840k231028J420853L442199O9638m417053l467586J863425
38232c392033M653130K455772l76530o50622k08373o68158l79523J086427Q11825
38223C331915k089191l661434j247618J551793K01311l530096m234980r94021
38215a0672321J784489J289599q6552Q53427L126673L185223L58606j723311K7527
38206a856640L494875L798858J17467k931140j810264J254889K365408J442606
38198E876059L05281j458537m110041m270786K54712M515884K383392l005817
38190D90147l025377K565123M928196O78656l042247j399228N74503j269896j984698
38181a484821K233458M831264l11959o657437m893986J080467O92709n060889
$$ y = [2192359, -72481, -2303509, -882656, 2559543, 2629181, -1787872, -5255458, -3392033, 1261097, 3716869, 3340339, 2689717, 2481344, 1813186, 1433663, 2520090, 3331915, 1242724, -2418710, -3666328, -2114535, -1913224, -5443320, -9678300, -10672321, -8887832, -7598233, -7684785, -6831358, -3704685, -519462, -160856, -1884167, -1856640, 1638235, 5437093, 5554560, 2623420, 813156, 2068045, 4433453, 5876059, 6181340, 4722803, 612762, -3658024, -3403312, 1112572, 3495964, 490147, -2535230, 29893, 4958089, 5636745, 2594498, 1195270, 1769773, 499877, -1484821, 748637, 5579901, 5267942, -1389495, -6283481, -5203014, -4510305, -9571194]
38173i571194n667938M93127M052551J611206P63226N046415P046269J879166
38165E652828l921148l563841k22854Q35482J344384L614421L305899k545585
38157D499586p148345l245630M332267N268147n94144m051626j196130K205482
38149F9607J137789j937333k342490N49879L724134L609719r93892o194549n391471
38140g768607J962406P312901L732773l945236o142651k270803M31022o83276
38132g371471j461024l02550l63346j703537k03582L915632M939277J442703q64697
38123a972595R32501K101257q62730l989292l072811m61556L41025P57320K608910
38114c617971L174931L92904j981456j64146L042476K995562N00313j101930j988691
$$ y = [-9571194, -15239132, -14746005, -10693454, -9082248, -8319022, -3272607, 3773662, 5652828, 1731680, -1832161, -2055015, -1219533, 124851, 3739272, 7045171, 4499586, -2648759, -5894389, -1562122, 3706025, 3111881, -939745, -2135875, 69607, 1207396, -729937, -3072427, -2522548, 1201586, 4811305, 3817413, -2377136, -7768607, -5806201, 1506700, 5239473, 1294237, -4848414, -7119217, -6688195, -7371471, -8832495, -9135045, -9498391, -11201928, -11405510, -7489878, -2550601, -1107898, -1972595, -1040094, 1061163, 198433, -3790859, -6863670, -7325226, -6984201, -6226881, -3617971, -443040, -50136, -2031592, -2195738, 846738, 3842300, 4342613, 3240683, 1251992]
38105A251992l275868k595508J349622L719353J72197m662494l127123L280396
38097c887433N799472J498137l518993m163411k176684q21005l49382l35811r68109
38088h923219p17979K213666N346045M148541m13778k327225K38112K180884N9947
38079A804994k469824j026165K646072L975594K124325k16487r96478j41964J136236
38070F836303Q12017j783079l660583j496014K368021K011569k838453n342773
38062c092992j758251K771646K545225n9916L54250K813563K017560k619943o132604
38053c161462n344602j964622J273775L219497L266239J537256J8894K90306O17694
$$ y = [1251992, -2023876, -4619384, -3269762, 449591, 621788, -4040706, -7167829, -3887433, 1912039, 3410176, -108817, -4272228, -6448912, -7269917, -7619299, -7955110, -8923219, -9641198, -7427532, -2081487, 2067054, 1653276, -673949, -435837, 1745047, 1804994, -664830, -1690995, 955077, 4930671, 7054996, 6838509, 5842031, 5700067, 6836303, 7648320, 5865241, 2204658, 708644, 3076665, 5088234, 2249781, -3092992, -4851243, -2079597, 465628, 405712, 759962, 3573525, 5591085, 2971142, -3161462, -8506064, -10470686, -9196911, -5977414, -2711175, -1173919, -1155025, -864719, -247025]
$$ [...]
##END NTUPLES=NMR SPECTRUM
##END=
