##TITLE=31Pdec_PR180_1
 D2o, 24 sc
 2.8.2019
##JCAMPDX= 6.0         $$ Bruker NMR JCAMP-DX V2.0
##DATA TYPE= NMR SPECTRUM
##DATA CLASS= NTUPLES
##ORIGIN= UXNMR, Bruker Analytische Messtechnik GmbH
##OWNER= root
$$ XWIN-NMR		Version 3.5
$$ Fri Aug  2 15:19:14 2019 Russian Standard Time (UT+4h)  she@DPX200
##.OBSERVE FREQUENCY= 81.013821
##.OBSERVE NUCLEUS= ^31P
##.ACQUISITION MODE= SIMULTANEOUS
##.ACQUISITION SCHEME= undefined
##.AVERAGES= 24
##.DIGITISER RES= 17
##SPECTROMETER/DATA SYSTEM= spect
##.PULSE SEQUENCE= zgpg30
##.SOLVENT NAME= CDCl3
##.SHIFT REFERENCE= (INTERNAL, CDCl3, 0, 182.463)
##AUDIT TRAIL= $$ (NUMBER, WHEN, WHO, WHERE, WHAT)
$$ ##TITLE= Audit trail, XWIN-NMR		Version 3.5
$$ ##JCAMPDX= 5.01
$$ ##ORIGIN= Bruker BioSpin GmbH
$$ ##OWNER= she
$$ F:/spectra/data/she/nmr/P31/1/pdata/1/auditp.txt
$$ ##AUDIT TRAIL=  $$ (NUMBER, WHEN, WHO, WHERE, WHAT)
(   1,<2019-08-02 15:18:05.00 +0400>,<she>,<DPX200>,
      <created by zg, POWCHK disabled, PULCHK disabled
       configuration hash MD5:
       00 E9 B6 7A A2 85 ED C7 34 08 36 98 17 FE 4E 26
       data hash MD5: 32K
       D0 E0 91 EE D3 80 D8 E5 D1 7D 29 82 FA AE 42 EB>)
(   2,<2019-08-02 15:18:07.71 +0400>,<she>,<DPX200>,
      <Start of raw data processing
       efp BC_mod = 2 LB = 1 FT_mod = 6 PKNL = 1 PHC0 = -599.8496 PHC1 = 729.2003 SI = 64K 
       data hash MD5: 64K
       90 97 15 F5 FE 75 99 95 00 CB 19 4E DE 1F DB B6>)
(   3,<2019-08-02 15:18:39.15 +0400>,<she>,<DPX200>,
      <pk PHC0 = 191.7904 PHC1 = -642.9999 
       data hash MD5: 64K
       0B 3E F3 31 0D FE BA F4 B7 6B 15 1E 6E DE 93 8A>)
(   4,<2019-08-02 15:18:42.45 +0400>,<she>,<DPX200>,
      <abs ABSG = 5 
       data hash MD5: 64K
       AA 1B 34 78 6A 6D A2 64 2B 70 21 2C 9B 65 62 13>)
$$ ##END=
$$ 
$$ hash MD5
$$ 3F 64 22 AA B9 03 52 03 FC EB F5 CC 1B F0 E4 52
##$RELAX= 
##$RELAX= 
##$RELAX= 
##$RELAX= 
##$RELAX= 
##$RELAX= 
##$RELAX= 
##$RELAX= 
$$ Bruker specific parameters
$$ --------------------------
##$DU= <F:/spectra>
##$EXPNO= 1
##$NAME= <P31>
##$PROCNO= 1
##$TYPE= <nmr>
##$USER= <she>
##$AMP= (0..31)
100 100 100 100 100 100 100 100 100 100 100 100 100 100 100 100 100 100 
100 100 100 100 100 100 100 100 100 100 100 100 100 100 
##$AQSEQ= 0
##$AQ_mod= 1
##$AUNM= <au_zg>
##$AUTOPOS= <>
##$BF1= 81.014009
##$BF2= 200.13
##$BF3= 200.13
##$BF4= 200.13
##$BF5= 200.13
##$BF6= 200.13
##$BF7= 200.13
##$BF8= 200.13
##$BYTORDA= 1
##$CFDGTYP= 0
##$CFRGTYP= 5
##$CHEMSTR= <none>
##$CNST= (0..31)
1 1 145 1 1 1 1 1 1 1 1 1 1 1 1 1 1 1 1 1 1 1 1 1 1 1 1 1 1 1 1 1 
##$CPDPRG= <waltz16>
##$CPDPRG1= <>
##$CPDPRG2= <waltz16>
##$CPDPRG3= <>
##$CPDPRG4= <mlev>
##$CPDPRG5= <mlev>
##$CPDPRG6= <mlev>
##$CPDPRG7= <mlev>
##$CPDPRG8= <mlev>
##$CPDPRGB= <>
##$CPDPRGT= <>
##$D= (0..31)
0 1 0 0 0 0 0 0 0 0 0 0.03 2e-05 3e-06 0 0 0 0 0 0 0 0 0 0 0 0 0 0 0 0 
0 0 
##$DATE= 1564744684
##$DBL= (0..7)
120 120 120 11 120 120 24 19 
##$DBP= (0..7)
150 150 150 150 150 150 150 150 
##$DBP07= 0
##$DBPNAM0= <>
##$DBPNAM1= <>
##$DBPNAM2= <>
$$ [...]
##$SUBNAM3= <"">
##$SUBNAM4= <"">
##$SUBNAM5= <"">
##$SUBNAM6= <"">
##$SUBNAM7= <"">
##$SUBNAM8= <"">
##$SUBNAM9= <"">
##$SW= 369.568048894756
##$SWIBOX= (0..15)
0 1 3 0 0 0 0 0 0 0 0 0 0 0 0 0 
##$SW_h= 29940.119760479
##$TD= 32768
##$TD0= 1
##$TE= 0
##$TE2= 300
##$TE3= 300
##$TEG= 300
##$TL= (0..7)
0 120 53 12 22 120 120 120 
##$TP= (0..7)
150 150 150 150 150 150 150 150 
##$TP07= 0
##$TPNAME0= <>
##$TPNAME1= <>
##$TPNAME2= <>
##$TPNAME3= <>
##$TPNAME4= <>
##$TPNAME5= <>
##$TPNAME6= <>
##$TPNAME7= <>
##$TPOAL= (0..7)
0.5 0.5 0.5 0.5 0.5 0.5 0.5 0.5 
##$TPOFFS= (0..7)
0 0 0 0 0 0 0 0 
##$TUNHIN= 0
##$TUNHOUT= 0
##$TUNXOUT= 0
##$USERA1= <user>
##$USERA2= <user>
##$USERA3= <user>
##$USERA4= <user>
##$USERA5= <user>
##$V9= 5
##$VALIST= <valist>
##$VCLIST= <CCCCCCCCCCCCCCC>
##$VD= 0
##$VDLIST= <DDDDDDDDDDDDDDD>
##$VPLIST= <PPPPPPPPPPPPPPP>
##$VTLIST= <TTTTTTTTTTTTTTT>
##$WBST= 1024
##$WBSW= 4
##$XGAIN= (0..3)
0 0 0 0 
##$XL= 0
##$YL= 0
##$YMAX_a= 88589
##$YMIN_a= -99894
##$ZGOPTNS= <>
##$ZL1= 120
##$ZL2= 120
##$ZL3= 120
##$ZL4= 120
##$ABSF1= 182.463
##$ABSF2= -187.1042
##$ABSG= 5
##$ABSL= 3
##$ALPHA= 0
##$AQORDER= 0
##$ASSFAC= 0
##$ASSFACI= 0
##$ASSFACX= 0
##$ASSWID= 0
##$AUNMP= <proc_1d>
##$AZFE= 0.1
##$AZFW= 0.5
##$BCFW= 0
##$BC_mod= 2
##$BYTORDP= 0
##$COROFFS= 0
##$CY= -3
##$DATMOD= 1
##$DC= 0
##$DFILT= <>
##$DTYPP= 0
##$F1P= 0
##$F2P= 0
##$FCOR= 1
##$FTSIZE= 65536
##$FT_mod= 6
##$GAMMA= 0
##$GB= 0
##$INTBC= 1
##$INTSCL= 5.30512e-09
##$ISEN= 30
##$LB= 1
##$LEV0= 0
##$LPBIN= 0
##$MAXI= 10000
##$MC2= 0
##$MEAN= 0
##$ME_mod= 0
##$MI= 50
##$NCOEF= 0
##$NC_proc= -3
##$NLEV= 6
##$NOISF1= 182.463
##$NOISF2= 159.3651
##$NSP= 0
##$NTH_PI= 0
##$NZP= 0
##$OFFSET= 182.463
##$PC= 4
##$PHC0= -408.0592
##$PHC1= 86.20044
##$PH_mod= 1
##$PKNL= yes
##$PPARMOD= 0
##$PSCAL= 0
##$PSIGN= 0
##$REVERSE= no
##$SF= 81.0140089999434
##$SI= 65536
##$SIGF1= 159.3651
##$SIGF2= -187.1042
##$SINO= 113.3802
##$SIOLD= 16384
##$SREGLST= <1H.CDCl3>
##$SSB= 0
##$STSI= 65536
##$STSR= 0
##$SW_p= 29940.119760479
##$SYMM= 0
##$S_DEV= 0
##$TDeff= 32768
##$TDoff= 0
##$TI= <>
##$TILT= no
##$TM1= 0
##$TM2= 0
##$TOPLEV= 0
##$USERP1= <user>
##$USERP2= <user>
##$USERP3= <user>
##$USERP4= <user>
##$USERP5= <user>
##$WDW= 1
##$XDIM= 65536
##$YMAX_p= 328128117
##$YMIN_p= -3706829
$$ End of Bruker specific parameters
$$ ---------------------------------
##NTUPLES= NMR SPECTRUM
##VAR_NAME=  FREQUENCY,     SPECTRUM/REAL,   SPECTRUM/IMAG
##SYMBOL=    X,             R,               I
##VAR_TYPE=  INDEPENDENT,   DEPENDENT,       DEPENDENT
##VAR_FORM=  AFFN,          ASDF,            ASDF
##VAR_DIM=   65536,         65536,           65536
##UNITS=     HZ,            ARBITRARY UNITS, ARBITRARY UNITS
##FACTOR=    0.456856943014862, 1,           1
##FIRST=     14782.0589164792, 0,            0
##LAST=      -15158.0608439998, 0,           0
##MIN=       -15158.0608439998, -3706829,    0
##MAX=       14782.0589164792, 328128117,    0
$$ Real data points
##PAGE= N=1
##DATA TABLE= (X++(R..R)), XYDATA
$$ [...]
46031b65269Q3796R5197Q3497l9125j94697j95097j6820J50428J69578J10789
46021a7723P8944M6146l9983j09425o1526P2788J72107J74308J00476p703r0461
46010C17948p5778K7674J02878P2211L365j8365l3433j03820j50825n6748J17811
45999B02918J87640J03961J021l0509n8054j48343k30740j96530n0396R9851J51547
45988C2366P6410o0144j30418n5051J03041K03581J79673P1378n3740j30800r4095
45977A42201L7451J02828k9076k38630k64073m8622J79214K09432P9608n1059
45967A19274j02858q1589k3235l682p5506j43968n7945J28576J82281N5596q754
45956a1810J21793K14560M2474k08170k03757P484P4461j06620k62830j85805
$$ plain form
46031 -265269 -181473 -86276 -2779 -41904 -236601 -431698 -448518 -298090 -128512 -17723
46021 -17723 61221 107367 67384 -42041 -103567 -30779 141328 315636 416112 408409 317948
46010 317948 242170 269844 372722 444933 448298 429933 396500 292680 141855 85107 202918
45999 202918 390558 494519 495540 465031 406977 258634 27894 -168636 -219032 -119181 32366
45988 32366 108776 48632 -81786 -136837 -33796 169785 349458 420836 367096 236296 142201
45977 142201 179652 282480 253404 14774 -249299 -297921 -118707 90725 170333 119274
45967 119274 16416 -65173 -88408 -92090 -167596 -311564 -369509 -240933 -58652 -3056 -11810
45956 -11810 109983 324543 367017 158847 -44910 -37426 37035 -69585 -332415 -518220
45946e18220Q128J32932J77347J86907J30909J7540l7011K2056R2481Q3116L1994
45935C28179k3930j24781k30795j76925O4656K43995J44290r6495j81712p5675
45925a29193K238m8450q6146K069J22984J42439O4803l4937j28806j98099j83710
45914d74808p0748N0423R3584Q6193Q9239P3071j8907j22149r5800P1331K12740
45903a05831J89880N9712k5100j1723L7280O7581O7862J0050j22385k38643k02041
45892b73358l2409P7588K4868m9072J6034J32372J00811n1214q7913O6960J97682
45881A22349J15212p3033j40073n2215M2656M9184l520o7424j08957p2807M4808
45870a43820J07146k4460k49707k83690j5790L09453L63012J04898k03708l08868
$$ plain form
45946 -518220 -510092 -377160 -199813 -12906 118003 135543 98532 120588 213069 296185 328179
45935 328179 304249 179468 -51327 -228252 -163596 80399 224689 128194 -53518 -129193
45925 -129193 -126955 -175405 -261551 -259482 -136498 5941 70744 35807 -92999 -291098 -474808
45914 -474808 -545556 -495133 -401549 -315356 -226117 -153046 -171953 -294102 -389902 -318571 -105831
45903 -105831 84049 143761 118661 106938 144218 211799 279661 289711 167326 -71317 -273358
45892 -273358 -305767 -228179 -203311 -252383 -236349 -103977 -3166 -54380 -142293 -75333 122349
45881 122349 237561 164528 24455 -27760 14896 64080 60560 -6864 -115821 -188628 -143820
45870 -143820 -36674 -61134 -310841 -594531 -610321 -300868 62144 167042 -36666 -345534
45860c45534j88972O546J45018K01994K13020J88286J01508l4771j22558o8255
45850I6282P7718J44078M4123j01341j13236J3641J12841P0152m4142q9976l1078
45839A79062N0499O7938J4584m2212l0514M0286O6732k3412j40226j20851K7983
45828H9869J02357r579j45250j10955R751p792j51630j77901k005J67520J62412
45817g3203Q6205Q4004R2626k823j30478j47741p0603K243P3661J56334J25411
45806A95636r0643k76835j79899P1306J16015p6639j49075P0765K92346K23441
45796A96418k220r1198m0749m6528j21249r4764P3475K27592K42259J30741n0816
45785D22961k39784l25628k30972l9022Q1832P6160K3109j1870l3830m7975m3680
$$ plain form
45860 -345534 -534506 -527960 -382942 -180948 32072 220358 321866 287095 164537 96282
45850 96282 174000 318078 362201 260860 147624 161265 274106 344258 300116 210140 179062
45839 179062 229561 297499 312083 269871 239357 279643 346375 322963 182737 61886 89869
45828 89869 192226 182647 37397 -73558 -63807 -71599 -223229 -401130 -403135 -235615 -73203
45817 -73203 13002 97006 189632 186809 56331 -91410 -162013 -159770 -86109 70225 195636
45806 195636 104993 -171842 -351741 -280435 -164420 -241059 -390134 -319369 -27023 196418
45796 196418 194198 103000 62251 15723 -105526 -200290 -126815 100777 343036 473777 422961
45785 422961 183177 -142451 -373423 -412445 -330613 -254453 -231344 -243214 -277044 -325019 -368699
45774c68699l8725m8158l0194N0188J34583J36851O3900r402m0529j7023P4175
45763i3033J76383J49651l7375j82934q9872J27584J69865k9986k14466j59207
45753a83390N6456J99729J63179J8304j08283j45531j22807j26367j65039j21526
45743e35275O6444K37570J79680n5699j96641j15219M6052J40700J93337K31819
45733A92768J67527j5285j35823o0710O7942L9248j00974j43679o5236m4708j35672
45722b34602j59042j158J77350J68516K1967m5593J7878M2007p9575k16596k01604
45711e10452p4855J213n712J1324Q2740J06195L1103n2151n6243M053R8353K10879
45699a53553K35644M1661k58838l30781o8198J95166J49312l4709r668J72772
$$ plain form
45774 -368699 -407424 -455582 -485776 -435588 -301005 -164154 -100254 -109656 -150185 -167208 -93033
45763 -93033 83350 233001 195626 12692 -77180 50404 220269 190283 -24183 -183390
45753 -183390 -126934 72795 235974 254278 145995 464 -122343 -248710 -413749 -535275
45743 -535275 -468831 -231261 -51581 -107280 -303921 -419140 -373088 -232388 -39051 192768
45733 192768 360295 345010 209187 148477 216419 255667 154693 11014 -54222 -98930 -234602
45722 -234602 -393644 -394802 -217452 -48936 -26969 -72562 -54684 -12677 -92252 -308848 -510452
45711 -510452 -585307 -584094 -589806 -578482 -495742 -389547 -358444 -410595 -466838 -462785 -364432 -153553
45699 -153553 82091 123752 -135086 -465867 -534065 -338899 -189587 -224296 -233964 -61192
45689f1192J79748j3136q9308M5964J09934m7089j81260q5730O7255M3580p5692
45678a06926q2505J1390N4550J3648n3695j27772j52801q763K61409L80296J93137
45667C81968p6982j40017l3726J6737l1659n8717l1612R835R4843K12658J98678
45656E42006j8728k03681j30423K7489m1127k52369k48604o079J00989r8647k98268
45645f27442j82778J35484L26355K62424O6836r2794j20673k3983P6273N8853
45635a21445l5547o1508J3853Q7925J02607Q5846L1820p6861j43789n8706Q5248
45624i0557Q8373m6188j26814r2628o9595j02654j00766o5944q7773q4556J21160
45613f57942M11432M24324J15411j08151L141J67693N8592j78186k11177n7203
$$ plain form
45689 -61192 118556 105420 16112 62076 172010 124921 -56339 -142069 -74814 -31234 -106926
45678 -106926 -189431 -178041 -123491 -109843 -163538 -291310 -444111 -452874 -191465 188831 381968
45667 381968 304986 164969 131243 147980 116321 57604 25992 35827 130670 343328 542006
45656 542006 523278 319597 189174 216663 175536 -76833 -325437 -331516 -230527 -329174 -627442
45645 -627442 -810220 -674736 -348381 -85957 -19121 -111915 -232588 -256571 -180298 -121445
45635 -121445 -156992 -218500 -204647 -116722 -14115 71731 103551 26690 -117099 -175805 -90557
45624 -90557 -2184 -48372 -175186 -267814 -337409 -440063 -540829 -606773 -694546 -779102 -657942
45613 -657942 -246510 177814 293225 185074 188215 355908 414500 236314 25137 -32066
45603c2066K4943j7388l3382Q907J2897k5358m7524q8269j67698j51478M0607
45592d75809K19688J78311K1871k1677J7949l0499j14310n6891O7709L2981j13058
45581b73735j01304Q0005J47645J2565p5291K4099J05689n433j51091j10459O0761
45570b86549J53198R1368n3676j86057k05398o3629J08775J08841l2170o0090
45560d25387R7251J88988M3756j45746j37697o255M5974L7099R3600J51253P1443
45549A4279n2414j8866J10104Q1333j12562j90885l8061J06308L6345j07277r9242
45538b70938K711j4093j44852j73921k4120J26048J18147L0960L2837J35193K01640
45527A9612J40630r197j52382k07276j26860N4425J94870J63705P107r3103n5373
$$ plain form
45603 -32066 -7123 -24511 -57893 -48986 -36089 -61447 -108971 -197240 -364938 -516416 -475809
45592 -475809 -256121 -77810 -55939 -77616 -59667 -90166 -204476 -261367 -193658 -160677 -273735
45581 -273735 -375039 -295034 -147389 -134824 -210115 -186016 -80327 -85760 -236851 -347310 -286549
45570 -286549 -133351 -41983 -95659 -281716 -487114 -550743 -441968 -333127 -365297 -425387
45560 -425387 -328136 -139148 -95392 -241138 -378835 -385090 -339116 -302017 -208417 -57164 14279
45549 14279 -38135 -57001 53103 134436 21874 -169011 -207072 -100764 -64419 -171696 -270938
45538 -270938 -268227 -282320 -427172 -601093 -625213 -499165 -381018 -350058 -317221 -182028 19612
45527 19612 160242 151045 -1337 -208613 -335473 -281048 -86178 77527 84634 -8469 -63842
45516f3842O120k8711j08910j14276m4349P579N578k1697p1497j35249j20231
45505f89485M4905K41123K56653P3880r1339p6932M2127J17231J32620J49903
45495B00686J52092O9302p9169j71035j18702K4037J06955L8951r7433j26193
45485e09l432J06156N3977o9688o6410P4875J78236J49384N8383m7178k04028
45474B29766l61007l51292j32895J10558K08443J90320J42657M9458r4284j64114
45464a72390o5340R0234J16491p579j46703j88005j15869J4773J00048O7329r364
45453c16375J2212J08643J03635k6743q1556K3939R2567j1445j10149l3813N6016
45442a83069l5341j41149q432K05451J44028j31307j99695L9519K07189O1915
$$ plain form
45516 -63842 -57722 -86433 -195343 -309619 -353968 -346389 -340811 -362508 -434005 -569254 -689485
45505 -689485 -644580 -403457 -146804 -72924 -164263 -241195 -199068 -81837 50783 200686
45495 200686 352778 422080 342911 171876 53174 77211 184166 223117 125684 -509
45485 -509 -3941 102215 156192 86504 20094 94969 273205 422589 480972 433794 229766
45474 229766 -131241 -482533 -615428 -504870 -296427 -106107 36550 86008 -8276 -172390
45464 -172390 -237730 -147496 -31005 -38584 -185287 -373292 -489161 -474388 -374340 -307011 -316375
45453 -316375 -304163 -195520 -91885 -118628 -200184 -176245 -83678 -95123 -205272 -239085 -183069
45442 -183069 -218410 -359559 -367991 -162540 -18512 -149819 -349514 -309995 -102806 -40891
45432d0891j48320j25860M8099J42136J34874J10850L4076j30991k46831j76086
45422c98944n663Q1246N1277o38q904L9590J22178J39791J1218j29371m1423K25748
45410H6105L09409N9158j96317j35546P5537R3443m8185p0841K4441p884j61587
45399B7733j53970O2565J69802q190k11821j50149O9985J42573Q268j25295j13079
45388b81578k6314J778m5192o0641M8626K16464K42856L8161k05374k19638j4106
45377c04958J43543J01962j2902n0206l8688n0512n5062k9244m3836j10707j08676
45366e59286k713L6796r0206j89848n2442J87920K38359R3037k04L4261K9291
45355b75035n9580n2488J01495J79326M5040j09402p2875O0942R0079L0326J1425
$$ plain form
45432 -40891 -189211 -315071 -266972 -124836 10038 120888 154964 23973 -222858 -398944
45422 -398944 -404607 -323361 -272084 -272722 -281626 -242036 -119858 19933 31151 -98220 -139643 86105
45410 86105 395514 454672 258355 122809 198346 291789 243604 172763 197204 189320 27733
45399 27733 -126237 -63672 106130 97940 -113881 -264030 -194045 -51472 -43204 -168499 -281578
45388 -281578 -307892 -306114 -351306 -411947 -363321 -146857 95999 134160 -71214 -290852 -304958
45377 -304958 -161415 -59453 -72355 -122561 -161249 -211761 -266823 -296067 -339903 -450610 -559286
45366 -559286 -561999 -525203 -615409 -805257 -857699 -669779 -431420 -338383 -338587 -304326 -275035
45355 -275035 -334615 -387103 -285608 -106282 -61242 -170644 -243519 -182577 -92498 -62172 -50747
45344e0747J2739m2755o6515M9375J71747J03829o1439q2873j802o4280k27241
45333b59962j64481J52675L17783J18157j11696m0583J31825O2575j34058j19352
45323d7117N6545O7102q1783o6581J43604J95274m2441k40236j44864M7869P0158
45312d2470j1300j2384K9739j926m8802j4786K6758o280j7492O7251R5181o4972
45300a483k34622j61760P9945K05693J35248J9981o5407j73562k69955k42828
45290g08750j18855k8709K7383J43241K57749K03001J2878p6417J8486J09926
45280a60067M2662r8033j59539j17459k3681P6053J11622L4676n4957O558J88625
45269a53540K65090J30133n6691j09877l7953M7664Q2358L0691j21880k75620
$$ plain form
45344 -50747 -38008 -80763 -147278 -97903 73844 177673 116234 33361 31559 -32721 -259962
45333 -259962 -424443 -271768 46015 164172 52476 11893 143718 206293 72235 -47117
45323 -47117 9428 76530 -5253 -71834 71770 267044 224603 -15633 -160497 -112628 -42470
45312 -42470 -53770 -66154 -36415 -38341 -87143 -101929 -75171 -81451 -98943 -31692 63489 -1483
45300 -1483 -236105 -397865 -317920 -112227 23021 43002 -22405 -195967 -465922 -708750
45290 -708750 -827605 -856314 -828931 -685690 -427941 -224940 -212062 -288479 -269993 -160067
45280 -160067 -117405 -215438 -374977 -492436 -516117 -440064 -328442 -293766 -348723 -342165 -153540
45269 -153540 111550 241683 184992 75115 37162 84826 167184 197875 75995 -199625
45259a99625k65427q8559O0233N9633J2878M0344Q8518O7024K5003M3926P2237
45248h3815K0648o0101m5574O3035J31186O8464p0831j60492j32832m3428q911
45237c22651o0422r9564n0518K1956M4291Q1098J89862K34679P6667j26445r7819
45226a08866J12665J80001J2335j39875j36406j30478j86725j14221J29495K52113
45216a29962R5807o3533K0541J42926L3363j48256j06465N9055N6550o5095m2950
45205a48019R0655R2668J345O7469K42155K09551n8285k33133j68935q1752j13569
45194i9850j25215l3826K5082K784N0996J92724K14317L3978j36156j42745r9332
45183a17243r6200k0178J60851K41062J08497m1348k9359K9087k1479r5635o3462
$$ plain form
45259 -199625 -465052 -553611 -493378 -433745 -420867 -380523 -292005 -224981 -199978 -156052 -83815
45248 -83815 -63167 -123268 -168842 -105807 25379 93843 23012 -137480 -270312 -313740 -322651
45237 -322651 -383073 -482637 -533155 -511199 -466908 -385810 -195948 38731 115398 -11047 -108866
45226 -108866 3799 183800 196135 56260 -80146 -210624 -397349 -511570 -382075 -129962
45216 -129962 -34155 -97688 -77147 65779 99142 -49114 -155579 -96524 -39974 -105069 -148019
45205 -148019 -57364 35304 36649 104118 346273 555824 497539 264406 95471 13719 -99850
45194 -99850 -225065 -258891 -233809 -231025 -180029 12695 227012 260990 124834 -17911 -117243
45183 -117243 -213443 -233621 -72770 168292 276789 235441 206082 235169 213690 118055 54593
45172E4593N44j4319n0875n3358j13158k31180j81015J34390M19336L63122Q0437
45161D08517j13307j63643j93104j50471O8960K75079J65747j75179l39460j70934
45151c87795O0882J08903M8654M1563P9872R4778J04163J26510J06832K8596l0725
45140C82233k9911l0238p3207j06383q5481m8773m0692m6037l7096j5498J4677
45129a16406N4889Q6631Q6965N6954j286r1232j69816j67650j07586r2612j16543
45118e77692m2305J33043J86712J2358j42943k3429K22662K68333J13540K4081
45108A74360M5654l5777k43620l06430r4051J73274K69813K27586J38927j3326
45098C36410j86100k14501q7144k7082j25538j57985K8086K05596J14017j09661
$$ plain form
45172 54593 55137 40818 -10057 -63415 -176573 -407753 -588768 -454378 -35042 328080 408517
45161 408517 295210 131567 -61537 -212008 -143048 132031 297778 122599 -216861 -387795
45151 -387795 -326913 -218010 -169356 -127793 -47921 46857 151020 277530 384362 412958 382233
45140 382233 352322 322084 248877 142494 57013 8240 -32452 -78489 -115585 -131083 -116406
45129 -116406 -61517 25114 112079 169033 167747 76515 -93301 -260951 -368537 -461149 -577692
45118 -577692 -619997 -486954 -300242 -287884 -430827 -454256 -231594 36739 150279 174360
45108 174360 220014 184237 -59383 -365813 -459864 -286590 -16777 210809 349736 336410
45098 336410 150310 -64191 -151335 -178417 -303955 -461940 -433854 -228258 -114241 -223902
45088b23902j51985p205Q4140O2619P4987J31101Q1378n4320o2706Q9501J52456
45077A76064j7531k15061j89418K693J23589R2410J5194l0494o2305q5709p4496
45066b65064n0573o1685q1673l9521N2072J02225Q4440O7063Q0766O7809M685
45055c9456l9267k9877l7943q9712p1730P3974J72531L7486j96382k10775K3497
45044d07654J82429P3852q6396m3242R7234P8530o8246q8142P1530J82502Q8063
45033H0460j01342k08320j98840j39582q9060p8293r2057n0524R2741K43027K60557
45022b81233J44839J7361l9204j0012J12386K65048K69805M6672j90877j77249
45012A57536J5787P9984o8081k06274j90911j20132o9388K6430J41326J14742
$$ plain form
45088 -223902 -375887 -383092 -298952 -236333 -161346 -30245 51133 -3187 -65893 23608 176064
45077 176064 158533 -56528 -245946 -243253 -119664 -27254 -12060 -42554 -104859 -190568 -265064
45066 -265064 -315637 -377322 -458995 -498516 -446444 -344219 -259779 -192716 -111950 -44141 -39456
45055 -39456 -78723 -108600 -146543 -236255 -307985 -234011 -61480 -23994 -220376 -431151 -407654
45044 -407654 -225225 -151373 -237769 -281011 -183777 -105247 -173493 -261635 -190105 -7603 80460
45033 80460 -20882 -229202 -428042 -567624 -656684 -734977 -827034 -877558 -784817 -541790 -281233
45022 -281233 -136394 -119033 -158237 -168249 -55863 209185 478990 525662 334785 157536
45012 157536 173323 253307 185226 -21048 -211959 -332091 -401479 -375049 -233723 -118981
45002a18981m3036j00734K303K5072j40745k29681l7977K00464J78845Q631j413
44991b57252J30963J33349l6614j47447r6719k8015l9775o0981m2197l0858l2990
44980e08536n171J3769m0306q8013o119J27842J26152J6182J4211J48255J85354
44969a6380K2905j10401J169K21191K60300Q6120o8235n8942j2140j07010k90758
44958g2181l16495p3481K09950K01225j12498l76021k93459L7707L10504L75169
44948a09580K79895R1252j19125k02379p8033Q5595N1947j38272k12707o2921
44938d14328J16348J23381j303q5419m1247Q5887J80044J39666j0264j07868n7099
44927g2202J5298n0419j66369j05617J36544L04555K19304l6743k80879l89130
$$ plain form
45002 -118981 -162017 -262751 -260448 -235376 -376121 -605802 -643779 -443315 -264470 -255839 -257252
44991 -257252 -126289 7060 -29554 -177001 -273720 -301735 -341510 -402491 -444688 -475546 -508536
44980 -508536 -513707 -499938 -540244 -628257 -634376 -506534 -380382 -364200 -349989 -201734 -16380
44969 -16380 6525 -103876 -102707 118484 378784 464904 396669 337727 325587 218577 -72181
44958 -72181 -388676 -462157 -252207 -50982 -163480 -539501 -832960 -795253 -484749 -109580
44948 -109580 170315 261567 142442 -59937 -137970 -52375 -428 -138700 -351407 -414328
44938 -414328 -297980 -174599 -175902 -261321 -302568 -216681 -36637 103029 92765 -15103 -72202
44927 -72202 -56904 -107323 -273692 -379309 -242765 61790 281094 244351 -36528 -425658
44917d25658k93384l0291J84502J41030o8584j36975M2962K54551K83912J55760
44907A07825j210j07648j01251L3106J51627Q6887p3986r0634L1086M1911j03215
44896b5502j55837l4979J2590j11470j29064R9218K30260j6863l14569j89457
44886f35673K13244L43782R1449j20519o1237J6141q7202j62224J121K17077J97873
44875A3832J2393l4212J36770K82915J86144q3425k79043k55230q9515L8618M1252
44864b9501l2749j09193j55083j27066J9098K01562K19897j700k76236l66840
44854f57811k40861j1605K35186M09749L62773P6631j87781j67021M2849J23967
44844a3924j5123j65782j62423n3019P0724J71650J79212L9998j14457q3558Q2334
$$ plain form
44917 -425658 -719042 -749333 -564831 -423801 -492385 -629360 -586398 -331847 -47935 107825
44907 107825 106615 -1033 -102284 -69178 82449 169336 95350 4716 35802 77713 -25502
44896 -25502 -181339 -216318 -203728 -315198 -444262 -345044 -114784 -131647 -446216 -635673
44886 -635673 -422429 -78647 12802 -107717 -168954 -152813 -240015 -402239 -401118 -184041 13832
44875 13832 26225 -7987 128783 411698 597842 514417 235374 -19856 -109371 -70753 -29501
44864 -29501 -62250 -171443 -326526 -453592 -434494 -232932 -13035 -14735 -290971 -657811
44854 -657811 -898672 -910277 -675091 -265342 97431 174062 -13719 -180740 -137891 -13924
44844 -13924 -29047 -194829 -357252 -410271 -339547 -167897 11315 51313 -63144 -146702 -64368
44833f4368J20343l4637j38597l0162J24381J20175K0756o00N3661O5886J7673
44822B54511k8314o1068q9572o9914P615N0638K413n1161l0330q266p2406j41796
44810b37650q2453O8651J54938J26037O2017J0506m9254r6680o9978J2414M9782
44799e1670J515o1188o6072k4677J3898K8312J7105k9267j15337k07181k26639
44788g21201j05910J18876K90596K74516J18544j800J196N6694Q2845Q4627P1926
44777B70909J0620q1387j11176n9063k8300o2257m7098Q6243J94646J12866q7865
44766A98138j97009j47845m2305M0651Q9937P0313l0108r3990m613J35648J11884
44755A30701p4337j82470p2729J20997K08810J56559K0107j50488k58840j90108
$$ plain form
44833 -64368 55975 21338 -117259 -147421 -23040 97135 117891 117291 170952 236838 254511
44822 254511 226197 165129 75557 5643 13258 63896 66309 15148 -15182 -23448 -95854 -237650
44810 -237650 -320103 -251452 -96514 29523 91540 102046 52792 -43888 -113866 -101452 -51670
44799 -51670 -50155 -111343 -177415 -202092 -188194 -159882 -142777 -172044 -287381 -494562 -721201
44788 -721201 -827111 -708235 -417639 -143123 -24579 -26379 -25183 31511 114356 198983 270909
44777 270909 281529 200142 88966 29903 1603 -60654 -107752 -21509 173137 286003 198138
44766 198138 1129 -146716 -189021 -148370 -58433 11880 -18228 -112218 -116831 18817 130701
44755 130701 56364 -126106 -198835 -77838 130972 287531 307638 157150 -101690 -291798
44745b91798J57P8931o5454k57979k88421j79802o4890M9662K00651K73931J37717
44734d07295p9584r1920J43599L41466K63523O961j62877j28796J7915J26775
44724B9767J06927k8871j60662j53644p994J33893J63599J18976P9607L6896n7494
44713B61000j77357k41388k15101j27051j0006J13944K06385K21464J42502p53
44703A73639j29037j40529j1387J23259Q4605j14504k48651j57078N3772J64978
44693b00933J09929j3880j10936j45245r7555Q976Q4761Q3454P9580J30487J44465
44682G3103K6934j26014j52769p3641k2356j513O7152J11301L289j41686q0105
44671c16305J29941J67006j1625n9954J59709K80468K0315l00396k34583P0554
$$ plain form
44745 -291798 -291641 -212710 -278164 -536143 -824564 -1004366 -1069256 -1019594 -818943 -545012 -407295
44734 -407295 -486879 -578799 -435200 -93734 169789 176750 13873 -114923 -97008 29767
44724 29767 136694 107823 -52839 -206483 -214477 -80584 83015 201991 281598 318494 261000
44713 261000 83643 -157745 -372846 -499897 -509903 -395959 -189574 31890 174392 173639
44703 173639 44602 -95927 -107314 15945 100550 -13954 -262605 -419683 -365911 -200933
44693 -200933 -91004 -104884 -215820 -361065 -458620 -449644 -364883 -281429 -201849 -71362 73103
44682 73103 100037 -25977 -178746 -252387 -274743 -276256 -209104 -97803 -94514 -236200 -316305
44671 -316305 -186364 -19358 -30983 -90937 68772 349240 369555 69159 -165424 -94870
44661i4870J05326j98077l92925k26767N0328J63204J73140K07396J87605M5646
44651B0006o0805J2847J30194O9654j36084k56070j77819k420J22616J29716L4071
44640a14094p1230n5580J06632K53178J95328l1964j74322o2971J44817J33180
44630C22974j48732l60982j98228J60426K65450M3177r5887R2316K86909J30049
44620D97472j64301j50524J06956J40221j44410l28747j81662J7071J3889k7659
44610b21694Q1930J86050J05347m948M7603J15727j9747k28618k33476o4717L3552
44599b02991K2645N2727J20707Q4779k2182r773J38119K17236J07697r1187k35476
44588A82301k62433j63048k046P3484O854n7298M13N1715o3126k21469j89019
$$ plain form
44661 -94870 10456 -187621 -580546 -807313 -756985 -593781 -420641 -213245 -25640 20006
44651 20006 -40799 -27952 102242 171896 35812 -220258 -398077 -400497 -277881 -148165 -114094
44640 -114094 -185324 -240904 -134272 118906 314234 282270 107948 44977 189794 322974
44630 322974 174242 -186740 -384968 -224542 40908 84085 -11802 80514 367423 497472
44620 497472 333171 182647 289603 429824 285414 -43333 -224995 -207924 -194035 -221694
44610 -221694 -139764 46286 151633 146685 194288 310015 290268 61650 -171826 -236543 -202991
44599 -202991 -180346 -127619 -6912 77867 55685 45912 184031 401267 508964 417777 182301
44588 182301 -80132 -243180 -245226 -171742 -164888 -222186 -221773 -170058 -233184 -454653 -643672
44577f43672q731P8879L9389M9370J29476J11620q434k1598J24250K14253J21949
44566A86751p816l9504m4994r6786j09638l1482K2011l1145q6825l5089P0809
44555b03708J32006J26911L8057j47314k82187j43503K01727L60597J26057j99814
44545H829k17652K3869J57832M2422j11871j11969j5984L4755K3052K1938N9923
44534h4856Q8782O0382Q310J9783R0070P2428j09237k65107j59635J00560J69318
44523i202j2619j14694L7456J60997j159k17312j34984J27206J71121l6121j50242
44512a79553m1341M2910m2879j13540l8106J5389q3827j60482m3537J08513P1697
44501d64756m7158J1005K05787K58216J22799N7406J67567K06776p881k48032
$$ plain form
44577 -643672 -652403 -573524 -534135 -484765 -355289 -243669 -252103 -273701 -149451 64802 186751
44566 186751 178935 139431 94437 -2349 -111987 -143469 -121458 -152603 -239428 -274517 -203708
44555 -203708 -71702 55209 93266 -54048 -336235 -479738 -278011 82586 208643 8829
44545 8829 -208823 -184954 -27122 15300 -96571 -208540 -224524 -189769 -166717 -144779 -84856
44534 -84856 3926 64308 72618 92401 182471 254899 145662 -119445 -279080 -178520 -9202
44523 -9202 -21821 -136515 -99059 61938 60779 -156533 -291517 -164311 6810 -29311 -179553
44512 -179553 -220894 -177984 -220863 -334403 -372509 -357120 -440947 -601429 -644966 -536453 -464756
44501 -464756 -511914 -500909 -295122 -36906 85893 143299 310866 517642 509761 261729
44491B61729j93733O6144J53114l8306k07227j25835L5929J5760j36958j78451
44481c47834m6711J12926K10150K59694K18657K4215k08726k72922j79909j43490
44471c73950k09570j74357L1760J66307N8311q4251P739K32948K82066J06415
44461D3418n7306o7206j6002o884k4797m6726q3952r3120j3760R0622Q6684k0954
44449b09983q7348m7167R254J255l5375l4041K0128J04189J58634R8678o2998
44438h4774j48501j5857K09412K73744J42655J9794K4579N8296K1880l8641o8405
44427C94182j03448j59353j79218j57994j61871j68677o6632J18201J88302P2127
44417b24381l5015L8355J82873K00818J02093K7618J346m7593j02363q7531k4812
$$ plain form
44491 261729 67996 134140 287254 248948 41721 -84114 -48185 -32425 -169383 -347834
44481 -347834 -394545 -281619 -71469 188225 406882 431097 222371 -50551 -230460 -373950
44471 -373950 -583520 -757877 -726117 -559810 -501499 -585750 -578011 -345063 -62997 43418
44461 43418 -13888 -81094 -97096 -103980 -128777 -175503 -259455 -352575 -366335 -275713 -189029 -209983
44449 -209983 -297331 -344498 -335244 -333989 -369364 -403405 -383277 -279088 -120454 -21776 -84774
44438 -84774 -233275 -249132 -39720 234024 376679 396473 421052 479348 501228 462587 394182
44427 394182 290734 131381 -47837 -205831 -367702 -536379 -603011 -484810 -296508 -224381
44417 -224381 -259396 -221041 -38168 162650 264743 292361 293707 246114 143751 56220 31408
44406C1408Q042K4362P6644J11592M7571m4676k2610Q1752Q3667o6868j94631
44395A36253j47437R380J09579Q3584j5583q5093k8525J55972K99183J90858j41579
44384E66592l95765l35689q0102O8640J0913q7314q9059o1787j00647j31596k8322
44373f64136J48132J88875K8834j39488j14815M9072J35649O6766k2235j1527
44363c34873L6523J2227l9592K3404K06084L18989K00865p4018k74580k65867
44353a90838j19433J5878P5243Q4267P8088P9443J08412J32170M6911j73404l32030
44342a95293j82426K04707M27262K33219j31378k39488m2884J17803K5043j54198
44332F2367j76355o0550J2379j5323m7594q747P6148J37011J16834J0059j11437
$$ plain form
44406 31408 39450 63812 140456 252048 299619 254943 232333 314085 397752 330884 136253
44395 136253 -11184 -1804 107775 191359 175776 90683 62158 218130 517313 708171 566592
44384 566592 170827 -164862 -244964 -176324 -165411 -252725 -341784 -403571 -504218 -635814 -664136
44373 -664136 -516004 -327129 -298295 -437783 -552598 -503526 -367877 -301111 -323346 -334873
44363 -334873 -298350 -286123 -325715 -302311 -96227 222762 423627 349609 75029 -190838
44353 -190838 -310271 -294393 -219150 -134883 -56795 22648 131060 263230 310141 136737 -195293
44342 -195293 -377719 -173012 254250 487469 356091 116603 73719 191522 216565 62367
44332 62367 -113988 -174538 -162159 -177482 -225076 -233823 -157675 -20664 96170 106229 -5208
44321e208j58311j30652r4337n0737M7825J37193P0379j18176j65493O0693L20416
44310h6408L12487J00279q901O1931P4467j17831l27204k98945n0481J79154K16409
44299E4957Q5548p8748j59246j27234m6264N395K8555Q2926J70672K04373J19730
44288C40664l2033j41355j56618j13838p3683n4465k3996M5786J20397J26518
44278C7377M6511m9851r1384p5059k1571O6878J50539J37239J1801r6695q8984
44267B6801n9028j33818k19070j15088J26674K10206L2328j23559Q982K67604
44257B2032K79130p428k52934j92841N0258J90570J41790K8451n6098j37740k24309
44246a59119k30841j04945O1932J33346R4656L9529K1695K1057M4978J30765K13034
$$ plain form
44321 -5208 -163519 -294171 -388508 -439245 -391420 -254227 -183848 -302024 -467517 -406824 -86408
44310 -86408 226079 326358 317457 379388 453855 336024 8820 -290125 -340606 -161452 54957
44299 54957 140505 61757 -97489 -224723 -270987 -265592 -237037 -154111 16561 220934 340664
44288 340664 308631 167276 10658 -103180 -176863 -231328 -255324 -209538 -89141 37377
44278 37377 83888 34037 -57347 -132406 -153977 -87099 63440 200679 212480 115785 26801
44267 26801 -32227 -166045 -385115 -500203 -373529 -163323 -130995 -254554 -245572 22032
44257 22032 301162 293734 40800 -152041 -101783 88787 230577 259028 202930 65190 -159119
44246 -159119 -389960 -494905 -432973 -299627 -204971 -165442 -143747 -122690 -77712 53053 266087
44235B66087J33855j19970l13595k35605J5311J69306J41129O6220K7835l1619
44225A18954j14945j14563k5870q691j20564j73067r703K20503K53002P5082q8477
44214A1661j06327o8629q5810j24281q6603M9667K12061K91069K16060L4679r9706
44203B43841q9505j6761k3958j01799j07195J0173J20574R4843j9023o3922K4167
44192G1435J33468R5119j20140l27980k97413k1696K37694K42672N6212o4770
44182D601n169J05894J11521M950j30798k26166k16480n6188J72061K61780J08724
44171A34730j21459j63986K3565K11923J85622r079j49976j17756j2952O722o7629
44160h0275j11843n7839K1002L5714J3913M4330J35593K00456J64465L8831j01867
$$ plain form
44235 266087 399942 279972 -33623 -269228 -253917 -84611 56518 122738 150573 118954
44225 118954 4009 -110554 -136424 -145115 -265679 -438746 -448449 -227946 25056 100138 11661
44214 11661 -94666 -163295 -249105 -373386 -459989 -410322 -198261 92808 308868 343547 243841
44203 243841 154336 137575 113617 11818 -95377 -85204 35370 130213 111190 47268 71435
44192 71435 204903 300022 179882 -148098 -445511 -467207 -229513 13159 69371 4601
44182 4601 -568 105326 216847 221797 90999 -135167 -351647 -407835 -235774 26006 134730
44171 134730 13271 -150715 -127150 84773 270395 261316 111340 -6416 -19368 -12646 -80275
44160 -80275 -192118 -249957 -228955 -193241 -179328 -134998 595 201051 365516 404347 302480
44149C02480j76695j52565p1074K343N9960J21731J29713J341j72416j57665P6389
44138c6458K23533M9740k22063k10159M8841J61046o602j44168k3198J56327J31195
44127A28034j4843o0333l7600j20578k59074k23171K6123K50444K31354p38k34261
44116c14643k70031q1023J43430J78775M3245k9328N0214R4771j5293j04264k1717
44105c25864N4285p7374k44308j63753O0251J05796j0761M802J54047J25637j08046
44094d25288j74051P6156K97489K28247R6182J54741K13551P455k83961l11337
44084a20816j29344o4013j51176j39422J5782Q3506n629l5170J10562K57105K41198
44073F2583J32823L9904p4142k37526l22572k11540M407J26450Q2430k9377p6314
$$ plain form
44149 302480 125785 -26780 -97854 -95511 -35551 86180 215893 217234 44818 -112847 -36458
44138 -36458 187075 236815 14752 -195407 -146566 14480 7878 -136290 -159488 -3161 128034
44127 128034 113191 52858 15258 -105320 -364394 -587565 -561442 -310998 -79644 -80382 -314643
44116 -314643 -584674 -665697 -522267 -343492 -300247 -329575 -279361 -184590 -199883 -304147 -325864
44105 -325864 -271579 -348953 -593261 -757014 -696763 -590967 -601728 -596926 -442879 -317242 -425288
44094 -425288 -599339 -523183 -225694 2553 98735 253476 467027 474482 190521 -120816
44084 -120816 -250160 -314173 -465349 -604771 -588989 -505483 -511112 -546282 -435720 -178615 62583
44073 62583 195406 235310 161168 -76358 -398930 -610470 -606063 -479613 -397183 -426560 -502874
44062e02874q502J13326J66077Q1673o5949j36773q8129n064K7061J0768o133
44051d14519O431N3845J21962J77031J88551J47583N3462p7281j74543j56144
44041g3622m1306N1253N8062L7192L8181J7158n3875j10078j03446p2496l4826
44030b87803M2773R6215j3362k16287k14677P2574K99716J82849n3407n3127P8248
44019f6288o331k39402k15229J10440L15524J80044k3804m7833j8557p4845p6269
44008a62550P2057J68771P0012k8776M2209Q3253j21061l64871l08547j4252J74593
43997c89162J53823J00250Q8534K3683q0849q5670O807M4845J136K600O8814O3312
43985a877n0148j19084l9443Q6232J00102j5381j40632j44902o380J38993J17929
$$ plain form
44062 -502874 -511376 -398050 -231973 -150300 -216249 -353022 -441151 -446215 -419154 -408386 -414519
44051 -414519 -408088 -354243 -232281 -55250 133301 280884 334346 257065 82522 -73622
44041 -73622 -114928 -63675 -5613 31579 69760 86918 33043 -77035 -180481 -252977 -287803
44030 -287803 -245030 -148815 -162177 -378464 -593141 -520567 -220851 -38002 -91409 -144536 -66288
44019 -66288 -72619 -312021 -527250 -416810 -101286 78758 54954 7121 -11436 -86281 -162550
44008 -162550 -90493 78278 148290 119514 161723 244976 123915 -240956 -549503 -563755 -389162
43997 -389162 -235339 -135089 -46555 -22872 -103721 -189391 -182584 -137739 -136603 -134003 -65189 -1877
43985 -1877 -52025 -171109 -210552 -124320 -24218 -39599 -180231 -325133 -331513 -192520 -74591
43974g4591m9161j35733k1211J17688P4262o8492q9778R482M4356k1086l7429
43963b51693M5555J00778N4191j7437n3584q8679j27030j05371j7455O2619R8228
43952b99878J07249P8296N238l5489K334O822j14761k05170n8471J92277J96712
43941a24841q0805k73229j46080Q8715J45231O8002N3727R5854O1725j9432j323
43930a32456J10146J49579M3248r4844j29470n5374L3899O1135L6489L1078O8383
43919A21813O9098k8881j32001r6486L9771Q9488J827o2716m118N6050o705j07945
43907f0805j05727l1402r629m7132o3320n7148p8160p9074L2443K01770K42483
43896e5701P8697j40974k20470j31019P73O6956P5172P6779O1779j3861j09066
$$ plain form
43974 -74591 -123752 -259485 -280696 -163008 -88746 -157238 -247016 -237534 -193178 -214264 -251693
43963 -251693 -206138 -105360 -51169 -68606 -122190 -210869 -337899 -443270 -460725 -398106 -299878
43952 -299878 -192629 -114333 -109095 -144584 -142250 -135428 -250189 -455359 -513830 -321553 -124841
43941 -124841 -205646 -478875 -624955 -536240 -391009 -323007 -269280 -173426 -111701 -131133 -132456
43930 -132456 -22310 127269 170517 75673 -53797 -109171 -75272 -14137 22352 53430 121813
43919 121813 190911 162030 30029 -66457 -26686 62802 64629 1913 -2205 53845 47140 -60805
43907 -60805 -166532 -197934 -207563 -254695 -318015 -375163 -453323 -532397 -499954 -298184 -55701
43896 -55701 22996 -117978 -338448 -469467 -468694 -401738 -326566 -249787 -188008 -201869 -310935
43885c10935r8559N4093K03416J91784N0016p8564j48076j97308j82301k3556
43875e39990J77630J88063k5399k03081j28548J01981K48728K21106R1748m6075
43865H6163j14750o4682L3190K1384j07375j41934L9506K31686J62228j08965
43855C6451k66574j72277l180N0450K1617L3106Q7501J03433P7294R3207J80823
43844B41851K40005J44606r5573l13224l42252j76348M9224J92584J82443K5659
43834A48975j69648k26960q5564O8815M681k19535k87990m4516K83125L66319
43824a62298J61206q5792j32516L8462K31247K22317o679k19227j91887k48R8098
43813d7317K4146p4532j10154j35094j21349M1456K53488K30563m2373k08338
$$ plain form
43885 -310935 -409494 -355401 -151985 39799 89815 11251 -136825 -334133 -516434 -539990
43875 -539990 -362360 -174297 -199696 -402777 -531325 -429344 -180616 40490 132238 86163
43865 86163 -28587 -93269 -60079 -38695 -146070 -288004 -248498 -16812 145416 36451
43855 36451 -230123 -402400 -405580 -355130 -333513 -300407 -212906 -109473 -32179 61028 241851
43844 241851 481856 626462 530889 217665 -124587 -300935 -251711 -59127 123316 148975
43834 148975 -20673 -247633 -333197 -264382 -259701 -479236 -767226 -811742 -528617 -162298
43824 -162298 -1092 -86884 -219400 -180938 50309 272626 265947 46720 -145167 -145415 -47317
43813 -47317 -23171 -97703 -207857 -342951 -464300 -422844 -169356 61207 18834 -189504
43803a89504p4983Q0616l295j21146J9045K54781K37380K8811m0213K8418n4644
43792A65266k69577k59588M1437K49964J48213P250P9062J70957K1860k19255
43782A35589k37842n8966M3854J3582L7148J53881J65078j1545j61494p5026J38175
43771A42434J87938j4391k48152k58619m4579J71246K02843O8454p8844j11884
43761A6446j3536J25606J67914N3434j11918j63175q3558m557J4521N4917J30537
43750A86631R9806q2413j97996m7566K20665K83571P6464j56531k07339j01890
43740G3402K8163R1761O0407j2130j6477M8108K2212j49859k38302m5995K12298
43729G3588J67382j24137k24652K6233K74864K04476j9373o9093M6403P1248p2006
$$ plain form
43803 -189504 -264487 -183871 -187166 -308312 -289267 -34486 202894 231705 191492 219910 165266
43792 165266 -104311 -363899 -322462 -72498 75715 82965 162027 332984 354844 135589
43782 135589 -102253 -161219 -117365 -103783 -66635 87246 252324 240779 79285 4259 142434
43771 142434 330372 315981 67829 -190790 -235369 -64123 138720 207174 128330 16446
43761 16446 2910 128516 296430 349864 237946 74771 -8787 -13344 1177 56094 186631
43750 186631 286437 204024 6028 -41538 179127 462698 539162 382631 175292 73402
43740 73402 101565 193326 253733 241603 225126 273234 295446 145587 -92715 -138710 73588
43729 73588 240970 116833 -107819 -81586 193278 397754 378381 309288 355691 426939 354933
43718C54933k09892k01943q5708M1337J24698J33055N3233o4341j17372m7564
43708a9564P8161J09096j8995j63480j26873M5500Q0558j16424k68546j28573
43698e29140J16998J27727m8348o7064J37239K55763J13949r2551j60036j37854
43688b83317j07443j6381J19213J37004J5244l4230P3776J19802m1577j92311
43678b10220q3709J60805K39233J06069l6673o5767k9919K23n603n5515r1155
43667g2231j8905J26028J82662J07479L2022l017j30585l46609l88361j21553
43657f33070J98847K85155K04546J59681J11960o9772k65384k42306l1903J28201
43647a54045J44239R9839L5848m8089o8345J7866O7676k3448q6684N4478K27023
$$ plain form
43718 354933 145041 -56902 -142610 -101273 23425 156480 209713 145372 28000 -19564
43708 -19564 58597 167693 148698 -14782 -141655 -96155 -15597 -132021 -400567 -529140
43698 -529140 -412142 -284415 -332763 -399827 -262588 -6825 107124 14573 -145463 -283317
43688 -283317 -390760 -407141 -287928 -150924 -135680 -169910 -96134 23668 -17909 -210220
43678 -210220 -293929 -133124 106109 212178 175505 109738 79819 80042 74439 18924 -72231
43667 -72231 -91136 34892 217554 325033 357055 354038 223453 -123156 -511517 -633070
43657 -633070 -434223 -149068 55478 215159 327119 257347 -8037 -250343 -282246 -154045
43647 -154045 -9806 90033 125881 77792 9447 27313 94989 71541 -15143 39335 266358
43636B66358J47490r3581j53603J5906J24631L9887m2715K4184J24948J26726
43626E80231O1710j6637j18560j99019j76208j04291j06374j28616j2943J78682
43616d2025K00552K2413j04586n1901J3218l6673p0183L4132J47844R9251o5594
43605A46448j87647k13687j83281j25827o5531j2954R0550K74707L83540K29073
43595C35391p8719k16359j15521m8677j42003j41044J28322L75597K34010j73522
43585A57475l93290k55259j0365J02425J24995J79876K44234K21773J01185m1420
43575D31629j31434j47931j26616j17032j15926p3492J2736P0472N8811L5791
43565a02992O8507J34382J58916R7297m7609k12256k58821q9183J79900K81882
$$ plain form
43636 266358 413848 320267 166664 182570 307201 347088 304373 328557 453505 580231
43626 580231 641941 625304 506744 307725 131517 27226 -79148 -207764 -220707 -42025
43616 -42025 158527 180940 76354 24453 37671 998 -69185 -35053 112791 212042 146448
43605 146448 -41199 -254886 -438167 -563994 -629525 -642479 -551929 -277222 106318 335391
43595 335391 256672 40313 -75208 -123885 -265888 -406932 -278610 96987 330997 157475
43585 157475 -235815 -491074 -501439 -399014 -274019 -94143 150091 371864 473049 431629
43575 431629 300195 152264 25648 -91384 -207310 -280802 -268066 -197594 -138783 -102992
43565 -102992 -34485 99897 258813 356110 308501 96245 -162576 -251759 -71859 210023
43555B10023J20964q9632j08541K7408J05472N2701j0211Q997N4752M0823k9357
43544C83399r6118j22490j03639m5780K6444O1790J9711o8848j01985j6276J03840
43533D0048J01427l4877j26305n7009L7600k3215j62994j53834J4588J07853J6442
43522b40276q3731k8144R2880J20477P6160N8144L0617q9161k17999j80129K6477
43511d34685K03237K06515J00838K1667j2415q3018k10884k81235j61261J16287
43501e34954L31614K86649K5824j98795j88074J1370J74370J32751n1718j50131
43491a61094l5972J33857J12819o7116j06111J14326L14563K15637n5044j97455
43481B68410j91336k04219k01831m1494J28085R589k86711k99221O2114L15961
$$ plain form
43555 210023 330987 241355 132814 160222 265694 318395 308184 317181 371933 412756 383399
43544 383399 287281 164791 61152 15372 41816 103606 123317 54469 -47516 -63792 40048
43533 40048 141475 106598 -19707 -76716 -39116 -62331 -225325 -379159 -364571 -256718 -240276
43522 -240276 -324007 -352151 -259271 -138794 -62634 -4490 26127 -63034 -281033 -461162 -434685
43511 -434685 -231448 -24933 75905 97572 85157 2139 -208745 -489980 -651241 -534954
43501 -534954 -203340 83309 109133 -89662 -277736 -266366 -91996 40755 -10963 -161094
43491 -161094 -197066 -63209 49610 -17506 -123617 -9291 305272 520909 465865 268410
43481 268410 77074 -127145 -328976 -370470 -242385 -232796 -519507 -818728 -756614 -440653
43471d40653J40388j35675p8217J89301K56459Q3861l5981j1255k0533j09054
43461a61359r6802Q0642K37848K14394P6405j5166N611Q3828J10296J5599j38765
43450D12531k07213j40028k5049P6243J72339J81185l0709l39296l77943n4874
43440c32814K31637J57422l7805K6726K29067J79231q6963j73222r963O4795o1950
43429A86161j04245M3164P6118j45789k79817p2547J59188K1359k92915k88950
43419f98273O2611L08990K05960m750n1673M008j0982q1509r3462l8836K6594
43408c71322J04296J93202K07383R1301m9915p1432p72Q955p3737j09195k4665
43397i5901M3682m8157k10686k26616n3877J33258K06359K19612K31647J60104
$$ plain form
43471 -440653 -300265 -435940 -514157 -324856 -68397 15464 -20517 -31772 -52305 -161359
43461 -161359 -258161 -177519 60329 274723 351128 335962 341573 425401 535697 551296 412531
43450 412531 205318 65290 40241 116484 288823 470008 439299 100003 -277940 -332814
43440 -332814 -101177 56245 18440 45166 274233 453464 366501 193279 183316 248111 186161
43429 186161 81916 125080 201198 55409 -224408 -296955 -137767 -116408 -409323 -698273
43419 -698273 -635662 -326672 -120712 -125462 -177135 -173127 -184109 -265618 -359080 -397916 -371322
43408 -371322 -267026 -73824 133559 224860 174945 103513 102741 111696 37959 -71236 -95901
43397 -95901 -52219 -100376 -311062 -537678 -591555 -458297 -251938 -32326 199321 359425
43387C59425n5092k60553k38435j0279J71123J45303J8715k5665L2979Q7270Q4421
43376C09212O1948L4093l8827j40242j53686j0274J68201J80082M872j51015j17297
43365A47067K7194Q7771J8554o4009p9746n7676k6818K4330O4855K8223o6268
43354A03477j13854q0920n2179q2775j08682n3325O3129J61040J76603Q8037n1236
43343D9315j11428k0079J15121J32541M1295j9949j5562k5821m8879j482P6975
43332A72047M6742q0010j38724r1796n9579m6570O8639K18179J60710q0839j58657
43321A0142N9971K60251J99483P7646J08088J02199j37015l38392j41158K79044
43311D80259M34457K24943l6082j75009k76520l18382j54955J24864K36437J33959
$$ plain form
43387 359425 304333 43780 -194655 -204934 -33811 111492 130207 104542 137521 224791 309212
43376 309212 371160 405253 366426 226184 72498 62224 230425 410507 415379 264364 147067
43365 147067 174261 262032 280586 216577 136831 79155 52337 76667 141522 169745 103477
43354 103477 -10377 -91297 -143476 -226251 -334933 -388258 -325129 -164089 12514 100551 49315
43343 49315 -62113 -82192 32929 165470 206765 186816 171254 145433 96554 95072 172047
43332 172047 218789 138779 55 -91741 -151320 -197890 -129251 88928 249638 168799 10142
43321 10142 70113 330364 529847 607493 715581 817780 680765 342373 201215 480259
43311 480259 914716 1139659 1103577 928568 652048 333666 178711 303575 540012 673971
43301F73971M7410O5008L4757q6576j36140n0486M4532Q8821J38033J52834N6024
43290A028188n796J87676N10339O01518M23432K94646L24718K93238K03483M18737
43280D280179J006658J498676J710134K278178L691902N014098M398416J179228
43272B5057469l002263n561084n352238l470354j801990j165180j034644p35988
43264B933728l31324k10982l35879l50631k15225k10530l56328l13588L4562L28055
43254I71858K46885m5282j94610j37930n5041k8173Q563P5308R7505K5109j01653
43243H62539j85195j46887k5354K6727o0258j37947n1171Q8037N0490j33385k03766
43232H3830p6604N1942M9048L0145J16433K37055K79945K65630K81719L71223
$$ plain form
43301 673971 721381 786389 821146 734570 598430 547944 592476 681297 819330 972164 1028188
43290 1028188 1022392 1210068 1720407 2321925 2745357 3040003 3364721 3657959 3861442 4280179
43280 4280179 5286837 6785513 8495647 10773825 14465727 19479825 23878241 25057469
43272 25057469 22055206 16494122 11141884 7671530 5869540 4704360 3669716 2933728
43264 2933728 2602404 2391422 2055543 1704912 1489687 1279157 922829 609241 643803 971858
43254 971858 1218743 1173461 978851 840921 785880 757707 766270 841578 939083 964192 862539
43243 862539 677344 530457 505103 531830 471572 333625 282454 370491 420981 287596 83830
43232 83830 7226 59168 108216 138361 254794 491849 771794 1037424 1319143 1690366
43222A690366N18433O24837N24742J81816j64545k07689J17950O47996J161170
43213E095076J433013J433815J690497K928358M780126N342634L012294j296978
43205B4418835m736732n498828m348386l011049k118998j364211p25502n03972
43197B111157n54926m14003p0832P2844o4784j51613m2470M7813j6125j05177
43187H11884j05780n0166L1407J18715J13545j4091r2775o229N8579j05161l40727
43176D19201l35533q8400J45600K74081M07922N51042N72417M88389N13592P87736
43166C736047J185188J372707J002260J3221j136142j742587j545102r72130n67920
43157A345542m13588k98344j74633j43198j78662j61476o9171N5165J79957K07949
$$ plain form
43222 1690366 2208799 2833636 3358378 3540194 3375649 3167960 3285910 3933906 5095076
43213 5095076 6528089 7961904 9652401 12580759 17360885 22703519 25715813 24418835
43205 24418835 19682103 14183275 9834889 6823840 4704842 3340631 2615129 2111157
43197 2111157 1556231 1142228 1071396 1144240 1079456 927843 885373 933186 917061 811884
43187 811884 706104 655938 687345 806060 919605 905514 812739 806510 865089 759928 419201
43176 419201 83668 -4732 140868 414949 822871 1373913 1946330 2434719 2948311 3736047
43166 3736047 4921235 6293942 7296202 7309423 6173281 4430694 2885592 1913462 1345542
43157 1345542 931954 633610 458977 315779 137117 -24359 -93530 -38365 141592 349541
43147C49541M8850j26960l0131K24751J64162k66130m69986r3502L58557K78525
43137D37677j23748k36210j3799J13206L8823K2491Q7116J8187j18096n3597J32303
43126C04353J07397r7909j22026Q2710J77209M3574m9477M1130J31146J09520
43116G27627J09296J87983K38007L07338O25590J181958J583354J453591P74756
43107G189500j70331r79876j316439j162735q49162o41670m57635j92129l8484
43098A381039j46206k56874j15522L3874j32545l72345k45020Q5793Q7262k26562
43088I2894l13291j3509K43893K04542J06836J23051Q2023r3289j95934j32082
43078A05134m8645K5075K00043L42712J72599j92686l10317j08836J4622j15985
$$ plain form
43147 349541 398391 271431 241300 466051 630213 364083 -105903 -199405 159152 437677
43137 437677 313929 77719 63920 177126 215949 238440 325556 343743 225647 172050 304353
43126 304353 411750 313841 191815 274525 451734 495308 445831 486961 618107 727627
43116 727627 836923 1024906 1262913 1570251 2195841 3377799 4961153 6414744 7189500
43107 7189500 7019169 6039293 4722854 3560119 2710957 2069287 1611652 1419523 1381039
43098 1381039 1234833 977959 862437 896311 763766 391421 146401 232194 319456 92894
43088 92894 -220397 -233906 9987 214529 321365 444416 526439 433150 237216 105134
43078 105134 56489 81564 281607 624319 796918 604232 293915 185079 199701 83716
43068H3716k11333q7839N0560N9457Q0552J58069J08478o5195r3391O8665J23827
43057B75566l7619j36805L873J87817K11387J18094k1923k01592k79021r5127
43047B4650J66314J58452p0542j49132o266P4262J9824M8045J58866J08510o4872
43036D68111n1541J45350K00300Q2279J04691L23351M69092M91115N50798M95172
43026C278718L2479n63358o75668l19485j20383k59090k66215J4892J30682j08428
43016A144144k85498j54658R234M8612J40268K05954p2275m82077m02129J23305
43006B74880L51025P6244q3279J22501J61834j70769l11782j8996J45720j02406
42996D44972k31110O7273K98751J43552J6112J49306J32657j40048j23846K63754
$$ plain form
43068 83716 -127617 -215456 -164896 -105439 -24887 133182 241660 176465 83074 151739 275566
43057 275566 237947 101142 105015 292832 504219 622313 600390 398798 119777 24650
43047 24650 190964 349416 278874 129742 123476 197738 217562 265607 424473 532983 468111
43036 468111 416570 561920 762220 844499 949190 1272541 1741633 2232748 2783546 3278718
43026 3278718 3311197 2747839 2072171 1752686 1632303 1373213 1106998 1121890 1252572 1144144
43016 1144144 858646 703988 713222 761834 902102 1108056 1035781 553704 151575 274880
43006 274880 625905 702149 618870 741371 903205 732436 420654 401658 547378 444972
42996 444972 213862 281135 579886 723438 739550 888856 1021513 881465 757619 1021373
42986A021373K98681k24605m85308o5401L04101R2090j51443J9708J19040j46639
42976G81597j78975K65852M11609r4325l83139P4233M57218J27173k13827N0210
42966A297626K68399j03958l63399L3014L43272K4944j41397L51226N96659M1440
42956B347826k89938K59100N91157n9289n43154L5583N60675J17292j54733O06882
42946C471401J071091L01316j79474O97857J242124K94079j41274J337511K408262
42937A0502893J333670P74359K935907M938721M376336M983302J0043866J5419722
42929E5308776J8450048K7973526N0685471O9422242N4209487J899915n1150542
42922B26798923o7635094m9327473k6461090j7498854j5954672j1824154o967323
$$ plain form
42986 1021373 1320054 1095449 610141 544740 848841 940931 789488 809196 928236 781597
42976 781597 602622 868474 1280083 1185758 802619 876852 1334070 1461243 1247416 1297626
42966 1297626 1566025 1462067 1098668 1131682 1474954 1499898 1358501 1709727 2306386 2347826
42956 2347826 2057888 2316988 2908145 2848856 2305702 2341285 2901960 3019252 2864519 3471401
42946 3471401 4542492 4843808 4664334 5362191 6604315 6898394 6757120 8094631 10502893
42937 10502893 11836563 12610922 15546829 20485550 24861886 29845188 39889054 55308776
42929 55308776 73758824 101732350 152417821 221840063 276049550 277949465 226798923
42922 226798923 159163829 109836356 83375266 65876412 49921740 38097586 31130263
42915C1130263n984127o295852m143465j610284j680774k504494j496856j93957
42907G220454p34736j627360q62540K47005j83931j044596n94478K39287j09810
42898B549295q16404m13121M06269K56246l86699l67754l6388k01151l61470J35365
42888G64188N43971O4019n66288m03701N1498J640j54986J18006K56726j99863
42878D75210m69577M8445N05776J15105l77707j16891K69512m6869m65749j35086
42868a97831L90956K20695j97100j9842L29744K8455m81552k79644L01962K85983
42858C81826k04548k91248N6242J53688o1320r9622K6875l3828j20930R8926L42523
42847B48584K08296j6128N6387J00941k17233m00907R017M13305J02714m37056
$$ plain form
42915 31130263 25146136 18850284 14706819 13096535 11415761 8911267 7414411 7220454
42907 7220454 6485718 4858358 3995818 4242823 4058892 3014296 2419818 2659105 2549295
42898 2549295 1732891 1319770 1726039 1982285 1595586 1227832 1191444 990293 628823 764188
42888 764188 1308159 1372178 805890 402189 453687 455327 300341 418347 675073 475210
42878 475210 5633 54078 559854 674959 297252 180361 449873 403004 -62745 -197831
42868 -197831 193125 413820 216720 196878 526622 555077 73525 -206119 95843 381826
42858 381826 177278 -113970 -57728 95960 34640 -64982 -38107 -71935 -192865 -93939 248584
42847 248584 456880 440752 497139 598080 380847 -20060 -11043 402262 504976 67920
42837F7920l31373J89918L12882Q5175R6563K26363j1726l13649o0163M31665
42827F93575M12299J04251K86043P63913O30069j15716n56385m15282l21303m96380
42817I85084m47268q8714K1544k27737k63800R0837L00716J13798n4970K2507
42807D51997K1375j94473k68309n4021Q8415n6295k35830k37034j47914j3847
42797f45936K12800L46648J57713j30404j08081J23249J35444n3488o8379P0412
42787C9978J7894j54482o2026J94631J32871k11039k91420o962J56492J8062n3745
42776b19746R2597J48798J8621j727J27415O9594j97830k67840m0623J03865K6662
42765a40214L5010J98751J63994j36110k64589k6511J98433J25198k2510j3106
$$ plain form
42837 67920 -263453 -73535 239347 324522 421085 647448 635722 322073 261910 693575
42827 693575 1105874 1210125 1496168 2260081 2890150 2774434 2218049 1802767 1481464 985084
42817 985084 537816 449102 470646 242909 -20891 69946 370662 484460 429490 451997
42807 451997 473372 278899 10590 -43431 44984 -11311 -247141 -484175 -632089 -645936
42797 -645936 -433136 -86488 71225 -59179 -167260 -44011 91433 37945 -30434 39978
42787 39978 57872 -96610 -158636 35995 168866 -42173 -333593 -340555 -184063 -166001 -219746
42776 -219746 -127149 21649 40270 38543 165958 235552 37722 -230118 -270741 -166876 -140214
42765 -140214 -105204 93547 257541 121431 -143158 -169669 28764 153962 131452 118346
42755A18346L2286Q485L2519Q9863j3864k02453j63058N6814O2715j68000k05982
42744c52329N5211J99134M1375p4064N0524J42960M9821J0961R7287J5715k55898
42733a9303k88802L8339K45308N5053j36723K2812K57308K07965K2322k8226k9067
42722C46986j15150j37807j1147M7529m7654l8799J45967J60959j23622k92489
42712f5227p2538J78160Q8689j23883j19586k1575o8038j21113L252J20341M2789
42701a58729l3530O3777J07699o8304j78344r453J21686o1711k35984m4485K24894
42690b72484J48686o2166K0684K23093J04180j78826j28045J62185J38570k18357
42680f2480l34580k5073K18542Q5833q5761L2941K09742R9626j70902k33546l4150
$$ plain form
42755 118346 150632 159117 191636 281499 267635 65182 -97876 -41062 21653 -146347 -352329
42744 -352329 -297118 -97984 -56609 -130673 -80149 62811 112632 123593 220880 236595 -19303
42733 -19303 -308105 -269766 -24458 30595 -106128 -83316 173992 381957 404279 376053 346986
42722 346986 231836 94029 82882 130411 82757 43958 189925 350884 227262 -65227
42712 -65227 -137765 40395 129084 5201 -114385 -135960 -203998 -325111 -321859 -201518 -158729
42701 -158729 -192259 -128482 -20783 -89087 -267431 -276884 -155198 -216909 -452893 -497378 -272484
42690 -272484 -123798 -185964 -165280 57813 161993 -16833 -144878 17307 155877 -62480
42680 -62480 -397060 -422133 -203591 -117758 -203519 -170578 39164 138790 -32112 -265658 -299808
42669b99808J58170J55984K6478p3286o7462J6933J08809J54375J31300L1677
42659C43170j06454j65415n8151J20341J83401R7873j5431j04841k00643k29338
42649a35488q8653R3362Q7200m2201k9492R0153J6087k26688k48579J9553J64485
42638c00261K5937q596K42753L35094k2105l53253j58719K34530K17955j02468
42628A10867j58021J13639K56287R4009j03110j66432j79011j50406l4822K4230
42618a92770p9537j02665J63673M05209K20802j57253j89952Q2184J43737r9959
42608A93469k28002r2830p806p9226k4474K05198K53547N841j67722l9401J24737
42597A43331P7461k3676O139M6974k5096q7473n8903q3454k06589k13342j3145
$$ plain form
42669 -299808 -141638 14346 40824 -32462 -99924 -82991 25818 180193 311493 343170
42659 343170 236716 71301 13150 133491 316892 414765 399334 294493 93850 -135488
42649 -135488 -224141 -130779 -43579 -85780 -115272 -25119 -9032 -235720 -484299 -464746 -300261
42638 -300261 -274324 -282920 -40167 294927 272822 -80431 -239150 -4620 213335 110867
42628 110867 -47154 66485 322772 416781 313671 147239 -31772 -182178 -217000 -192770
42618 -192770 -272307 -374972 -211299 193910 414712 257459 67507 149691 293428 193469
42608 193469 -34533 -127363 -135169 -214395 -238869 -33671 219876 225717 57995 18594 143331
42597 143331 220792 197116 203255 250229 225133 137660 78757 -4697 -211286 -424628 -437773
42586d37773J43368O3474p3876l6907R5560J20176L2988l9448m7914m456O8361
42575a16447P6591n7644j93369j05747J25330J63608o2768k16116n8963K06128
42565b39397K78382J62712M9553K6223P0092J22262N4604k09210m57628l58160
42555e00567L7554K72827J13675j32413j14561P4938J61294J36592J46139J54833
42545C50311M3779j14074j59629j13049q8062n7029N4921J42787M4406j64175
42535e9814k33715r3486N9165L9976j02413j83443j02879O4844J56986R2058l7425
42524d00146o6301N3169K09730K71715K07537Q1837o707n963K2753k5260j18632
42513B23732r9875M8651J23574K4961m7296N9441J30015p3240l35594k68368N4244
$$ plain form
42586 -437773 -294405 -230931 -304807 -341714 -246154 -125978 -92990 -132438 -180352 -184808 -116447
42575 -116447 -39856 -97500 -290869 -396616 -271286 -107678 -170446 -386562 -445525 -239397
42565 -239397 38985 201697 251250 277473 347565 469827 524431 315221 -142407 -500567
42555 -500567 -463013 -190186 -76511 -208924 -323485 -248547 -87253 49339 195478 350311
42545 350311 394090 280016 120387 7338 -80724 -137753 -82832 59955 104361 -59814
42535 -59814 -293529 -387015 -327850 -287874 -390287 -573730 -676609 -611765 -454779 -362721 -400146
42524 -400146 -466447 -413278 -203548 68167 275704 357541 350834 344871 367624 342364 223732
42513 223732 123857 172508 296082 321043 273747 333188 463203 389963 54369 -213999 -159755
42502a59755J91520K8568j04060l3963J6318r0466j51025k8579Q9056M3457l8652
42491b37581m0311o1112j31514o7425J69551L02609J68679m644L104N6594j0709
42480A47241m6888J14936K80896J79853r0674k36822k02529j20651j7830J11983
42470A19515J16570r4671k87000j93417N3124J16651k2040r4222j8129J8627n8677
42459c43669q6021L2604J65124J66911N5719o9603j21531l2965J61340K66062
42449A93971J21410j50584k68141j58125l0787o3771j71039j51703L2873K09441
42439d36455K01613M8907l0146P0973J72019N2469j87508k23071L4778L10279
42429A3858L46514J81565k9026k09795k85826j75620N113N185j52658j27645J90023
$$ plain form
42502 -159755 31765 60333 -43727 -77690 -61372 -151838 -302863 -331442 -242386 -198929 -237581
42491 -237581 -277892 -339004 -470518 -537943 -368392 -65783 102896 98252 101356 157950 147241
42480 147241 100353 215289 496185 676038 585364 348542 146013 25362 7532 119515
42470 119515 236085 141414 -145586 -339003 -285879 -169228 -191268 -285490 -303619 -284992 -343669
42459 -343669 -429690 -397086 -231962 -65051 -9332 -78935 -200466 -233431 -72091 193971
42449 193971 315381 164797 -103344 -261469 -292256 -356027 -527066 -678769 -645896 -436455
42439 -436455 -234842 -185935 -216081 -145108 26911 79380 -108128 -331199 -296421 13858
42429 13858 360372 541937 512911 303116 17290 -158330 -153217 -148032 -300690 -428335 -238312
42418b38312M21259K52381p1980j41714R369O5021k6077p1704m5004o8991j05778
42407b1530m2136J5839q9059k02119o3682J97085K04925n3634k03066q0369P1498
42396b66248Q1631R1418J82236J65041n3808k27602j26847J06956J91288R5760
42386B39825k81K697N6338P8929O465j66932l03811k09388R0979K95743J83123
42375B73687q4046j60588L4112K24521J41891j37999k93501j60166O3332Q1375
42365a7382r8101j89549n8104R0886N1224o5750l9720R6189J38705N5551m462
42354d0513J4499K8752J5159L7248Q3801Q2760O0724R3190J20835K6161j22424
42343D00192j28493J8761J07255J4314j39565j93758j32280k4406O6940Q4514
$$ plain form
42418 -238312 182947 435328 363348 221634 231003 296024 269947 198243 153239 84248 -21530
42407 -21530 -63666 -47827 -136886 -339005 -402687 -205602 -677 -54311 -257377 -337746 -266248
42396 -266248 -184617 -93199 89037 254078 200270 -27332 -154179 -47223 144065 239825
42386 239825 239544 242241 298579 377508 383973 217041 -86770 -296158 -205179 90564 273687
42375 273687 189641 29053 63165 287686 429577 291578 -1923 -162089 -98757 -17382
42365 -17382 -115483 -305032 -363136 -272250 -221026 -286776 -326496 -230307 -91602 -36051 -40513
42354 -40513 -26014 2738 17897 55145 138946 221706 282430 375620 496455 522616 400192
42343 400192 271699 290460 397715 412029 272464 78706 -53574 -77980 -11040 73474
42333G3474J7467m4118j5369M2848J9372n6643p3759l2575r267J4493Q9309J27292
42321A52524J8445j26960r5546R0130J92673J12866j7534q9943j18816q7204M9531
42310H0166J87912J58092M120o7121k7247m1339j24996r9751M7326Q2876p7801
42299A22237j95200p9766J18613J68215Q6915M3100R2918J61608J54291j602k77134
42288C94195m59238l38536k3844J52307Q8726J7350Q4564J34000L8505n0763J8661
42277E5927J27216J03577J0602n778K1115j9089q9115p9445j965N2733N6992K6209
42265B58979l5648q1293l7534N7040Q4498N7238R1644J38955J8749k03188k01807
42254A47633Q7957K79638R5669j97474k10570j2425O0625l6289p3068M979K1176
$$ plain form
42333 73474 90941 46823 31454 74302 93674 37031 -36728 -69303 -78570 -64077 25232 152524
42321 152524 170969 44009 -51537 38593 231266 344132 326598 236655 117839 30635 80166
42310 80166 268078 426170 430290 363169 335922 294583 169587 69836 117162 200038 122237
42299 122237 -72963 -152729 -34116 134099 221014 264114 357032 518640 672931 671329 394195
42288 394195 -65043 -403579 -427423 -275116 -186390 -169040 -84476 49524 88029 37266 55927
42277 55927 183143 286720 297322 291544 312659 293570 204455 125010 123045 175778 232770 258979
42265 258979 223331 142038 104504 161544 246042 303280 394924 533879 552628 349440 147633
42254 147633 235590 515228 610897 413423 202853 190428 251053 214764 141696 146675 167851
42243A67851p8019j36657o6384M2501R9909J09096Q4099L1494j0485l5317j01396
42232A06692j94854j84552m4254M2580l0030p9053P2639K63279K21825n776j46513
42221B1983j13849m1440J4647J03248J53549K9433j88185k45663o9662J49871
42211a86068K38594J89983N2006j15272j76505m1619J45973J54818m703j11476
42201A45731q1755m5801o9962n8092K0857M2808n7868j78674k17170j77066o9428
42190g46420J08370K62431K66058J68364J33630J41104o676k99845m16015j58849
42180e47848K20683L44655J86709J4226k8091l5548r0720j31291j08586r0144
42170b65955j15024q0168J02792L08992L09160Q1602j26197j12404K7380P8190
$$ plain form
42243 167851 89832 -46825 -113209 -70708 29201 138297 222396 253890 243405 208088 106692
42232 106692 -88162 -272714 -316968 -274388 -304418 -383471 -310832 -47553 174272 168496 21983
42221 21983 -91866 -133306 -118659 -15411 138138 167571 -20614 -266277 -335939 -186068
42211 -186068 52526 242509 294515 179243 2738 -38881 107092 261910 257207 145731
42201 145731 63976 18175 -51787 -109879 -89022 -46214 -104082 -282756 -499926 -676992 -746420
42190 -746420 -638050 -375619 -109561 58803 192433 333537 326861 27016 -388999 -547848
42180 -547848 -327165 17490 204199 218425 190334 154786 64066 -67225 -175811 -265955
42170 -265955 -380979 -461147 -358355 -49363 259797 341399 215202 102798 130178 208368
42160B08368K4291N989K3127p4141k76391l47692j66981P7883J67057J26893Q6202
42149a45395M6696k1868l0935P0514J29405N84j87458k01179m3262R2607J25322
42138a64969J24315J11133M1947n1287q6327n5490J2950J21626J99066R4078j46313
42127B00729k08409K6602J90774n1734m13629l65318M1303K56594R4804n1520
42117b79804O9100J90212O3989j17424j11425l1234n6318o9525R0293K73360K44241
42106B65465P4326Q521P5630R7756q290j58220k49298k16209l4921J89034K52218
42095B96012J02995o9022j06026q0299r3978p8141L2724J11685L6679p5671n5634
42084B1324K8343m136j26281j49226l0542Q2629R6198O5533N5496O1332O9595
$$ plain form
42160 208368 232659 238648 261775 187634 -88757 -436449 -603430 -525547 -358490 -231597 -145395
42149 -145395 -98699 -120567 -151502 -80988 48417 49001 -138457 -339636 -382898 -290291 -164969
42138 -164969 -40654 70479 112426 61139 -25188 -80678 -67728 53898 252964 347042 200729
42127 200729 -7680 18922 209696 157962 -255667 -620985 -579682 -323088 -228284 -279804
42117 -279804 -210704 -20492 43497 -73927 -185352 -216586 -272904 -342429 -252136 21224 265465
42106 265465 339791 348312 423942 521698 513408 355188 105890 -110319 -145240 43794 296012
42095 296012 399007 329985 223959 143660 49682 -28459 4265 115950 152629 76958 21324
42084 21324 49667 45531 -80750 -229976 -260518 -177889 -81691 -16158 39338 100670 170265
42073A70265P4181M0573m4874j14203r7144k5767K4944N6790J20587K04878K30854
42062F41084J38795n5987k52225l03928j61285K0333K9654j24204k23799j54224
42052d45786l0124L4251Q4993J70991K18669J80233J34334J22796O1929o3119
42042D69167j05596l339P2007j9724j52594j49152n8883k4814l4096j2056j1631
42031c0711q5097j11571Q949J25760O1420n5090L1710K68905L38084J11217j99362
42020D64214l45549k71694m9216J99123L14749K36775J00586L6741m1018k27956
42010D16755l30115j00792K78956L38908j3373l34141k72056q213J18036J05685
42000A99650J44948K11332J32910n3879j26792l0924N3193J4659m8127n5458r8612
$$ plain form
42073 170265 244446 285019 240145 125942 28798 3031 27975 84765 205352 410230 641084
42062 641084 779879 723892 471667 167739 6454 26787 56441 -67763 -291562 -445786
42052 -445786 -475910 -441659 -356666 -185675 32994 213227 347561 470357 532286 469167
42042 469167 363571 360232 432239 412515 259921 110769 51886 27072 -7024 -19080 -30711
42031 -30711 -115808 -227379 -218430 -92670 -31250 -86340 -54630 214275 552359 663576 464214
42020 464214 118665 -153029 -202245 -3122 311627 548402 648988 685729 644711 416755
42010 416755 86640 -14152 264804 603712 590339 256198 -15858 -24071 93965 199650
42000 199650 344598 555930 688840 634961 508169 477245 530438 545097 496970 441512 342900
41989C42900k36838l11734j53479J18088K12296P2151n8402j8351M7627k3479
41979i221j19376n8606P6734Q3352q06J9554J19117R5844l1564m3487L8961n2819
41967A17683l04209l22948L6090L82311L84982K45098K55605L00005J90547J25304
41957A410468L15666M73277K29304j66531j71188J67089K73823m4881l74112m10612
41947A702303l29512l19451k82594j55885o7037k0923J34410L06940J91661j56977
41937A002935k81085m1761J24452o4386k53221n7057K89403L18226L4721j87284
41927H84943j70952j4146J92090L78518M17379L22339L16242M26600K97832k47241
41917B803604p53632o89632k36075k4991k20112l72903j73738J42660K33608J01802
$$ plain form
41989 342900 106062 -205672 -359151 -241063 -28767 43384 -15018 -33369 14258 -9221
41979 -9221 -128597 -187203 -110469 -27117 -27923 -8369 110748 206592 175028 131541 170502 117683
41967 117683 -186526 -509474 -473384 -91073 293909 539007 794612 1094617 1285164 1410468
41957 1410468 1726134 2199411 2428715 2262184 2090996 2258085 2531908 2487027 2112915 1702303
41947 1702303 1372791 1053340 770746 614861 547824 526901 661311 968251 1159912 1002935
41937 1002935 721850 680089 804541 740155 486934 429877 719280 1037506 1072227 884943
41927 884943 713991 699845 891935 1270453 1687832 2010171 2326413 2753013 3050845 2803604
41917 2803604 2049972 1360340 1124265 1099274 879162 506259 332521 475181 708789 810591
41907H10591k9788l3979M7412Q7797j0j12174p382L41027O06589N46163L76681
41896B632927L96611M29508Q9776n03253p87030n50925j80515j7274M4039J50660
41886A704524J52191n7927k38853j63521J093o093r9117m2613R2011L2495k20146
41875A154044l62913k27789K9044J96799K38700K09485J34934L6708n1558j32594
41865A224860k13684k30270j18092M4283R9601L0252k3052J7997P8438J03001
41855A013334J52038K30316J88518l7190k15711q3777K31985L20422N3079k20216
41845A632798j73763L8404N3724j49074k63918j42187M2022J15726J10571Q7569
41835A351872K6162j8950R4020L15931L52833O1103l02742m10533k66477r8533
$$ plain form
41907 810591 780803 746824 794236 882033 882023 769849 762467 1103494 1710083 2256246 2632927
41896 2632927 3029538 3459046 3548822 3045569 2258539 1707614 1527099 1509825 1553864 1704524
41886 1704524 1856715 1798788 1559935 1396414 1397507 1391414 1292297 1249684 1341695 1374190 1154044
41875 1154044 791131 563342 592386 789185 1027885 1237370 1372304 1409012 1357454 1224860
41865 1224860 1011176 780906 662814 707097 806698 836950 813898 831895 910333 1013334
41855 1013334 1165372 1395688 1584206 1547016 1331305 1247528 1479513 1799935 1853014 1632798
41845 1632798 1459035 1497439 1551163 1402089 1138171 995984 1038006 1153732 1264303 1351872
41835 1351872 1378034 1359084 1453104 1769035 2121868 2182971 1880229 1469696 1203219 1104686
41825A104686j7438R838q64k0756M8921J93250J91263o0283k91363k09455L7418
41814I85217P8697j05863k06301j23169p9881j65186j68805J4783J83911J94596
41804F07999K06078L55367M56529K71152j05047l59812l54564k11500r7170o9255
41794F99777q0097l6831Q5643J63949O9385j03183j25676J6201Q4596l3739j52515
41783E87510j06059n568o460l3786M9299J62377J20722p4735k47368k66203j21225
41772E8504J13890K67161J58831j40248k88819r2277K02441K30368k313j79575
41762C27963j29437K0518Q9558L3420q4579j43054k9365J96316K88707J29718
41752F99765o3184m1222R1077N6354j30662j93349n7130M3444l5336j36982r1903
$$ plain form
41825 1104686 1087248 1097086 1096222 1075466 1124387 1317637 1508900 1448617 1157254 947799 985217
41814 985217 1063914 958051 751750 628581 548700 383514 214709 229492 413403 607999
41804 607999 814077 1169444 1625973 1897125 1792078 1432266 1077702 866202 769032 699777
41794 699777 619680 582849 668492 832441 901826 798643 672967 689168 773764 740025 587510
41783 587510 481451 475883 469423 435637 484936 647313 768035 693300 445932 179729 58504
41772 58504 172394 439555 598386 458138 169319 77042 279483 509851 507538 327963
41762 327963 198526 219044 308602 342022 257443 114389 85024 281340 570047 699765
41752 699765 636581 595359 686436 742790 612128 418779 361649 405093 369757 232775 140872
41741A40872L1487Q1021L7520k8527o4818k4887J06540K17987J55044m2547j43350
41730D66342k5739J72020K59555K00083N3751j21150k39403k18650j17973j02457
41720C26379j96995k25637p3978J41957K56100K50604J83393P4645k7689k2205
41710F86574Q3952J26887K1538r5694q9142l7129o3209r7197l381J53828J81961
41699H68988M2891j23736k17580k41446j85428l3575J20627J38691L2947m4094
41689C58285j1346P6183J65565K47241K51045Q9935j31310j33800J81574N20537
41679A613909M89737N7661m06651n45795l57788j09531l140o283J2682P4689P9706
41668H99196k1917j36599j45695n8959J2209N131l6182m3195P26P1481J34088
$$ plain form
41741 140872 172359 253380 290900 262373 197555 172668 279208 497195 652239 609692 466342
41730 466342 440603 612623 872178 1072261 1126012 1004862 765459 546809 428836 326379
41720 326379 129384 -96253 -170231 -28274 227826 478430 661823 736468 708779 686574
41710 686574 770526 897413 918951 823257 734115 696986 633777 536580 533199 687027 868988
41699 868988 911879 788143 570563 329117 143689 110114 230741 369432 402379 358285
41689 358285 346939 423122 588687 835928 1086973 1176908 1045598 911798 1093372 1613909
41679 1613909 2103646 2161307 1754656 1208861 851073 741542 738402 732119 744801 819490 899196
41668 899196 877279 740680 594985 536026 548235 553366 517184 473989 474715 546196 680284
41657F80284J43011O5324n9841j22330n6195N4899M9695j05902k43666j89782
41647B15497M00J10307O4337K1585J07719K06756J57070K7987J678N6108M723
41636I74167j65226k51257j74415j00810j27623r9873R9522K95717K66399P8394
41626G94995l8021k7620l415j559K3576K0974j05167k80196l04431j28449Q2310
41615C2997J66164J10353p943q8810m1534J17799K38650K32837K20809L19350
41605A300672L87075K14828j01412k55127j77908j05556j73559k41505j90696
41596F56812j10293p3943N051J52875K09595R2920k0280M1032J70228J62905K4664
41585A311566q3751r3636n1815R877Q1292J24616J22328Q9169j5564k32550m04657
$$ plain form
41657 680284 823295 888619 828778 706448 650253 705152 754847 648945 405279 215497
41647 215497 215897 326204 390541 412126 519845 726601 883671 911658 913336 969444 974167
41636 974167 808941 557684 383269 282459 154836 54963 154485 450202 716601 794995
41626 794995 756974 729354 725939 724380 747956 768930 663763 383567 79136 -49313 32997
41615 32997 199161 309514 301571 212761 171227 289026 527676 760513 981322 1300672
41605 1300672 1687747 1902575 1801163 1546036 1368128 1262572 1089013 847508 656812
41596 656812 546519 472576 477627 630502 840097 933017 912737 953769 1123997 1286902 1311566
41585 1311566 1227815 1134179 1082364 1092241 1173533 1298149 1420477 1509646 1494082 1261532 856875
41574H56875k71134J12339L11146Q1084k46138k25876O4730J99407N5672j00516
41564H37589j15998j24190j87212j50478L1034J45859O1231n9237m2353J8900
41554D15145k9844j11548n4087J00311J49327M4889n0039k3896L5486Q336o9277
41543D14803p9413j7798p34p4147j26124n5506N9439P5672J1235J863N9145O9555
41531C37990M8312J48633L33882L14526p788k87875j89330J16113K12848M9727
41521A077038o6921Q564J23676J74991K29175K97813L45731N14939R27701J235359
41511D868066Q59495j46423r51966r41657m27604l3085K07419O21865J070663
41502E126773R93881K81954m52462o36037l86090k10235l42578o05847p57135
$$ plain form
41574 856875 585741 698080 1009226 1090310 844172 618296 683026 882433 938105 837589
41564 837589 721591 597401 410189 259711 290745 436604 497835 438598 396245 415145
41554 415145 385301 273753 219666 319977 469304 514193 464154 440258 475744 484080 414803
41543 414803 335390 317592 316858 242711 116587 61081 120520 196192 207427 209290 268435 337990
41531 337990 386302 534935 868817 1183343 1175555 887680 698350 814463 1027311 1077038
41521 1077038 1010117 1018681 1142357 1317348 1546523 1844336 2190067 2705006 3632707 4868066
41511 4868066 5727561 5581138 4629172 3687515 3259911 3226826 3434245 4056110 5126773
41502 5126773 6120654 6402608 5950146 5314109 4928019 4717784 4375206 3769359 3012224
41493C012224p33724n99299m18245k30912r1011n9581j23352j52155l2744J47029
41483G18230J74685J6732j10369o0253L1140J932m8702M6307J86379J46108k3652
41472A078537n1794R9952J60373K19j38975k0305K23142K97797J60615J0791k9609
41461A790743j9050j3301L9105J84209L52159M02088K45293o0115l03582k66715
41451B350834M4623L42586L25586N732l11731l79009k39175p9551K7700J24796
41441B212391J77565O0971k19869m34146l65968q5950J29546J20012k3522j27923
41431A443107j29760q0207n0283o2721o4874K7534K03020L08924K27632N6369
41421A878741j7025J9677K5652k7243k0296N9351O1878n8116j44644j14174r4709
$$ plain form
41493 3012224 2278500 1679201 1260956 1030044 939033 879452 756100 603945 571201 718230
41483 718230 892915 909647 799278 739025 770165 772097 723395 769702 956081 1102189 1078537
41472 1078537 1026743 1126695 1287068 1287287 1148312 1128007 1351149 1648946 1809561 1820352 1790743
41461 1790743 1771693 1758392 1797497 1981706 2333865 2735953 2981246 2921131 2617549 2350834
41451 2350834 2395457 2738043 3063629 3069361 2757630 2378621 2139446 2059895 2087595 2212391
41441 2212391 2389956 2450927 2231058 1796912 1430944 1344994 1474540 1594552 1571030 1443107
41431 1443107 1313347 1233140 1182857 1120136 1055262 1082796 1285816 1594740 1822372 1878741
41421 1878741 1861716 1881393 1907045 1879802 1859506 1918857 1980735 1922619 1777975 1663801 1569092
41410A569092j48375r3864J84035M51601M14051J45465l8680m2322m4762j42086
41400B254155k08135j38719j6757K1853n2875j66632k07810j17127J2171N650
41390A385774j31060j65131Q686J48669K6192j69501r7997J74723K48878j930
41380A427303k53361k12808L0961K24843K53811J35866n9275k03865k09673j64484
41370I69318j84854j66497N1999L07037K45697j11362l24924j79602O941q2067
41360E31686k69028k03736Q9138K96075K73676J35934O96r9833j31518q4707l4137
41349E04246l3795l0623J4887M2671K7856N1727J27261J20498k8485j77350k04120
41338D14773j78974j83494j57656p0709k9521n8488o694J48962J77136p614j07826
$$ plain form
41410 1569092 1420717 1326853 1510888 1962489 2376540 2522005 2483325 2441003 2396241 2254155
41400 2254155 2046020 1907301 1890544 1912397 1859522 1692890 1485080 1367953 1380124 1385774
41390 1385774 1254714 1089583 1098269 1246938 1273130 1103629 1005632 1180355 1429233 1427303
41380 1427303 1173942 961134 992095 1216938 1470749 1606615 1547340 1343475 1133802 969318
41370 969318 784464 617967 669966 977003 1222700 1111338 786414 606812 613753 531686
41360 531686 262658 58922 148060 444135 717811 853745 854441 754608 623090 538383 504246
41349 504246 470451 439828 454715 497386 525242 576969 704230 824728 796243 618893 414773
41338 414773 235799 52305 -105351 -176060 -205581 -264069 -270763 -121801 55335 47721 -60105
41327f0105R7958L36072K42019n2999j57179n1707k6419j07636n1204J32564J54467
41316D55831o586j7900K27048L95061K61662O4421O7919J28857o619k37221k62581
41305A069892m7078J62236J92731Q2424p8713k28472k78962j69328J4598J06683
41295H26011O6044J6078N7162J30803J27766P9700J42789L53894M97508L49312
41285B647067K1086j28524K2954J80769O3760j95381k89958j98062j23695j05880
41275A894136j2741J25500J15802m4830j29756n6143m828p9770j30357l8569P1784
41264A710228O4087N752o053l9097j68512k85831k51251j20532n0244o2655n6816
41253G39076M055M3350j7032j66324k95769k64282m6368J86788K41421J46407
$$ plain form
41327 -60105 37853 373925 615944 562945 405766 354059 327640 220004 168800 301364 455831
41316 455831 449245 431345 658393 1053454 1315116 1379537 1447456 1576313 1569694 1332473 1069892
41305 1069892 1022814 1185050 1377781 1460205 1381492 1153020 874058 704730 719328 826011
41295 826011 892055 908133 965295 1096098 1223864 1303564 1446353 1800247 2297755 2647067
41285 2647067 2668153 2539629 2562583 2743352 2807112 2611731 2321773 2123711 2000016 1894136
41275 1894136 1881395 2006895 2122697 2077867 1948111 1891968 1887140 1807370 1677013 1638444 1710228
41264 1710228 1774315 1780067 1774014 1734917 1566405 1280574 1029323 908791 858547 795892 739076
41253 739076 743131 786481 769449 603125 307356 43074 -3294 183494 424915 571322
41243E71322Q2662Q5835K3112j10973j18474Q5497K98019L05347J55666J7791
41233A395804o5925j32759j48545o8094M8011J06593R3101L1081n6196q0380N7592
41222A180283K64636K92633R5431m6604R1362L75904N93137Q24670J249228J675332
41212F596012J611431Q65479j42678p75968p98008n36099m65445o79138q28027
41203D847559o17036k27068m7599p7305P4809N32021Q52796N96254q8933o84979
41193E160519r00385q01071n45258k64165p0391N5917K65516N50349O82628O70056
41183D803715R44149J672797K148181J464957k08673j601532j727756q70643l254
41174F621941L77533N55333R85352J703565K324651K484390K223642J843540J347181
$$ plain form
41243 571322 653984 739819 762931 651958 533484 618981 917000 1222347 1378013 1395804
41233 1395804 1329879 1197120 1048575 980481 1028492 1135085 1228186 1259267 1203071 1122691 1180283
41222 1180283 1444919 1737552 1832983 1786379 1877741 2253645 2846782 3671452 4920680 6596012
41212 6596012 8207443 9072922 8930244 8154276 7356268 6820169 6354724 5675586 4847559
41203 4847559 4230523 4003455 3955856 3878551 3953360 4485381 5338177 5934431 5845498 5160519
41193 5160519 4260134 3459063 2913805 2649640 2579249 2635166 2900682 3451031 4133659 4803715
41183 4803715 5747864 7420661 9568842 11033799 10825126 9223594 7495838 6625195 6621941
41174 6621941 6999474 7554807 8540159 10243724 12568375 15052765 17276407 19119947 20467128
41165B0467128L01242j441774l105484l594697k753858j539101q39828o19936
41157F873692m09065j00778J47103M17519R17990J503306J734858J381326N85457
41148A3051408l78266j243101j749789j808363j624276j432193j186066p58116
41140B871238l18627j70891k62104k42150l6057L8313j62541l19707j67153L8236
41130A268557r1892m27223m67733q7784K64936K03503r1685j92796k0244J41544
41120D99183J09371J003l3383k6179m4622k5216R2285J95152J37149k3477j01132
41109G80134o3686n3104j18704j19988L4515K10083K25041J12997Q8891K91088
41099A387267O29315Q53615P34618K48441l46450o77747n93444l01716j18426
$$ plain form
41165 20467128 20768370 19326596 16221112 12626415 9872557 8333456 7493628 6873692
41157 6873692 6464627 6363849 6510952 6928471 7846461 9349767 11084625 12465951 13051408
41148 13051408 12673142 11430041 9680252 7871889 6247613 4815420 3629354 2871238
41140 2871238 2552611 2381720 2119616 1877466 1841409 1879722 1717181 1397474 1230321 1268557
41130 1268557 1176665 749442 281709 193925 458861 662364 570679 377883 357639 499183
41120 499183 608554 609557 576174 549995 505373 480157 572442 767594 904743 881266 780134
41109 780134 716448 663344 544640 424652 459167 669250 894291 1007288 1096179 1387267
41099 1387267 2016582 2870197 3604815 3853256 3506806 2829059 2235615 1933899 1815473
41090A815473j22082j39017k8744J34563J89927J14411N8003J68596M15485N98932
41080C205547N35774K27565j59894m54177n76571n22773l40261j47606q1283j51304
41070A535017k05988j17832L5351O5515o5849j88567j53212k5036K3940m4305
41060H59034j03412o0475K5668O0436M9222M2269K4855k8433m8512L6057J26078
41049I82787M1633j90185l15726j95470N904P7628M3126K7993K728j24599k53195
41038A02624j75819R0234K74690J90726o3763k66841k86203j14526J54110L42851
41028B48083L15984J25661n5127j37103j43905q1570N4445J62376J16375k3038
41018E82181o9540J673K9740m3450r0398o1057q2178j88767j98451r070J89264
$$ plain form
41090 1815473 1693391 1554374 1525630 1660193 1850120 1964531 2022534 2191130 2606615 3205547
41080 3205547 3741321 3968886 3808992 3354815 2778244 2255471 1915210 1767604 1686321 1535017
41070 1535017 1329029 1211197 1246548 1312063 1246214 1057647 904435 879399 903339 859034
41060 859034 755622 695147 720815 781251 830473 872742 897597 869164 820652 856709 982787
41049 982787 1024420 834235 518509 323039 328943 406571 449697 477690 480418 355819 102624
41038 102624 -73195 17039 291729 482455 418692 151851 -134352 -248878 -94768 248083
41028 248083 564067 689728 634601 497498 353593 272023 326468 488844 605219 582181
41018 582181 512641 514314 544054 500604 410206 349149 266971 78204 -120247 -129317 59947
41007E9947J83456M3274l6771m8503j05895j83802j53001k4049N1926J8163j7602
40996b12857L7474J30538J35520j769j89225k48074j01270J00563J42342K7006
40986a79752n4612l0816p731Q316J57393L81622L57546m644k94406j46144J95745
40975C82517K35510l4327j88284o6453N2003j1906p8933m940P0322M2550O2148
40964D60207K13307K70557M2807k63964l17012j39250l1804j01012j53292n4554
40954g4010P1731P8485K3468L9419J01848P2045p3716j91346j62518l9984N0046
40943a04532O9110N2319L165p9907j17978m6161K4140p0834k40761j96421R7077
40932f10783K82678J10602j67091j67287N7791J62812Q4339P4846J95002J91816
$$ plain form
41007 59947 243403 286677 249906 201403 95508 -88294 -241295 -265344 -213418 -195255 -212857
40996 -212857 -175383 -44845 90675 88906 -100319 -348393 -449663 -349100 -206758 -179752
40986 -179752 -234364 -265180 -272911 -264595 -107202 274420 631966 627322 332916 186772 382517
40975 382517 618027 583700 395416 328963 380966 369060 290127 285187 355509 398059 460207
40964 460207 673514 944071 986878 722914 405902 266652 234848 133836 -19456 -74010
40954 -74010 -2279 76206 99674 139093 240941 312986 239270 47924 -114594 -154578 -104532
40943 -104532 -35422 16897 20062 -59845 -177823 -223984 -199844 -270678 -511439 -707860 -610783
40932 -610783 -328105 -217503 -384594 -551881 -494090 -331278 -246939 -172093 22909 214725
40922B14725l0656j97646r3346R8082R1761q6530k03864j62397l3539J14501K27823
40911f1086K08561L0026j55449j72977l4396J21103K14121K34128J54917q649
40901E30299j22642o9430O5452Q2425n8716j78627j16946O3616J62366Q4691n4428
40890C88060q2111J4494Q7270M8670j2884n948K118o3371q9330N3023K19872J55150
40878G15013p6214j28500R1806K56328J14640j42431k22190j60970j58173k00971
40868H8338j49655l9913J73K2504J49630K73494J74270q7526k00811n3514J14682
40857B91672P0393j25206k59712k21860m6500J43357J96553P3277n6575J781J84418
40846B51598K41516J00430m5400n2754k4179r5498k09361k26623j36880m1393
$$ plain form
40922 214725 184069 -13577 -106923 -8841 82920 -3610 -207474 -369871 -403410 -288909 -61086
40911 -61086 147475 177501 22052 -150925 -185321 -64218 149903 384031 538948 530299
40901 530299 407657 338227 403679 486104 427388 248761 131815 195431 357797 442488 388060
40890 388060 305949 320443 407713 456383 443499 437551 439669 376298 286968 339991 559863 715013
40878 715013 638799 510299 602105 858433 973073 830642 608452 447482 289309 88338
40868 88338 -61317 -101230 -101057 -78553 71077 344571 518841 431315 230504 176990 291672
40857 291672 362065 236859 -22853 -244713 -291213 -147856 48697 121974 65399 67180 251598
40846 251598 493114 593544 548144 495390 471211 375713 166352 -60271 -197151 -238544
40836b38544j3736n9203j28712j15864N9050L03934M00283K57444K2046j17282
40826C69416j19958l8376Q4279J78329J48900J9805m7826J0854M6940n4702j57559
40815D40102r1021L7159q025j84443j98378L6051K33534J51601n4784q0387P6917
40804C58326J40002k3648k31851k76075j83153q9532r722J10242K00105J28117
40794A22811m8043r5072N9400J85245Q2498r3806m9931J87201K84066R0544j40163
40783E84750j32296K5904N8235q0705j80847j09332M0740J33351J44248J03282
40773E87330L0078k9540k5131M115k4387p0590k391J56458J88072L417j68394
40762F49037r1174J11768J27961q6882k76121k84256k18829j70264n3114J50701
$$ plain form
40836 -238544 -252280 -311483 -440195 -556059 -497009 -193075 207208 464652 486698 369416
40826 369416 249458 211082 295361 473690 622590 642395 594569 605423 652363 597661 440102
40815 440102 349081 386240 378215 193772 -4606 31445 264979 416580 361796 281409 358326
40804 358326 498328 474680 242829 -33246 -216399 -305931 -315653 -205411 -5306 122811
40794 122811 74768 -20304 39096 224341 306839 213033 163102 350303 634369 724913 584750
40783 584750 452454 478358 536593 455888 275041 165709 206449 339800 484048 587330
40773 587330 617408 587868 562737 566852 542465 471875 469484 625942 814014 817431 649037
40762 649037 557863 669631 797592 710710 434589 150333 -68496 -238760 -291874 -141173
40752a41173K46132J11796o8080p2741K3191K6800j6590O1030J80248J00307j47913
40741C03007k62358j45534l6603p2790o8482R8429K16236J08222j8353Q7762K59925
40730D69461J66369j21869k25493o9697J1314j65096l43375k45124L0411K03312
40720b89787J89756J04100N2005P8833J84103K53531J20607j71718l26426j67237
40710B7767R2312J43607J0772m8260K8789N5268m4182j01080n679R1957K1288
40699B72559j31184j46756J2185J66378J61909K3305j25454j85162j16958M7262
40689b1916J90557J82323K3438j25674j23780k2939J1691o0186r9627m867J22781
40678G1801J22427J5641k6688M9937R1340l4974k25132k56225p1466J52458K23127
$$ plain form
40752 -141173 104959 216755 148675 75934 99125 125925 109335 170365 350613 450920 303007
40741 303007 40649 -104885 -141488 -214278 -282760 -184331 31905 140127 121774 209536 469461
40730 469461 635830 513961 288468 218771 230085 64989 -278386 -523510 -493099 -289787
40720 -289787 -100031 4069 56074 134907 319010 572541 693148 521430 195004 27767
40710 27767 120079 263686 274458 226198 254987 310255 266073 164993 159314 251271 272559
40699 272559 141375 -5381 6804 173182 335091 358396 232942 47780 -69178 -21916
40689 -21916 168641 350964 374402 248728 124948 102009 113700 53514 -46113 -50980 71801
40678 71801 194228 209869 183181 233118 324458 289484 64352 -191873 -263339 -110881 112246
40667A12246J39179M7723M2186N9883n759j31460j71150o1186N4668m501j94075
40656a12246k74557j25121R9738J93037J57354J31909J48878J20985M2131L0558
40646D12666J34529K31633J92291M4174j01919k03712k72155k73687j67424j6173
40636a9777N4824K0197k1082p336o249r1388j97756j79873M370K21806K80771
40625E8507J11642j48640k57099j02501J50058K23233N5529j29446j26299K86
40615a64730O4502L8413K0402J1922o1147j30732k8664K05544K86956P0178k11606
40604A01038k41009j3537K14128K65143J69882K9811p9341j02677m3029J0580
40594C10989j5129q3145j26414j45492j37995l9661J35169K08136O2756j40484
$$ plain form
40667 112246 251425 299148 341334 401217 395458 263998 92848 31662 86330 81829 -112246
40656 -112246 -386803 -511924 -412186 -219149 -61795 70114 218992 339977 382108 412666
40646 412666 547195 778828 971119 1015293 913374 709662 437507 163820 -3604 -19777
40636 -19777 35047 55244 34162 26826 20577 -70811 -268567 -448440 -444070 -222264 58507
40625 58507 170149 21509 -235590 -338091 -188033 35200 90729 -38717 -165016 -164730
40615 -164730 -100228 -61815 -41413 -29491 -90638 -221370 -250034 -44490 242466 312644 101038
40604 101038 -139971 -153508 60620 325763 495645 525456 446115 343438 300409 310989
40594 310989 295860 212715 86301 -59191 -197186 -236847 -101678 106458 169214 28730
40584B8730j68936n1625J3587P841P1840J72641J05924j23394k33689r3572O3851
40573b06802J5557j06214m8840J66357L06563K62700J22416m718o2992k7005M6144
40562D63166J6523j49061k74257k01376k6260N2082J8922m07J5294o204l1182
40551a22760M3405J70677J92553J09639R4609J94273K30786P9737j41545k64800
40541E86574k82879k53961j52137K9879J49944P4625r2853j23056K0161J38909
40531I5206R1992l5975j03966j00001o8172J4326J49489K04099O1748j46139j54549
40520H058O4937K35954J52947n3454j44492r7506l2463L5610J40167J63389k5556
40509D47591k65925k41460M2047K18721J00813m9554L6604K03131J46193q6615
$$ plain form
40584 28730 -140206 -191831 -178244 -170403 -98563 74078 180002 56608 -177081 -270653 -206802
40573 -206802 -191245 -297459 -346299 -179942 126621 389321 511737 507019 444027 417022 463166
40562 463166 479689 330628 56371 -145005 -171265 -119183 -100261 -100668 -85374 -91578 -122760
40551 -122760 -79355 91322 283875 393514 488123 682396 913182 992919 851374 586574
40541 586574 303695 49734 -102403 -72524 77420 152045 59192 -63864 -43703 95206
40531 95206 187198 151223 47257 -52744 -120916 -106590 42899 246998 308746 162607 8058
40520 8058 72995 308949 461896 408442 263950 166444 133981 169591 309758 473147 447591
40509 447591 181666 -59794 -17747 200974 301787 252233 288837 491968 638161 551546
40499E51546j96607j16348n4880r1040n4182J24388K31980R4665j29470j61951
40489A98101R780J43507R4973j6090k4944L4147J0433j05514j58461q3818k6744
40478G5370r8156j53820j0647K08608K09847p591j18887K5003J71735R3160n9012
40467C35610n0385M4074L6265J091J11217K42229J25080j67245k65953n8432J49596
40456E03147R4668j15415k26573j48890M5385K24825K35418L3662j77560j55912
40446C12755K1428N4950j02576j74113l0971R5585J9012j03419p8706n491n1757
40435d3303j39298j10945k1307K669K3443J39674K16124O8197j80418k33970p3319
40424c52453L3970k5855n6418R7931K95865L11922J32983p2037j58372q8408Q8499
$$ plain form
40499 551546 354939 238591 183711 92671 38489 162877 394857 489522 360052 198101
40489 198101 207881 351388 446361 430271 405327 439474 449907 344393 185932 102114 75370
40478 75370 -22786 -176606 -187253 21355 231202 223611 104724 129727 301462 394622 335610
40467 335610 285225 329299 365564 366655 477872 720101 845181 677936 411983 353551 503147
40456 503147 597815 482400 255827 106937 152322 377147 612565 646227 468667 312755
40446 312755 334183 389133 286557 112444 81473 177058 196070 92651 13945 8454 -43303
40435 -43303 -182601 -293546 -314853 -312184 -288741 -149067 67057 135254 -45164 -279134 -352453
40424 -352453 -318483 -344338 -400756 -302825 -6960 304962 437945 365908 207536 119128 207627
40413B07627K41225K14314j4298k54692k73112o1305J23713N2262j72177k11343
40403a47786O0801L48003L09198L0488j10541K49R0376k5518j68233j37536m2256
40392B07245o0168j05068j0276J31325J12350k0163m5207N1555P7663j4247o6494
40381B58515j7971Q842l8200n2676O047L3184o682p544N0766K3857j28682j96023
40369f6567k609K97074L84379J66329j40599k78317j88697n334J06771Q6711n191
40358C53950p2627o3803K0310J29686J57116K8446j41777j20294J03548K01531
40348E96086o5785m32931m27306l4170K64143J63139p6055o5321J59980K66363
40338C48143J26783o1074j02419k9091K4218J2049j7950l6155o8474j16744r7482
$$ plain form
40413 207627 448852 663166 648868 394176 121064 59759 183472 235734 63557 -147786
40403 -147786 -86985 261018 570216 600704 490163 490412 580788 555270 387037 249501 207245
40392 207245 147077 42009 31733 163058 275408 255245 210038 261593 339256 325009 258515
40381 258515 240544 249386 211186 158510 164557 197741 191059 183515 234281 258138 129456 -66567
40369 -66567 -69176 227898 612277 778606 638007 359690 170993 165659 272430 359141 353950
40358 353950 281323 217520 237830 367516 524632 553078 411301 291007 394555 596086
40348 596086 530301 97370 -329936 -364106 -99963 63176 -12879 -78200 81780 348143
40338 348143 474926 413852 311433 282342 306560 318609 300659 264504 196030 79286 -18196
40327a8196N8934K46381K44878J8807j77317j24723N0538P8050n6847j47318j16518
40316E6669n8506K0073J79558K78391Q8649k60810l41019n7804J53725j6563k69423
40305b27060j68166K04612M23050L41077J67096M8250n7196j48110j36163k4687
40295D22703J00702K22829L38899L48376K14138J21184K21084L36952K17668k2027
40285B522508n8003J16071J91824N6934q6724j45655k71727m78598n14661k88619
40275A043350p3889q0649j35767l0437R6481J9588j43706r7592J51700K90916
40265A039995J47973j02660j98863p8976J11437J84604P3828j04034j76562j30490
40255G66252j03564j33402q2021R8729K20585J43097K8286Q6321K07581J31802
$$ plain form
40327 -18196 40738 287119 531997 550804 373487 248764 299302 377352 320505 173187 56669
40316 56669 -1837 18236 197794 476185 564834 304024 -36995 -94799 58926 42363 -227060
40305 -227060 -395226 -190614 232436 573513 740609 788859 731663 583553 447390 422703
40295 422703 523405 746234 1085133 1433509 1647647 1768831 1989915 2326867 2544535 2522508
40285 2522508 2464505 2580576 2772400 2829334 2742610 2596955 2325228 1846630 1331969 1043350
40275 1043350 969461 888812 753045 722608 819089 838677 694971 597379 749079 1039995
40265 1039995 1187968 1085308 886445 807469 918906 1103510 1177338 1073304 896742 766252
40255 766252 662688 529286 447265 545994 766579 909676 937962 1024283 1231864 1363666
40245A363666q6597j02133J98311M89574M52288K01809R8381K66116M92322N57676
40235C931413M99812N26789P81683J239528J752122K110116K107530J681338J036892
40226A5667223N18441K37487r6245q16156j800964k519150k594003k144106j522581
40217D929946r44497m92830k64346k73542l28374k31241m9662P469o8326q0157
40207B204440M4312J27318J491k54803m18372l75043k19790j35314j78796j94850
40197F00593j0222K81342L78160J79415n1175o0584N7149R9138J22923K88549
40187A885288M85663M62759K48670J05572J15915J57325K30296M32461O60885
40178D784834P70398R76413J585504K374026K918403L582254N235720P600240
$$ plain form
40245 1363666 1277069 1174936 1373247 1862821 2315109 2516918 2615299 2881415 3373737 3931413
40235 3931413 4431225 4958014 5739697 6979225 8731347 10841463 12948993 14630331 15667223
40226 15667223 16185664 16423151 16326906 15510750 13709786 11190636 8596633 6452527 4929946
40217 4929946 3985449 3492619 3228273 2954731 2626357 2395116 2345454 2352923 2284597 2204440
40207 2204440 2248752 2376070 2377561 2122758 1704386 1329343 1109553 974239 795443 600593
40197 600593 590371 871713 1249873 1429288 1378113 1317529 1374678 1473816 1596739 1885288
40187 1885288 2370951 2833710 3082380 3187952 3303867 3461192 3691488 4123949 4784834
40178 4784834 5555232 6531645 8117149 10491175 13409578 16991832 22227552 29827792
40170B9827792Q864340P775137N334264L303453J574571j498440o132378r991440
40162C9057299j0710637q532759n633858l581059k396270j630832j197469j037402
40154D337013q28404m08716n8563p5823l45218n33858n05777l65386k37558j61206
40144H16504j21773q0900r383O2923O5610k7301j60553k38302j84984j3969J39238
40133B47110J31675J293o2558J0636P2958J9206k2710P7956J88664R6926j41933
40122F19223k75560k15929j01309l3854J4157M5637J8443j2789N0293J44532J07791
40111C60635m2774j21683q1238o0789r6602n2878Q7553J43345N4708Q628J05552
40100C04457J76377J03244M1636J03716J01423j08700k80679j36503J30836J24888
$$ plain form
40170 29827792 38692132 46467269 51801533 55104986 56679557 55181117 49048739 39057299
40162 39057299 28346662 19813903 14180045 10598986 8202716 6571884 5374415 4337013
40154 4337013 3508609 3099893 3041330 2965507 2620289 2086431 1580654 1215268 977710 816504
40144 816504 694731 613831 604448 667371 732981 705680 545127 306825 121841 107872 247110
40133 247110 378785 380078 317520 328156 401114 420320 397610 475566 664230 761156 619223
40122 619223 343663 127734 26425 -7429 6728 52365 70808 58019 108312 252844 360635
40111 360635 317861 196178 114940 54151 -42451 -95329 -7776 135569 190277 198905 304457
40100 304457 480834 584078 625714 729430 830853 722153 441474 304971 435807 560695
40090E60695j08036j54889P2408J97250J7033j69520p3143J27636J18644m4798
40080E43280q6427K3855Q0034J8283k6561j3225n5288j60100j61240M140J57643
40069C24394J34537J2277n0406o5112j29701j83110o3609J87388K95139J13727
40059E75524j49435k08508p2622L1063J9106J1932N4898L3654o9355q0282O8863
40048B14838J67448M5214j19285n7413J54372K06686L7234j06597p9709p404P683
40037D63067M5317J29998J16994l0283j02597K7093J64367R8974n6428q7000n3677
40026G15825j44332k75124j90620Q0220K20779J15704J2904R7347K05453J29640
40016I67796m3580j14519j05284j71339k86545k64015o5822J20957J48247Q4504
$$ plain form
40090 560695 452659 297770 370178 567428 584461 414941 341798 469434 588078 543280
40080 543280 456853 480708 560742 579025 552464 539239 483951 323851 162611 166751 324394
40069 324394 458931 471208 420802 355690 225989 42879 -20730 166658 461797 575524
40059 575524 426089 217581 144959 176022 195128 207060 261958 295612 226257 145975 214838
40048 214838 382286 427500 308215 250802 405174 611860 649094 542497 462788 455384 463067
40037 463067 508384 638382 755376 725093 622496 649589 813956 912930 856502 769502 715825
40026 715825 571493 296369 105749 185969 406748 522452 535356 632703 838156 967796
40016 967796 924216 809697 704413 533074 246529 -17486 -83308 37649 185896 270400
40006B70400P1848J26391J58012J16932L9022l2212j01333j77371k07426j06008
39996A58255J21123L14314K85066J9372k86435m11001k98026o3563J26278J66449
39986A31832O9680m1833m5109M6657J01141M9954j6400N943O9557N5747k9239
39975C97930o2547j976N4363L8910K2506P6150J26339O4629n8164q8646j2553
39964E56941J1595r1730j70960o9991J15649J65767O0637j0233L6400N9934l8185
39953F25824j29594p5690L1662K5504n6881n4202L4961O6968J2436k5713m2491
39942D12784j37022k61727k20519K567J57265R0182l3393k2385M3711P601o7287
39931b8223k6152R1192J37484J22829J48897J71617Q7053k2442q661K9390j29220
$$ plain form
40006 270400 342248 468639 626651 743583 782605 750393 649060 471689 264263 158255
39996 158255 279378 593692 878758 898130 611695 200694 -97332 -160895 -34617 131832
39986 131832 201512 159679 114570 161227 262368 312322 295922 301865 371422 427169 397930
39975 397930 335383 333407 387770 426680 449186 525336 651675 716304 658140 569494 556941
39964 556941 568536 476806 305846 235855 351504 517271 577908 567675 604075 664009 625824
39953 625824 496230 420540 452202 477706 420825 366623 401584 468552 480988 455275 412784
39942 412784 275762 14035 -206484 -203917 -46652 43530 10137 -12248 31463 39064 -28223
39931 -28223 -54375 36817 174301 297130 446027 617644 704697 682255 673594 702984 573764
39920E73764l89571l73405K1383M07390M07163J11745j31931j73695j06293l4662
39910C11888n521m9095j15948p6191P1289J18589n3278k32705j48067J23201K59328
39899B03490J52010M660k2994j1512o0212r7343l7221L5768n596j08027q9455
39888c6432J04407L04296L03888R0746j40213j94548p5373M9092N9017J026l0689
39877D35217m9027j21437k06796j65723M1327K58992L02903J76504N4469N4219
39867G80648R3133K4493j26135j69944l4226R0359K077k00349k40725o9520P3723
39856B23534L8682k8027L4323J26773Q3149k8897k3688Q5188J12554K212j10499
$$ plain form
39920 573764 184193 -189212 -167829 239561 646724 758469 626538 452843 346550 311888
39910 311888 306367 257272 141324 65133 136422 255011 201733 -30972 -179039 -55838 203490
39899 203490 355500 360160 337166 325654 265442 168099 130878 166646 161050 53023 -36432
39888 -36432 67975 372271 676159 766905 626692 432144 356771 405863 464880 465906 435217
39877 435217 386190 264753 57957 -107766 -66439 192553 495456 671960 726429 780648
39867 780648 873781 898274 772139 602195 567969 658328 660405 460056 219331 149811 223534
39856 223534 262216 234189 268512 395285 478434 449537 425849 511037 623591 625803 515304
$$ [...]
##END NTUPLES=NMR SPECTRUM
##END=
