##TITLE=31Pdec_PR179_rm
 D2O, 24 sc
 25.7.2019
##JCAMPDX= 6.0         $$ Bruker NMR JCAMP-DX V2.0
##DATA TYPE= NMR SPECTRUM
##DATA CLASS= NTUPLES
##ORIGIN= UXNMR, Bruker Analytische Messtechnik GmbH
##OWNER= root
$$ XWIN-NMR		Version 3.5
$$ Thu Jul 25 14:18:56 2019 Russian Standard Time (UT+4h)  she@DPX200
##.OBSERVE FREQUENCY= 81.013821
##.OBSERVE NUCLEUS= ^31P
##.ACQUISITION MODE= SIMULTANEOUS
##.ACQUISITION SCHEME= undefined
##.AVERAGES= 24
##.DIGITISER RES= 17
##SPECTROMETER/DATA SYSTEM= spect
##.PULSE SEQUENCE= zgpg30
##.SOLVENT NAME= CDCl3
##.SHIFT REFERENCE= (INTERNAL, CDCl3, 0, 182.463)
##AUDIT TRAIL= $$ (NUMBER, WHEN, WHO, WHERE, WHAT)
$$ ##TITLE= Audit trail, XWIN-NMR		Version 3.5
$$ ##JCAMPDX= 5.01
$$ ##ORIGIN= Bruker BioSpin GmbH
$$ ##OWNER= she
$$ F:/spectra/data/she/nmr/P31/1/pdata/1/auditp.txt
$$ ##AUDIT TRAIL=  $$ (NUMBER, WHEN, WHO, WHERE, WHAT)
(   1,<2019-07-25 14:16:45.50 +0400>,<she>,<DPX200>,
      <created by zg, POWCHK disabled, PULCHK disabled
       configuration hash MD5:
       00 E9 B6 7A A2 85 ED C7 34 08 36 98 17 FE 4E 26
       data hash MD5: 32K
       C6 04 6B 84 88 2E 02 B9 F1 A2 37 28 C3 BE 52 CE>)
(   2,<2019-07-25 14:16:48.34 +0400>,<she>,<DPX200>,
      <Start of raw data processing
       efp BC_mod = 2 LB = 1 FT_mod = 6 PKNL = 1 PHC0 = -543.4921 PHC1 = 494.8 SI = 64K 
       data hash MD5: 64K
       10 6B 3F 7E BC 58 60 26 E2 73 EC FA 7E 12 52 8A>)
(   3,<2019-07-25 14:17:12.87 +0400>,<she>,<DPX200>,
      <pk PHC0 = -92.15266 PHC1 = 197.8 
       data hash MD5: 64K
       91 BF 52 5B 0B A9 0D 51 85 5B F5 2F 61 7D BC 67>)
(   4,<2019-07-25 14:17:15.84 +0400>,<she>,<DPX200>,
      <abs ABSG = 5 
       data hash MD5: 64K
       11 E9 54 8F 8C ED 77 01 03 F8 A8 A1 8D 21 6F 45>)
$$ ##END=
$$ 
$$ hash MD5
$$ 00 08 A7 CF 15 56 B4 F1 55 22 40 4A 09 3C 53 3E
##$RELAX= 
##$RELAX= 
##$RELAX= 
##$RELAX= 
##$RELAX= 
##$RELAX= 
##$RELAX= 
##$RELAX= 
$$ Bruker specific parameters
$$ --------------------------
##$DU= <F:/spectra>
##$EXPNO= 1
##$NAME= <P31>
##$PROCNO= 1
##$TYPE= <nmr>
##$USER= <she>
##$AMP= (0..31)
100 100 100 100 100 100 100 100 100 100 100 100 100 100 100 100 100 100 
100 100 100 100 100 100 100 100 100 100 100 100 100 100 
##$AQSEQ= 0
##$AQ_mod= 1
##$AUNM= <au_zg>
##$AUTOPOS= <>
##$BF1= 81.014009
##$BF2= 200.13
##$BF3= 200.13
##$BF4= 200.13
##$BF5= 200.13
##$BF6= 200.13
##$BF7= 200.13
##$BF8= 200.13
##$BYTORDA= 1
##$CFDGTYP= 0
##$CFRGTYP= 5
##$CHEMSTR= <none>
##$CNST= (0..31)
1 1 145 1 1 1 1 1 1 1 1 1 1 1 1 1 1 1 1 1 1 1 1 1 1 1 1 1 1 1 1 1 
##$CPDPRG= <waltz16>
##$CPDPRG1= <>
##$CPDPRG2= <waltz16>
##$CPDPRG3= <>
##$CPDPRG4= <mlev>
##$CPDPRG5= <mlev>
##$CPDPRG6= <mlev>
##$CPDPRG7= <mlev>
##$CPDPRG8= <mlev>
##$CPDPRGB= <>
##$CPDPRGT= <>
##$D= (0..31)
0 1 0 0 0 0 0 0 0 0 0 0.03 2e-05 3e-06 0 0 0 0 0 0 0 0 0 0 0 0 0 0 0 0 
0 0 
##$DATE= 1564049804
##$DBL= (0..7)
120 120 120 11 120 120 24 19 
##$DBP= (0..7)
150 150 150 150 150 150 150 150 
##$DBP07= 0
##$DBPNAM0= <>
##$DBPNAM1= <>
##$DBPNAM2= <>
$$ [...]
##$SUBNAM3= <"">
##$SUBNAM4= <"">
##$SUBNAM5= <"">
##$SUBNAM6= <"">
##$SUBNAM7= <"">
##$SUBNAM8= <"">
##$SUBNAM9= <"">
##$SW= 369.568048894756
##$SWIBOX= (0..15)
0 1 3 0 0 0 0 0 0 0 0 0 0 0 0 0 
##$SW_h= 29940.119760479
##$TD= 32768
##$TD0= 1
##$TE= 0
##$TE2= 300
##$TE3= 300
##$TEG= 300
##$TL= (0..7)
0 120 53 12 22 120 120 120 
##$TP= (0..7)
150 150 150 150 150 150 150 150 
##$TP07= 0
##$TPNAME0= <>
##$TPNAME1= <>
##$TPNAME2= <>
##$TPNAME3= <>
##$TPNAME4= <>
##$TPNAME5= <>
##$TPNAME6= <>
##$TPNAME7= <>
##$TPOAL= (0..7)
0.5 0.5 0.5 0.5 0.5 0.5 0.5 0.5 
##$TPOFFS= (0..7)
0 0 0 0 0 0 0 0 
##$TUNHIN= 0
##$TUNHOUT= 0
##$TUNXOUT= 0
##$USERA1= <user>
##$USERA2= <user>
##$USERA3= <user>
##$USERA4= <user>
##$USERA5= <user>
##$V9= 5
##$VALIST= <valist>
##$VCLIST= <CCCCCCCCCCCCCCC>
##$VD= 0
##$VDLIST= <DDDDDDDDDDDDDDD>
##$VPLIST= <PPPPPPPPPPPPPPP>
##$VTLIST= <TTTTTTTTTTTTTTT>
##$WBST= 1024
##$WBSW= 4
##$XGAIN= (0..3)
0 0 0 0 
##$XL= 0
##$YL= 0
##$YMAX_a= 49234
##$YMIN_a= -58285
##$ZGOPTNS= <>
##$ZL1= 120
##$ZL2= 120
##$ZL3= 120
##$ZL4= 120
##$ABSF1= 182.463
##$ABSF2= -187.1042
##$ABSG= 5
##$ABSL= 3
##$ALPHA= 0
##$AQORDER= 0
##$ASSFAC= 0
##$ASSFACI= 0
##$ASSFACX= 0
##$ASSWID= 0
##$AUNMP= <proc_1d>
##$AZFE= 0.1
##$AZFW= 0.5
##$BCFW= 0
##$BC_mod= 2
##$BYTORDP= 0
##$COROFFS= 0
##$CY= -3
##$DATMOD= 1
##$DC= 0
##$DFILT= <>
##$DTYPP= 0
##$F1P= 0
##$F2P= 0
##$FCOR= 1
##$FTSIZE= 65536
##$FT_mod= 6
##$GAMMA= 0
##$GB= 0
##$INTBC= 1
##$INTSCL= 5.30512e-09
##$ISEN= 30
##$LB= 1
##$LEV0= 0
##$LPBIN= 0
##$MAXI= 10000
##$MC2= 0
##$MEAN= 0
##$ME_mod= 0
##$MI= 50
##$NCOEF= 0
##$NC_proc= -4
##$NLEV= 6
##$NOISF1= 182.463
##$NOISF2= 159.3651
##$NSP= 0
##$NTH_PI= 0
##$NZP= 0
##$OFFSET= 182.463
##$PC= 4
##$PHC0= -635.6448
##$PHC1= 692.6
##$PH_mod= 1
##$PKNL= yes
##$PPARMOD= 0
##$PSCAL= 0
##$PSIGN= 0
##$REVERSE= no
##$SF= 81.0140089999434
##$SI= 65536
##$SIGF1= 159.3651
##$SIGF2= -187.1042
##$SINO= 113.3802
##$SIOLD= 16384
##$SREGLST= <1H.CDCl3>
##$SSB= 0
##$STSI= 65536
##$STSR= 0
##$SW_p= 29940.119760479
##$SYMM= 0
##$S_DEV= 0
##$TDeff= 32768
##$TDoff= 0
##$TI= <>
##$TILT= no
##$TM1= 0
##$TM2= 0
##$TOPLEV= 0
##$USERP1= <user>
##$USERP2= <user>
##$USERP3= <user>
##$USERP4= <user>
##$USERP5= <user>
##$WDW= 1
##$XDIM= 65536
##$YMAX_p= 342815854
##$YMIN_p= -19514616
$$ End of Bruker specific parameters
$$ ---------------------------------
##NTUPLES= NMR SPECTRUM
##VAR_NAME=  FREQUENCY,     SPECTRUM/REAL,   SPECTRUM/IMAG
##SYMBOL=    X,             R,               I
##VAR_TYPE=  INDEPENDENT,   DEPENDENT,       DEPENDENT
##VAR_FORM=  AFFN,          ASDF,            ASDF
##VAR_DIM=   65536,         65536,           65536
##UNITS=     HZ,            ARBITRARY UNITS, ARBITRARY UNITS
##FACTOR=    0.456856943014862, 1,           1
##FIRST=     14782.0589164792, 0,            0
##LAST=      -15158.0608439998, 0,           0
##MIN=       -15158.0608439998, -19514616,   0
##MAX=       14782.0589164792, 342815854,    0
$$ Real data points
##PAGE= N=1
##DATA TABLE= (X++(R..R)), XYDATA
$$ [...]
45151h0418j31216K27958L11747J50198Q4881J19705l0644k89650k23753J95815
45141C34623M17672J41318j88729p9961K35055J94318j88449l47790l6789L18011
45131G99279K53496j02773k72317r3006J10040r112l67317n48527k89491K12552
45121c07176N07715L77689M8220j08129j6970M6924j43316m39505m96611k25379
45111g56538Q7875J49244r21j12150o6864N3114J63722K56176K94004K06039Q750
45100B82451j83713k71362j97843N4663L50985L99824J05475j77262n4717L07882
45090F16383L88414Q7467j61882j30239j05210k72935l35036q5922J24604m0144
45080H5500k89594j85542J05270J27829m7257J6562K72817J90535l44579p44343
$$ plain form
45151 -80418 -211634 16324 328071 478269 563150 682855 652211 362561 138808 334623
45141 334623 752295 893613 704884 624923 859978 1054296 865847 518057 481268 799279
45131 799279 1052775 950002 677685 584679 694719 685607 318290 -230237 -519728 -307176
45121 -307176 200539 578228 626448 518319 501349 548273 404957 -34548 -531159 -756538
45111 -756538 -668663 -519419 -520340 -632490 -699354 -646240 -482518 -226342 67662 273701 282451
45100 282451 98738 -172624 -370467 -315804 35181 435005 540480 363218 308501 616383
45090 616383 1004797 1092264 930382 800143 694933 421998 86962 1040 125644 85500
45080 85500 -204094 -389636 -284366 -156537 -203794 -187232 85585 276120 -68459 -812802
45070h12802n30737K9570L43112K23068k1818m7197J45563K42336K4588k59223
45060f63540j36525L84515O96646M25796j3017r1330M043k08187n82085n60833
45050g44517j42595J19439L5934k6784J05419J86878J42445J89426K73544Q1250
45040B20439k71997k90501K6084J21943j23693j76331J25969K20259j14223k49361
45030e11412J83299N48257K61775j92605j06990K67191K60783m0986r8112L9167
45020F10367o9838l15730k21085J41323K76282J41224O3258l1082m14900p39406
45010e59587l91262L51148N27667j6474l53254M9570N35363L86012j07314k84566
45000A37303j50426j06077j34421N9670L66058L47079q5519n29925o16909l63081
$$ plain form
45070 -812802 -1343539 -1313969 -970857 -747789 -769607 -816804 -671241 -428905 -404317 -663540
45060 -663540 -800065 -415550 281096 706892 693875 602545 606588 398401 -183684 -744517
45050 -744517 -887112 -767673 -731739 -758523 -653104 -466226 -323781 -134355 139189 220439
45040 220439 -51558 -342059 -315975 -194032 -317725 -494056 -368087 -147828 -262051 -511412
45030 -511412 -328113 220144 481919 289314 182324 449515 710298 669312 571200 610367
45020 610367 540529 224799 3714 145037 421319 562543 625801 594719 179819 -559587
45010 -559587 -950849 -599701 -72034 -88508 -441762 -392192 143171 529183 421869 137303
45000 137303 -13123 -119200 -253621 -193951 172107 519186 433667 -96258 -713167 -1076248
44990a076248k5479J61009J13039p0911k03357j87478p1012N7482J24258P4168
44980a104529k6262L9897L58923O51197N72468J91946j08795j53522p3339M5210
44970C93194K28395L35951J31507k83686m84959k95851k3237l284k03314l77650
44960e82934l48938o2616L62984N93829L82519n2396k61531j84119j57915k93569
44950f04686k97356l3457J97396J50645J4328N0343J90085K31040J58890N0970
44940A08198r7184k50383k58576p9085J08285J32472J7759j04696r7157J29792
44930c90575M31387M20056k3368l98317k10646K23912K24003j36429j47508K79203
44920B71718L92966j19441n65592l90152k9492n4061k28236j00614J37488J19354
$$ plain form
44990 -1076248 -1101727 -940718 -827679 -898590 -1101947 -1289425 -1360437 -1302955 -1178697 -1104529
44980 -1104529 -1130791 -1090894 -731971 -80774 491694 683640 574845 421323 347984 393194
44970 393194 621589 957540 1089047 805361 320402 24551 1314 -1970 -205284 -582934
44960 -582934 -931872 -994488 -631504 -37675 344844 292448 30917 -153202 -311117 -604686
44950 -604686 -902042 -935499 -738103 -587458 -573130 -522787 -332702 -101662 57228 108198
44940 108198 11014 -239369 -497945 -577030 -468745 -336273 -318514 -423210 -520367 -390575
44930 -390575 40812 460868 437500 39183 -171463 52449 276452 140023 -7485 271718
44920 271718 664684 545243 -20349 -410501 -439993 -494054 -722290 -822904 -685416 -566062
44910e66062N1600K34802L56617O3733k36839j4824L54062J37205m75139o27141
44900g21986j69925K10769J94875J85873L89153M49640K06450N480K4278p476
44890G67131j97701k74436j81867k24012m03632l11328P1760J80842j80347m07670
44880a161260p6392L03788R7373m19086m87905O220M84680N51075L47340J29020
44870b25147j8833m9162P0566K05659J47209j06088l27756l20488r0046J86744
44860e27342L06158K33968J64712K45419K94014M9870l39521m52931k40152r1142
44850c56947j57230j05881K20072M11251J28398l08413m13527k55689j89735j74329
44840a202030O9940M08995M07848N8633j53552K3374K83550K79197O9639r1214
$$ plain form
44910 -566062 -514462 -279660 76957 140690 -96149 -110973 243089 380294 -94845 -721986
44900 -721986 -891911 -681142 -486267 -300394 88759 538399 744849 750329 774607 767131
44890 767131 569430 294994 113127 -110885 -514517 -825845 -754085 -573243 -753590 -1161260
44880 -1161260 -1237652 -933864 -836491 -1255577 -1743482 -1737262 -1252582 -701507 -354167 -225147
44870 -225147 -243980 -293142 -222576 -16917 130292 24204 -303552 -624040 -714086 -527342
44860 -527342 -221184 12784 177496 422915 716929 766799 427278 -25653 -265805 -356947
44850 -356947 -514177 -620058 -399986 11265 139663 -168750 -582277 -837966 -1027701 -1202030
44840 -1202030 -1132090 -723095 -315247 -256614 -410166 -386792 -103242 175955 245594 154380
44830A54380j02587n037J33775K00444J05615m6312n3573O4914P0463j11824k52506
44819A57752j72593j6070j4274j54692k55726k39563j51776j631K20551L92606
44809b35416L19307L192k74538k52852j0214J39557O3687k8595Q1564K76884K69991
44798C52567L9023j33619p0088Q0522R5817m6587k35313l62465k95750N6294N00241
44787a9358O12880K49746k06626l37035k11637j47819j70732j04444l5115k00782
44777e70922m63561m00917L704K56987J08905o5976R6974L75961L84951K03633
44767g0261J39694J40517n3032l44292m12138l17393m01378n60003k46629N95284
44757a529631J181698Q50538m6586o34814n72857j81521J98391M49442M41089
$$ plain form
44830 154380 51793 46756 180531 380975 486590 440278 386705 451619 522082 410258 157752
44819 157752 -14841 -30911 -45185 -199877 -455603 -695166 -846942 -848573 -628022 -235416
44809 -235416 83891 87083 -187455 -440307 -450521 -310964 -247277 -275872 -194308 82576 352567
44798 352567 391590 257971 187883 268405 364222 317635 82322 -280143 -575893 -519599 -19358
44787 -19358 593522 843268 636642 299607 87970 -59849 -230581 -335025 -370140 -570922
44777 -570922 -1034483 -1435400 -1431696 -1174709 -1065804 -1131780 -1034806 -658845 -273894 -70261
44767 -70261 69433 209950 156918 -187374 -599512 -916905 -1318283 -1878286 -2124915 -1529631
44757 -1529631 -347933 502605 456019 -178795 -751652 -933173 -734782 -285340 155749
44748A55749J07770k51584k36512O7359K05640O8468l934J26367J93709J14240
44738E47272J70855L61280J95008m38748q07062l48568L34385K60687m59204p85179
44728i69274k84157L52460M44338J84049O5694J12227R5298M2566P4027O2244
44718A79472j27170k90684j60310J40147K45467N2533k00051k81917j76638J3913
44708f05238K00076L52287M77783N01908K38568l17227p36291n53161N2024L97650
44698H379K48263J19463L73333N49172R0136o79281r48616n80483k00416j74435
44688a194485j70914J14592L98434K95318m9378j93092k8231J62470J63386M2702
44678d59198n3777q4786n6882M3734J91709K90499K70503J70390O2072o0246k22550
$$ plain form
44748 155749 263519 11935 -224577 -157218 48422 116890 112956 239323 433032 547272
44738 547272 718127 1079407 1274415 835667 28605 -319963 14422 275109 -184095 -969274
44728 -969274 -1253431 -900971 -456633 -272584 -206890 -94663 635 43201 117228 179472
44718 179472 52302 -238382 -398692 -258545 -13078 39455 -160596 -442513 -619151 -605238
44708 -605238 -405162 -52875 424908 926816 1165384 848157 111866 -441295 -389271 8379
44698 8379 256642 376105 749438 1298610 1388746 709465 -239151 -819634 -1020050 -1194485
44688 -1194485 -1365399 -1250807 -852373 -557055 -606433 -799525 -827756 -665286 -501900 -459198
44678 -459198 -512975 -597761 -654643 -610909 -419200 -128701 141802 312192 374264 314018 91468
44667I1468l20772j83002J39387L00455O5571l04046l17659J00817M85011M05976
44657D63206l6628l94100l55822K9810M46536N40088K26659j62277k18799L0618
44647E69291J87097P0964p7845p5996q0816k00731k12462K6062K12456K5069l34964
44636A08125m17498j66787P6884Q9328n5300j96099j85912P4486M23487M58846
44626B09560Q0556k38314j10097J25741n6600m36672l43741K06705M51001Q6316
44616b5545k15381J29076O52138M92114l38189r26369o33964J59438N86961L02121
44606A82400k19939l20674P0222M29853L53068J5894j84585j82881j72787j89597
44596b19026j17657m918q740p5627j1507J62049K48315K35630K80251L57162K76449
$$ plain form
44667 91468 -229304 -412306 -272919 27536 93107 -210939 -528598 -427781 57230 463206
44657 463206 426578 32478 -323344 -293534 153002 693090 919749 757472 538673 569291
44647 569291 756388 827352 749507 673511 592695 391964 179502 205564 418020 443089 108125
44636 108125 -309373 -476160 -399276 -309948 -365248 -561347 -747259 -672773 -249286 209560
44626 209560 290116 51802 -58295 67446 10846 -425826 -769567 -562862 -111861 -25545
44616 -25545 -240926 -111850 540288 1032402 694213 -232156 -866120 -706682 -119721 182400
44606 182400 -37539 -358213 -287991 141862 494930 510824 326239 143358 -29429 -219026
44596 -219026 -336683 -341601 -350341 -425968 -437475 -275426 -27111 208519 488770 845932 1122381
44585A122381M2412j34401j70192j38287k8440J70778K31674n9953m73665n81721
44575a9414l68119j46696P843K12006K92533J9708k57715J0594N50127M85903
44565G86770k58289p17290l51055J81785J78259q5876q9216K2498k5295M7814
44555c09895M15488N02882q9101o50150l63837K91588K71510l09920m22292J15734
44545e47993M06941N5059k66547p6207K02420J62455N8317R3408k3269l14580
44535b49996j98148M90562R29358M77207k52022k84726K51849M27794m5070n33816
44525A012992n44951k79817o8026R8601K82849L34938J36721j75673l86500m10256
44515H78k76198q4445J5051k5960n3676N8342J57573K9359j99612j74776J53554
$$ plain form
44585 1122381 1164793 1030392 860200 721913 693473 864251 1095925 1035972 562307 -19414
44575 -19414 -387533 -534229 -526386 -314380 -21847 -2139 -259854 -249260 300867 786770
44565 786770 528481 -188809 -539864 -358079 -179820 -265696 -354912 -332414 -357709 -309895
44555 -309895 105593 608475 519374 -130776 -494613 -203025 68485 -241435 -663727 -547993
44545 -547993 -141052 -85993 -352540 -428747 -226327 -63872 -5555 87853 64584 -249996
44535 -249996 -448144 42418 971776 1448983 1196961 912235 1164084 1591878 1546808 1012992
44525 1012992 468041 188224 120198 218799 501648 836586 973307 797634 411134 878
44515 878 -275320 -359765 -344714 -370674 -424350 -366008 -208435 -179076 -378688 -553464 -399910
44504c99910M04683K67216j08407l32301k10315J48945M92602N61695K23789l52956
44494F95041p31075n82214l5823M57536N96903M53576K40432L1210k01271l97488
44484E26827m28659k81595r5207J852m822o8629j25761q6683P7615K24598J77113
44473h3351P496j1873J77301K79787P8921k01188j94806R1019L09666K33039m5519
44462F40492k84457k69200O8343M77009M83524l6247n27860l89428J65481L56741
44452F84398m9092m28365k70899R1448R2635j68906j59930J83507L41934J9000
44442C35730l99759l85081J6666K58029J0916l99492l78406J90271P44325O86941
44432F80140J08183l33756k09398K44564N17948M01885N4662k79308m31790l46675
$$ plain form
44504 -399910 4773 271989 163582 -168719 -379034 -230089 262513 824208 1047997 695041
44494 695041 -36034 -618248 -654071 -196535 400368 853944 1094376 1125586 924315 526827
44484 526827 98168 -183427 -278634 -276782 -281604 -350233 -475994 -562677 -485062 -260464 -83351
44473 -83351 -75855 -87728 89573 369360 448281 247093 52287 143306 452972 686011 640492
44462 640492 356035 86835 155178 632187 1115711 1079464 551604 162176 327657 684398
44452 684398 635306 206941 -63958 27490 120125 -48781 -208711 -25204 316730 335730
44442 335730 -64029 -449110 -432444 -174415 -163499 -562991 -941397 -751126 -6801 680140
44432 680140 788323 454567 245169 489733 1007681 1409566 1464228 1184920 753130 406455
44422D06455j47881q1231k29445l57135j79292K71418O55876O56224K30387l59268
44412H66108p00732n52825j18880J28676J125j91803j13077J26466K03589J19266
44402b32087J60656L81458M77591K52766q9363k56065k36945j93391j55631m1104
44392F7885J20455J89869J28565M0257o899n7331j35075j62445p7042O1916J48967
44381C19122J34395m278k76570n53865n49484j26680M10060N60173K15101j95429
44371f7455k36907K9036K14247J29144m8943p5924N7638J51046N0832j42616j61638
44360a01540Q0295L09780K26956n3669j57773k1260M3611r5505j85195r4973p9551
44349a28824k53894k59011J41570N38144M55342J17426N3643K14118J37348j79600
$$ plain form
44422 406455 258574 177343 -52102 -409237 -588529 -317111 338765 994989 1225376 866108
44412 866108 165376 -387449 -506329 -377653 -376528 -568331 -681408 -554942 -351353 -232087
44402 -232087 -71431 310027 787618 1040384 951021 694956 458011 264620 108989 67885
44392 67885 188340 378209 506774 547031 540132 482801 347726 185281 108239 170155 319122
44381 319122 453517 449239 172669 -381196 -930680 -1057360 -647300 -87127 127974 -67455
44371 -67455 -304362 -275326 -61079 68065 19122 -56802 836 151882 202714 60098 -101540
44360 -101540 -21245 288535 515491 461822 304049 282789 326400 230895 45700 -49273 -128824
44349 -128824 -382718 -641729 -500159 37985 493327 610753 664396 878514 1015862 836262
44339H36262k84673q1576N3494k3911o6695j7941r1359k13264o6603K28141J98877
44328D70752j02498j01508K47183K77942k18175n47654k73335P9519M0018K3254
44318a04502M22913P07393L07559k95559l38299l5697n0216k22976K8271M38279
44308H57166K54353l40833m20206J12747L81307P3811j10570J67691K63412k34624
44298A004254p10565n41938m2614K16009K58618K87161J36045k19361k80573J70876
44288B77912M97902J48072l96784l89077k3077R677k18350m5079N16330O86127
44278A063653J69132l77207l64172m7914M0824j17690k03061j34229j01516k11613
44268b83793l66994m04491k24812J18465M08602M58263L08912J12123j03388l32578
$$ plain form
44339 836262 551589 470013 523507 499596 432901 414960 323601 110337 43734 271875 470752
44328 470752 368254 266746 513929 791871 573696 26042 -247293 -167774 -127756 -104502
44318 -104502 318411 1025804 1333363 1037804 699505 663808 613592 390616 418887 857166
44308 857166 1111519 770686 350480 463227 844534 918345 807775 975466 1238878 1004254
44298 1004254 293689 -248249 -290863 -74854 183764 470925 606970 387609 107036 277912
44288 277912 775814 923886 527102 138025 114948 124625 -93725 -138804 377526 1063653
44278 1063653 1232785 855578 491406 443492 484316 366626 163565 29336 -72180 -283793
44268 -283793 -650787 -1055278 -1280090 -1161625 -753023 -294760 14152 126275 22887 -309691
44258c09691l72936n1487L41294K60612l11728o79011k94961M60827P28573K53434
44248B4926l51458m33426l5472L48362M60248M14332K85861k5684m29429n13723
44238b55463q1175M18308L82305j03506l51516m4154L31468K29580j71745l00770
44228E3332n2557J30864j5044j99748n8666K78811L46433k1048m31238m01568
44218c70429L0452L46693K18712q4456j29224M3945L7621k37335m13278k34107
44208g91406J04888L14377L64154L16029J42208q1497j22392L2855O4649j58359
44198A85506k87301n1684K33477J44640j58857k23420o2783o1421k23050j18587
44188f23480L65621P62828O61433J97068k33587m06355l03657m9729O9715j62136
$$ plain form
44258 -309691 -682627 -734114 -392820 -132208 -443936 -1122947 -1417908 -957081 -228508 24926
44248 24926 -326532 -759958 -795430 -447068 13180 427512 713373 687689 258260 -255463
44238 -255463 -336638 81670 463975 360469 8953 -35201 296267 525847 354102 53332
44228 53332 775 131639 116595 -83153 -141819 136992 483425 462377 31139 -370429
44218 -370429 -339977 6716 225428 140972 11748 55693 93314 -144021 -557299 -791406
44208 -791406 -686518 -372141 -7987 308042 450250 368753 246361 279216 343865 185506
44198 185506 -101795 -153479 79998 224638 65781 -157639 -220422 -281843 -504893 -623480
44188 -623480 -257859 504969 1166402 1363470 1129883 723528 419871 370142 439857 277721
44178B77721n22264n05360K1872N98193P18389L55413j51546m55938l69191K9825
44168b886L38982J81736k70811m29066o3865L65996L37142q9131m39056l89257
44158d60216J6177M59989N28434Q5503m09412l19244K93999O59729L81713q161
44148A228511M8771K50229L6199l85718l82717K771J22859j73308l20189k4930
44138D02478K67307J39635j86978l11186k13424p4008K7057j6365l06572n54752
44128h26808k48945M95885Q38954L82273j65439p1398K62264K9355n36403m71960
44118c12222L07094P85820L99665j86366k37645j5884r6690l27429k25391M3973
44108A34925q1619n25841n85754k2916N25739M34676j01481m14303j92729K94351
$$ plain form
44178 277721 -244543 -749903 -728031 -129838 588551 943964 792418 336480 -32711 -2886
44168 -2886 336096 517832 247021 -182045 -245910 120086 457228 368097 -70959 -460216
44158 -460216 -444039 15950 544384 629887 220475 -98769 195230 854959 1236672 1228511
44148 1228511 1277282 1527511 1563710 1177992 795275 798046 920905 747597 427408 402478
44138 402478 669785 809420 622442 311256 97832 23824 50881 34516 -272056 -826808
44128 -826808 -1075753 -579868 259086 641359 475920 404522 666786 696141 159738 -312222
44118 -312222 -5128 780692 1180357 993991 756346 740462 643772 316343 90952 134925
44108 134925 53306 -472535 -1058289 -1081205 -555466 -120790 -222271 -636574 -829303 -534952
44098e34952O07879N41473K06363j23566k57403k14859j02780M6324J98191J89892
44088E56562r2834m39875m70180j13807K70288L36806J32281o1051r2547k6020
44078c77L3319N5821N9563M6949j6517j53367k94294l08040j66090p82Q1047J44910
44066e17858K79124M13789M38428L81092K91298P9804k91246n82580n24147k00041
44056b32337R1758K52521L36465K42586j07373l85143j86066K69066L50241R6
44046F31814j58943J22101K84300n2495l79231j49601K49622J10246m22283n80317
44036c44787j70413K32745K34678O6280K9650R6713J63207K14006J57485p4673
44026F04891k47286r0081J74499Q6833k69746l35734L640K03830m2149l25173
$$ plain form
44098 -534952 72927 614400 820763 697197 439794 224935 122155 168479 366670 556562
44088 556562 463728 23853 -446327 -560134 -289846 46960 179241 118190 25643 -377
44078 -377 32942 88763 148326 195275 178758 25391 -268903 -576943 -743033 -743815 -662768 -517858
44066 -517858 -238734 175055 613483 994575 1285873 1365677 1074431 491851 -32296 -232337
44056 -232337 -140579 111942 448407 690993 583620 198477 12411 281477 631718 631814
44046 631814 472871 594972 879272 826777 447546 297945 547567 657813 235530 -344787
44036 -344787 -515200 -282455 -47777 18503 48153 144866 308073 522079 679564 604891
44026 604891 357605 267524 442023 528856 259110 -76624 -72984 130846 88697 -236476
44016b36476k44424k6130j4894n6699J25952L50483K94638J01063J19507K44720
44006F57740O2543m16006o76135m06735J02920L68135K37049o2606k08562o8482
43996d10139J75727K12024j01j40086J3784K26800J68031m7389m0792J91023K41482
43985E90364n8004l61843l37135j21720k1155k0447R4715K92936L17481J23551
43975D98743j9485N5679J48208K113k81115l52991p8827L06587N02684M31089
43965A212685J92583r0473l06111l61910k67571j32018k8262L7937J3952j56013
43955A14799l21790k17152J08202K29469n8243l71882k84207L0611J13930k7675
43945f83938q198K13395K74825R2736J5815J65294J86361j07158l46385j75827
$$ plain form
44016 -236476 -480900 -507030 -521924 -578623 -452671 -102188 192450 293513 413020 657740
44006 657740 720283 304277 -371858 -778593 -675673 -307538 -70489 -133095 -341657 -410139
43996 -410139 -234412 -22388 -22489 -162575 -148791 78009 246040 198651 157859 348882 590364
43985 590364 532360 170517 -166618 -288338 -309493 -329940 -235225 57711 375192 498743
43975 498743 479258 534937 683145 685258 404143 51152 -27675 278912 781596 1212685
43965 1212685 1405268 1314795 1008684 646774 379203 247185 218923 256860 270812 114799
43955 114799 -206991 -424143 -315941 -86472 -144715 -516597 -800804 -770193 -656263 -683938
43945 -683938 -692136 -478741 -203916 -111180 -95365 69929 256290 149132 -197253 -373080
43935c73080K09875M17900L82290K32755L340k02439j21284K26353L54094j4456
43925A115348m21731l04941J44367K94168K8130k05316j83864j39201j91309j39914
43915d263O0532J19352j07337l40176k72157N9102M31906O86650O92043L62478
43905A688130j32152m19811l45729j44262q2695j40470j53143o7692P4110K27506
43895E03792K97981J67038j13091k91811k04835K1996J42389O5633j00743j90624
43885B97725j18490L5720P5928p5254k23871j35889J16064K41072J61530J12599
43875D87134K43529L56438J91026j86792m44846l67128o6938J49306P4219k15672
43865B20276m41671m03392j53516J20362K93485L20167J84858k5165j07442K9617
$$ plain form
43935 -373080 -163205 254695 636985 869740 873080 670641 549357 775710 1129804 1115348
43925 1115348 693617 388676 533043 827211 855341 650025 466161 326960 135651 -4263
43915 -4263 56269 175621 68284 -271892 -544049 -484947 -53041 633609 1325652 1688130
43905 1688130 1555978 1136167 790438 646176 563481 423011 269868 202176 276286 503792
43895 503792 801773 968811 855720 563909 359074 381070 523459 589092 488349 297725
43885 297725 179235 214955 290883 215629 -8242 -144131 -28067 213005 374535 487134
43875 487134 730663 1087101 1278127 1091335 646489 279361 212423 361729 435948 220276
43865 220276 -221395 -624787 -778303 -657941 -364456 -44289 140569 115404 7962 37579
43855C7579K17761K67589K36867K54855K14691n9234l99427l93337M7963M95022
43845I20329M89449N6517l59079l64511Q148L36340K48499j36545l53428k21063
43835F24656n6378j14756j88999o6888R094j94664l42864m7667L50187K67965
43825B39686m8528J59546Q01269Q96803J33115n40232l51359J51666P9321m05178
43815A116109n01758r8317J91848Q5361o4573K5743J77380J15744j71140m47641
43805D28756l79819J55385P12743N95164j65617o19679j65879M96702L61823l76593
43795A042986o83600k93276L1251j58420l78361j81441J14091P9412j04118n3199
43785e84675J62229K19640O7480j23881k78437l83497l57761j81873K8032K20223
$$ plain form
43855 37579 255340 522929 759796 1014651 1229342 1170108 770681 377344 425307 920329
43845 920329 1409778 1466295 1107216 742705 750853 1087193 1335692 1199147 845719 624656
43835 624656 568278 453522 264523 197635 206729 12065 -330799 -378466 -28279 239686
43825 239686 191158 350704 1151973 2048776 2181891 1641659 1290300 1441966 1521287 1116109
43815 1116109 614351 516034 707882 793243 728670 754413 931793 1047537 876397 428756
43805 428756 48937 204322 917065 1512229 1346612 726933 561054 1057756 1419579 1042986
43795 1042986 359386 66110 97361 -61059 -439420 -620861 -506770 -427358 -531476 -584675
43785 -584675 -422446 -202806 -135326 -259207 -537644 -921141 -1278902 -1460775 -1432743 -1212520
43775a212520M55721O63804O39315L92048J86039J19355N226k09761k97122j82290
43765E59815j24160k42138k72408o6837P2560r7274k88145j27783K25349L59563
43755a458K58900J96731J55364j25456n66286p16333l93527L9314J83567R1932
43745h77252P5800K34911L72553K98510P3495o4228K5810K22729K91810J61176
43735H15314l7239j70386k04715j25137M9293J61682O6100r2071l5746J44534
43725E71629L0607m13582n98222j20843N26345N40463r6548o15090m97497l8648
43715g11386K02086R7167p1370m7528J79485M38058N10834K88306j18888m36109
43705C30655m16117j5529N11731P05159K95795l94504o85367l27588J77513K49913
$$ plain form
43775 -1212520 -756799 -92995 546320 938368 1124407 1243762 1248988 1039227 742105 559815
43765 559815 435655 193517 -78891 -145728 -73168 -170442 -458587 -586370 -361021 -1458
43755 -1458 257442 454173 609537 484081 -82205 -798538 -1192065 -1152751 -969184 -877252
43745 -877252 -801452 -566541 -193988 104522 178017 113789 139599 362328 654138 815314
43735 815314 778075 607689 402974 277837 327130 488812 554912 462841 427095 571629
43725 571629 602236 188654 -409568 -530411 -4066 536397 439849 -175241 -672738 -711386
43715 -711386 -509300 -412133 -483503 -531031 -351546 86512 597346 885652 766764 330655
43705 330655 -85462 -100991 410740 1115899 1411694 1017190 331823 4235 181748 431661
43695D31661m8130k57217k29448j85822k20778j85513k0825J67556L42186N20191
43685C13861N86808M45314K53507J59245m1643n24755q77221n37854K39781N64085
43675E81128J63806k42104r3457K00475M3869l62162m17061q1668J90730K32673
43665B16229K72256L89008L94482K24605J6584j91452m62413o73538n76546j70053
43655e60838K61206M85262M81935L16390Q9706m1735k5413k1557j41895k02604
43645F40457K522L10490L80011J77927m9949k10614m00408n43657l92783L7714
43635d8290L70709L23631L1689j77007j36934Q3329K91767L08647J22630q2752
43625A087419j46972r7763j2190J01844J41361r5863m95553n35586j0260M76029
$$ plain form
43695 431661 383531 126314 -103134 -288956 -509734 -695247 -716072 -548516 -206330 313861
43685 313861 900669 1345983 1599490 1758735 1717092 1192337 315116 -222738 17043 581128
43675 581128 744934 502830 409373 609848 653717 291555 -125506 -207174 -16444 216229
43665 216229 488485 877493 1271975 1496580 1513164 1321712 859299 185761 -390785 -560838
43655 -560838 -299632 185630 667565 983955 1073661 1031926 1006513 984956 843061 640457
43645 640457 642979 953469 1333480 1511407 1461458 1250844 850436 306779 -86004 -48290
43635 -48290 322419 646050 677739 500732 363798 447127 738894 1047541 1170171 1087419
43625 1087419 940447 842684 830494 932338 1073699 977836 482283 -53303 -63563 412466
43615D12466K89323k24359k12898L33806N34027q051o04765n55352q9870J67592
43605D1919Q2478j02890k77508l85340k31867J88826M97372M37549K52128K15938
43595G18605J88175O371j03617L2141R8577j83686m75391l37976L18L0471j65720
43584a91732j18179J56219K07522p660n8067J81212L49157K67928J67961J45126
43574A099487q79k34995j77140K44979N33448K84726k63259n83086m54781n1384
43564C97116K88493K69384j02799m23399l27191J4816J71559J07828R9163J13487
43554F08457j04231l60718j48289M36347O42478J71560l67792m18178k02312j18847
43544A38475q5386M9254O6744j18024j02759K81760M73766N9476l98287j83812
$$ plain form
43615 412466 701789 477430 264532 598338 1132365 1124314 519549 -35803 -125673 41919
43605 41919 124397 21507 -256001 -641341 -873208 -684382 -187010 250539 502667 718605
43595 718605 906780 913151 809534 841675 940252 756566 281175 -56801 -56483 -26012 -191732
43584 -191732 -309911 -153692 53830 46170 -11897 169315 518472 786400 954361 1099487
43574 1099487 1098608 863613 686473 931452 1464900 1749626 1486367 903281 448500 397116
43564 397116 685609 954993 852194 428795 101604 116420 287979 395807 494970 608457
43554 608457 504226 143508 -4781 431566 1074044 1245604 877812 459634 257322 138475
43544 138475 53089 102343 169087 51063 -51696 230064 703830 763306 365019 181207
43534A81207L83242M58475K7632k05825r2521j70009n08836m56556J90433O59035
43524D66277L15919l65208m98615J7333N37788O02195L18640k5219k77447l57720
43514G33943k21020L2801K06975K32395K15717K09997P6637k75692n88666m52509
43504A70578R8995M76209K80301r7256m9271K84260K57627j41275j97882K95401
43494A377687N72329J09612m96611n22753k54730l00160m04099Q189N60821L92292
43484A042577l13055m93291O8720M21892P8985k32847P4125M40809K02260k54839
43474A035336k02472K05081K68803j10447m12214l70811j89073l4650J00315J41903
43464D31771J7498r5095J675J63865J34534j5644m2180K4600l5301k04351k51869
$$ plain form
43534 181207 564449 1022924 1050556 844731 752210 582201 73365 -383191 -192758 466277
43524 466277 782196 416988 -81627 -64294 473494 1075689 1394329 1369110 1091663 733943
43514 733943 512923 545724 752699 985094 1200811 1410808 1487445 1211753 623087 170578
43504 170578 269573 745782 1026083 928827 879556 1163816 1421443 1280168 1082286 1377687
43494 1377687 1950016 2059628 1563017 1040264 785534 485374 81275 89464 650285 1042577
43484 1042577 729522 236231 304951 726843 805828 572981 647106 1087915 1290175 1035336
43474 1035336 832864 1037945 1306748 1196301 784087 413276 224203 189553 289868 431771
43464 431771 449269 354174 355849 519714 654248 638604 596424 621024 585723 381372 129503
43453A29503j23474J6697R0102J66078K45402K20509M8975j86418l54004l27089
43443g3719q1044J85447K01824j1594j40802k8723J25271J25334M4882j0723r4455
43432B41698k00276j81094o8955j21957l39601l30983N2063L63524K13017j08626
43422d81190q5119K56160M89162M52724L06081J17215j43409l24443k30014K8378
43412C85545J39203j1367k62415l70728j54522L00116M90811l729p31772o93739
43402i12597K30019R07355N37420j64943j47809L36035L18164j88763l27379L3062
43392F20564J62197j05369r2195L60425M67038j42372o98631m80607J48773M61304
43382G01127L65474J35914j70794m66135m15029k2985J40197j68621l55300N1842
$$ plain form
43453 129503 6029 22726 112828 278906 524308 744817 793792 607374 253370 -73719
43443 -73719 -154763 30684 232508 220914 80112 51389 176660 301994 346876 336153 241698
43432 241698 41422 -139672 -208627 -330584 -670185 -1001168 -949105 -585581 -372564 -481190
43422 -481190 -566309 -310149 179013 631737 937818 1055033 911624 587181 357167 385545
43412 385545 524748 513381 250966 -119762 -274284 25832 516643 512914 -218858 -912597
43402 -912597 -682578 224777 762197 597254 449445 785480 1103644 914881 587502 620564
43392 620564 782761 677392 585197 945622 1412660 1270288 571657 91050 239823 701127
43382 701127 1066601 1202515 1031721 565586 150557 127572 267769 99148 -256152 -204310
43372b04310N44786M32961l9500j58876R0423J54897o5101j54123j1621L8144
43362F27680n8753K895K23125J92931k03117n26386m13563l7253K38182L06925
43352C52666K63395J83018J18737J15513J29979Q5294J9380J4367J3150r1247
43342A204252k18126j72760N2224K46605K42925M5601k43374m53056l83238k8336
43332B92717L06821L26254J01390j04972k55503m75132o40572m17749K02509P25838
43322F1601O98915K43247j37564j64506o05J06025J75822L50830N13705L41136
43312B188606j67184n00892k63081K17166K89642j05660m03846k81254k1045R1924
43302A044376J75050L22776L38181K08055K88240O01057N16339l00389j127001
$$ plain form
43372 -204310 340476 773437 733937 575061 665484 820381 755280 601157 589536 627680
43362 627680 568927 571822 794947 987878 784761 258375 -155188 -192441 45741 352666
43352 352666 616061 799079 917816 1033329 1163308 1248602 1267982 1282349 1295499 1204252
43342 1204252 986126 813366 865590 1112195 1355120 1400721 1157347 704291 321053 292717
43332 292717 599538 925792 1027182 922210 666707 191575 -448997 -866746 -664237 61601
43322 61601 760516 1003763 866199 701693 701088 807113 982935 1333765 1847470 2188606
43312 2188606 2021422 1520530 1257449 1474615 1764257 1658597 1254751 973497 952452 1044376
43302 1044376 1219426 1542202 1880383 2088438 2376678 2977735 3494074 3193685 2066684
43293B066684j072899l47205J24168O3368j6749J24987J59039j4717k9565J97660
43283A254771K39830n9890k65466j05620P6771k8173j86810j36432o1311j30610
43273E97060p7362K62964M46172L4336o02489o98057j22366N34038P86146O60845
43263A821287L51771k6812l07326l19650j75046j80731l84833m74654k16137K24262
43253C12131M83914L77280K3223k70470k47463M2143K51138J33932j23375j51329
43243H31124Q2864K47816J51985J2644J04983L43353M01336J64333j26778k08406
43233B005254j30531j44300l00510l37048o4954K83067L16262M6922j05624N9220
43223A627758K08494l492l65037l95467o5302J67194N6340p1444J68586O12225
$$ plain form
43293 2066684 993785 646580 770748 834116 817367 942354 1101393 1086676 1057111 1254771
43283 1254771 1494601 1434711 1169245 1063625 1140396 1112223 925413 788981 727670 597060
43273 597060 519698 782662 1228834 1263170 660681 -37376 -159742 374296 1160442 1821287
43263 1821287 2173058 2146246 1838920 1519270 1344224 1163493 778660 304006 87869 312131
43253 312131 796045 1173325 1196548 926078 678615 720758 971896 1105828 982453 831124
43243 831124 913988 1161804 1313789 1326433 1431416 1774769 2176105 2340438 2213660 2005254
43233 2005254 1874723 1730423 1429913 1092865 1027911 1310978 1627240 1674162 1568538 1627758
43223 1627758 1836252 1832760 1467723 1072256 1006954 1174148 1230488 1159044 1327630 1939855
43213A939855P18008K53698m15331p39141n39172j01508J89782K17832J36316
43204A660339R5037O3989m2567j63461j39705L3794J39863R625k21383k60474
43194A175057m3211J79972J95437J14103J68183L24534L13345L4377k83692l94643
43184A783462l08925j55046L3442K27926K76023Q8193j52812j91942l6904J13407
43174A676824J78736J88114O2337k64173n43491m18827J8530K65165J23222j7392
43164A269045J66115L89246K36228j32298k22689p918L0769l10907o04948m09436
43154D03207J04307M13911L29093J23718O8272J07769N2042j10903k15184j47691
43144A128541L2297J82529K04615Q7147r5424k08267j57412l610Q9090N3254j1420
$$ plain form
43213 1939855 2657863 2911561 2496230 1757089 1217917 1116409 1306191 1524023 1660339
43204 1660339 1755376 1819365 1776798 1613337 1473632 1507426 1647289 1656914 1435531 1175057
43194 1175057 1131846 1311818 1507255 1621358 1789541 2114075 2427420 2461797 2178105 1783462
43184 1783462 1474537 1319491 1352933 1580859 1856882 1945075 1792263 1600321 1563417 1676824
43174 1676824 1855560 2043674 2106011 1841838 1298347 879520 898050 1163215 1286437 1269045
43164 1269045 1435160 1824406 2060634 1928336 1705647 1697729 1728498 1417591 812643 403207
43154 403207 507514 921425 1250518 1374236 1442508 1550277 1602319 1491416 1276232 1128541
43144 1128541 1160838 1343367 1547982 1635129 1539705 1331438 1174026 1170416 1259506 1312760 1301340
43133A301340j0872L165n2023j33057j34668l0334J44382L38344M13849K04532
43123B044658j79592l11701J818L19248J13753l96216m82915J3265M24038K57064
43113A803420j15024j34428P1863L2031k01355j51990K37409M77266L02077M7469
43103B368738Q7428L05953L64065J95036k2908j87437l08221l34686j92767K3438
43093B298639Q9489p2901k81164l21366k02601p5667M5279K90898O08024O43359
43083C021989J82898m20221n72830j88194K21559K64210J28639J67126L58567
43074C163743M56294M04558K99332J40103n7580p6308K22112N46951M73787L7683
43064E610675l00644k57742J468J68201P9443k60528o58489p75559m92314j75291
$$ plain form
43133 1301340 1290468 1293633 1241610 1108553 973885 943551 1087933 1426277 1840126 2044658
43123 2044658 1865066 1553365 1555183 1874431 1988184 1591968 1109053 1122318 1546356 1803420
43113 1803420 1688396 1553968 1625831 1657862 1456507 1304517 1541926 2019192 2321269 2368738
43103 2368738 2456166 2762119 3126184 3321220 3298312 3110875 2802654 2467968 2275201 2298639
43093 2298639 2388128 2315227 2034063 1712697 1510096 1434429 1479708 1770606 2378630 3021989
43083 3021989 3204887 2784666 2211836 2023642 2245201 2509411 2638050 2805176 3163743
43074 3163743 3620037 4024595 4323927 4464030 4406450 4330142 4552254 5099205 5572992 5610675
43064 5610675 5310031 5052289 5053757 5221958 5301401 5040873 4382384 3606825 3114511 2939220
43054B939220k50607n76744o28650k67617J13218K26890K05292K02835J74244
43045B138081J70048L48474N22159K40900m16870p19078l30945R3930q3139m34319
43035A529241j64199N25586O86737J29188k69861O0307N42437L86567k81439p44825
43025B399739p04785m21565j27501J62807L72895L61505J96747R3740Q6245N0315
43015B470142K0926J58778L81006L58220q256l74294l71553m9699K39500K51621
43005C076391K1897k42595l40003k59511k42584m79456o98395l64052N29071J197777
42995B198540R68900J87720k48770j10415J6665j98045l22117j0909K98451R4963
42985B874983k86199j64881L23181L66559k29572o82628l94734K19316M74516
$$ plain form
43054 2939220 2688613 2111869 1483219 1215602 1328820 1555710 1761002 1963837 2138081
43045 2138081 2308129 2656603 3178762 3419662 3002792 2283714 1952769 2046699 1963560 1529241
43035 1529241 1365042 1890628 2577365 2706553 2436692 2496999 3039436 3426003 3144564 2399739
43025 2399739 1694954 1273389 1145888 1308695 1681590 2043095 2239842 2333582 2419827 2470142
43015 2470142 2491068 2649846 3030852 3389072 3380816 3006522 2634969 2585270 2824770 3076391
43005 3076391 3098288 2855693 2515690 2256179 2013595 1534139 835744 471692 1000763 2198540
42995 2198540 3167440 3355160 3106390 2995975 3012640 2814595 2492478 2481569 2780020 2874983
42985 2874983 2588784 2423903 2747084 3113643 2884071 2201443 1806709 2026025 2500541
42976B500541M08684M59045N48821K12842m79596q22762m41874J72149L64462
42967B922312J62045O8570K57813L86324J84692j16818j07225K39952N23075M22181
42957D942921R6921k5584J99392M41924L03391j97050o42370o54946k07679M25933
42947D682853Q70927Q42817L61497j70327k88812M2196M22724N59153N69891O03498
42937H496417M79073P7326j53232L39547J242317J511268P35348k19561m04191
42928A2104312j35548m41401j417305k016056j572546p14832l77801n68057o57161
42919D203605m29644j90041q9005Q168P8320m0030j89033r495M15207N65005K75463
42908D598520J3004J27049L05872J26816k36005k96459k0652J46127n3775l75910
$$ plain form
42976 2500541 2909225 3368270 3917091 4129933 3650337 2827575 2385701 2557850 2922312
42967 2922312 3084357 3152927 3410740 3797064 3981756 3864938 3757713 3997665 4520740 4942921
42957 4942921 5039842 5014258 5213650 5655574 5958965 5761915 5119545 4464599 4256920 4682853
42947 4682853 5553780 6396597 6758094 6587767 6298955 6341151 6763875 7323028 7892919 8496417
42937 8496417 8975490 9052816 8899584 9239131 10481448 11992716 12728064 12508503 12104312
42928 12104312 11968764 11527363 10110058 8094002 6521456 5806624 5428823 4860766 4203605
42919 4203605 3773961 3583920 3494915 3503083 3581403 3541373 3352340 3342845 3758052 4323057 4598520
42908 4598520 4611524 4738573 5044445 5171261 4935256 4638797 4618145 4764272 4710497 4334587
42898D334587m55342k31313O9613K00618R7718q3108j23001J7035J65700J90821
42888D183328J58220J73010K14478K30078K28510J61902q4744m27862n40557l04160
42878C992203o9318j51754k84663q57N67915P85668M31951K5200O8472M09385
42868E774202N97793N17625L47124J52646j28851m35601o00836n65218l83425
42859E275459j23195Q3996N7428j65121k54094l2276J93461O6937k10064j23652
42849D768879L49449O34436L36040k63563o24711n41730j65553K53194M63055
42840E209496L35542Q2768R2597L75307M84994K09006l1979J82516N77087N87517
42830H104851K28974K3671J74394L48416K71577L6050k09551l89399k84584K84234
$$ plain form
42898 4334587 3879245 3647932 3717545 3918163 4015881 3932773 3809772 3826807 3992507 4183328
42888 4183328 4341548 4514558 4729036 4959114 5187624 5349526 5264782 4836920 4296363 3992203
42878 3992203 3922885 3771131 3486468 3485611 4053526 4839194 5271145 5296345 5364817 5774202
42868 5774202 6371995 6889620 7236744 7389390 7260539 6824938 6224102 5658884 5275459
42859 5275459 5152264 5236260 5293688 5128567 4874473 4842197 5035658 5102595 4892531 4768879
42849 4768879 5118328 5752764 6088804 5825241 5200530 4658800 4493247 4746441 5209496
42840 5209496 5545038 5627806 5720403 6095710 6580704 6789710 6757731 6940247 7517334 8104851
42830 8104851 8333825 8357496 8531890 8880306 9151883 9187933 8978382 8588983 8304399 8588633
42820H588633R69955J149994Q03881N39907N48101K48568o06391j227896q96135
42811A0118617j96023k37990r57290j191586m36849M54993O08197L17855L92958
42802H872882Q67454J002653L69449n86834j087745q48346k91974l3907k01734
42793H061898l43131n9301M60735P59599P64715P29810O39580J97358n30019r85067
42783I696177q62039n45450n22726p09998o80340k96243J98027N18333N05974
42774G301715J31246m09988p44471o86417m39064k88122k64860k49720j96136
42765D154183r3890O7614J54682k1322l12884k79701J38691L76409K9731m57268
42755C756245l81615J79654M68698J05419m68661o44250l11601K27266O67243
$$ plain form
42820 8588633 9558588 10708582 11512463 12052370 12600471 12849039 12242648 11014752 10118617
42811 10118617 9922594 9684604 8727314 7535728 7098879 7553872 8162069 8479924 8872882
42802 8872882 9740336 10742989 11112438 10525604 9437859 8589513 8297539 8263632 8061898
42793 8061898 7718767 7659466 8120201 8879800 9644515 10374325 11013905 11211263 10681244 9696177
42783 9696177 8834138 8288688 7765962 7055964 6375624 6079381 6277408 6795741 7301715
42774 7301715 7432961 7022973 6278502 5592085 5153021 4864899 4600039 4350319 4154183
42765 4154183 4060293 4127907 4282589 4261267 3948383 3668682 3807373 4183782 4213513 3756245
42755 3756245 3374630 3554284 4022982 4128401 3659740 3015490 2703889 2931155 3598398
42746C598398Q65026Q05665N47797J65834k21806l58098j0605O18205R15093N62915
42736G488424j7709k56632k13238l46124p10163r03863p45768m97508l94081l91087
42726C012251m08602m21512k94623O2516L74331K69302j19650k91471j30925l801
42716B047816m5887M1880L25843L91125N1720k66302k18771q2136j61018j79388
42706A904882J70756N09577K88443k40757l11864J89142N61003L61572j8684q3535
42696C330535L8334l3277k24561j43858K45703N26518M20012J49522P7963K06449
42686D593340K54130J45590J46591M42038Q22244R99213J072816J378222J910545
42677A1764729K218000J916870J033821k04498j564568k651309k958616k398226
$$ plain form
42746 3598398 4463424 5269089 5816886 5982720 5760914 5402816 5392211 6010416 6925509 7488424
42736 7488424 7470715 7214083 7000845 6654721 5944558 5040695 4294927 3797419 3403338 3012251
42726 3012251 2603649 2182137 1887514 1950030 2324361 2593663 2474013 2182542 2051617 2047816
42716 2047816 2001929 2043809 2369652 2760777 2812497 2546195 2327424 2245288 2084270 1904882
42706 1904882 2075638 2585215 2873658 2632901 2321037 2510179 3071182 3432754 3414070 3330535
42696 3330535 3368869 3335592 3111031 2967173 3212876 3739394 4159406 4308928 4386891 4593340
42686 4593340 4847470 4993060 5139651 5581689 6403933 7403146 8475962 9854184 11764729
42677 11764729 13982729 15899599 16933420 16728922 15164354 12513045 9554429 7156203
42669G156203j536481r92231p86853n77794l01287j74995k02640j36927O9982
42660B516977J90895J49420J42373K44669K55034Q2464n0453O462M0892j62277
42650C416456m07350l49666l0222J78396J14787J1009R2099K52327K44213J8187
42640C540236k55443m02365l69079j96792J6147J36137O4495j70913l98339m04937
42630A559147j24429K31352L09303J2650k84954j20946M38179Q02632N94333J09947
42620C527214j74143k85762n43855q29483o34633P7068O06620M12213j52106l77639
42610A625494j64039K5111k8989o8269Q3792K26032J73614O6587Q4484J20022
42600B143839l9266l55536n59519m63988j39274J93694L72909L94215L21805J58179
$$ plain form
42669 7156203 5619722 4627491 3840638 3262844 2961557 2786562 2583922 2446995 2516977
42660 2516977 2707872 2857292 2999665 3244334 3499368 3581832 3531379 3537841 3578733 3416456
42650 3416456 3009106 2659440 2629218 2807614 2922401 2933410 3025509 3277836 3522049 3540236
42640 3540236 3284793 2882428 2513349 2316557 2332704 2468841 2533336 2362423 1964084 1559147
42630 1559147 1434718 1666070 1975373 1988023 1703069 1582123 2020302 2822934 3417267 3527214
42620 3527214 3353071 3067309 2523454 1693971 1059338 1136406 1743026 2155239 2003133 1625494
42610 1625494 1461455 1486566 1457577 1389308 1473100 1699132 1872746 1939333 2023817 2143839
42600 2143839 2104573 1749037 1189518 725530 586256 779950 1152859 1547074 1868879 2027058
42590B027058r0448k49207j05075K14864K70357q7924m09420k37462K17720L79133
42580A929596J13164j83191k12846o5103Q8299J64230N6995k26852l55045n1372
42570A257875L34353J79716m40248p33325k99649L33337N43722M10520L11950
42561A898251K41816N276k63673k69894l7176J63005K00834J18934l7969j74776
42551A844628j32844N7990J42329L2148m9567J0721J2776j29881j66414J6486
42541A638372J25117j0829q4941J16659K45142k9155l74100k88880Q9270K41330
42531A667985O7208j21420j77685j55880L419K96243L88832N8360l30528l16757
42521A379777m2922R0110J45189L74855N52063L35374K4492J09973L06239j5829
$$ plain form
42590 2027058 1936610 1687403 1582328 1797192 2067549 1979625 1570205 1332743 1550463 1929596
42580 1929596 2042760 1859569 1646723 1581620 1669919 1834149 1891144 1664292 1309247 1257875
42570 1257875 1592228 1771944 1331696 598371 298722 632059 1175781 1586301 1898251
42561 1898251 2140067 2145343 1881670 1611776 1574600 1737605 1938439 2057373 2019404 1844628
42551 1844628 1711784 1769774 1912103 1944251 1894684 1905405 1918181 1788300 1621886 1638372
42541 1638372 1763489 1752660 1667719 1784378 2029520 2000365 1626265 1337385 1426655 1667985
42531 1667985 1735193 1613773 1436088 1280208 1283627 1579870 1968702 2027062 1696534 1379777
42521 1379777 1336855 1426965 1572154 1947009 2499072 2834446 2858938 2968911 3275150 3259321
42511C259321n88235n15273J99601N22491K971n65263m75859r3992j731o5934
42501A678097L2188J12634n937J6275M03945O75153L49418k31362m29104k37928
42491B363379p3127j5747J17577K69362K82816K71832L42754K57018j31780m47714
42481C236370l17667L5906K63734N20763R72151J104327L79963o88199j040594
42472D466754n63302j80381m14275p38880n67843q0233K73554M23089M56225K99085
42462C373793J0198o8531J56215K50535r8282n18977m80910r3952R4878o8086
42452B556881j97800j7737K74132L63190K22052K5109j24281k25191k46953j12929
42442B516473J74362M48279M72696J78697j95781l05194r6760R4517k8239k99969
$$ plain form
42511 3259321 2671086 2155813 2355414 2877905 2880876 2315613 1839754 1745762 1744031 1678097
42501 1678097 1710285 1822919 1816982 1833257 2237202 2912355 3261773 3030411 2601307 2363379
42491 2363379 2290252 2274505 2392082 2661444 2944260 3216092 3558846 3815864 3684084 3236370
42481 3236370 2918703 2954609 3218343 3739106 4711257 5815584 6195547 5507348 4466754
42472 4466754 3903452 3723071 3308796 2569916 2002073 1921840 2195394 2618483 3074708 3373793
42462 3373793 3383991 3315460 3471675 3722210 3623928 3104951 2624041 2530089 2624967 2556881
42452 2556881 2359081 2341344 2615476 2978666 3200718 3225827 3101546 2876355 2629402 2516473
42442 2516473 2690835 3139114 3611810 3790507 3594726 3289532 3192772 3287289 3259050 2959081
42432B959081l05804N963K07979J8201k38364q7632L52388N09084K13702n9387
42422C575211K5274J25479j67661n65835m67665Q6829M32563K44255n9093k718
42412C226639L10648M72477L38717J03565J6235J69624M13383M49638K04044K5188
42402E730158K29195N95444P61323R48139J593348K264804J838406J02966j629957
42393A2433826k087619j542227j092268j037049q33382l07452N1892k4368k14632
42384E346721k37549k29066l37988m44784m32434l39290j46300K13131N52229
42375C944670N14488Q1366l04675k47688J78024N60427N36639Q4442l92515l76680
42365D578498J51307N74746L86998j29474l29400r7116J55233K21175K70960L37513
$$ plain form
42432 2959081 2653277 2659240 2867219 2885420 2647056 2559424 2911812 3420896 3634598 3575211
42422 3575211 3600485 3725964 3558303 2992468 2524803 2611632 3044195 3288450 3229357 3226639
42412 3226639 3537287 4009764 4348481 4452046 4468281 4637905 5051288 5500926 5704970 5730158
42402 5730158 5959353 6554797 7316120 8264259 9857607 12122411 13960817 14063783 12433826
42393 12433826 10346207 8803980 7711712 6674663 5841281 5533829 5585721 5561353 5346721
42384 5346721 5109172 4880106 4542118 4097334 3664900 3325610 3179310 3392441 3944670
42375 3944670 4459158 4540524 4235849 3988161 4166185 4726612 5263251 5347693 4955178 4578498
42365 4578498 4729805 5304551 5691549 5562075 5232675 5135559 5290792 5511967 5782927 6120440
42355F120440K17684m0660r2848J25864K64976J54842O6116J85846K97479K24614
42345G524353J60473K65634L32186J79041K3661Q0726J09296j83852n23921l84282
42335G583315J60535M45543J63097k03088j31756J70552J63149j30969j46931
42326H073447L21803P62648O77484K64189N6073J93063M19272N59536N84348M06384
42316A2318247P8158R477M46520Q95633P24196K32452L20997J051450J458600
42307A7535730J055869O05193R25917J767023K413089K622208K345751J346355
42299C0617135q9752p90882J606J539582K678472L430089M276225M525564K885794
42290D9073833l55458l109183l780050k780686j464368m93622K40673P37424N32136
$$ plain form
42355 6120440 6338124 6297464 6204616 6330480 6595456 6750298 6816414 7002260 7299739 7524353
42345 7524353 7684826 7950460 8282646 8461687 8485348 8566074 8675370 8491518 7967597 7583315
42335 7583315 7743850 8189393 8352490 8149402 8017646 8188198 8351347 8220378 8073447
42326 8073447 8395250 9157898 9835382 10099571 10155644 10348707 10767979 11327515 11911863 12318247
42316 12318247 12396405 12405882 12852402 13748035 14472231 14704683 15025680 16077130 17535730
42307 17535730 18591599 19196792 20122709 21889732 24302821 26925029 29270780 30617135
42299 30617135 30527383 29736501 29738107 31277689 33956161 37386250 41662475 46188039 49073833
42290 49073833 48718375 45609192 41829142 39048456 37584088 37090466 37331139 38068563 38600699
42281C8600699q30459l050658m840422m895206l387406j903628j458853j363340
42273A6870727p35381j15772l84843r55138o21934L31199N75768j336k13057L33777
42263A5084010P74787O91689O20864P14200N14105K20816N43872J154050J014486
42254B1332879L70555M92832J275742J272278M69190N93099J945007K455813J002258
42245C1209653p44255j104029p06910n59540j02608J112709J992891J925677K137341
42236C5160929L323942M215095M261682N133968P536458R529952J0414692J2819686
42228I2396404J8017176K3442068K8863162L9236170N3710270N6469474L0681130
42221C42815854j7104010n7346870o7233301n2359979l4194049k4343741j9227650
$$ plain form
42281 38600699 37770240 34719582 29879160 24983954 21596548 19692920 18234067 16870727
42273 16870727 16135346 16019574 15634731 14679593 14057659 14388858 14964626 14963290 14750233 15084010
42263 15084010 15858797 16550486 17171350 17885550 18399655 18620471 19164343 20318393 21332879
42254 21332879 21703434 22196266 23472008 24744286 25213476 25806575 27751582 30207395 31209653
42245 31209653 30465398 29361369 28654459 28094919 27992311 29105020 31097911 33023588 35160929
42236 35160929 38484871 42699966 46961648 52095616 59632074 69162026 79576718 92396404
42228 92396404 110413580 133855648 162718810 201954980 255665250 312134724 342815854
42221 342815854 325711844 268364974 201131673 148771694 114577645 90233904 71006254
42214G1006254j3886840r647945q245845p383182n016886k728620k294727k594346
42206A9207863k004982j028775p11986o29700q329P70732R97491P24223K72435
42197A7588972k26030l91924J16107O71140L00297o65811r48956l91158j39075
42188A5913562o10551q91799m82513n4639j5397J82882P66192J095727R75284
42179A6878748J135816J809122K180156J959449K142090L302970M328835L853225
42171C7590411J998145k24488k294468l974408m614541l867442k565897j819339
42163B0227973j601030j149288l97116j2061j90277l55383j22181J78646J27163
42154A6706446j38625j46864K54173O18700K91875q60538k172325k829321k711884
$$ plain form
42214 71006254 57119414 47471469 39225624 31842442 26825556 24096936 21802209 19207863
42206 19207863 17202881 16174106 15462120 14832420 14824091 15594823 16592314 17316537 17588972
42197 17588972 17362942 16971018 17087125 17758265 18058562 17392751 16443795 16052637 15913562
42188 15913562 15303011 14411212 13928699 13874060 13858663 14041545 14807737 15903464 16878748
42179 16878748 18014564 19823686 22003842 23963291 26105381 29408351 33737186 37590411
42171 37590411 39588556 39364068 37069600 33095192 28480651 24613209 22047312 20227973
42163 20227973 18626943 17477655 17080539 17068478 16878201 16522818 16400637 16579283 16706446
42154 16706446 16567821 16420957 16675130 17293830 17585705 16725167 14552842 11723521 9011637
42145I011637k276086j761407j071043l83833j60322l64207l67899O9948L67843
42136C064631K7600o04168q98773p61662m67315j51225J06033J20059n9176o1268
42126C14736J83332K07190k01860m95176j74224L70925M46332Q7808j44859j04617
42116D89587r8635j81456r7804J16285R6478k21608m32231k30240J99510M51461
42106I1347L21922n5528l30115k49887K5521R5507r4360j47407J11078K67574
42096C5652j3925l52283j82533L46735N70277K48410k23251m60425m36366k21700
42086f89409J23912L72261K81306n224q0043J58144L86075L31831N8517k33395
42076G03975l85116k76087N1825K94037K13768J4564M7894K42569K45984O5215
$$ plain form
42145 9011637 6735551 4974144 3903101 3519268 3358946 2994739 2626840 2696788 3064631
42136 3064631 3092231 2488063 1589290 827628 360313 209088 315121 435180 376004 314736
42126 314736 498068 705258 503398 8222 -166002 204923 651255 739063 594204 489587
42116 489587 390952 209496 111692 227977 324455 102847 -329384 -559624 -360114 91347
42106 91347 413269 357741 27626 -222261 -196740 -101233 -195593 -343000 -231922 35652
42096 35652 21727 -330556 -513089 -166354 403923 652333 429082 -31343 -467709 -689409
42086 -689409 -565497 -193236 88070 82846 2803 160947 547022 878853 937370 703975
42076 703975 318859 42772 94597 388634 602402 616966 664860 907429 1153413 1218628
42066A218628N2884K28323J80352j89735l81328n5699L80472L57432k6133j95989
42056A569207P5462M61748N90349L73748j16078p21076j102386r23081k82222
42047g4329K66620L03889l669j94902j06751M6398R6659J37523K65233L61323
42037A097994K81096Q4231p8353j54721j15965J09988M02856L75836j08869n36792
42027A357301l30222K56691M10796m5796m01343k00940N7213j83090n65399m00233
42017d5022K02864N16330K88162n6563k08675k74820k78657m4809K84279K34973
42007F18062k55673o02021l61057J61210L96300K51106L7373n4155o4980k7414
41997I8751P4474J70541J52535L4508n3459n049J61217K78482J48066j91774l94591
$$ plain form
42066 1218628 1271512 1499835 1680187 1490452 1109124 1053425 1433897 1791329 1765196 1569207
42056 1569207 1644669 2106417 2696766 3070514 2954436 2233360 1130974 207893 -74329
42047 -74329 192291 496180 492511 297609 190858 237256 333915 471438 736671 1097994
42037 1097994 1379090 1463321 1384968 1230247 1114282 1224270 1627126 2002962 1894093 1357301
42027 1357301 1027079 1283770 1694566 1648770 1247427 1046487 1103700 920610 355211 -45022
42017 -45022 157842 674172 962334 905771 697096 422276 143619 98810 383089 618062
42007 618062 362389 -239632 -600689 -439479 -43179 207927 245300 191145 126165 98751
41997 98751 173225 343766 496301 530809 477350 472301 633518 912000 1060066 868292 473701
41986D73701k19954O3270l849l84670n59639k73026J27827K27301M6865j49222
41976f51396k03483l4755L87993Q15242Q05535L13115j31291j10411J31416J49482
41966A471447k9137j02537p2123j43154k47807j61278L9083J12322J32556L10578
41956A309950M31563Q2807n34291o80377j55026L27541J71332k49505k41560J47083
41946F09517L14341J03603k8939J74786L75126K10823j51350k95474j22559J16416
41936A306290K11506J89114J55767J17266m685k33917m51429m68933k23151J26843
41926G24671L54344L98250L76713M01917M84243O07383P69363R11776R13850P22043
41916F664553M35245K25232J92278K76998K88872J12956m6054J96537Q45631J356508
$$ plain form
41986 473701 253747 317017 313168 -71502 -631141 -904167 -776340 -549039 -502174 -651396
41976 -651396 -854879 -889634 -501641 313601 1119136 1432251 1300960 1190549 1321965 1471447
41966 1471447 1442310 1339773 1267650 1124496 876689 715411 754494 866816 999372 1309950
41956 1309950 1741513 1824320 1290029 609652 454626 782167 953499 703994 462434 609517
41946 609517 923858 1027461 998522 1173308 1548434 1759257 1607907 1312433 1189874 1306290
41936 1306290 1517796 1706910 1862677 1979943 1975258 1741341 1289912 820979 597828 724671
41926 724671 1079015 1477265 1853978 2255895 2740138 3347521 4116884 5028660 5942510 6664553
41916 6664553 7099798 7325030 7517308 7794306 8083178 8196134 8150080 8346617 9192248 10548756
41906A0548756J415164J648172K812359M201555L816852P88803l040654m904658
41898A7286349m173487k656334j995687j954942j579474q60823m27884l58847
41890C278871k60164j20728k02926l20904p2523L26938K72746j77051l09842O2010
41880B476427K62450j21145n52232m43735p8828m3445k49625k07442N8097Q3790
41870A184312j68991k14277J45669M85388L99066L7161j97971j54585O7417L36433
41860A919622M98700L94093R1958m8373K17648O57659Q31988O71035N36340O63251
41850F433921P74873M33839l18690r05378q60433l71406j8584o2216k16514j61811
41840D727601k7983j66765n74631q15460n59929o298L52346K79171o787j38834
$$ plain form
41906 10548756 11963920 13612092 16424451 20626006 24442858 25231661 22191007 17286349
41898 17286349 13112862 10456528 8460841 6505899 4926425 4065602 3637718 3278871
41890 3278871 3018707 2897979 2695053 2374149 2301626 2628564 2901310 2724259 2414417 2476427
41880 2476427 2738877 2617732 2065500 1621765 1542937 1499492 1249867 1042425 1100522 1184312
41870 1184312 1015321 801044 946713 1432101 1831167 1868328 1670357 1515772 1583189 1919622
41860 1919622 2418322 2812415 2904373 2856000 3073648 3731307 4563295 5234330 5770670 6433921
41850 6433921 7208794 7642633 7323943 6418565 5558132 5186726 5168142 5105926 4889412 4727601
41840 4727601 4699618 4532853 3958222 3142762 2582833 2576535 2928881 3208052 3201265 3062431
41830C062431M618K31056K73967M9391k89069m95936m43225k28303p2279q1842
41820B010809j41329r7702K414n020j02271p8687J12260K14154N5907j29832l6091
41809A804612K29600L17818K02574J70532K44001P6522m14970p46245n02813L5659
41799A417290K77802J16419n0902K6243J92573K70234L13319L86636L99644L04132
41789C653390K29098K69783L16374K33137O0898r8882k61751m46645m91910k11313
41779C252179K84658O54651P88578R92379J514845K005244J738211M74126j107260
41770A0597611k010227j866717j129055m41022p5702J4357j00786l84929p23723
41761C879807r28323q47703m57710P4866M06700K57986k64387o93588o52140k10044
$$ plain form
41830 3062431 3067049 3298105 3572072 3621463 3332394 2836458 2393233 2164930 2092651 2010809
41820 2010809 1869480 1771778 1774192 1769172 1666901 1588214 1700474 1914628 1970535 1840703 1804612
41809 1804612 2034212 2352030 2554604 2725136 2969137 3045659 2630689 1884444 1381631 1417290
41799 1417290 1695092 1811511 1760609 1786852 1979425 2249659 2562978 2949614 3349258 3653390
41789 3653390 3882488 4152271 4468645 4701782 4762680 4663798 4402047 3955402 3463492 3252179
41779 3252179 3536837 4191488 4980066 5972445 7487290 9492534 11230745 11704871 10597611
41770 10597611 8587384 6720667 5591612 5150590 5074888 5089245 4988459 4603530 3879807
41761 3879807 2951484 2103781 1646071 1720937 2127637 2385623 2121236 1427648 775508 565464
41751E65464K45242L94460K12973m8848o3978K45864N46106M32134k8279l39415
41741B161723k37245Q27N6520L4719J53162K86800K11607P6809J89519M60155
41731C394596N22649L51086K85025M16461M20821J15583k39138l81072m15524
41722D470487n16778n76952m29274j92138j07162j72847j79645k3455J96426L16438
41712B785100K17041j05668m57654n53863l30212l2851J11074J57789K39666K65583
41702B296005N7041l04698n06749l85498j09404M7189k283j18169j18203K6667
41692H81898J67089J60913O0594L2599J04199J29191L2240p7501j07752j28490
41682A254980k03896k41856j66535j05650k15219m03582m24978k09835P0466K49687
$$ plain form
41751 565464 810706 1205166 1418139 1369291 1305313 1551177 2097283 2529417 2501138 2161723
41741 2161723 1924478 1925305 1981825 2016544 2169706 2456506 2668113 2744922 2934441 3394596
41731 3394596 3917245 4268331 4553356 4969817 5390638 5506221 5267083 4886011 4470487
41722 4470487 3953709 3376757 2947483 2755345 2648183 2475336 2295691 2272236 2468662 2785100
41712 2785100 3002141 2896473 2438819 1884956 1554744 1521893 1632967 1790756 2030422 2296005
41702 2296005 2353046 2048348 1541599 1156101 1046697 1093886 1091603 973434 855231 881898
41692 881898 1048987 1209900 1270494 1303093 1407292 1536483 1568723 1491222 1383470 1254980
41682 1254980 1051084 809228 642693 537043 321824 -81758 -506736 -716571 -646105 -396418
41672c96418L18211L25644K76854J62844N319j53286k50889k15539m2613J56869
41662A86996K50136K04904P4054q1676j84687j30723Q6993K77064K10061r9152
41652G93970l68053l40456l9156K96881M60908M21896K70932J04391j7013n0039
41642A534261Q693P5056L7635q7296j39620j8624J86220L50462M77700N65527
41632B990014M49390K8675m20677m58601m0677L88217M19099Q2022l01843m25604
41622B710015j36428M26725P79777N17199j11034m09048j53363J19085m5147l51844
41612C345937l00979K8522K17847K14152K61752L49718K85129J80532L14566N85047
41602E482223O51315N78163P57787J175886J380622J309744J520227K336473L366876
$$ plain form
41672 -396418 -78207 247437 524291 687135 692454 539168 288279 72740 30127 186996
41662 186996 437132 642036 716090 634414 449727 319004 405997 683061 893122 793970
41652 793970 425917 85461 46305 343186 804094 1225990 1496922 1601313 1584300 1534261
41642 1534261 1542954 1618010 1655645 1568349 1428729 1410105 1596325 1946787 2424487 2990014
41632 2990014 3439404 3468079 3047402 2588801 2548124 2936341 3355440 3437462 3135619 2710015
41622 2710015 2573587 3000312 3780089 4297288 4186254 3777206 3623843 3742928 3697781 3345937
41612 3345937 3044958 3073480 3291327 3505479 3767231 4116949 4402078 4582610 4897176 5482223
41602 5482223 6133538 6711701 7469488 8645374 10025996 11335740 12855967 15192440 18559316
41593A8559316M285398N574395P786562J0128666J0389972O744844k16630p328698
41585E5923825j1080731j0434595p466141n055104m167999l749647k824557j716058
41577I428993j100451q84198o04978k79399j92272k71701k77841k87275m35939
41568E094939m78711j66700J92819J25348k64827m89588m23834k92880j11545
41559C185021K30175M65319K26633k25052k51586J58947L49691N0960k50555j94749
41549C744804p7712j87995k88200j67666j09956l32391m91462k75433j4101j07108
41539A692780k64489m704M01834K68734l51623o42785k32785K85119K71094j18546
41529A304629l44892k79328j70138j18574j9776J05929R6686m8468j30159n4409
$$ plain form
41593 18559316 22844714 28419109 36205671 46334337 56724309 63469153 63252523 55923825
41585 55923825 44843094 34408499 26942358 21887254 17719255 13969608 11145051 9428993
41577 9428993 8328542 7444344 6839366 6559967 6367695 6095994 5818153 5530878 5094939
41568 5094939 4616228 4449528 4642347 4767695 4502868 4013280 3589446 3296566 3185021
41559 3185021 3415196 3880515 4107148 3882096 3630510 3789457 4139148 4190108 3939553 3744804
41549 3744804 3667092 3479097 3190897 3023231 2913275 2580884 2089422 1813989 1799888 1692780
41539 1692780 1428291 1423587 1825421 2094155 1742532 1099747 866962 1152081 1423175 1304629
41529 1304629 959737 680409 510271 391697 371921 477850 574536 526068 395909 341500
41519C41500K4218n8844k30324k69752r4454J32395J85507K1291j88996k44167
41509c81626r6268J32030K63128K04887K8490j00424j16408j36143k53221l14839
41499g70394q4121L79216P12715O77603L82346J9252l54000o31759n59734r1112
41489c19988L71494M10837J36243k3195N2685J10987K7036k3586O8946J65653
41479I77112J53472J03672O1268m4539j85484k14142j66797k85326n83130o86534
41469h70428l25785K56334O10694N95266L79158J47471K9604J18140L12502L32008
41459A584964J24653L7084K90738N53706M36124J73900K92947P46009J021580
41450E261705J083092J431208K006448J827850L09246j620689k464931j952956
$$ plain form
41519 341500 365718 306874 76550 -193202 -287656 -155261 30246 51537 -137459 -381626
41509 -381626 -477894 -345864 -82736 122151 150641 50217 -66191 -202334 -455555 -770394
41499 -770394 -854515 -475299 237416 915019 1297365 1316617 962617 330858 -228876 -319988
41489 -319988 51506 462343 598586 575391 628076 739063 766099 742513 811459 977112
41479 977112 1130584 1234256 1295524 1250985 1065501 851359 684562 399236 -183894 -870428
41469 -870428 -1196213 -939879 -329185 266081 645239 792710 822314 940454 1252956 1584964
41459 1584964 1709617 1746701 2037439 2591145 3027269 3201169 3494116 4240125 5261705
41450 5261705 6344797 7776005 9782453 11610303 11919549 10298860 7833929 5880973
41442E880973j144494q58840q23882n43475k10537k59148n30353n05283j32482
41433H72479J51678J49123J13121J91167J57022j13536l18926j85189N6088N160
41423A078187k73970l57721j37338K3639j13727k83613j46835J72777K86076J25997
41413C73472J241P8533J36517m9475l35355m25691l00398j76707j21387J6372
41403h02878K51470L26157R0427j91848j64638J06278K29324P9528k0042J78506
41393H2284M20883K85254k07310n84551m96349p9748K71157L27649J66751J4252
41383B00272J1635Q3197K9864j95419l70483k80595m3686L4184r2040j44409L0980
41372g36500K09850J43754l9284k9876J79634K78873J03996j27081j36764K8381
$$ plain form
41442 5880973 4736479 3877639 3053757 2510282 2299745 2040597 1510244 1004961 872479
41433 872479 1024157 1173280 1286401 1477568 1634590 1521054 1202128 1016939 1073027 1078187
41423 1078187 804217 446496 309158 332797 219070 -64543 -211378 -38601 247475 373472
41413 373472 374713 453246 589763 540288 204933 -220758 -521156 -697863 -819250 -802878
41403 -802878 -551408 -225251 -134824 -326672 -491310 -385032 -155708 -76180 -96222 82284
41393 82284 503167 788421 581111 -3440 -499789 -579537 -308380 19269 186020 200272
41383 200272 211907 295104 324968 129549 -240934 -521529 -565215 -531031 -623071 -767480 -736500
41372 -736500 -526650 -382896 -422180 -452056 -272422 6451 110447 -16634 -153398 -125017
41362a25017Q7373p5382k59216k23408j890J51828R3779n3101r6893j7697P4208
41351d45416J31769J93802K55975K51321J53804J527j57768k50049j74790L9040
41341g85J64825N9415q3023j9984R2855p9543m13387l89011Q8786M40833K49023
41330A10004j35855k03120o1473j01376k30032o3576L19283M59804K73643R9998
41320D67300K3302k02097m91576l81874J59558N21848L41984J7298k9058j4265
41310D12420k53684m71705k59085J50257K07690p0983j89068q490J11354j0052
41300c81346j35484j04064n1142l9592N8147J89061Q4123k36115l41994p146M17708
41289e47844M92552K47661O26j18527j78018j83004q1734R5555L08637N67949
$$ plain form
41362 -125017 -37644 -113026 -372242 -595650 -597540 -445712 -351933 -405034 -501927 -519624 -445416
41351 -445416 -313647 -119845 136130 387451 541255 542782 385014 134965 -39825 -785
41341 -785 164040 223455 140432 120448 213303 133760 -279627 -668638 -579852 -139019 110004
41330 110004 -25851 -228971 -290444 -391820 -621852 -685428 -366145 93659 367302 467300
41320 467300 490602 288505 -203071 -584945 -425387 96461 438445 455743 426685 412420
41310 412420 158736 -312969 -572054 -421797 -214107 -285090 -474158 -482648 -371294 -381346
41300 -381346 -516830 -620894 -672036 -711628 -653481 -464420 -380297 -616412 -958406 -965552 -547844
41289 -547844 -55292 192369 192995 74468 -103550 -286554 -368288 -272733 35904 603853
41279F03853P42936N28813j21040p11441p01629k01419J73904J15368q3990j04237
41269B41118p2403k29136m21606k97837J00306L22922J54937o3602L8436K83984
41259E7119K30780r6762j91590J58702N10596M16346O8988p6378m8913k34584
41249G94304o29011p69609m62234o5133R9163J39403J87518P3128k52544l85232
41239a270247j6528M80392N09416J03851j87949j53529j11083k49868l07616n0328
41229a253489L48433N91659N99040M20806J29512o6551N5357L25475K56583k34877
41219A171948n46534j77870M94992O67986J60026m36283n87072l56921q3485P7737
41209C84524J47290J69371K21953L55264M18359J97254j60414j54564M35007J208494
$$ plain form
41279 603853 1346789 1875602 1754562 1043121 341492 140073 313977 429345 345355 241118
41269 241118 168715 -60421 -482027 -779864 -679558 -356636 -201699 -265301 -226865 57119
41259 57119 287899 191137 -453 158249 668845 1085191 1154179 1077801 1028888 794304
41249 794304 165293 -604316 -1066550 -1131683 -1032520 -893117 -705599 -632471 -885015 -1270247
41239 -1270247 -1286775 -806383 -296967 -193116 -381065 -534594 -645677 -895545 -1203161 -1253489
41229 -1253489 -905056 -313397 285643 706449 835961 769410 824767 1150242 1406825 1171948
41219 1171948 625414 447544 942536 1610522 1770548 1334265 747193 390272 306787 384524
41209 384524 531814 701185 923138 1278402 1696761 1894015 1733601 1579037 2014044 3222538
41199C222538J706746K011453K346234K304927J173085q41255k370531k367310
41191G185887j396158q37004j060690j180031o20823k3563j36096n85031n43649
41182H02842j34564j68919o50225o48836J11697O28750J77313m35265j05289P17640
41172B95144O08885o07884j452956q55497M16759R31491M22913k31408l55907
41163h28460o3210K72468M59046M09890J11144k47753l96164k73430l8176J33522
41153d61123J11607j52415m55056m19239R074L81650L65532K58416M71030P64114
41143H73590N74152l4326l81839j65680J72786K03139N3212j5602n0194j24034
41133A105204o9632J62585K60496K7772k23553j37967J05771Q7098j93139l47639
$$ plain form
41199 3222538 4929284 6940737 9286971 11591898 12764983 11923728 9553197 7185887
41191 7185887 5789729 4952725 3892035 2712004 2091181 2067618 1931522 1346491 802842
41182 802842 668278 499359 -150866 -799702 -688005 -59255 118058 -317207 -422496 295144
41172 295144 904029 296145 -1156811 -2012308 -1595549 -664058 -241145 -472553 -828460
41163 -828460 -891670 -619202 -160156 249734 360878 113125 -283039 -556469 -594645 -461123
41153 -461123 -349516 -501931 -956987 -1376226 -1367152 -985502 -619970 -361554 109476 873590
41143 873590 1447742 1413416 1031577 865897 1038683 1241822 1295034 1279432 1229238 1105204
41133 1105204 1035572 1198157 1458653 1486425 1262872 1124905 1230676 1317774 1124635 776996
41123G76996j78143J38203L59004L84760K35175N1278J5377P9762m0350l90911
41113A431151n55036k17124K96312M34159J87194n66M8207Q8263k8428j37220
41103A546912j06910k0934M0631R0654R6925L6836L5804J49423J29636k05357
41093A793620n08735l11854J92928L53506L5024k29511j40005r767n8669j2231
41083A104306K66979L83168P7114k54939k00995j7115j40426m24065m32346j90035
41073A71646o4582j27346j62196j13623l0075K23143O71216Q67759M14671l10039
41063A540574n61048k70379m7245j64961k31151J7219K30225K1186m37890o69187
41053e72657m39608R1110N16516M51887m1053l50385k0802N34022N40190Q204
$$ plain form
41123 776996 598853 737056 1096060 1480820 1715995 1767273 1782650 1862412 1822062 1431151
41113 1431151 876115 658991 955303 1389462 1576656 1576090 1624297 1712560 1684132 1546912
41103 1546912 1440002 1419068 1459699 1550353 1647278 1684114 1719918 1869341 1998977 1793620
41093 1793620 1284885 973031 1165959 1519465 1554489 1324978 1184973 1175206 1116537 1104306
41083 1104306 1371285 1754453 1831567 1576628 1375633 1358518 1218092 794027 361681 171646
41073 171646 107064 -20282 -182478 -296101 -326176 -103033 568183 1435942 1850613 1540574
41063 1540574 979526 709147 661902 496941 265790 283009 513234 534420 96530 -572657
41053 -572657 -1012265 -921155 -404639 47248 6195 -344190 -364992 169030 709220 717424
41043G17424k89479k4499K51209Q4452k08975k18677j10228j53619j63732O7755
41033d8369K77782J94981M5805Q1247O8027j83493k80524Q4392L95047M8897n51147
41022A32645n60123p1927Q7631j79970j27688L91433N27448j24926p43259n44202
41012a212938M8393K37151J26131L04880O80872O55295J95105j36178j19955q9144
41002F89612k03272k16008m2210N9426p489k9733L3961m7442k44256j72439K32493
40991E2643M61144J76196k38290k74354o5973p1362k59484j77262K53560N47423
40981D04241L55120p1617k91148k30353j14025o3987k7191J1112k008j8656Q2676
40970C4164K41873J93506j41950l90332j21111M93804P41571K61118m03289m64246
$$ plain form
41043 717424 427945 403446 654655 739107 530132 311455 201227 47608 -116124 -48369
41033 -48369 229413 424394 470199 551446 619473 435980 155456 239848 634895 683792 132645
41022 132645 -427478 -499405 -411774 -591744 -719432 -327999 199449 74523 -668736 -1212938
41012 -1212938 -1164545 -927394 -801263 -496383 184489 839784 1034889 898711 778756 689612
41002 689612 486340 270332 228122 287548 280059 250326 284287 236845 -7411 -179850 52643
40991 52643 513787 689983 451693 177339 111366 40004 -219480 -396742 -143182 404241
40981 404241 759361 687744 396596 166243 52218 -11769 -38960 -27848 -29856 -48512 34164
40970 34164 276037 469543 327593 -62739 -183850 309954 1051525 1312643 909354 445108
40960D45108O7289M37174K17522j80343k31845o0740j03312l47349l95778j50980
40950c03254N1466J4048l3685J54362M46834N20566K58493j57557m26605l48235
40940A76433O709L17873L23210P6221k22533n06442p06827n24851J90478Q84110
40930A4381P18505k52934r12070m58105N13196Q28467K81870k71271k02703J85116
40920D44452L22633J58188J2125J6260P893j67706m45911n84008l72858J08247
40910e00685M80999M48283J29566j38015k23318k07152j13183L6683J7556l13536
40900c82802n72897k11327N96086R72697M82469k66960n04099k97913k06445l08706
40890f99897k10422J51666L42662J17252k22480k96589j10265R8489J91903J73710
$$ plain form
40960 445108 512397 949571 1167093 986750 754905 694165 590853 243504 -152274 -303254
40950 -303254 -251788 -237740 -271425 -117063 329771 850337 1108830 951273 524668 176433
40940 176433 183142 501015 824225 900446 677913 171471 -535356 -1060207 -869729 14381
40930 14381 732886 479952 -432118 -890223 -377027 451440 733310 462039 259336 444452
40920 444452 767085 925273 937398 953658 961551 793845 347934 -236074 -608932 -500685
40910 -500685 -19686 428597 558163 420148 196830 -10322 -123505 -86822 -69266 -382802
40900 -382802 -955699 -1167026 -570940 401757 884226 617266 113167 -184746 -391191 -699897
40890 -699897 -910319 -758653 -415991 -298739 -521219 -817808 -928073 -829584 -637681 -463971
40880d63971J09288J03694J79451J40321k06945o42645o41485n0201N94494O61672
40870b16327J77168k74028k97190n3468J30651K27176M04531O21294N80423J32086
40860A432316m48471p12038n02172o9497K29930K33388R301k44927l24103j71063
40850e67336N5037J68930J90880K29708J95892q0442m31244m29743l9546K08483
40840d99381k8477l41239j76946K86591M22049J49352K5246L08130N52176L50007
40830A047508l9255j42281K4891Q8502q5611k93034l60306l03495j83226m2989
40820b89296N3043R8318J86004L13508K62133j12512n50695n96062j40783M20735
40810c55607O09177L08267j91280m65550k91388J51174M00798J64274l36854n80444
$$ plain form
40880 -463971 -354683 -250989 -71538 68783 -138162 -780807 -1422292 -1472493 -877999 -216327
40870 -216327 -39159 -313187 -610377 -663845 -533194 -306018 98513 719807 1300230 1432316
40860 1432316 983845 271807 -230365 -299862 -69932 163456 172757 -72170 -396273 -567336
40850 -567336 -512299 -343369 -152489 77219 273111 192669 -238575 -668318 -707864 -499381
40840 -499381 -527858 -869097 -1046043 -759452 -337403 -188051 -162805 145325 697501 1047508
40830 1047508 1008253 865972 890863 979365 893754 600720 240414 -63081 -246307 -289296
40820 -289296 -236253 -137935 48069 361577 623710 511198 -39497 -635559 -776342 -355607
40810 -355607 253570 561837 370557 -94993 -386381 -235207 165591 329865 -6989 -587433
40800e87433l27853J19600L00536J27260o8928P177K50301L28237J42463n1164
40790B40196j8913J27587J23616o3803k40770k92660k55962j36713P3988K16428
40780b27006J03691j12205n7974K68254L90939N0753l52038l18644L5890K12076
40770f264O2640j10691p9980Q9913K88472M45235L87653j1646n10841o59358l46424
40759d51291Q7305L08053K73796P1654j83748k69278m9158J96951N4879l31877
40749b92714l37305J92032N82475K83769k97693m06578k5688K26146Q0304j14331
40739a09583p8599J7392k3781q8575k3472Q8490R9193M583j31401k42262j89251
40728f77266J13212M37314M00917m277l30169k51157N4907K54599K93131K79887
$$ plain form
40800 -587433 -915286 -795686 -495150 -367890 -436818 -429641 -179340 148897 291360 240196
40790 240196 221283 348870 472486 408683 167913 -124747 -380709 -517422 -443434 -227006
40780 -227006 -123315 -235520 -293494 -25240 365699 416452 64414 -254230 -218340 -6264
40770 -6264 56376 -54315 -134295 -44382 244090 689325 1076978 1065332 554491 -104867 -451291
40759 -451291 -363986 -55933 217863 289517 105769 -163509 -212667 -15716 39163 -292714
40749 -292714 -630019 -437987 144488 428257 130564 -276014 -301702 -75556 4748 -109583
40739 -109583 -188182 -170790 -194571 -283146 -306618 -218128 -118935 -114352 -245753 -488015 -677266
40728 -677266 -564054 -126740 274177 269900 -60269 -311426 -256519 -1920 291211 571098
40718E71098K15555P8972l8191j13190k77342m89660m12216O7399M67428K90911
40708C60764k29989m47281k20404K925k3515n5796O2611J15318J2589M7839L44668
40697c0271N02160J83593k94729l91112r7164J57918J67501P5981k6640j94368
40687E2869l37412k42587P1045L18645L17970J62215K7748K1342J72537L53708
40677I18080K87651j06138m68495m07506n6426J22713R742j06047q0680p1718
40667D1176j16027m1377J05154L1963k44725l21911r0619J6015k51284m81270
40657a352905k41970K33846M45824L43937J89265L1779j71907k11611O2711L10353
40647c60678J35273k42967l21009j27775p6402j46258N9477M65398N03904O4582
$$ plain form
40718 571098 786653 865625 827434 714244 436902 -52758 -464974 -397575 69853 360764
40708 360764 130775 -316506 -536910 -533985 -557500 -613296 -550685 -435367 -422778 -374939 -30271
40697 -30271 471889 655482 360753 -30359 -127523 30395 197896 273877 247237 52869
40687 52869 -284543 -527130 -456085 -137440 180530 342745 370493 391835 564372 918080
40677 918080 1205731 1099593 631098 223592 167166 289879 299621 193574 112894 41176
40667 41176 -74851 -116228 -11074 20889 -223836 -545747 -636366 -620351 -871635 -1352905
40657 -1352905 -1594875 -1361029 -915205 -571268 -382003 -350224 -522131 -733742 -671031 -360678
40647 -360678 -225405 -468372 -789381 -917156 -993558 -1139816 -1080339 -614941 -111037 -46455
40637d6455k75082j86556m5643j46064j64135J48004L74232J10604k86793k69799
40627g87687r881m1989k77777j40154M05391P01221L83586j14736k67485j49777
40617b99288j29016k32553j80481J22818M20036M03512O1245k76511k49101J07436
40607b51903L30863R2877l15984l33877R3526M39309L51193Q8662K1702O1685
40597E78053q0325l27202l47624j33074l3569j70979k07288J23660N55911O32108
40587E89671L19480j4792j48502j92042k22755q9610K49442M77289K82925j68008
40577A083098m07311k50397M0646J53826M5585j42439k55634j91859o979L7162
40567A05698k30705n41301m33153Q7276M70379L50751J8741n0980J58976L18137
$$ plain form
40637 -46455 -321537 -508093 -553736 -699800 -863935 -715931 -341699 -231095 -517888 -787687
40627 -787687 -797568 -839557 -1117334 -1257488 -852097 -150876 232710 117974 -149511 -299288
40617 -299288 -428304 -660857 -841338 -718520 -298484 105028 166273 -110238 -359339 -251903
40607 -251903 78960 171837 -144147 -478024 -384498 54811 406004 494666 516368 578053
40597 578053 497728 170526 -177098 -310172 -343741 -514720 -722008 -598348 -42437 589671
40587 589671 909151 894359 745857 553815 331060 241450 490892 968181 1251106 1083098
40577 1083098 675787 425390 466036 619862 665447 523008 267374 75515 68536 105698
40567 105698 -125007 -666308 -1099461 -1012185 -541806 -191055 -172314 -223294 -64318 253819
40557B53819K56776N9005j66160l06978k06799R7411K50959J8938k99465k59011
40547c01505M5147J00860k35818n06499k90808K63507O82836O87880L54660n0345
40537G49915k89159l12008k29549r2644J59345M30131M15755P3212j58734O165
40527G52429J47826k35168p95437p47112j06927K88703Q3252j39867M4603K06948
40517e00750o1078l41758j17609K95042K73728q0996j98688k1923K4290j19895
40507h49637p0766K50689M37152K37041j21522l19650k73933o7564J13817N2292
40497f12081j82977j67637K62109O02349L79965n0600n7088J94278K6217n23838
40487a29303o89705k43217J51923O4199j11721l877J37338R9895J67638M22326
$$ plain form
40557 253819 510595 569600 403440 96462 -110337 -12926 238033 256971 -42494 -301505
40547 -301505 -256358 -155498 -391316 -897815 -1188623 -925116 -242280 445600 800260 749915
40537 749915 460756 148748 -80801 -173445 -14100 416031 831786 904998 746264 752429
40527 752429 900255 665087 -130350 -877462 -984389 -695686 -612434 -752301 -707698 -500750
40517 -500750 -561828 -903586 -1021195 -726153 -452425 -533421 -732109 -754032 -729742 -849637
40507 -849637 -920403 -669714 -232562 4479 -117043 -436693 -710626 -778190 -664373 -612081
40497 -612081 -795058 -962695 -700586 -98237 281728 231128 174040 368318 394535 -129303
40487 -129303 -819008 -1062225 -910302 -846103 -957824 -961701 -824363 -724468 -556830 -134504
40477a34504L59188k05862n68444j80044L81312K86719k32396l32807Q0936L77238
40467a68664L27254K77925L04735J02111k55371k91057Q277P6341k84479n37610
40457d40538k64862K13752L81844K07533j1177r7188m6507N7861L2637k02463
40447a69108l58298r2577L88075N12521J80823j18303j18647j03001k36622k17078
40437c32215R5216K98089J06157j43720r1176L8872p9082k41189j34605J5139
40427d68514j50062l84365j95987K55681L31137p5231l60645j21755L39125N52290
40417b78326M47915K20232J2588q8717l6162P0520P4596N135P167M7982l1807
40406D51123j94025k39793j67379j61460k05548o5511K59339M16595J79315k29525
$$ plain form
40477 -134504 224684 18822 -549622 -729666 -348354 -61635 -294031 -626838 -545902 -168664
40467 -168664 158590 436515 741250 843361 587990 296933 305210 381551 97072 -440538
40457 -440538 -705400 -491648 -109804 97729 86552 -10636 -57143 718 33355 -169108
40447 -169108 -527406 -619983 -231908 280613 461436 343133 224486 121485 -115137 -332215
40437 -332215 -236999 61090 167247 23527 -67649 -28777 -107859 -349048 -483653 -468514
40427 -468514 -618576 -1002941 -1198928 -943247 -612110 -687341 -1047986 -1169741 -830616 -278326
40417 -278326 169589 389821 402409 313692 277530 348050 422646 427781 434948 482930 451123
40406 451123 257098 17305 -150074 -311534 -517082 -582593 -323254 93341 272656 43131
40396D3131m37893l29872l4509K75302M44384L69744J03325j67069k77853j65196
40386a76506J32783M02084L23788j28166m90912l40578R1002K17688o0292k82290
40376c11399j82420N527Q3943J84456L29962K32049j77328m75306l53693p9761
40366g43970J8785J14147M57998P56482N35024p5082m77246m42422k77709k03052
40356c37045r4052Q6850J06838j02640k27598l1278K61766K98322R9013m3376
40346A6800l5746o6875k35194l55342k41156j3613N0133p8690j18269J31470M94175
40335d52307O25301L99335k3891l88619m61871j40796L34757M55694M2282l88738
40325A147k57916K04378K48436k53588n85965k69198K61886L85482J57857K1266
$$ plain form
40396 43131 -394762 -724634 -759143 -483841 -39457 330287 433612 266543 -11310 -176506
40386 -176506 -43723 358361 682149 553983 63071 -277507 -186505 31183 -29109 -311399
40376 -311399 -493819 -488292 -404349 -219893 110069 342118 164790 -310516 -664209 -743970
40366 -743970 -725185 -611038 -153040 603442 1138466 1063384 586138 143716 -133993 -337045
40356 -337045 -431097 -344247 -237409 -340049 -567647 -598925 -337159 -38837 60176 16800
40346 16800 -18946 -85821 -321015 -676357 -917513 -931126 -880993 -959683 -1077952 -946482 -452307
40335 -452307 172994 572329 548438 159819 -302052 -442848 -108091 347603 389885 1147
40325 1147 -256769 -52391 196045 -57543 -643508 -912706 -650820 -265338 -107481 -86215
40315h6215P1815Q6170k1520j75864l15086k83857R8188N58898M48640k80356
40305A00813p14169j94295O32137P43379K55339N1283K33213Q3818m84530o41733
40295F5255n6082M80648L02362j71926k86238j60249j94006k21130Q3453M16470
40285B58557K54419k16515l16862Q2394L90163K04253j58957k03843O0412K12154
40275E66175K5116k35708j79003J47662K77041J1580k08279K4111L19445O403
40265G54543p12083q93619k65993L23768K16158j08318M8377M30818L52779j07029
40255C9401k95207j00394l2678k69510l95852j61742J44411K12193R5412k9437
40245g93403o5624J07916N24288Q47430O25274o3409n88260n27998j36648Q5944
$$ plain form
40315 -86215 -14400 71770 50250 -125614 -440700 -724557 -626369 -67471 381169 100813
40305 100813 -613356 -807651 -175514 567865 823204 874487 1107700 1191518 706988 65255
40295 65255 9173 489821 792183 620257 334019 173770 -20236 -241366 -157913 258557
40285 258557 512976 296461 -20401 61993 452156 656409 497452 293609 354021 566175
40275 566175 591291 355583 176580 324242 601283 612863 404584 428695 748140 754543
40265 754543 42460 -851159 -1117152 -793384 -577226 -685544 -637167 -206349 146430 39401
40255 39401 -255806 -356200 -388878 -658388 -1054240 -1215982 -1071571 -859378 -763966 -793403
40245 -793403 -859027 -751111 -226823 620607 1245881 1182472 594212 66214 -70434 15510
40235A5510J4361p9241M9272L14390L89956R1130l36508m51475j81770Q4935P4962
40224a4478l7860n7546j23171l25374l70029n4142K81910K59591P2485N9975M4653
40213b63986k52535m80570j31452M89910O24348K52556L8347J44843P8598k30259
40203B69800k28974J46646J91617l30071o28539j33255N40686N37369p481l69133
40193a1335l20083j33799N5957K50381K78589N5047j53082j57995j82617l52799
40183f71736l29412P2392L96860K41012m9527Q404K04750J01534j19110l6015
40173a80848J66898N7373j61012Q890L63501K52454k96176n95973m03869j41196
40163i29958k0918J74337L87982K46434j35035j53344K71140N01758K44968j5494
$$ plain form
40235 15510 29871 -49370 -98 314292 704248 795378 458870 7395 -174375 -89440 -14478
40224 -14478 -52338 -109884 -233055 -558429 -928458 -982600 -700690 -441099 -368614 -308639 -263986
40213 -263986 -516521 -997091 -1128543 -638633 -14285 238271 276618 421461 500059 269800
40203 269800 40826 187472 379089 49018 -579521 -712776 -172090 365279 357798 -11335
40193 -11335 -331418 -465217 -409260 -158879 119710 174757 21675 -136320 -318937 -671736
40183 -671736 -1001148 -928756 -531896 -290884 -340411 -332007 -127257 -25723 -144833 -180848
40173 -180848 -13950 43423 -117589 -108699 254802 507256 211080 -384893 -788762 -929958
40163 -929958 -950876 -776539 -388557 -142123 -277158 -430502 -159362 342396 587364 571870
40153E71870N3279R3294j53873l04059q2541R4851j27213l44419r3314K81660
40143a0465J65790l18132n40253l21549k763K29021M35997M89932J72741l08630
40133h311m62946k01302Q4276J48308J37163J53706M9778j81979k17515J26244
40123c72578M98360M06359j13713n12669m25925r5730M8186J7081J47120M13189
40113I680L26918k69374p60706n53440L6067K74244J32508J66234L95627K36606
40103e636l10429l92680L32249R68594O88571L944j11174K32507J75446l64191
40093A217201n86950j87459J74333k2679m09392m13306q1358J51477R5392j05523
40083a68264k36115j58004Q8338K50570J64281N8978K44337N47035M91093M6306
$$ plain form
40153 571870 625149 718443 564570 260511 177970 272821 145608 -198811 -292125 -10465
40143 -10465 155325 -162807 -703060 -1024609 -1027372 -798351 -362354 127578 300319 -8311
40133 -8311 -471257 -672559 -588283 -439975 -302812 -149106 -99328 -281307 -498822 -372578
40123 -372578 125782 532141 418428 -94241 -520166 -615896 -567710 -550629 -403509 9680
40113 9680 336598 67224 -693482 -1246922 -1210855 -936611 -804103 -637869 -242242 -5636
40103 -5636 -316065 -708745 -376496 592098 1280669 1284613 1173439 1405946 1581392 1217201
40093 1217201 630251 442792 617125 594446 185054 -228252 -309610 -158133 -62741 -168264
40083 -168264 -404379 -562383 -474045 -223475 -59194 -216 244121 791156 1282249 1328555
40073A328555k88084k44569j47296l20453n69545n19937j54422K41442M40530
40064b33779L88832J59017o6010j30484r3730j10300j54649j15115q0364j77861
40054f14443k11204P7364M27000L09447j96332m19228j32867J13527k7565j29425
40044h03726J47011L24821q6400o15819m67620K10394N32725K02273j73025j01965
40034h31331J82223K84651K07171J11791m773j50010j87099n4468J15517K22792
40024a03536L05231L38532J91571j22047l75813l97461k20187M8344K96931L67531
40014C29096J95344j7858l5253M3822m5658k40706k28751k6511n759k30134k73207
40003e35575N6067K88200j2627m93125m33377K59647R27698R62279L72356l96643
$$ plain form
40073 1328555 1040471 795902 648606 328153 -241392 -761329 -915751 -674309 -233779
40064 -233779 155053 314070 248060 117576 23846 -86454 -241103 -356218 -436582 -614443
40054 -614443 -825647 -748283 -321283 -11836 -208168 -627396 -760263 -646736 -674301 -803726
40044 -803726 -656715 -331894 -418294 -1034113 -1501733 -1291339 -758614 -556341 -729366 -831331
40034 -831331 -649108 -364457 -157286 -45495 -50268 -200278 -387377 -441845 -326328 -103536
40024 -103536 201695 540227 731798 609751 233938 -163523 -383710 -335366 -38435 329096
40014 329096 524440 506582 471329 515151 469493 228787 36 -26475 -32234 -262368 -535575
40003 -535575 -479508 -191308 -203935 -697060 -1130437 -870790 56908 1019187 1391543 994900
39993I94900q74836q16344l56698L5418J0839k31449j98633K09555N45746M17491
39983b64011j7035k97248k10287O9757K66365K70685J87879K06313L68021M49081
39973A029520K01531k51094m73922k99754j03871k55491n17328l86152P6924K62120
39963g17517o4926l80240k12576J42196J68694J4386J95838O05380N41707j82338
39953A10604q39455p78139k62301O1832Q5901J47162L29280L83266K13434o088
39943e54504j46559k05546j41263N4676K04290J73269J40112K98597M28902J83107
39933D35081k87919m59537j84733J32165J63341K3195q0808j38514j45713j1769
39923e55211J84982J96633R585p6507R5336L28924M29250M16555K85472m7495
$$ plain form
39993 994900 120064 -696280 -1052978 -1017560 -1006721 -1238170 -1436803 -1227248 -681502 -264011
39983 -264011 -281046 -578294 -788581 -718824 -452459 -181774 6105 212418 580439 1029520
39973 1029520 1231051 979957 506035 206281 102410 -153081 -670409 -1056561 -979637 -717517
39963 -717517 -782443 -1162683 -1375259 -1233063 -1064369 -1049983 -854145 -248765 292942 110604
39953 110604 -728851 -1506990 -1769291 -1707459 -1621558 -1474396 -1145116 -761850 -548416 -554504
39943 -554504 -701063 -906609 -1047872 -993196 -788906 -615637 -475525 -176928 251974 435081
39933 435081 147162 -312375 -497108 -364943 -201602 -178407 -259215 -397729 -543442 -555211
39923 -555211 -370229 -173596 -164011 -240518 -145182 183742 612992 1029547 1315019 1267524
39913A267524m19321m72720k09499n0598j47649j30433J85076L63659K7915m90156
39903g6202o38270m06004j38090N5814K25481K57417J31582J68324M91546O01324
39893F72922R4899n30280n21621m6602J03909j78819k36019J27792K88921p9558
39883c04456m04598j45355L61977M75875J48112k10907l59155k94622l3372K99779
39873d66722M18181K21710k6868q6350k6534L4593J39590K48090J63370p8334
39863E40726j39568N9080J36278j15368l42509k20025K4275P3529O0521J70397
39853B47336J44320k41345n70050l25094K19780L47930m764k07938L7280L17874
39843c4671K55159K5121n7227J0238Q4198J15295N7872j26449k57832p0145L30335
$$ plain form
39913 1267524 848203 375483 165984 115386 -32263 -162696 22380 386039 413954 -76202
39903 -76202 -714472 -1120476 -1258566 -1202752 -977271 -719854 -588272 -419948 71598 672922
39893 672922 767821 237541 -284080 -330682 -226773 -405592 -641611 -513819 -224898 -304456
39883 -304456 -709054 -854409 -492432 -16557 131555 -79352 -438507 -733129 -766501 -466722
39873 -466722 -48541 173169 146301 59951 33417 68010 207600 455690 619060 540726
39863 540726 401158 460238 596516 481148 138639 -81386 -57111 16418 76939 247336
39853 247336 391656 150311 -419739 -744833 -525053 -177123 -181887 -389825 -352545 -34671
39843 -34671 220488 245609 188382 198620 282818 398113 455985 329536 71704 1559 331894
39832C31894M82795J97007j56215j58085J17813K70128Q9705k49247m12625k39208
39822B73962Q3022K00458L5396r8114J9548J42043k5072k74506k17433K0561j0986
39811A48879k70151k36950J80927M15150J33070k39712k24933P074M1836j15475
39801a60285k18336k60641l30466k78514Q662K40668R5893k06545j69656K42780
39791a036440N66884N08252K57533J06503P5572M030k01520m64195n68588l39524
39781a091493J05383L98052L47158J69985J45033K31289K37195J51560M3125j56252
39771E81035m44883n16257j19514M56817O60034L87228N0960m6386k2195o5297
39761I21542j45349j73786j66962j39580n5471M5279O6235L3208N1927P9915l2210
$$ plain form
39832 331894 814689 1011696 855481 697396 815209 1085337 1175042 925795 513170 273962
39822 273962 356984 557442 592838 494724 514272 656315 631243 356737 139304 159865 148879
39811 148879 -121272 -358222 -177295 237855 370925 131213 -93720 -86646 -44810 -160285
39801 -160285 -378621 -639262 -969728 -1248242 -1239580 -998912 -903019 -1109564 -1279220 -1036440
39791 -1036440 -469556 38696 296229 402732 478304 482334 280814 -183381 -751969 -1091493
39781 -1091493 -986110 -588058 -240900 -70915 74118 305407 542602 694162 737287 581035
39771 581035 136152 -380105 -499619 -42802 617232 1004460 1055420 1009034 986839 921542
39761 921542 776193 602407 435445 295865 240394 285673 351908 385116 437043 516958 484748
39750D84748k50262l38778j84089N5612J60271N5484j74502l26048j96303J45506
39740e68361L07054L3768l87012m69463j73565J22459J97270J55429R1146M80
39730f90795k855J83534L25471J15209k59853l29695j17140r0432k88665k11681
39720a366902K33346M51470J68023o6577J23249K15080k37319o20689j78561O11591
39710f67289O52909m9335m04166M8206N36594L93308j5694j13587j8302o9645
39700B92999j12104J23346L85917K71039q8853k56799j89841j83427k75137k14466
39690b47326K8912J80505J03590l7464q8007o7256M981J48231K40541Q8902k25728
39679A29881l40802r7498J90854J62478n9453l1495L44793O17333L79118j47896
$$ plain form
39750 484748 234486 -104292 -288381 -232769 -72498 -17014 -191516 -517564 -713867 -568361
39740 -568361 -261307 -227539 -614551 -1084014 -1257579 -1135120 -937850 -782421 -691275 -690795
39730 -690795 -693650 -510116 -184645 -69436 -329289 -658984 -776124 -866556 -1155221 -1366902
39720 -1366902 -1133556 -682086 -514063 -580640 -457391 -242311 -479630 -1100319 -1278880 -667289
39710 -667289 -14380 -63715 -467881 -419675 116919 510227 494533 380946 362644 292999
39700 292999 180895 304241 690158 961197 872344 615545 425704 242277 -32860 -247326
39690 -247326 -218414 -37909 65681 28217 -59790 -127046 -122065 26166 266707 355609 129881
39679 129881 -210921 -308419 -117565 44913 -14540 -46035 298758 916091 1295209 1147313
39669A147313l85973j72609O5686l4413k90046l43903k06218q7353O4808L96100
39659A53392O48940L99346j73619l46763J12180N23510K62929l33969n19484k18771
39649E07691J4274q4130k26880j89243j09674r7578l5379P8206J2857k69072m32841
39638h31769k41959Q9632K50645K70430L30735L57657J35115k65754m83302l20559
39628g09129P383J48750J7295j52049j08985J07438K22181R9720m3269O0503K98489
39617e1673K92058m7945l51548k81449N1328L19364M00131L63339K40744O3663
39607I98012k1863M5610M5203k19799m98403l34943K44431O46047M38496j18397
39597A224394m53981l77089j69865j24404k10207j93924L4937K89598K52166j26309
$$ plain form
39669 1147313 761340 588731 654417 620004 329958 -13945 -220163 -307516 -242708 153392
39659 153392 802332 1201678 1028059 681296 793476 1316986 1579915 1245946 726462 507691
39649 507691 521965 437835 210955 21712 -87962 -185540 -220919 -142713 -129856 -398928 -831769
39638 -831769 -1073728 -984096 -733451 -463021 -132286 225371 360486 94732 -388570 -709129
39628 -709129 -701746 -552996 -535701 -687750 -796735 -689297 -467116 -367396 -410665 -350162 -51673
39617 -51673 240385 192440 -159108 -440557 -389229 -69865 330266 693605 934349 998012
39607 998012 976149 1021759 1066962 847163 348760 13817 258248 904295 1342791 1224394
39597 1224394 770413 393324 223459 99055 -111152 -305076 -270139 19459 271625 145316
39587A45316m56629l24409J49018M20076K47439j6475j0243J13183M6010j03045
39577B10241l3588J53083J07249j00300l8163K95092L45674r6848m51541k03733
39567A87166K69092K73669j42350l56868k17210k06551n32371p31915m30939N1674
39557a836603K11883P9035M1884K20853L86820L52876J40421j36373l09405j99439
39547a048048J55866M35036L94608J63291n114q1439j49450j74537j57774k70829
39537g38390m91189l75604L22311J024150R20835J11572m98529m57676k19964
39528d02484j93300j14968K27975L71900q9641o47440n01369K24314O38427L70773
39518a15813j3605K5294K73558K56991j7970j76579o4392J03572Q5437j12808
$$ plain form
39587 145316 -311313 -635722 -486704 -66628 180811 164336 154093 267276 313286 210241
39577 210241 176653 329736 436985 336685 298522 593614 939288 842440 390899 187166
39567 187166 456258 729927 587577 230709 13499 -193052 -725423 -1457338 -1888277 -1836603
39557 -1836603 -1624720 -1545685 -1503801 -1282948 -896128 -543252 -402831 -539204 -848609 -1048048
39547 -1048048 -892182 -457146 -62538 100753 95639 14200 -135250 -309787 -467561 -738390
39537 -738390 -1229579 -1605183 -1282872 -258722 662113 773685 275156 -182520 -402484
39528 -402484 -595784 -710752 -482777 -110877 -200518 -847958 -1349327 -1125013 -486586 -115813
39518 -115813 -129418 -104124 169434 426425 408455 231876 167484 271056 356493 243685
39508B43685k89064k74776j13846o530m5287q6467K6376K17331K89285J72101
39498A32808p8688l79194n44325l35257J58669M24320J76689j30684N9504M63441
39488e2717L11960l91441p41470k53992M23102N06158J37330o8015o046O671o0288
39477a88748Q551J37355O6760j21428j28026R178j797j51410j69108n6872n7708
39466f53253j31158r395K26656K04708n8338j30733Q0508J74771J7980o471K32026
39455e2699K78292p3766k82732N5848M24494J72535l83300m38659L4168L40885
39445G5066K21043R6210J77816J65839l3002p3056J08670P0504l13024n02624
39435f558j91068R6300j52854n40400l69954K38420N61419L67311R3908M0870
$$ plain form
39508 243685 -45379 -320155 -434001 -440531 -485818 -572285 -545909 -328578 -39293 132808
39498 132808 54120 -325074 -869399 -1204656 -1045987 -621667 -444978 -575662 -516158 -52717
39488 -52717 259243 -132198 -873668 -1127660 -704558 -198400 -61070 -129085 -135131 -128460 -188748
39477 -188748 -180197 -42842 23918 -97510 -225536 -216358 -218155 -369565 -538673 -595545 -653253
39466 -653253 -784411 -793806 -567150 -362442 -420780 -551513 -471005 -296234 -278254 -284725 -52699
39455 -52699 225593 151827 -130905 -75057 349437 521972 138672 -299987 -265819 75066
39445 75066 296109 392319 570135 735974 702972 629916 738586 809090 496066 -6558
39435 -6558 -197626 -101326 -254180 -794580 -1164534 -926114 -364695 2616 96524 137394
39425A37394N9797M6698J10644J73223j7042l41208l35316N9265L07119Q9587
39415B90161k06206j37487J21363J69889N5099P0819J70657R8845p2831n8017
39405E02292Q4157J2772k72250l59192o6445K73225L15741J26104p2389k30495
39395C13520l37703k45966R6431M21577M10754P9904k86295m59775l60712L628
39385c64637M42951N56067J16523n27273p36116l33216J82815K94003Q4508n677
39375b90052J47220K60232J84100J52966L41007M90235K81922j29888l39628l27524
39365G70590m03017n16746k20476M65000P52334J49170o58405o55236O2707M69663
39355B15584J21441l54024l77494j82206j33663o2167K04529K75588j81953p07003
$$ plain form
39425 137394 197191 243889 354533 527756 510714 169506 -165810 -106545 200574 290161
39415 290161 83955 -53532 67831 237720 292819 363638 534295 633140 560309 502292
39405 502292 586449 599221 326971 -32221 -98666 174559 490300 616404 544015 313520
39395 313520 -24183 -270149 -173718 247859 658613 738517 452222 -7553 -368265 -364637
39385 -364637 78314 634381 750904 223631 -512485 -845701 -662886 -368883 -284375 -290052
39375 -290052 -142832 117400 301500 454466 795473 1285708 1567630 1437742 1098114 770590
39365 770590 367573 -149173 -369649 95351 847685 996855 338450 -316786 -254079 215584
39355 215584 337025 -16999 -394493 -576699 -710362 -772529 -568000 -292412 -474365 -1181368
39345a181368o22987n6396L03298K56736K12131L52180L95456K32203J40815K17310
39335B49378J60112j59036l92568k37854J24130L42121L17624J20749j86918m39620
39325a01882l88004n4738J92210J13962j03245j85041j18919j801J52775K62846
39315b31837J56197q1807q3893K14654L41278j6795m47428l95982j733J85452
39305c61894R1876J01770K67767K26786m1491o3116K88086M28624m5452o14314
39295B78642n27844Q2125M05225J42596j49167O71K80285J59736k66068m50086
39285d3885k06120J13196K09760J73307J38820K0358k00662k57469K2243L50311
39275C19859L38038O6470p5154k1592p5325l12759l94724j18694K18213K46722
$$ plain form
39345 -1181368 -1804355 -1860751 -1557453 -1300717 -1088586 -736406 -340950 -108747 32068 249378
39335 249378 409490 250454 -142114 -379968 -255838 86283 403907 524656 337738 -101882
39325 -101882 -489886 -544624 -352414 -238452 -341697 -526738 -645657 -647458 -494683 -231837
39315 -231837 -75640 -157447 -241340 -26686 314592 297797 -149631 -545613 -547346 -361894
39305 -361894 -270018 -168248 99519 326305 284814 221698 509784 938408 892956 278642
39295 278642 -249202 -167077 238148 380744 231577 232248 512533 672269 406201 -43885
39285 -43885 -250005 -136809 72951 246258 385078 405436 204774 -52695 -30452 319859
39275 319859 657897 724367 649213 627621 552296 239537 -155187 -273881 -55668 191054
$$ [...]
##END NTUPLES=NMR SPECTRUM
##END=
