##TITLE=31Pdec_PR179_K1
 D2O, 24 sc
 29.7.2019
##JCAMPDX= 6.0         $$ Bruker NMR JCAMP-DX V2.0
##DATA TYPE= NMR SPECTRUM
##DATA CLASS= NTUPLES
##ORIGIN= UXNMR, Bruker Analytische Messtechnik GmbH
##OWNER= root
$$ XWIN-NMR		Version 3.5
$$ Mon Jul 29 14:09:56 2019 Russian Standard Time (UT+4h)  she@DPX200
##.OBSERVE FREQUENCY= 81.013821
##.OBSERVE NUCLEUS= ^31P
##.ACQUISITION MODE= SIMULTANEOUS
##.ACQUISITION SCHEME= undefined
##.AVERAGES= 24
##.DIGITISER RES= 17
##SPECTROMETER/DATA SYSTEM= spect
##.PULSE SEQUENCE= zgpg30
##.SOLVENT NAME= DMSO
##.SHIFT REFERENCE= (INTERNAL, DMSO, 0, 182.463)
##AUDIT TRAIL= $$ (NUMBER, WHEN, WHO, WHERE, WHAT)
$$ ##TITLE= Audit trail, XWIN-NMR		Version 3.5
$$ ##JCAMPDX= 5.01
$$ ##ORIGIN= Bruker BioSpin GmbH
$$ ##OWNER= she
$$ F:/spectra/data/she/nmr/P31/1/pdata/1/auditp.txt
$$ ##AUDIT TRAIL=  $$ (NUMBER, WHEN, WHO, WHERE, WHAT)
(   1,<2019-07-29 14:08:46.68 +0400>,<she>,<DPX200>,
      <created by zg, POWCHK disabled, PULCHK disabled
       configuration hash MD5:
       00 E9 B6 7A A2 85 ED C7 34 08 36 98 17 FE 4E 26
       data hash MD5: 32K
       0D 8F 7B A4 BF 8D 2A 56 47 F0 39 88 89 65 7F 60>)
(   2,<2019-07-29 14:08:51.78 +0400>,<she>,<DPX200>,
      <Start of raw data processing
       efp BC_mod = 2 LB = 1 FT_mod = 6 PKNL = 1 PHC0 = -403.2846 PHC1 = 130.4 SI = 64K 
       data hash MD5: 64K
       AC 65 68 63 6E 67 0E 68 FD 08 2D 45 46 A0 A2 06>)
(   3,<2019-07-29 14:09:06.26 +0400>,<she>,<DPX200>,
      <pk PHC0 = -24.03005 PHC1 = 0 
       data hash MD5: 64K
       DB C4 3E 95 A1 84 81 E1 FB 83 A4 D0 7C 14 F8 B4>)
(   4,<2019-07-29 14:09:24.54 +0400>,<she>,<DPX200>,
      <pk PHC0 = -2.600003 PHC1 = 0 
       data hash MD5: 64K
       C7 B5 EF 44 36 F5 F4 8C 00 F2 E3 CB 59 F6 FD 27>)
$$ ##END=
$$ 
$$ hash MD5
$$ 85 CB 1F 7B 6D 6F 20 1A AF DE AF CE 63 AD 92 C0
##$RELAX= 
##$RELAX= 
##$RELAX= 
##$RELAX= 
##$RELAX= 
##$RELAX= 
##$RELAX= 
##$RELAX= 
$$ Bruker specific parameters
$$ --------------------------
##$DU= <F:/spectra>
##$EXPNO= 1
##$NAME= <P31>
##$PROCNO= 1
##$TYPE= <nmr>
##$USER= <she>
##$AMP= (0..31)
100 100 100 100 100 100 100 100 100 100 100 100 100 100 100 100 100 100 
100 100 100 100 100 100 100 100 100 100 100 100 100 100 
##$AQSEQ= 0
##$AQ_mod= 1
##$AUNM= <au_zg>
##$AUTOPOS= <>
##$BF1= 81.014009
##$BF2= 200.13
##$BF3= 200.13
##$BF4= 200.13
##$BF5= 200.13
##$BF6= 200.13
##$BF7= 200.13
##$BF8= 200.13
##$BYTORDA= 1
##$CFDGTYP= 0
##$CFRGTYP= 5
##$CHEMSTR= <none>
##$CNST= (0..31)
1 1 145 1 1 1 1 1 1 1 1 1 1 1 1 1 1 1 1 1 1 1 1 1 1 1 1 1 1 1 1 1 
##$CPDPRG= <waltz16>
##$CPDPRG1= <>
##$CPDPRG2= <waltz16>
##$CPDPRG3= <>
##$CPDPRG4= <mlev>
##$CPDPRG5= <mlev>
##$CPDPRG6= <mlev>
##$CPDPRG7= <mlev>
##$CPDPRG8= <mlev>
##$CPDPRGB= <>
##$CPDPRGT= <>
##$D= (0..31)
0 1 0 0 0 0 0 0 0 0 0 0.03 2e-05 3e-06 0 0 0 0 0 0 0 0 0 0 0 0 0 0 0 0 
0 0 
##$DATE= 1564394926
##$DBL= (0..7)
120 120 120 11 120 120 24 19 
##$DBP= (0..7)
150 150 150 150 150 150 150 150 
##$DBP07= 0
##$DBPNAM0= <>
##$DBPNAM1= <>
$$ [...]
##$SUBNAM2= <"">
##$SUBNAM3= <"">
##$SUBNAM4= <"">
##$SUBNAM5= <"">
##$SUBNAM6= <"">
##$SUBNAM7= <"">
##$SUBNAM8= <"">
##$SUBNAM9= <"">
##$SW= 369.568048894756
##$SWIBOX= (0..15)
0 1 3 0 0 0 0 0 0 0 0 0 0 0 0 0 
##$SW_h= 29940.119760479
##$TD= 32768
##$TD0= 1
##$TE= 0
##$TE2= 300
##$TE3= 300
##$TEG= 300
##$TL= (0..7)
0 120 53 12 22 120 120 120 
##$TP= (0..7)
150 150 150 150 150 150 150 150 
##$TP07= 0
##$TPNAME0= <>
##$TPNAME1= <>
##$TPNAME2= <>
##$TPNAME3= <>
##$TPNAME4= <>
##$TPNAME5= <>
##$TPNAME6= <>
##$TPNAME7= <>
##$TPOAL= (0..7)
0.5 0.5 0.5 0.5 0.5 0.5 0.5 0.5 
##$TPOFFS= (0..7)
0 0 0 0 0 0 0 0 
##$TUNHIN= 0
##$TUNHOUT= 0
##$TUNXOUT= 0
##$USERA1= <user>
##$USERA2= <user>
##$USERA3= <user>
##$USERA4= <user>
##$USERA5= <user>
##$V9= 5
##$VALIST= <valist>
##$VCLIST= <CCCCCCCCCCCCCCC>
##$VD= 0
##$VDLIST= <DDDDDDDDDDDDDDD>
##$VPLIST= <PPPPPPPPPPPPPPP>
##$VTLIST= <TTTTTTTTTTTTTTT>
##$WBST= 1024
##$WBSW= 4
##$XGAIN= (0..3)
0 0 0 0 
##$XL= 0
##$YL= 0
##$YMAX_a= 9361
##$YMIN_a= -11707
##$ZGOPTNS= <>
##$ZL1= 120
##$ZL2= 120
##$ZL3= 120
##$ZL4= 120
##$ABSF1= 0
##$ABSF2= 0
##$ABSG= 0
##$ABSL= 0
##$ALPHA= 0
##$AQORDER= 0
##$ASSFAC= 0
##$ASSFACI= 0
##$ASSFACX= 0
##$ASSWID= 0
##$AUNMP= <proc_1d>
##$AZFE= 0.1
##$AZFW= 0.5
##$BCFW= 0
##$BC_mod= 2
##$BYTORDP= 0
##$COROFFS= 0
##$CY= -3
##$DATMOD= 1
##$DC= 0
##$DFILT= <>
##$DTYPP= 0
##$F1P= 0
##$F2P= 0
##$FCOR= 1
##$FTSIZE= 65536
##$FT_mod= 6
##$GAMMA= 0
##$GB= 0
##$INTBC= 1
##$INTSCL= 5.30512e-09
##$ISEN= 30
##$LB= 1
##$LEV0= 0
##$LPBIN= 0
##$MAXI= 10000
##$MC2= 0
##$MEAN= 0
##$ME_mod= 0
##$MI= 50
##$NCOEF= 0
##$NC_proc= -6
##$NLEV= 6
##$NOISF1= 182.463
##$NOISF2= 159.3651
##$NSP= 0
##$NTH_PI= 0
##$NZP= 0
##$OFFSET= 182.463
##$PC= 4
##$PHC0= -429.9147
##$PHC1= 130.4
##$PH_mod= 1
##$PKNL= yes
##$PPARMOD= 0
##$PSCAL= 0
##$PSIGN= 0
##$REVERSE= no
##$SF= 81.0140089999434
##$SI= 65536
##$SIGF1= 159.3651
##$SIGF2= -187.1042
##$SINO= 113.3802
##$SIOLD= 16384
##$SREGLST= <1H.CDCl3>
##$SSB= 0
##$STSI= 65536
##$STSR= 0
##$SW_p= 29940.119760479
##$SYMM= 0
##$S_DEV= 0
##$TDeff= 32768
##$TDoff= 0
##$TI= <>
##$TILT= no
##$TM1= 0
##$TM2= 0
##$TOPLEV= 0
##$USERP1= <user>
##$USERP2= <user>
##$USERP3= <user>
##$USERP4= <user>
##$USERP5= <user>
##$WDW= 1
##$XDIM= 65536
##$YMAX_p= 327175253
##$YMIN_p= -31378636
$$ End of Bruker specific parameters
$$ ---------------------------------
##NTUPLES= NMR SPECTRUM
##VAR_NAME=  FREQUENCY,     SPECTRUM/REAL,   SPECTRUM/IMAG
##SYMBOL=    X,             R,               I
##VAR_TYPE=  INDEPENDENT,   DEPENDENT,       DEPENDENT
##VAR_FORM=  AFFN,          ASDF,            ASDF
##VAR_DIM=   65536,         65536,           65536
##UNITS=     HZ,            ARBITRARY UNITS, ARBITRARY UNITS
##FACTOR=    0.456856943014862, 1,           1
##FIRST=     14782.0589164792, 0,            0
##LAST=      -15158.0608439998, 0,           0
##MIN=       -15158.0608439998, -31378636,   0
##MAX=       14782.0589164792, 327175253,    0
$$ Real data points
##PAGE= N=1
##DATA TABLE= (X++(R..R)), XYDATA
$$ [...]
$$ plain form
44578 -1617459 -2550144 -2677463 -1813541 -757896 134399 1385005 3045929 4088100 3806459
44569 3806459 2952654 2612696 2531352 1545238 -486274 -2166384 -2259749 -1193669 -337142
44560 -337142 -245255 -367116 -362573 -764019 -1889431 -2844917 -2479256 -1039456 45327 21507
44550 21507 -475152 -753576 -1088211 -1828422 -2412945 -2232143 -1844292 -2128427 -2491109 -1305347
44540 -1305347 1570489 3960828 3830167 1736459 -92392 -571056 -536399 -898636 -1250911
44531 -1250911 -758236 462353 1578393 2169563 2373040 2170043 1363723 347679 155627
44522 155627 1355879 3303836 4841317 5443365 5343376 4787562 3622251 1652550 -801718
44513 -801718 -2761505 -3082383 -1412742 1207573 3036343 3171361 2207483 1299521 1048464
$$ packed form
44578a617459r32685j27319Q63922J055645Q92295J250606J660924J042171k81641
44569C806459q53805l39958q1344r86114k031512j680110r3365J066080Q56527
44560c37142R1887j21861M543m01446j125412r55486L65661J439800J084783k3820
44550B1507m96659k78424l34635p40211n84523J80802L87851k84135l62682J185762
44540a305347K875836K390339j30661k093708j828851m78664L4657l62237l52275
44531a250911M92675J220589J116040N91170K03477k02997q06320j016044j92052
44522A55627J200252J947957J537481O02048r9989n55814j165311j969701k454268
44513h01718j959787l20878J669641K620315J828770J35018r63878r07962k51057
$$ plain form
44504 1048464 1502579 2533951 3605254 3760638 2685818 1361230 760547 339638 -965007
44495 -965007 -2517506 -2408013 -401868 1216406 637395 -1057215 -1728708 -1247618 -1049392
44486 -1049392 -1368928 -947895 490529 1416812 795051 -357894 -735402 -856528 -2036852
44477 -2036852 -3885876 -4350029 -2319334 971726 3485389 4409115 4132241 3003489 1079607
44468 1079607 -1086835 -2369827 -2156713 -1018321 86215 908167 1757914 2538332 2581856
44459 2581856 1498286 -340354 -2273194 -3809375 -4503922 -4054474 -2920460 -2225857 -2417583
44450 -2417583 -2482664 -1250658 854756 2239265 2162765 1395438 820411 417680 -26903
44441 -26903 -178042 247417 841884 1148011 1383660 1860641 2222458 2051091 1772193 2015512
$$ packed form
44504A048464M54115J031372J071303J55384j074820j324588o00683m20909j304645
44495i65007j552499J09493K006145J618274n79011j694610o71493M81090J98226
44486a049392l19536M21033J438424R26283o21761j152945l77508j21126j180324
44477b036852j849024m64153K030695L291060K513663R23726k76874j128752j923882
44468A079607k166442j282992K13114J138392J104536Q21952Q49747P80418M3524
44459B581856j083570j838640j932840j536181o94547M49448J134014O94603j91726
44450b417583o5081J232006K105414J384509p6500p67327n75027m02731m44583
44441b6903j51139M25459N94467L06127K35649M76981L61817j71367k78898K43319
$$ plain form
44431 2015512 2371356 1853152 556836 -241440 100101 649725 235865 -1067491 -2343060
44422 -2343060 -3078552 -3362522 -3259877 -2656729 -1585458 -303964 803958 1248939 788387
44413 788387 19450 32027 986632 1617595 824991 -753831 -1616931 -1450639 -1263398 -1598765
44403 -1598765 -1758521 -1059822 103819 931129 1240158 1338710 1402616 1462843 1639785 1992012
44393 1992012 2381126 2698172 2926477 2900939 2467964 1983681 2072716 2729928 3324965 3696277
44383 3696277 4378396 5312362 5294225 3521810 937238 -930185 -1839245 -2465345 -2715844
44374 -2715844 -1877856 -338333 409850 -73468 -330070 899075 2729911 3275428 2075650
44365 2075650 322605 -982205 -1931421 -2733152 -2995525 -2596121 -2487437 -3686002 -5638771
$$ packed form
44431B015512L55844n18204j296316p98276L41541N49624m13860j303356j275569
44422b343060p35492k83970J02645O03148J071271J281494J107922M44981m60552
44413G88387p68937J2577R54605O30963p92604j578822q63100J66292J87241l35367
44403a598765j59756O98699J163641Q27310L09029R8552O3906O0227J76942L52227
44393A992012L89114L17046K28305k5538m32975m84283Q9035O57212N95037L71312
44383C696277O82119R33966j8137j772415k584572j867423r09060o26100k50499
44374b715844Q37988J539523P48183m83318k56602J229145J830836N45517j199778
44365B075650j753045j304810r49216q01731k62373L99404J08684j198565j952769
$$ plain form
44356 -5638771 -6464624 -5054496 -2343794 -193933 474986 54238 -662931 -1048867 -669758
44347 -669758 358295 1098382 699749 -395177 -972041 -802172 -877504 -1700611 -2517438
44338 -2517438 -2760915 -3042518 -3826437 -4205104 -3228967 -1701675 -1255277 -1989701 -2349895
44329 -2349895 -1286532 585260 2054447 2626697 2649331 2775540 3302801 3635204 2797028
44320 2797028 984375 -129462 511833 1768450 1972268 1302698 959860 800977 -119515
44311 -119515 -1113703 -457636 1393166 1742280 -363823 -2402444 -1908343 210584 1445309
44302 1445309 1177699 621715 383645 -87706 -1087372 -2075798 -2314583 -1373044 438523
44293 438523 1702730 1067469 -589767 -641734 1624758 3482949 2485802 160774 -189050
$$ packed form
44356e638771q25853J410128K710702K149861O68919m20748p17169l85936L79109
44347f69758J028053P40087l98633j094926n76864J69869p5332q23107q16827
44338b517438k43477k81603p83919l78667R76137J527292M46398p34424l60194
44329b349895J063363J871792J469187N72250K2634J26209N27261L32403q38176
44320B797028j812653j113837O41295J256617K03818o69570l42838j58883r20492
44311a19515r94188O56067J850802L49114k106103k038621M94101K118927J234725
44302A445309k67610n55984k38070m71351r99666r88426k38785R41539J811567
44293D38523J264207o35261j657236n1967K266492J858191r97147k325028l49824
$$ plain form
44284 -189050 1685191 2857590 1575051 -685541 -1709307 -1055995 379650 1661965
44276 1661965 2139314 1788291 1628902 2643616 4089046 4148872 2493789 859483 719964
44267 719964 1687701 2687666 3416591 3930699 3887518 3080718 2038976 1399401 1178859 1067712
44257 1067712 854813 257072 -921062 -2039610 -1828212 4699 1931686 2090487 319324
44248 319324 -1886756 -3268097 -4001704 -4860746 -5719269 -5584167 -4218257 -2949120 -3069784
44239 -3069784 -3925600 -3823959 -2677768 -2104412 -2600609 -2580555 -1175197 26964 -376720
44230 -376720 -1091119 -398647 684465 214327 -950936 -388796 1565301 2159821 891009
44221 891009 331909 1670270 2806979 2119403 1020495 1144210 1733870 1685304 1702554
$$ packed form
44284a89050J874241J172399j282539k260592j023766O53312J435645J282315
44276A661965M77349l51023j59389J014714J445430N9826j655083j634306j39519
44267G19964R67737R99965P28925N14108m3181q06800j041742o39575k20542j11147
44257A067712k12899n97741j178134j118548K11398J832911J926987J58801j771163
44248C19324k206080j381341p33607q59042q58523J35102J365910J269137j20664
44239c069784q55816J01641J146191N73356m96197K0054J405358J202161m03684
44230c76720p14399O92472J083112m70138j165263N62140J954097N94520j268812
44221H91009n59100J338361J136709o87576j098908J23715N89660m8566J7250
$$ plain form
44212 1702554 2366621 2295037 465392 -1557579 -1993989 -1687197 -2225493 -2912988 -2233078
44203 -2233078 -929681 -810719 -1493841 -1187784 4041 445907 205822 956489 2596754
44194 2596754 2860370 901454 -1185930 -1314904 64673 1235632 1409034 859334 177027
44185 177027 58875 824552 1776990 1976671 1670261 1851821 2576608 3074606 3359716 4108661
44175 4108661 4967191 4721608 3320561 2000652 1191453 120736 -1178445 -1449113 -405499
44166 -405499 580256 777986 1182444 2296287 2740403 1492405 -77320 -36787 1411674
44157 1411674 2651023 3135212 3546939 4065475 4010364 3065362 1776089 873989 705424
44148 705424 1049300 1112163 240911 -1044968 -1484132 -798790 32928 517089 1259535 2272548
$$ packed form
44212A702554O64067p1584j829645k022971m36410L06792n38296o87495O79910
44203b233078J303397J18962o83122L06057J191825M41866k40085P50667J640265
44194B596754K63616j958916k087384j28974J379577J170959J73402n49700o82307
44185A77027j18152P65677R52438J99681l06410J81560P24787M97998K85110P48945
44175D108661Q58530k45583j401047j319909q09199j070717j299181k70668J043614
44166d05499R85755J97730M04458J113843M44116j247998j569725M0533J448461
44157A411674J239349M84189M11727N18536n5111r45002j289273r02100j68565
44148G05424L43876O2863q71252j285879m39164O85342Q31718M84161P42446J013013
$$ plain form
44138 2272548 2320602 1009766 -61674 361603 1160978 791604 -105814 -31007 577218
44129 577218 208708 -756281 -468840 1189248 2284092 1954364 1579152 2254337 3172287
44120 3172287 3370603 3319053 3739657 4286315 4428249 4458926 4670596 4558813 3693149 2394924
44110 2394924 840251 -1342949 -3740793 -4707629 -3449908 -1481869 -692651 -913494 -839145
44101 -839145 -453165 -739511 -1516741 -1500982 -436560 652733 1423977 2564551 3866373
44092 3866373 3955108 2719925 2031941 2743793 2816664 380400 -2721740 -2945675 -46150
44083 -46150 2546670 2554258 1545613 1892390 3251766 3720168 2960914 2238410 2126637 2036237
44073 2036237 1741246 1748433 2122626 2312735 2277757 2564347 3070430 2895257 1741302 441298
$$ packed form
44138B272548M8054j310836j071440M23277P99375l69374q97418P4807O08225
44129E77218l68510r64989K87441J658088J094844l29728l75212O75185R17950
44120C172287J98316n1550M20604N46658J41934L0677K11670j11783q65664j298225
44110B394924j554673k183200k397844r66836J257721J968039P89218k20843P4349
44101h39145L85980k86346p77230J5759J064422J089293P71244J140574J301822
44092C866373Q8735j235183o87984P11852P2871k436264l102140k23935K899525
44083d6150K592820P588j008645L46777J359376M68402p59254p22504j11773r0400
44073B036237k94991P187L74193J90109l4978K86590N06083j75173j153955j300004
$$ plain form
44063 441298 -246748 -411278 -246443 416617 1353808 1679089 933008 -310507 -1373328
44054 -1373328 -2173083 -2573420 -2079706 -864079 -94965 -401817 -930125 -833100 -713538
44045 -713538 -1399299 -2190579 -1824961 -580542 222124 497472 1425584 3141659 4121869
44036 4121869 3400825 1996835 1400505 1722602 2100663 2076936 1759959 1202245 340793
44027 340793 -780930 -2160575 -3784333 -5088672 -5045329 -3315669 -945701 561551 623056
44018 623056 -240220 -1200869 -1735565 -1736181 -1380508 -812770 51309 1100185 1552103 605203
44008 605203 -1298258 -2601892 -2383023 -1338112 -657225 -598898 -694085 -710157 -711974 -620389
43998 -620389 -423429 -532679 -1298826 -2397833 -3219496 -3581971 -3553932 -2969743 -1830122
$$ packed form
44063D41298o88046j64530J64835O63060R37191L25281p46081j243515j062821
44054a373328p99755m00337M93714J215627P69114l06852n28308R7025J19562
44045g13538o85761p91280L65618J244419Q02666K75348R28112J716075R80210
44036D121869p21044j403990n96330L22097L78061k3727l16977n57714q61452
44027C40793j121723j379645j623758j304339M3343J729660K369968J507252O1505
44018F23056q63276r60649n34696o16L55673N67738Q64079J048876M51918r46900
44008F05203j903461j303634K18869J044911O80887N8327r5187j6072j817R1585
43998f20389J96960j09250p66147j099007q21663l62475K8039N84189J139621
$$ plain form
43989 -1830122 -904418 -1112952 -2322622 -3391818 -3400289 -2301478 -509602 1427906 2738980
43980 2738980 2807980 1960227 1329685 1604733 2235321 2135373 928215 -698757 -1719422
43971 -1719422 -1712052 -1100791 -432810 461596 2152461 4358340 5693109 5163346 3356586
43962 3356586 1564826 413476 140686 1272424 3509355 4615337 2548949 -1243611
43954 -1243611 -2946295 -1459826 -26539 -1361936 -3418999 -2449899 1157452 3160658
43946 3160658 1363105 -1611151 -2132975 81108 2541095 3247673 2130797 363525
43938 363525 -586802 40357 1379265 1688329 592621 -397344 -283834 -223296 -1565665
43929 -1565665 -3366944 -3531254 -1848531 -163440 319746 264132 607250 1279092 1957019
$$ packed form
43989a830122R25704k08534j209670j069196q471J098811J791876J937508J311074
43980B738980O9000q47753o30542K75048O30588r9948j207158j626972j020665
43971a719422P370O11261O67981Q94406J690865K205879J334769n29763j806760
43962C356586j791760j151350k72790J131738K236931J105982k066388l792560
43954a243611j702684J486469J433287j335397k057063R69100L607351K003206
43946C160658j797553k974256n21824K214083K459987P06578j116876j767272
43938C63525r50327O27159J338908L09064j095708r89965J13510O0538j342369
43929a565665j801279j64310J682723J685091M83186n5614L43118O71842O77927
$$ plain form
43920 1957019 2816437 3894695 4653784 4752163 4485980 4032648 3076731 1657706 547638
43911 547638 199607 84276 -311073 -610971 -449895 -497152 -1547764 -3028442 -3507396
43902 -3507396 -2593606 -1383704 -945902 -1154839 -1219188 -719717 163531 1042993 1701221
43893 1701221 2281152 3103217 4043995 4266243 3094143 1179915 199654 1062656 2789366
43884 2789366 3563581 2739354 1411666 965468 1445888 1719545 1105091 254924 123534
43875 123534 617035 978453 1164788 1756029 2436278 1894122 -70286 -1534575 -801589
43866 -801589 1016318 1334345 -251534 -1390372 -418983 1258653 1262885 -416481 -1560365
43857 -1560365 -790834 811317 1306665 149612 -1593393 -2696741 -2898401 -2730053 -2645233
$$ packed form
43920A957019Q59418J078258P59089R8379k66183m53332r55917j419025j110068
43911E47638l48031j15331l95349k99898J61076m7257j050612j480678m78954
43902c507396R13790J209902M37802k08937o4349M99471Q83248Q79462O58228
43893A701221N79931Q22065R40778K22248j172100j914228r80261Q63002J726710
43884B789366P74215q24227j327688m46198M80420K73657o14454q50167j31390
43875A23534M93501L61418J86335N91241O80249n42156j964408j464289P32986
43866h01589J817907L18027j585879j138838R71389J677636M232j679366j143884
43857a560365P69531J602151M95348j157053j743005j103348k01660J68348Q4820
$$ plain form
43848 -2645233 -2480417 -1755536 -451962 652890 639674 -477318 -1468980 -939448 1187927
43839 1187927 3325976 3636612 1920828 -87565 -511744 748073 2159160 2444759 1808512
43830 1808512 1198380 986488 912040 968266 1526237 2436692 2743551 1846166 542833 221156
43820 221156 1129603 2169352 2444061 2184690 1848561 1278343 520860 602682 2203197
43811 2203197 4011157 3985277 2321509 1487994 2694281 3970742 3028107 749116 16528
43802 16528 1620038 3266054 2827775 879140 -677045 -1144169 -1132964 -1010109 -553736
43793 -553736 71314 204473 -133026 117829 1487053 2569253 1311267 -2064812 -4485058
43784 -4485058 -3302310 405840 3014102 2672672 1069137 576739 1171620 1207444 135103
$$ packed form
43848b645233J64816P24881J303574J104852j3216j116992r91662N29532K127375
43839A187927K138049L10636j715784k008393m24179J259817J411087K85599o36247
43830A808512o10132k11892p4448N6226N57971R10455L06859q97385j303333l21677
43820B21156R08447J039749K74709k59371l36129n70218p57483Q1822J600515
43811B203197J807960k5880j663768q33515J206287J276461r42635k278991p32588
43802A6528J603510J646016m38279j948635j556185m67124J1205J22855M56373
43793e53736O25050J33159l37499K50855J369224J082200j257986l376079k420246
43784d485058J182748L708150K608262l41430j603535m92398N94881L5824j072341
$$ plain form
43775 135103 -945833 -944195 204778 1848859 2939014 2470285 722620 -336337 855680
43766 855680 3252248 4423725 3719274 2627021 2077083 1318109 -41660 -784309 34622
43757 34622 1383578 1705696 1041255 444434 102888 -598695 -1601003 -2062280 -1650886
43748 -1650886 -976086 -718331 -1019025 -1642670 -2112362 -1780739 -365463 1577172 3078061
43739 3078061 3539774 2876704 1294724 -606786 -1890967 -2026394 -1375942 -531931 465818
43730 465818 1702935 2606558 2434480 1440566 711526 680153 515488 -631308 -2285389
43721 -2285389 -3102359 -2487758 -1211710 -283502 281361 1087616 2056898 2334462 1671661
43712 1671661 1024314 1176310 1498134 943264 -272878 -1035666 -1006388 -805615 -757815 -642967
$$ packed form
43775A35103j080936J638J148973J644081J090155m68729j747665j058957J192017
43766H55680K396568J171477p04451j092253n49938p58974j359769p42649Q18931
43757C4622J348956L22118o64441n96821l41546p01583j002308m61277M11394
43748a650886O74800K57755l00694o23645m69692L31623J415276J942635J500889
43739C078061M61713o63070j581980j901510j284181j35427O50452Q44011R97749
43730D65818J237117R03623j72078r93914p29040l1373j64665j146796j654081
43721b285389q16970O14601J276048R28208N64863Q06255R69282K77564o62801
43712A671661o47347J51996L21824n54870j216142p62788K9278K00773M7800J14848
$$ plain form
43702 -642967 -538730 -637471 -385934 686301 1360338 -163464 -3228043 -4860601 -3793622
43693 -3793622 -2330361 -2869937 -4398170 -4292595 -2332170 -828229 -1340466 -3029409 -4048947
43684 -4048947 -3273257 -937691 1362427 1767162 241987 -1052354 -478037 862482 879642
43675 879642 -472436 -1529019 -1549443 -1207547 -871299 -237013 423571 339151 -363234 -780362
43665 -780362 -792942 -1155072 -1991082 -2460374 -1963004 -637372 1123833 2598813 2694940
43656 2694940 1323004 265641 1130141 2978796 3707913 3158872 2778099 2710345 1759081
43647 1759081 144378 -405320 310379 462900 -607663 -1263060 -540779 312175 519724
43638 519724 1465928 3973241 6064537 5527835 3142421 1342752 883779 720548 240184
$$ packed form
43702f42967J04237r8741K51537J072235O74037j523802l064579j632558J066979
43693c793622J463261n39576j528233J05575J960425J503941n12237j688943j019538
43684d048947P75690K335566K300118M04735j525175j294341N74317J340519J7160
43675H79642j352078j056583k0424L41896L36248O34286O60584q4420p02385m17128
43665g80362j2580l62130q36010m69292M97370J325632J761205J474980R6127
43656B694940j371936j057363Q64500J848655P29117n49041l80773o7754r51264
43647A759081j614703n49698P15699J52521j070563o55397P22281Q52954K07549
43638E19724R46204K507313K091296n36702k385414j799669m58973j63231m80364
$$ plain form
43629 240184 -187658 -282102 -67445 446743 840477 358893 -783193 -1324691 -1011285 -1192971
43619 -1192971 -2245239 -2184748 409561 3635725 4513950 2886254 1001200 114855 -336495
43610 -336495 -779684 -843284 -410646 368703 1736829 3432079 3825095 1863871 -637075
43601 -637075 -740829 1760981 4171731 4444222 3027301 1256497 -103968 -535995 153160
43592 153160 1051404 936917 -182 -663065 -1091634 -2174356 -3398218 -3065557 -1115855
43583 -1115855 441876 604523 779783 2092972 3250274 2555820 589844 -724355 -755836
43574 -755836 -366488 -81518 530872 1751964 2964829 3219550 2252430 933942 558542
43565 558542 1336294 1935032 1240760 141785 396041 1984485 3085845 2754735 2013883
$$ packed form
43629B40184m27842r4444K14657N14188L93734m81584j142086n41498L13406j81686
43619a192971j052268O0491K594309L226164Q78225j627696j885054q86345m51350
43610c36495m43189o3600M32638P79349J368126J695250L93016j961224k500946
43601f37075j03754K501810K410750K72491j416921j770804j360465m32027O89155
43592A53160Q98244j14487r37099o62883m28569j082722j223862L32661J949702
43583a115855J557731J62647J75260J313189J157302o94454j965976j314199l1481
43574g55836L89348K84970O12390J221092J212865K54721r67120j318488l75400
43565E58542P77752N98738o94272j098975K54256J588444J101360l31110p40852
$$ plain form
43556 2013883 1899686 2052110 1962379 2106942 2805609 3141351 2176640 484230 -488080
43547 -488080 -51904 1303871 2488019 2404213 814096 -1007902 -1425975 -576534 -193711
43538 -193711 -952888 -1488536 -751681 290115 449177 319321 991837 1957866 1960026 1113957
43528 1113957 549557 531126 484786 405877 661422 711092 -385158 -2241363 -3349060 -3073323
43518 -3073323 -2212051 -1530983 -996979 -630149 -873580 -1672454 -2130334 -1589139 -443879
43509 -443879 454401 743008 712829 913774 1626054 2391960 2258905 936198 -565254
43500 -565254 -1003601 -285334 889717 2312558 4147171 5702713 5578737 3424851 678305
43491 678305 -929694 -992048 -168358 1040891 2586997 4193215 5088346 4719649 3510753
$$ packed form
43556B013883j14197J52424q9731J44563O98667L35742r64711j692410r72310
43547d88080M36176J355775J184148q3806j590117j821998m18073Q49441L82823
43538a93711p59177n35648P36855J041796J59062j29856O72516R66029K160q46069
43528A113957n64400j8431m6340p8909K55545M9670j096250j856205j107697K75737
43518c073323Q61272O81068N34004L66830k43431p98874m57880N41195J145260
43509d43879Q98280K88607l0179K00945P12280P65906j33055j322707j501452
43500e65254m38347P18267J175051J422841J834613J555542j23976k153886k746546
43491F78305j607999o2354Q23690J209249J546106J606218Q95131l68697j208896
$$ plain form
43482 3510753 2533569 2294145 2167824 1413460 455378 457638 1668209 3009111 3478855
43473 3478855 3106709 2243258 905438 -631443 -1564785 -1633740 -1600026 -1883997 -1644770
43464 -1644770 -191109 1586599 2369698 2229998 2035950 1782567 974971 74059 -59464
43455 -59464 264990 251198 491770 2153356 4325961 4405569 1668165 -1550588 -3076695
43446 -3076695 -3389628 -3726775 -3526868 -1609038 1202620 2671039 2107802 1092239 1069265
43437 1069265 1519812 1025183 -646325 -2167218 -2169458 -720032 864075 1520553 1370373
43428 1370373 971748 229235 -1214675 -2811129 -3357171 -2532837 -1269528 -345117 468592
43419 468592 1452449 2044707 1608238 541246 -54314 425045 1582797 2478525 2411909
$$ packed form
43482C510753r77184k39424j26321p54364r58082K260J210571J340902M69744
43473C478855l72146q63451j337820j536881r33342o8955L3714k83971K39227
43464a644770J453661J777708P83099j39700j94048k53383q07596r00912j33523
43455e9464L24454j3792K40572J661586K172605P9608k737404l218753j526107
43446c076695l12933l37147J99907J917830K811658J468419n63237j015563k2974
43437A069265M50547m94629j671508j520893k240J449426J584107O56478j50180
43428A370373l98625p42513j443910j596454n46042Q24334J263309R24411Q13709
43419D68592R83857N92258m36469j066992n95560M79359J157752Q95728o6616
$$ plain form
43410 2411909 1553766 796267 583596 161491 -1240144 -2785392 -2839502 -1409548 -308986
43401 -308986 -521906 -980862 -710585 -558210 -1510215 -2637194 -2390501 -1115200 -560609
43392 -560609 -1303621 -2217678 -2306796 -1652260 -632913 428373 787831 -267570 -2259072
43383 -2259072 -3811496 -4214709 -3738177 -2488321 -275345 2138393 3033236 1713957 -387323
43374 -387323 -1266725 -385707 1301492 2639540 3016903 2420620 1416288 782967 732172
43365 732172 721339 251289 -506567 -1010365 -813576 326572 2114648 3312551 2550266
43356 2550266 63812 -2103414 -2280068 -973929 105494 175013 -298609 -846438 -1479150
43347 -1479150 -2087124 -2366746 -2430267 -2689521 -3025855 -2820144 -1981445 -1255127 -1230648 -1571563
$$ packed form
43410B411909q58143p57499k12671m22105j401635j545248n4110J429954J100562
43401c08986k12920m58956K70277J52375r52005j126979K46693J275301N54591
43392e60609p43012r14057q9118O54536J019347J061286L59458j055401j991502
43383b259072j552424m03213M76532J249856K212976K413738Q94843j319279k101280
43374c87323q79402Q81018J687199J338048L77363n96283j004332o33321n0795
43365G32172j0833m70050p57856n03798J96789J140148J788076J197903p62285
43356B550266k486454k167226j76654J306139J079423O9519m73622n47829o32712
43347a479150o07974k79622o3521k59254l36334K05711Q38699P26318K4479l40915
$$ plain form
43337 -1571563 -1482440 -566747 812876 1576041 515065 -2305028 -4782431 -4591101 -2095416
43328 -2095416 -201761 -651817 -1844008 -1504707 -156219 -873 -1168932 -1497256 -109942
43319 -109942 1149809 643655 -720799 -1251212 -911675 -599975 -370825 44223 98646
43310 98646 -463286 -345030 1516139 3642462 3658600 1832468 671377 1080918 1440188
43301 1440188 888062 874084 2318626 3596627 3015386 1444482 610405 270849 -841479
43292 -841479 -2366714 -2844062 -2307125 -2236560 -3147633 -4152759 -4843979 -5673614 -6286675
43283 -6286675 -5438359 -3219312 -1689506 -2309709 -3925701 -4313297 -2907924 -1072984 -211291
43274 -211291 -453792 -968462 -949277 -310582 393108 770064 1099247 1662459 1920743 1137939
$$ packed form
43337a571563Q9123R15693J379623P63165j060976k820093k477403J91330K495685
43328b095416J893655m50056j192191L39301J348488J55346j168059l28324J387314
43319a09942J259751n06154j364454n30413L39537L11700K29150M15048N4423
43310I8646n61932J18256J861169K126323J6138j826132j161091M09541L59270
43301A440188n52126j3978J444542J278001n81241j570904q34077l39556j112328
43292h41479j525235m77348N36937P0565r11073j005126o91220q29635o13061
43283f286675Q48316K219047J529806o20203j615992l87596J405373J834940Q61693
43274b11291k42501n14670J9185O38695P03690L76956L29183N63212K58284p82804
$$ plain form
43264 1137939 -333800 -1311595 -1315361 -883824 -342387 585324 1715187 2227686 2068490
43255 2068490 2295787 3305182 3900404 3120384 1924371 1805124 2543817 2769249 2222445
43246 2222445 1933874 2314341 2554329 2082312 1328091 735097 197731 -102322 534702
43237 534702 2057531 3174890 2989891 2283971 2137655 1982673 472951 -1876923 -2548106
43228 -2548106 -163134 3387435 5011199 3971440 2241802 1617405 1852452 1994692 2226473
43219 2226473 3248399 4480527 4275051 2107970 -461655 -1563565 -1137116 -643760 -962996
43210 -962996 -1304896 -413474 1596432 3115571 2844269 1339770 333217 651670 1482512
43201 1482512 1859123 2021354 2611369 3213951 2827514 1530290 449487 5994 -540696
$$ packed form
43264A137939j471739r77795l766M31537N41437R27711J129863N12499j59196
43255B068490K27297J009395N95222p80020j196013j19247P38693K25432n46804
43246B222445k88571L80467K39988m72017p54221n92994n37366l00053O37024
43237E34702J522829J117359j84999p05920j46316j54982j509722k349874o71183
43228b548106K384972L550569J623764j039759j729638o24397K35047J42240K31781
43219B226473J021926J232128k05476k167081k569625j101910M26449M93356l19236
43210i62996l41900Q91422K009906J519139k71302j504499j006553L18453Q30842
43201A482512L76611J62231N90015O02582l86437j297224j080803m43493n46690
$$ plain form
43192 -540696 -1441173 -1682448 -674255 429502 273549 -608287 -602457 479326 1132957
43183 1132957 430183 -757889 -1181305 -788221 -307400 -67855 63352 79154 -134559
43174 -134559 -403059 -445822 -345280 -445505 -870148 -1402994 -1696387 -1386225 -294337 1119247
43164 1119247 1794048 1113566 -186047 -727207 -133680 646118 799427 713765 1123111
43155 1123111 1818048 1983402 1509909 1120610 1255458 1664391 2189788 3067783 4152916
43146 4152916 4687492 4310581 3544707 2799573 1790808 656401 612734 2275399 4103754
43137 4103754 4068714 2471762 1434322 1704656 1829395 808921 -333225 -457685 -93220
43128 -93220 -126001 -92934 783696 1882572 2035942 1445910 1326487 2090637 3195468 4349704
$$ packed form
43192e40696r00477k41275J008193J103757j55953q81836N830J081783O53631
43183A132957p02774j188072m23416L93084M80821K39545J31207J5802k13713
43174a34559k68500m2763J00542j00225m24643n32846k93393L10162J091888J413584
43164A119247O74801o80482j299613n41160N93527P79798J53309q5662M09346
43155A123111O94937J65354m73493l89299J34848M08933N25397Q77995J085133
43146D152916N34576l76911p65874p45134j008765j134407m3667J662665J828355
43137D103754l5040j596952j037440K70334J24739j020474j142146j24460L64465
43128i3220l2781L3067Q76630J098876J53370n90032j19423P64150J104831J154236
$$ plain form
43118 4349704 5487142 5830939 4463905 1900161 -113222 -497623 347969 1466539 2036970
43109 2036970 1420272 -183977 -1220994 -312555 1619116 2179970 678572 -979404 -981136
43100 -981136 237532 1148362 1135843 548315 -199837 -790581 -1068778 -1429945 -2247029 -2696735
43090 -2696735 -1518917 670398 1559621 446966 -494445 490961 2079548 2274139 1681941
43081 1681941 1990247 2550210 1422814 -809780 -1365503 527397 2615897 3261538 3280112
43072 3280112 3347947 2489904 663095 189583 2417562 4974421 4833368 2670888 1560975
43063 1560975 2320475 2931176 2178819 1050297 275858 -896546 -2672018 -3679014 -3128839
43054 -3128839 -2241439 -2230915 -2325705 -1221874 639517 1784941 1898402 1772604 1621708
$$ packed form
43118D349704J137438L43797j367034k563744k013383l84401Q45592J118570N70431
43109B036970o16698j604249j037017R08439J931671N60854j501398j657976j732
43100i81136J218668R10830j2519n87528p48152n90744k78197l61167q17084m49706
43090b696735J177818K189315Q89223j112655r41411R85406J588587J94591n92198
43081A681941L08306N59963j127396k232594n55723J892900K088500O45641J8574
43072C280112O7835q58043j826809m73512K227979K556859j41053k162480j109913
43063A560975P59500O10701p52357j128522p74439j172404j775472j006996N50175
43054c128839Q87400J0524r4790J103831J861391J145424J13461j25798j50896
$$ plain form
43045 1621708 1025541 360975 767186 2488438 4427690 5565778 5789163 5149256 3496919
43036 3496919 1351397 121718 757288 2797259 5170976 7124325 7872310 6464982
43028 6464982 3139562 93545 -475317 1081555 2461607 2455203 2068310 2414196 2941789
43019 2941789 2575588 1538025 908446 952488 1013256 826255 909194 1608060 2582794 3361455
43009 3361455 3740735 3588769 2972008 2564816 3104419 4178926 4403835 3247155 1864816
43000 1864816 1521431 2005550 2475808 3101616 4566152 6309726 6760557 5484969 3803456
42991 3803456 2860153 2285218 1394185 552901 385722 531902 346542 200532 808623
42982 808623 1653908 1488471 379934 -134718 705542 1695148 1361464 -37665 -967622
$$ packed form
43045A621708n96167o64566M06211J721252J939252J138088K23385o39907j652337
43036C496919k145522j229679O35570K039971K373717J953349P47985j407328
43028F464982l325420l046017n68862J556872J380052o404l86893L45886N27593
43019B941789l66201j037563o29579M4042O0768j87001Q2939O98866R74734P78661
43009C361455L79280j51966o16761m07192N39603J074507K24909j156680j382339
43000A864816l43385M84119M70258O25808J464536J743574M50831j275588j681513
42991C803456r43303n74935q91033q41284j67179J46180j85360j46010O08091
42982H08623Q45285j65437j108537n14652Q40260R89606l33684j399129r29957
$$ plain form
42973 -967622 -499926 924528 2225660 2623728 2136736 1550613 1606476 1953338 1385154
42964 1385154 -515858 -2531631 -3168681 -2420987 -1519368 -1237158 -1157880 -519168 832417
42955 832417 2354142 3270802 3178811 2493475 2118659 2372459 2559224 2029447 1287002 1406476
42945 1406476 2551729 3720392 3906604 3014209 1737749 1041848 1581014 3032245 4080657
42936 4080657 3611149 1846181 -122434 -1633818 -2676746 -3143381 -2723078 -1460801 291520
42927 291520 2301124 4087036 4524333 3012588 952122 724373 2905809 5585551 6707113
42918 6707113 5990314 4341890 2742082 2208896 3441677 5656937 6949864 6634493 6046448
42909 6046448 6204101 6142815 4840234 3333130 3101978 3459300 2720546 1325066 1373355
$$ packed form
42973i67622M67696J424454J301132L98068m86992n86123N5863L46862n68184
42964A385154j901012k015773o37050P47694R01619K82210P9278O38712J351585
42955H32417J521725R16660r1991o85336l74816K53800J86765n29777p42445J19474
42945A406476J145253J168663J86212q92395j276460o95901N39166J451231J048412
42936D080657m69508j764968j968615j511384j042928m66635M20303J262277J752321
42927B91520K009604J785912M37297j511745k060466k27749K181436K679742J121562
42918F707113p16799j648424j599808n33186J232781K215260J292927l15371n88045
42909F046448J57653o1286j302581j507104k31152L57322p38754j395480M8289
$$ plain form
42900 1373355 3102299 4254138 3550727 2626148 3406266 5309305 6437995 6239542 5424449
42891 5424449 4174921 2213448 325625 54405 1516139 2844577 2508820 1276291
42883 1276291 968122 1810353 2190814 1118518 -233667 -188008 996682 1514089 636668
42874 636668 -363370 -277762 260810 -107949 -1445800 -2610314 -2830406 -2209171 -1070949
42865 -1070949 192008 929153 907645 957160 1909149 3092436 3065656 1841990 1142924
42856 1142924 2138228 3971634 4933391 4282367 2585689 993509 456236 1031970 1848988
42847 1848988 2323046 3146396 5100238 7211637 7581103 6101676 4686690 4365204 3898106
42838 3898106 2162664 298380 160732 1796561 3808783 5364609 6537294 7322189
$$ packed form
42900A373355J728944J151839p03411r24579P80118J903039J128690j98453q15093
42891E424449j249528j961473j887823k71220J461734J328438l35757j232529
42883A276291l08169Q42231L80461j072296j352185M5659J184690N17407q77421
42874F36668j000038Q5608N38572l68759j337851j164514k20092O21235J138222
42865a070949J262957P37145k1508M9515R51989J183287k6780j223666o99066
42856A142924R95304J833406R61757o51024j696678j592180n37273N75734Q17018
42847A848988M74058Q23350J953842K111399L69466j479427j414986l21486m67098
42838C898106j735442j864284j37648J635829K012222J555826J172685P84895
$$ plain form
42830 7322189 7558784 7380827 6769976 5215685 2726203 500518 -381525 -255305 48502
42821 48502 477961 973238 511533 -1424783 -3267094 -3124402 -1587418 -827547 -1295996
42812 -1295996 -1492270 -914559 -811510 -1513546 -1382542 483472 2430757 2527973 1240014
42803 1240014 450049 934975 2137905 3484017 4531770 4555875 3413789 2406560 3000536
42794 3000536 4965270 6910397 8359585 9991055 11865601 12806436 12036029 10434617
42786 10434617 9454191 9332861 9094795 8094753 6865602 6239254 6079549 5399757 3746923
42777 3746923 1988669 1377243 2081992 3050403 3182874 2258768 862195 -125591 -50891
42768 -50891 996169 2229568 3113777 3980627 5110314 5615374 4306104 1612272 -508382
$$ packed form
42830G322189K36595j77957o10851j554291k489482k225685q82043J26220L03807
42821D8502M29459M95277m61705j936316j842311J42692J536984P59871m68449
42812a295996j96274N77711J03049p02036J31004J866014J947285R7216j287959
42803A240014p89965M84926J202930J346112J047753K4105j142086j007229N93976
42794C000536J964734J945127J449188J631470J874546R40835p70407j601412
42786A0434617r80426j21330k38066j000042j229151o26348j59705o79792j652834
42777C746923j758254o11426P04749R68411J32471r24106j396573r87786P4700
42768e0891J047060J233399Q84209Q66850J129687N05060j309270k693832k120654
$$ plain form
42759 -508382 -845210 -136924 279718 17927 -528721 -891332 -611807 376793 1014384 -76570
42749 -76570 -2432732 -3706994 -2724932 -1281675 -1547284 -2796711 -2483959 46012 2797019
42740 2797019 3985487 3948882 3875692 4065956 4115553 3910580 3753531 3892108 4261661 4516286
42730 4516286 4352793 3970071 3826193 3666862 2566740 637220 -195868 1628203 4909976
42721 4909976 6925847 6794305 6099016 6228283 6767667 6885936 6737370 6740602 6662419 6229341
42711 6229341 5763041 5520527 5171720 4514995 3956011 3719598 3346128 2590374 2159453
42702 2159453 2905974 4719012 6625073 7564046 6944120 5162892 3746048 4045332 5505827
42693 5505827 6220967 5529971 4848571 5380575 6400464 6792425 7016959 8152121 9838501
$$ packed form
42759e08382l36828P08286M16642k61791n46648l62611K79525R88600O37591j090954
42749g6570k356162j274262R82062J443257k65609j249427L12752K529971K751007
42740B797019J188468l6605p3190J90264M9597k04973j57049J38577L69553K54625
42730D516286j63493l82722j43878j59331j100122j929520q33088J824071L281773
42721D909976K015871j31542o95289J29267N39384J18269j48566L232p8183m33078
42711F229341m66300k42514l48807o56725n58984k36413l73470p55754m30921
42702B159453P46521J813038J906061R38973o19926j781228j416844K99284J460495
42693E505827P15140o90996o81400N32004J019889L91961K24534J135162J686380
$$ plain form
42684 9838501 10676955 10265442 9581018 9584405 10464445 11981131 13641192 14851347 15666283
42675 15666283 16835548 18290690 18440306 16208792 13000574 11085592 10617793 10048029
42667 10048029 9114746 9245101 10710635 11479365 9802163 6444470 3460210 2001094
42659 2001094 2199531 4013696 7057089 10307147 12861540 14455485 14792105 13333624
42651 13333624 10472485 7910766 6872815 6671983 5992905 4824912 3980957 3362720 2164575
42642 2164575 624664 142278 1318774 2918044 3317033 2392533 1467589 1671316 2768183
42633 2768183 3645304 3751740 3721196 4342964 5337485 5932479 6472422 8172140 10799181
42624 10799181 11943302 9781012 5716627 2874172 2430476 2916034 2957772 3035130 4065768
$$ packed form
42684I838501Q38454m11513o84424L387Q80040J516686J660061J210155Q14936
42675A5666283J169265J455142J49616k231514l208218j914982m67799n69764
42667A0048029r33283J30355J465534P68730j677202l357693k984260j459116
42659B001094J98437J814165L043393L250058K554393J593945L36620j458481
42651A3333624k861139k561719j037951k00832o79078j167993q43955o18237j198145
42642B164575j539911m82386J176496J599270L98989r24500r24944K03727J096867
42633B768183Q77121J06436l0544O21768R94521N94994N39943J699718K627041
42624A0799181J144121k162290m064385k842455m43696M85558M1738P7358J030638
$$ plain form
42615 4065768 5616664 6385326 5743084 4186738 2805254 2690689 4204136 6333067 7399916
42606 7399916 6947902 6334250 6866263 7999894 8249028 7387005 6575711 6344589 5674236
42597 5674236 3660469 1236058 328496 1603086 3887110 5842075 7379038 9041145
42589 9041145 10656593 11354647 10723113 9293802 7881641 6962018 6646992 6642655 6191450
42580 6191450 4748684 2812441 1317905 174312 -1429164 -2966000 -2474934 341068
42572 341068 2479105 1105728 -2246591 -3373126 -1069066 1513104 1677640 644979
42564 644979 769497 1708868 1754177 1425501 2789202 5563346 6782707 5036800 2727674
42555 2727674 2742602 4495257 5077686 3597337 2454266 4052969 7665302 10432620 10814975
$$ packed form
42615D065768J550896P68662o42242j556346j381484j14565J513447K128931J066849
42606G399916m52014o13652N32013J133631K49134q62023q11294k31122o70353
42597E674236k013767k424411r07562J274590K284024J954965J536963J662107
42589I041145J615448O98054o31534j429311j412161r19623l15026m337m51205
42580F191450j442766j936243j494536j143593j603476j536836M91066K816002
42572C41068K138037j373377l352319j126535K304060K582170J64536j032661
42564F44979J24518R39371M5309l28676J363701K774144J219361j745907k309126
42555B727674J4928J752655N82429j480349j143071J598703L612333K767318L82355
$$ plain form
42546 10814975 10081110 10499056 12953830 16640897 20251849 22606681 22553545 19463844 14197300
42537 14197300 8846654 5083896 3142332 2478233 2636571 3124157 3261045 2778873 2010555
42528 2010555 1085231 -280767 -1729310 -2100651 -1195822 -541071 -1096624 -1311472 685438
42519 685438 3721963 4755434 3309050 2239867 3459480 5262768 5213609 3694854 2750835
42510 2750835 2770989 2408052 1121623 -178452 -872763 -1280489 -1372006 -332169 1999054
42501 1999054 4231745 4653101 2961995 512298 -848926 -160587 1964127 3876747
42493 3876747 4370035 3622528 2589711 1859075 1489967 1524581 1963040 2422981 2456394 2132817
42483 2132817 1869553 1900277 2327754 3301752 4595093 5494844 5802477 6338424 7522134
$$ packed form
42546A0814975p33865M17946K454774L687067L610952K354832n3136l089701n266544
42537A4197300n350646l762758j941564o64099J58338M87586J36888m82172p68318
42528B010555r25324j365998j448543l71341R04829O54751n55553k14848J996910
42519F85438L036525J033471j446384j069183J219613J803288m9159j518755r44019
42510B750835K0154l62937j286429j300075o94311m07726r1517J039837K331223
42501A999054K232691M21356j691106k449697j361224O88339K124714J912620
42493C876747M93288p47507j032817p30636l69108L4614M38459M59941L3413l23577
42483B132817k63264L0724M27477R73998J293341Q99751L07633N35947J183710
$$ plain form
42474 7522134 8143055 6929243 4847291 4037012 4499082 3914142 1386893 -646547 386454
42465 386454 3551486 5627117 5100696 3283863 1917316 1363590 1240486 1391285 1734787
42456 1734787 2079271 2550088 3553728 4899487 5426724 3985360 749673 -2574806 -3961737
42447 -3961737 -2810115 -638399 391331 -91558 -310789 1100161 3026777 3436947 2424242
42438 2424242 2121174 3536959 5123262 5160903 4170432 3776597 4136859 3996658 2943810
42429 2943810 2050775 1985379 1794829 404027 -1451585 -1862749 -185853 2048948 2927609
42420 2927609 2218340 1195605 847609 966111 942042 676099 328595 -241968 -1129648
42411 -1129648 -1749916 -1332376 -113207 662969 250281 -631788 -790733 -95672 596628
$$ packed form
42474G522134O20921j213812k081952q10279M62070n84940k527249k033440J033001
42465C86454L165032K075631n26421j816833j366547n53726j23104J50799L43502
42456A734787L44484M70817J003640J345759N27237j441364l235687l324479j386931
42447c961737J151622K171716J029730m82889k19231J410950J926616M10170j012705
42438B424242l03068J415785J586303L7641r90471l93835L60262j40201j052848
42429B943810q93035o5396j90550j390802j855612m11164J676896K234801Q78661
42420B927609p09269j022735l47996J18502k4069k65943l47504n70563q87680
42411a129648o20268M17540J219169P76176m12688q82069j58945O95061O92300
$$ plain form
42402 596628 821207 1035590 1623911 2069751 1643045 576414 -31162 510494 1707889
42393 1707889 2471313 2179979 1041309 -365983 -1677940 -2862332 -3786153 -3815599 -2309043
42384 -2309043 180865 1756029 1139709 -362071 -71634 2543233 4842749 4383063 2150464
42375 2150464 1013378 1732883 2345399 1336917 -486284 -1709014 -2198011 -2509853 -2766753
42366 -2766753 -2971553 -3273600 -3122407 -1422343 1494147 3382246 2886555 1619420 1839827
42357 1839827 3088666 3074156 1268885 -468207 -689216 156129 1045713 1353281 407808
42348 407808 -1960325 -4087710 -3641334 -734717 1899304 2475905 1992477 1731184 1193860
42339 1193860 29003 -79246 2276688 5335468 5998721 3915483 1518933 330278
$$ packed form
42402E96628K24579K14383N88321M45840m26706j066631o07576N41656J197395
42393A707889P63424k91334j138670j407292j311957j184392r23821k9446J506556
42384b309043K489908J575164o16320j501780K90437K614867K299516m59686k232599
42375B150464j137086P19505O12516j008482j823201j222730m88997l11842k56900
42366b766753k04800l02047J51193J700064K916490J888099m95691j267135K20407
42357A839827J248839j4510j805271j737092k21009Q45345Q89584L07568r45473
42348D07808k368133k127385M46376K906617K634021N76601m83428k61293n37324
42339A193860j164857j08249K355934L058780O63253k083238k396550j188655
$$ plain form
42331 330278 -512612 -1886020 -2996537 -2866718 -1963409 -1342847 -1102421 -564556 524716
42322 524716 1686256 2422973 2853169 3557189 4723528 5524117 4880831 3066008 1765140
42313 1765140 2012305 2913317 3205231 3124099 3548358 4179157 4128287 3669076 3643788 3612108
42303 3612108 2628874 1627009 2610323 5135564 6111718 4093094 1476851 956892 1803201
42294 1803201 1601612 159379 -569351 406995 2218036 3915232 5211225 5592415 4509207
42285 4509207 2623021 1389442 1193971 1154643 836018 766154 1034918 844209 13699
42276 13699 -314991 773713 2662055 4145272 4854744 5015691 4580444 3527278 2490822
42267 2490822 2107311 1962946 1104844 -429773 -1472677 -1364030 -977169 -1505273 -2630457
$$ packed form
42331C30278q42890j373408j110517J29819R03309O20562K40426N37865J089272
42322E24716J161540P36717M30196P04020J166339Q00589o43286j814823j300868
42313A765140K47165R01012K91914q1132M24259O30799n0870m59211k5288l1680
42303C612108r83234j001865R83314K525241R76154k018624k616243n19959Q46309
42294A803201k01589j442233p28730R76346J811041J697196J295993L81190j083208
42285D509207j886186j233579j95471l9328l18625o9864K68764j90709q30510
42276A3699l28690J088704J888342J483217P09472J60947m35247j053166j036456
42267B490822l83511j44365q58102j534617j042904J08647L86861n28104j125184
$$ plain form
42258 -2630457 -2723935 -994140 1292120 2273050 1686978 783474 295247 -316712 -1321165
42249 -1321165 -1735170 -854997 198559 -161161 -1585185 -2260186 -1659973 -1210129 -1886825
42240 -1886825 -2769985 -2829139 -2743192 -3592678 -4651877 -4121981 -1829238 333574 924896
42231 924896 656993 1000446 2096903 2981409 3266500 3427758 3449450 2372935 -166055
42222 -166055 -2715398 -3345274 -2045150 -786808 -976359 -1789843 -1647058 -545917 92979
42213 92979 -423057 -1182237 -1090458 -269549 366231 320449 -148068 -522105 -471097 -14145
42203 -14145 487212 620509 336025 -25390 -87996 311387 1040100 1571460 1287756 358345
42193 358345 -31455 953414 2473588 2976836 2320186 1774224 1842448 1455953 -132071
$$ packed form
42258b630457r3478J729795K286260R80930n86072r03504m88227o11959j004453
42249a321165m14005Q80173J053556l59720j424024o75001O00213M49844o76696
42240a886825q83160n9154Q5947q49486j059199N29896K292743K162812N91322
42231I24896k67903L43453J096457Q84506K85091J61258K1692j076515k538990
42222a66055k549343o29876J300124J258342j89551q13484J42785J101141O38896
42213I2979n16036p59180R1779Q20909O35780m5782m68517l74037N1008M56952
42203a4145N01357J33297k84484l61415o2606L99383P28713N31360k83704r29411
42193C58345l89800R84869J520174N03248o56650n45962O8224l86495j588024
$$ plain form
42184 -132071 -1937591 -2609357 -2191730 -1569937 -1055502 -613701 -706389 -1605292 -2378528 -1903100
42174 -1903100 -620032 -13548 -511680 -1178555 -1396755 -1439836 -1228753 -41346 1951542
42165 1951542 3198177 2764839 1875267 2356862 4097751 5156927 4248617 2134758 368134
42156 368134 -568765 -1348827 -2395961 -3113251 -2783203 -1804869 -1406605 -2117888 -3129064
42147 -3129064 -3358841 -2541138 -983061 942782 2493853 2632945 1371729 306861 615792
42138 615792 1162488 144110 -1792873 -2026490 284672 2864085 3407712 2301104 1319769
42129 1319769 1171852 1548639 2325019 3296520 3659721 3110000 2681997 3225418 3873784
42120 3873784 3471065 2736418 3241273 4663003 4972001 3428444 1680266 1494066 2775151
$$ packed form
42184a32071j805520o71766M17627O21793N14435M41801r2688q98903p73236M75428
42174a903100J283068O06484m98132o66875k18200m3081K11083J187407J992888
42165A951542J246635m33338q89572M81595J740889J059176r08310k113859j766624
42156C68134r36899p80062j047134p17290L30048R78334L98264p11283j011176
42147c129064k29777Q17703J558077J925843J551071J39092j261216j064868L08931
42138F15792N46696j018378j936983k33617K311162K579413N43627j106608r81335
42129A319769j47917L76787P76380R71501L63201n49721m28003N43421O48366
42120C873784m02719p34647N04855J421730L08998j543557j748178j86200J281085
$$ plain form
42111 2775151 4254911 4937829 4471888 3226448 2432339 3182174 4877510 5711031 5049064
42102 5049064 4122580 3852684 3424782 2033105 771355 1247777 2947242 3560130 1939265
42093 1939265 -496580 -1572355 -688446 996253 2062058 2045140 1455839 1030203 1105522
42084 1105522 1662947 2693940 4116131 5348058 5546933 4603159 3495299 3236235 3718296
42075 3718296 3996636 3535191 2784908 2593225 3318716 4510423 5332647 5373154 5040727
42066 5040727 4995082 5268269 5292859 4712747 3654779 2249175 617777 -521189 -126801
42057 -126801 1785850 3744652 4388864 3870896 3179468 2801147 2821451 3637684 5440404
42048 5440404 7324346 8062585 7730335 7569270 8174528 8749316 8373930 7226871 6246615
$$ packed form
42111B775151J479760O82918m65941j245440p94109P49835J695336Q33521o61967
42102E049064r26484k69896m27902j391677j261750M76422J699465O12888j620865
42093A939265k435845j075775Q83909J684699J065805j6918n89301m25636P5319
42084A105522N57425J030993J422191J231927J98875r43774j107860k59064M82061
42075C718296K78340m61445p50283j91683P25491J191707Q22224M0507l32427
42066E040727m5645K73187K4590n80112j057968j405604j631398j138966L94388
42057a26801J912651J958802O44212n17968o91428l78321K0304Q16233J802720
42048E440404J883942P38239l32250j61065O05258N74788l75386j147059r80256
$$ plain form
42039 6246615 6143396 6911286 7789419 7657752 6113876 4249809 3662084 4516126 5307572
42030 5307572 4817271 3590254 3039429 3662715 4687955 5147724 4858021 4505454 5000956
42021 5000956 6544929 8217071 8752256 7769270 5963401 4235711 3124179 2883589 3326578
42012 3326578 3619883 3145086 2598483 3151761 4404018 4619672 3527474 3205774 5009868
42003 5009868 7181575 7325016 6085429 6018238 7331294 7452693 5240340 3082564 3570552
41994 3570552 6010296 7825901 8016637 7466482 6811477 5933550 5167248 5217909 5877521
41985 5877521 6300373 6579542 7548157 8844665 8824308 7019078 5206461 5059247 5916211
41976 5916211 6043829 5169240 4407214 4296225 4390199 4574985 5331886 6531689 7230087
$$ packed form
42039F246615j03219P67890Q78133j31667j543876j864067n87725Q54042P91446
42030E307572m90301j227017n50825O23286J025240M59769k89703l52567M95502
42021E000956J543973J672142N35185r82986j805869j727690j111532k40590M42989
42012C326578K93305m74797n46603N53278J252257K15654j092198l21700J804094
42003E009868K171707J43441j239587o7191J313056J21399k212353k157776M87988
41994C570552K439744J815605J90736n50155o55005q77927p66302N0661O59612
41985E877521M22852K79169R68615J296508k0357j805230j812617j47214Q56964
41976E916211J27618q74589p62026j10989R3974J84786P56901J199803O98398
$$ plain form
41967 7230087 7079339 6954749 7683002 8919009 9776764 9984669 10038414 10734889 12729685
41958 12729685 15809028 18401890 18843887 17611665 17150153 18613906 19934467 18519692
41950 18519692 15053053 12817737 13476774 15383349 16391220 16549124 17080703 18100244
41942 18100244 18762581 19037831 19975607 22221128 25181572 27831502 29794931 31463498
41934 31463498 33334350 35336317 36776751 37089886 36597451 36120592 35770246 34726356 32523278
41925 32523278 29908316 27848902 26191030 24017384 21016060 17777585 14986506 13090276
41917 13090276 12569211 13575086 15198305 15995569 15581321 14982670 15062986 15325130 14844028
41908 14844028 13806909 13387861 14343614 16334132 18452436 19875131 20175733 19662939 19403865
$$ packed form
41967G230087j50748j24590P28253J236007Q57755K07905N3745O96475J994796
41958A2729685L079343K592862M41997j232222m61512J463753J320561j414775
41950A8519692l466639k235316O59037J906575J007871J57904N31579J019541
41942A8100244O62337K75250R37776K245521K960444K649930J963429J668567
41934C1463498J870852K001967J440434L13135m92435m76859l50346j043890k203078
41925C2523278k614962k059414j657872k173646l001324l238475k791079j896230
41917A3090276n21065J005875J623219P97264m14248n98651Q0316K62144m81102
41908A4844028j037119m19048R55753J990518K118304J422695L00602n12794k59074
$$ plain form
41899 19403865 20260395 21742854 22373287 21428080 19861386 19240711 20194066 22190127 24380233
41890 24380233 26219653 27650714 29259320 32114481 37014181 43968013 52608077 62739965
41882 62739965 74411575 88621595 108946812 140959056 186989308 240539530 288000251
41875 288000251 317776793 327175253 319774604 298237696 262565780 215001638 163418974
41868 163418974 117880658 84451228 62954163 49617310 40646178 33721457 27681016
41861 27681016 21990146 16796589 13003496 11457903 11758609 12429421 12632691 13003444 14187715
41852 14187715 15370153 15235702 13750147 11870070 10080675 8480137 7680395 8058369
41844 8058369 8623342 8400154 8448622 10350076 13030137 13790860 12689113 12866293 15662024
$$ packed form
41899A9403865Q56530J482459O30433r45207j566694o20675R53355J996061K190106
41890B4380233J839420J431061J608606K855161M899700O953832Q640064J0131888
41882F2739965J1671610J4210020K0325217L2012244M6030252N3550222M7460721
41875B88000251K9776542R398460p400649k1536908l5671916m7564142n1582664
41868A63418974m5538316l3429430k1497065j3336853q971132o924721o040441
41861B7681016n690870n193557l793093j545593L00706O70812K03270L70753J184271
41852A4187715J182438j34451j485555j880077j789395j600538p99742L77974
41844H058369N64973k23188M8468J901454K680061P60723j101747J77180K795731
$$ plain form
41835 15662024 18476908 18996594 18540005 19045140 19465962 17970512 15542037 14281171 13796183
41826 13796183 12521059 11281279 12041948 13930405 14079790 12110226 10346185 9731772
41818 9731772 9123094 8836167 11029166 15552909 18999487 19435671 18984867 19948512 21224966
41809 21224966 20706416 18830765 17425761 16842358 16407150 16235954 16607097 16788027 16217400
41800 16217400 15642502 15582646 15040183 13234177 11116892 9607209 7940207 5495084 3549485
41791 3549485 3220621 3313410 2399152 1390285 1601326 1894993 685816 -574443 728151
41782 728151 3805892 5258697 4170235 3009318 3322239 3936357 4047192 4734049 6155902
41773 6155902 6168931 3484136 66770 -1273072 -120175 1954381 3522116 3878298 2905935
$$ packed form
41835A5662024K814884N19686m56589N05135M20822j495450k428475j260866m84988
41826A3796183j275124j239780P60669J888457J49385j969564j764041o14413
41818I731772o08678k86927K192999M523743L446578M36184m50804R63645J276454
41809B1224966n18550j875651j405004n83403m35208j71196L71143J80930n70627
41800A6217400n74898n9856n42463j806006k117285j509683j667002k445123j945599
41791C549485l28864R2789r14258j008867K11041K93667j209177j260259J302594
41782G28151L077741J452805j088462j160917L12921O14118J10835O86857J421853
41773F155902J3029k684795l417366j339842J152897K074556J567735L56182r72363
$$ plain form
41764 2905935 1463837 818017 1044085 1211503 1364957 2470127 4006445 3959610 2126893
41755 2126893 966627 1740472 2287079 666192 -1242161 -498318 2127174 3222656 1856100
41746 1856100 608192 1403389 2962181 3166214 1986922 973682 1003032 1549616 1713282
41737 1713282 1335979 1099548 1535773 2050781 1557873 291003 35041 1864652 4513997
41728 4513997 5891989 5488022 4346038 3419687 3055354 3423888 4218648 4401129 3436135
41719 3436135 2373967 2569578 3736488 4417671 3990154 3042130 2149510 1465171 1168448
41710 1168448 1169039 760394 -315742 -1050970 -684904 -248318 -912746 -1556009 -196245 2458099
41700 2458099 3404327 1605681 -564884 -918339 -234848 -227301 -646809 -82778 1583057
$$ packed form
41764B905935j442098o45820K26068J67418J53454J105170J536318m6835j832717
41755B126893j160266P73845N46607j620887j908353P43843K625492J095482j366556
41746A856100j247908P95197J558792K04033j179292j013240K9350N46584J63666
41737A713282l77303k36431M36225N15008m92908j266870k55962J829611K649345
41728D513997J377992m03967j141984r26351l64333L68534P94760J82481r64994
41719C436135j062168J95611J166910O81183m27517r48024q92620o84339k96723
41710A168448N91m08645j076136p35228L66066M36586o64428o43263J359764K654344
41700B458099R46228j798646k170565l53455O83491P547m19508N64031J665835
$$ plain form
41691 1583057 3127138 3731996 3616134 3430755 3835190 5071163 6331095 6290093 4838470
41682 4838470 3426627 3137285 3442432 3511789 3551758 3938263 4193453 3940123 3801448 4109359
41672 4109359 3761230 1869739 -284440 -665378 621536 1539425 1019896 5423 -440439
41663 -440439 -457983 -442656 -102246 938899 2475856 4087730 5440549 5980223 5121141
41654 5121141 3090770 966781 -383646 -894640 -834259 -490468 -393876 -974590 -1726318
41645 -1726318 -1552495 -345864 573667 159897 -905383 -1187879 -446689 289398 469376
41636 469376 891216 2360059 4046629 4078783 1958665 -385113 -753405 474115 777004
41627 777004 -1089060 -3409747 -3930506 -2713145 -1368266 -468874 540249 1401778 1059270
$$ packed form
41691A583057J544081O04858j15862j85379M04435J235973J259932m1002j451623
41682D838470j411843k89342L05147O9357L9969L86505K55190k53330j38675L07911
41672D109359l48129j891491k154179l80938J286914R17889n19529j014473m45862
41663d40439j7544J5327L40410J041145J536957J611874J352819N39674q59082
41654E121141k030371k123989j350427n10994O0381L43791R6592n80714p51728
41645a726318J73823J206631R19531m13770j065280k82496P41190P36087J79978
41636D69376M21840J468843J686570L2154k120118k343778l68292J227520L02889
41627G77004j866064k320687n20759J217361J344879Q99392J009123Q61529l42508
$$ plain form
41618 1059270 -269510 -962207 -459549 -73126 -538472 -574234 823882 2241621 1780702
41609 1780702 55151 -704245 110049 1185523 1923897 3109644 4647482 4876383 3134560
41600 3134560 1151116 498432 207645 -1281012 -2986824 -2580771 -340172 680077 -905100
41591 -905100 -2465189 -964558 2658524 4665649 3257547 159633 -2217613 -3138058
41583 -3138058 -2812393 -1389579 319391 705703 -665900 -1965327 -1295220 819438 2447285
41574 2447285 2971804 3202656 3300682 2493867 936862 104315 823288 2228972 3135337
41565 3135337 3259895 2712953 1560155 418998 245667 932314 1337444 1291526 2141663
41556 2141663 4441433 6571634 6889874 6017789 5663651 6305033 7462828 9141129 11308909
$$ packed form
41618A059270j328780o92697N02658L86423m65346l5762J398116J417739m60919
41609A780702j725551p59396Q14294J075474P38374J185747J537838K28901j741823
41600C134560j983444o52684k90787j488657j705812M06053K240599J020249j585177
41591i05100j560089J500631L623082K007125j408102l097914k377246r20445
41583c138058L25665J422814J708970L86312j371603j299427O70107K114658J627847
41574B447285N24519K30852R8026q06815j557005q32547P18973J405684R06365
41565C135337J24558n46942j152798j141157j73331O86647M05130m5918Q50137
41556B141663K299770K130201L18240q72085l54138O41382J157795J678301K167780
$$ plain form
41547 11308909 12911544 13227823 13374364 14476529 15117469 12955221 8476097 4657565
41539 4657565 2958073 2151300 1270499 939631 1157708 578759 -822092 -962850 933034
41530 933034 2526479 1806363 173676 -40764 805922 953473 472733 511134 609528 -308716
41520 -308716 -1163586 13327 2497312 3619173 2963132 2700891 3551857 3721966 2633848
41511 2633848 2386181 4025890 5389800 4661441 3429204 3749019 4403612 3052576 542665
41502 542665 -214361 1032466 1508039 -139360 -1966932 -2048084 -1164014 -974795 -1419017
41493 -1419017 -1419953 -878918 -441248 -54084 814344 1868360 2158688 1568982 1114104 1486848
41483 1486848 2049660 1742790 593224 -221014 237911 1636583 2867063 3240406 2900067
$$ packed form
41547A1308909J602635L16279J46541J102165O40940k162248m479124l818532
41539D657565j699492q06773q80801l30868K18077n78949j400851j40758J895884
41530I33034J593445p20116j632687k14440Q46686J47551m80740L8401R8394r18244
41520c08716q54870J176913K483985J121861o56041k62241Q50966J70109j088118
41511B633848k47667J639709J363910p28359j232237L19815O54593j351036k509911
41502E42665p57026J246827M75573j647399j827572q1152Q84070J89219m44222
41493a419017r36N41035M37670L87164Q68428J054016K90328n89706m54878L72744
41483A486848N62812l06870j149566q14238M58925J398672J230480L73343l40339
$$ plain form
41474 2900067 2302455 1759795 1482073 1630212 2183863 2972962 3774355 4122196 3377424
41465 3377424 1655953 390269 902656 2413306 2740753 1335195 219679 1121926 2999097
41456 2999097 3643231 2711667 1691818 1558856 2027262 2722600 3544019 4004276 3631235
41447 3631235 3000543 3087329 3671985 3710647 3186629 3116299 3695776 4020876 3824445 3850184
41437 3850184 4174620 3880776 2923398 2531165 2988604 2850733 1454602 435144 1309458
41428 1309458 3165906 4472612 5716556 8099666 10671247 11251052 9874487 8974310
41420 8974310 9959074 11632943 12406578 12217377 11576489 10322378 8296016 6145240 4564966
41411 4564966 3518514 2849509 2854109 3568609 4196901 3962535 3038522 2078420 1326910 753540
$$ packed form
41474B900067n97612n42660k77722J48139N53651P89099Q01393L47841p44772
41465C377424j721471j265684N12387J510650L27447j405558j115516R02247J877171
41456B999097O44134r31564j019849j32962M68406O95338Q21419M60257l73041
41447C631235o30692Q6786N84656L8662n24018p0330N79477L25100j96431K5739
41437C850184L24436k93844r57378l92233M57439j37871j396131j019458Q74314
41428A309458J856448J306706J243944K383110K571581N79805j376565r00177
41420H974310R84764J673869P73635j89201o40888j254111k026362k150776j580274
41411D564966j046452o69005M600P14500O28292k34366r24013r60102p51510n73370
$$ plain form
41401 753540 616392 1258516 2531924 3841550 4638844 4700648 4191151 3589776 3240515
41392 3240515 2897673 2125403 1172666 859125 1427120 2134553 2282442 2063496 2013421 2132944
41382 2132944 1993979 1346136 255824 -1028868 -2077610 -2500914 -2404558 -2233565 -1996681
41373 -1996681 -1155836 480167 2282657 3471639 3728308 3014361 1588382 506984 1126676
41364 1126676 3427643 5616708 6117780 5223982 4095669 3119762 2331796 2464811 3984449
41355 3984449 5632489 5644949 4216859 3060946 2588340 1463887 -705566 -2308754 -2271995
41346 -2271995 -1789452 -2130762 -2314636 -819774 1487982 2322899 1468143 1116468 2464005
41337 2464005 3886484 3329432 1112181 -699603 -840934 229547 1411332 2045411 2129384
$$ packed form
41401G53540j37148O42124J273408J309626P97294O1804n09497o01375l49261
41392C240515l42842p72270r52737l13541N67995P07433J47889k18946n0075J19523
41382B132944j38965o47843j090312j284692j048742m23304R6356J70993K36884
41373a996681Q40845J636003J802490J188982K56669p13947j425979j081398O19692
41364A126676K300967K189065N01072q93798j128313r75907p87966J33015J519638
41355C984449J648040J2460j428090j155913m72606j124453k169453j603188L6759
41346b271995M82543l41310j83874J494862K307756Q34917q54756l51675J347537
41337B464005J422479n57052k217251j811784j41331J070481J181785O34079Q3973
$$ plain form
41328 2129384 2124415 2479344 2995714 2931324 2095264 1436665 1948786 3221295 3761813 2775408
41318 2775408 1052974 -62324 -122633 298746 609520 853946 1274760 1569347 1058053
41309 1058053 -306596 -1592160 -2001634 -1942338 -2224559 -2454506 -1406073 793342 2198325
41300 2198325 1558312 106089 -329719 67406 -26089 -471818 -114773 501421 -517225
41291 -517225 -2831333 -3325235 -591387 2417118 2422560 655243 802267 3242864 4661657
41282 4661657 3315549 1296760 653840 410940 -725952 -1326478 432271 3056631 3365019
41273 3365019 1157747 -641740 -527800 -253778 -1355705 -2450512 -1670755 92250 559129
41264 559129 -310159 -343461 1314590 2775675 2127292 17610 -1531228 -1906426 -2201739
$$ packed form
41328B129384m969L54929N16370o4390q36060o58599N12121J272509N40518r86405
41318B775408j722434j115298o0309M21379L10774K44426M20814K94587n11294
41309A058053j364649j285564m09474N9296k82221k29947J048433K199415J404983
41300B198325o40013j452223m35808L97125r3495m45729L57045O16194j018646
41291e17225k314108m93902K733848L008505N442j767317J47024K440597J418793
41282D661657j346108k018789o42920k42900j136892o00526J758749K624360L08388
41273C365019k207272j799487J13940K74022j101927j094807P79757J763005M66879
41264E59129q69288l3302J658051J461085o48383k109682j548838l75198k95313
$$ plain form
41255 -2201739 -3046237 -3424948 -2133792 293700 1868466 1339288 -394520 -1326765 -528999
41246 -528999 1122491 2306409 2697331 2710722 2421774 1591388 638638 623827 1890690
41237 1890690 3414021 4003257 3636057 3077175 2719782 2521919 2614609 3003052 2925536 1662672
41227 1662672 15411 -284232 977928 1903826 1101817 -279259 -331485 725936 1081930
41218 1081930 350180 165755 1443794 2769682 2471379 1032996 183607 363602 487873
41209 487873 -82955 -728166 -888501 -1018198 -1675527 -2456639 -2480973 -1487560 76416 1673832
41199 1673832 2849309 3152718 2615816 2179161 2865901 4361755 5074073 3956427 1795653
41190 1795653 283198 169953 739838 776216 -378220 -2359648 -3831978 -3344568 -851025
$$ packed form
41255b201739q44498l78711J291156K427492J574766n29178j733808r32245P97766
41246e28999J651490J183918L90922J3391k88948q30386r52750j4811J266863
41237A890690J523331N89236l67200n58882l57393j97863R2690L88443p7516j262864
41227A662672j647261k99643J262160R25898q02009j381076n2226J057421L55994
41218A081930p31750j84425J278039J325888k98303j438383q49389J79995J24271
41209D87873n70828o45211j60335j29697o57329p81112k4334R93413J563976J597416
41199A673832J175477L03409n36902m36655O86740J495854P12318j117646k160774
41190A795653j512455j13245N69885L6378j154436j981428j472330M87410K493543
$$ plain form
41181 -851025 1851844 2949234 2625874 2340873 2397580 1695064 58047 -933389 -328049
41172 -328049 516473 6237 -1146555 -1153775 -71616 458932 -47033 -520190 -638777 -1327894
41162 -1327894 -2487701 -2390232 -401307 1519074 1436919 133129 -367048 225543 707036
41153 707036 763811 1154108 1804642 1609516 330496 -849984 -1087091 -930618 -1140418
41144 -1140418 -1515331 -1498267 -1130299 -804299 -658723 -697219 -992268 -1337842 -1173176 -283235
41134 -283235 820369 1607488 2224357 3018957 3677868 3420789 2058777 407312 -580701
41125 -580701 -879482 -1234190 -1868970 -1819704 -179518 2138349 2882309 1190475 -1049418
41116 -1049418 -1486636 -324802 172925 -1075283 -2650441 -2809133 -1678592 -607549 -290687
$$ packed form
41181h51025K702869J097390l23360k85001N6707p02516j637017r91436O05340
41172c28049Q44522n10236j152792p220J082159N30548n05965m73157j18587o89117
41162a327894j159807R7469J988925J920381q2155j303790n00177N92591M81493
41153G07036N6775L90297O50534j95126j279020j180480k37107J56473k09800
41144a140418l74913J7064L67968L26000J45576l8496k95049l45574J64666Q89941
41134b83235J103604P87119O16869P94600O58911k57079j362012j651465r88013
41125e80701k98781l54708o34780M9266J640186K317867P43960j691834k239893
41116a049418m37218J161834M97727j248208j575158j58692J130541J071043L16862
$$ plain form
41107 -290687 -387157 -386148 1678 957661 2260344 3016264 2396271 743768 -528628 -362117
41097 -362117 834569 1674653 1371879 645663 792185 1915287 2683590 2198595 1393191
41088 1393191 1710412 2916191 3480139 2944310 2394836 2319778 1637084 -324246 -2321086
41079 -2321086 -2890353 -2431303 -2220147 -2263949 -1729376 -844819 -567178 -660001 -18975 1030948
41069 1030948 765099 -1079515 -2364918 -1446405 629828 2046750 2798909 3678618 3946947
41060 3946947 2306410 -250896 -968282 926926 3070281 3374823 2749683 3110642 4227940
41051 4227940 4428494 3564420 3166982 3742229 3881174 2562733 747214 -116027 87670
41042 87670 672236 1369472 1971794 1776068 679502 52733 1053160 2598484 2625883
$$ packed form
41107b90687r6470J009L87826R55983J302683P55920o19993j652503j272396J66511
41097c62117J196686Q40084l02774p26216J46522J123102P68303m84995q05404
41088A393191L17221J205779N63948n35829n49474p5058o82694j961330j996840
41079b321086n69267M59050K11156m3802N34573Q84557K77641r2823O41026J049923
41069A030948k65849j844614j285403R18513K076233J416922P52159Q79709K68329
41060C946947j640537k557306p17386J895208K143355L04542o25140L60959J117298
41051D227940K00554q64074l97438N75247J38945j318441j815519q63241K03697
41042H7670N84566O97236O02322j95726j096566o26769J000427J545324K7399
$$ plain form
41033 2625883 1092810 -9332 371766 1242158 1785276 2678043 4219648 4962647 3728726
41024 3728726 1709688 910406 1382906 1642141 1142484 600003 263792 -346757 -1091815
41015 -1091815 -1305520 -1300915 -2100056 -3449834 -3838173 -2934455 -2247269 -2595759 -2679607 -1343334
41005 -1343334 285548 484644 -384938 -637334 45294 520905 465160 880512 2114214
40996 2114214 2923628 2078561 -144788 -2495959 -3904928 -3822304 -2369868 -611967 120667
40987 120667 -331487 -792986 -311475 828056 1885240 2541524 2576305 1696577 412975
40978 412975 126574 1347603 2594268 2215492 708289 -87561 322232 723067 403532
40969 403532 61065 145559 -84703 -1034804 -1651971 -965655 241035 555640 31627 -158746
$$ packed form
41033B625883j533073j102142L81098Q70392N43118Q92767J541605P42999j233921
41024C728726k019038p99282M72500K59235m99657n42481l36211o10549p45058
41015a091815k13705M605p99141j349778l88339R03718O87186l48490q3848J336273
41005a343334J628882J99096q69582k52396O82628M75611n5745M15352J233702
40996B114214Q09414q45067k223349k351171j408969Q2624J452436J757901P32634
40987A20667m52154m61499M81511J139531J057184O56284L4781q79728j283602
40978D12975k86401J221029J246665l78776j507203p95850M09793M00835l19535
40969D03532l42467Q4494k30262r50101o17167O86316J206690L14605n24013j90373
$$ plain form
40959 -158746 308272 704424 820537 1271896 2099296 2503923 2449093 3197709 5414783 7747254
40949 7747254 8305291 6880111 4714563 2667947 782230 -654683 -949720 -84459 1120602
40940 1120602 2239351 3646261 5208283 5608737 3970450 1541380 540877 1415100
40932 1415100 2403580 2107540 1343845 1662519 2881287 3318458 2201380 579548 -323288
40923 -323288 -483741 -342135 137811 774868 502284 -1300465 -3312578 -3493387 -1659685
40914 -1659685 427634 1465969 1698155 1577269 1078465 828418 2062237 4354061 5055593
40905 5055593 2622251 -725861 -1535843 485291 2533100 2610715 1298231 -133886 -1124629
40896 -1124629 -1118972 261942 1648185 663126 -2627917 -4918639 -3801541 -1086675 -178970
$$ packed form
40959a58746M67018L96152J16113M51359Q27400M04627n4830P48616K217074K332471
40949G747254N58037j425180k165548k046616j885717j436913k95037Q65261J205061
40940A120602J118749J406910J562022M00454j638287k429070j000503Q74223
40932A415100R88480k96040p63695L18674J218768M37171j117078j621832r02836
40923c23288j60453J41606M79946O37057k72584j802749k012113j80809J833702
40914a659685K087319J038335K32186j20886m98804k50047J233819K291824P01532
40905E055593k433342l348112q09982K021134K047809P7615j312484j432117r90743
40896a124629N657J380914J386243r85059l291043k290722J117098K714866R07705
$$ plain form
40887 -178970 -1425780 -2239218 -1161240 478283 993418 459188 -108673 -223308 65424
40878 65424 601566 991646 769195 68760 -449114 -485167 -271514 127388 837383 1453575
40868 1453575 1262116 368435 -343890 -581142 -919503 -1440456 -1313281 -322657 391553
40859 391553 -2638 -653068 -330482 776062 1700945 2319728 2972922 3126045 2038112
40850 2038112 514354 279632 1426136 2094487 1214620 102989 460121 1934367 2812794
40841 2812794 2461675 1960158 2520189 4078444 5430327 5359104 3807992 2133504 1762517
40832 1762517 2414995 2380053 901115 -699074 -1010184 -613560 -937030 -1820346 -1856632
40823 -1856632 -865078 -276011 -852438 -1642603 -1720511 -1511943 -1624936 -1656278 -1165839 -811672
$$ packed form
40887a78970j246810q13438J077978J639523N15135n34230n67861j14635K88732
40878F5424N36142L90080k22451p00435n17874l6053K13653L98902P09995O16192
40868A453575j91459q93681p12325k37252l38361n20953J27175R90624P14210
40859C91553l94191o50430L22586J106544R24883O18783O53194J53123j087933
40850B038112j523758k34722J146504O68351q79867j111631L57132J474246Q78427
40841B812794l51119n01517N60031J558255J351883p1223j551112j674488l70987
40832A762517O52478l4942j478938j600189l11110L96624l23470q83316l6286
40823a856632R91554N89067n76427p90165p7908K08568j12993l1342M90439L54167
$$ plain form
40813 -811672 -1404131 -2567861 -3362319 -3575982 -3440161 -2777323 -1540344 -531281 -359900
40804 -359900 -313939 361693 704847 -683823 -2957387 -3681114 -2337101 -1124774 -1704510
40795 -1704510 -3109680 -3779548 -3733894 -3419391 -2181352 301674 2400544 2439217 1401113
40786 1401113 1615455 3140768 3570638 1492606 -1777564 -4242076 -5301165 -5315605 -4674478
40777 -4674478 -4017061 -4096417 -4662257 -4514642 -3278593 -2066838 -1779311 -1902338 -1767076
40768 -1767076 -1831932 -2655218 -3518681 -3255139 -1869683 -369495 475432 389615 -654113
40759 -654113 -1993391 -2362896 -1503275 -875380 -1499280 -1978113 -432868 2219082 3112255
40750 3112255 1554154 44638 562351 1893382 1829864 421105 -458362 219079 1808651
$$ packed form
40813h11672n92459j163730p94458k13663J35821O62838J236979J009063J71381
40804c59900M5961O75632L43154j388670k273564p23727J344013J212327n79736
40795a704510j405170o69868M5654L14503J238039K483026K098870L8673j038104
40786A401113K14342J525313M29870k078032l270170k464512j059089j4440O41127
40777d674478O57417p9356n65840J47615J236049J211755K87527j23027J35262
40768a767076o4856q23286q63463K63542J385456J500188Q44927q5817j043728
40759f54113j339278l69505Q59621O27895o23900m78833J545245K651950Q93173
40750C112255j558101j509516N17713J331031o3518j408759q79467O77441J589572
$$ plain form
40741 1808651 3234492 3845273 3430696 2410291 1728248 1773811 1786318 1058399 176408
40732 176408 117099 570010 281952 -1104778 -2615089 -3347815 -3407538 -3345422 -3448328 -3696813
40722 -3696813 -3795867 -3226452 -1887924 -658813 -662903 -1981892 -3687518 -5014273 -5782362
40713 -5782362 -5837469 -5045938 -3929117 -3358321 -3366114 -3057814 -1937642 -553495 389987
40704 389987 769705 720635 492637 860919 2567741 4862030 5755926 4552077 3065943
40695 3065943 3236058 4379480 4228707 2246738 366230 315072 1531454 2265288 1840025
40686 1840025 1122531 1210312 2292004 3694998 4593603 4535780 3504473 1773903 -153241
40677 -153241 -1655430 -2341413 -2284826 -1752398 -907053 -69389 131136 -480460 -1052145 -817813
$$ packed form
40741A808651J425841O10781m14577j020405o82043M5563J2507p27919q81991
40732A76408n9309M52911k88058j386730j510311p32726n9723O2116j02906k48485
40722c696813r9054N69415J338528J229111m090j318989j705626j326755p68089
40713e782362n5107P91531J116821N70796p793L08300J120172J384147R43482
40704C89987L79718m9070k27998L68282J706822K294289Q93896j203849j486134
40695C065943J70115J143422j50773j981969j880508n1158J216382P33834m25263
40686A840025p17494Q7781J081692J402994Q98605n7823j031307j730570j927144
40677a53241j502189o85983N6587N32428Q45345Q37664K00525o11596n71685K34332
$$ plain form
40667 -817813 -514970 -1432215 -3107906 -3600291 -2411211 -1328410 -1509797 -1625685 -347636
40658 -347636 1075083 781185 -490367 -598570 395741 489011 -644252 -1017081 314592
40649 314592 1777150 1942092 1417056 1035096 231653 -1343211 -2263618 -1056269 1529318
40640 1529318 3376990 3408326 2127680 592980 -242978 -26280 343346 -480346 -2094653
40631 -2094653 -2256003 -11171 2472836 2643155 949732 -125359 511027 1814802 2559057
40622 2559057 2360263 1329844 279849 628845 2440253 3304301 1177118 -2265143 -3433987
40613 -3433987 -1726610 -78250 -445337 -1413905 -1116692 -9533 693984 1334523 2760135
40604 2760135 4310292 4602906 3576345 2363564 1696936 1501481 1472775 1140334 28023
$$ packed form
40667h17813L02843r17245j675691m92385J189080J082801j81387j15888J278049
40658c47636J422719k93898j271552j08203R94311R3270j133263l72829J331673
40649C14592J462558J64942n25036l81960q03443j574864r20407J207349K585587
40640A529318J847672L1336j280646j534700q35958K16698L69626q23692j614307
40631b094653j61350K244832K484007J70319j693423j075091O36386J303775P44255
40622B559057j98794j030419j049995L48996J811408Q64048k127183l442261j168844
40613c433987J707377J648360l67087r68568K97213J107159P03517O40539J425612
40604B760135J550157K92614j026561j212781o66628j95455k8706l32441j112311
$$ plain form
40595 28023 -1388399 -1669067 -291669 1285071 1506009 833754 706815 1137191 941725
40586 941725 19561 -286528 720108 2018628 2305509 1478734 282229 -679408 -1121298
40577 -1121298 -933990 -326300 269853 675929 983222 1033410 456823 -553455 -1100654
40568 -1100654 -667765 57474 10057 -735566 -887133 392623 2181305 2737388 1681590
40559 1681590 539734 754067 1814428 2133899 1323289 483249 324170 272000 -216040
40550 -216040 -668960 -598177 -405377 -431548 -41417 1281889 2677854 2922765 2168845 1503563
40540 1503563 1234349 861125 392679 306683 360195 -130138 -793878 -448911 917529 1822898
40530 1822898 1383630 424575 -32762 -71737 22633 614886 1632746 1792627 217166
$$ packed form
40595B8023j416422k80668J377398J576740K20938o72255j26939M30376j95466
40586I41725r22164l06089J006636J298520K86881q26775j196505r61637m41890
40577a121298J87308O07690N96153M06076L07293N0188n76587j010278n47199
40568a100654M32889P25239m7417p45623j51567J279756J788682N56083j055798
40559A681590j141856K14333J060361L19471q10610q40040j59079n2170m88040
40550b16040m52920P0783J92800k6171L90131J323306J395965K44911p53920o65282
40540A503563k69214l73224m68446q5996N3512m90333o63740L44967J366440R05369
40530A822898m39268r59055m57337l8975R4370N92253J017860J59881j575461
$$ plain form
40521 217166 -1982651 -3058591 -2915491 -2674610 -2534091 -1820061 -1051617 -1949134 -4632980
40512 -4632980 -6418771 -4758662 -534086 2981824 4082232 4107914 4834862 5871856 5667875
40503 5667875 4218665 3241380 3607849 4028508 3069752 1454009 1068762 2113021 2707152
40494 2707152 1574332 -204355 -812712 -91838 657559 668993 449165 711359 1482788
40485 1482788 2350926 2957716 3138078 2986731 2787393 2592554 2142553 1603743 1878983
40476 1878983 3361810 4760374 4317868 2186326 372772 108958 609780 985503 1872294
40467 1872294 3884612 5584785 4844625 1923932 -568033 -990893 -387504 -356273 -707367
40458 -707367 -305282 818562 1575644 1579560 1502845 1755694 1943898 1815206 1751877 1913312
$$ packed form
40521B17166k199817j075940J43100K40881J40519P14030P68444q97517k683846
40512d632980j785791J660109M224576L515910J100408K5682P26948J036994k03981
40503E667875j449210r77285L66469M20659r58756j615743l85247J044259N94131
40494B707152j132820j778687o08357P20874P49397J1434k19828K62194P71429
40485A482788Q68138O06790J80362j51347j99338j94839m50001n38810K75240
40476A878983J482827J398564m42506k131542j813554k63814N00822L75723Q86791
40467A872294K012318J700173p40160k920693k491965m22860O03389L1231l51094
40458g07367M02085J123844P57082L916p6715K52849J88204j28692o3329J61435
$$ plain form
40448 1913312 1665291 445356 -1238070 -2172941 -1602837 209193 2219200 3162108 2364996
40439 2364996 491396 -832670 -626425 425901 989364 794471 703432 1255600 1961737
40430 1961737 2175628 1935296 1606511 1274910 904369 602348 246945 -669196 -2139417
40421 -2139417 -2936479 -1773388 713193 2061821 650871 -2258307 -3823260 -2746670
40413 -2746670 -446398 858182 510272 -438083 -872475 -761912 -731878 -1018149 -1119010
40404 -1119010 -402623 1055939 2333601 2526670 1791919 1208451 1380502 1571924 774538
40395 774538 -630796 -1164951 -374302 267514 -735973 -2730040 -3621689 -2580900 -1012754
40386 -1012754 -617299 -1382435 -2074515 -2066523 -1813213 -1708366 -1368266 -360706 916628
$$ packed form
40448A913312k48021j219935j683426r34871N70104J812030K010007R42908p97112
40439B364996j873600j324066K06245J052326N63463j94893r1039N52168P06137
40430A961737K13891k40332l28785l31601l70541l02021l55403r16141j470221
40421b139417p97062J163091K486581J348628j410950k909178j564953J076590
40413b746670K300272J304580l47910r48355m34392J10563L0034k86271j00861
40404a119010P16387J458562J277662J93069p34751n83468J72051J91422p97386
40395G74538j405334n34155P90649O41816j003487j994067q91649J040789J568146
40386a012754L95455p65136o92080P992K53310J04847L40100J007560J277334
$$ plain form
40377 916628 1603867 1467209 1196914 1544901 2403698 2884588 2251981 730512 -596259
40368 -596259 -742744 224909 1253069 1472176 1187700 1334969 1937151 1724040 -208218
40359 -208218 -2743747 -3558830 -1706160 1221081 2791442 2150838 415745 -902096 -1280272
40350 -1280272 -1099662 -748208 -125119 1060553 2703192 4167551 4797393 4442640 3400460
40341 3400460 2090465 1071565 1061277 2296241 3895641 4516937 3785707 2502200 1378833
40332 1378833 372543 -546570 -1008442 -1189735 -2105092 -4004014 -5317165 -4415849 -1904143
40323 -1904143 76081 461366 -67546 -674246 -1070530 -702202 994875 3044633 3245887
40314 3245887 908960 -1967053 -3156521 -2702083 -1936379 -1186070 59936 1406311 1658556
$$ packed form
40377I16628O87239j36658k70295L47987Q58797M80890o32607j521469j326771
40368e96259j46485R67653J028160K19107k84476J47269O02182k13111j932258
40359b08218k535529q15083J852670K927241J570361o40604j735093j317841l78176
40350a280272J80610L51454O23089J185672J642639J464359O29842l54753j042180
40341C400460j309995j018900j0288J234964J599400O21296p31230j283507j123367
40332A378833j006290r19113m61872j81293r15357j898922j313151R01316K511706
40323a904143J980224L85285n28912o06700l96284L68328J697077K049758K01254
40314C245887k336927k876013j189468M54438P65704P50309J246006J346375K52245
$$ plain form
40305 1658556 617070 -565571 -974556 -839501 -706761 -690685 -799025 -1080252 -1053001
40296 -1053001 155523 2458872 4209745 3796136 1688020 140879 657960 2288285
40288 2288285 2901505 1846610 605618 656999 1514463 1610923 554852 -633268 -1366050
40279 -1366050 -2183496 -3248750 -3551351 -2506814 -1223508 -977978 -1269722 -777042 342986
40270 342986 689312 -82957 -835660 -959160 -1235127 -2210002 -3098201 -3024411 -2220888 -1233652
40260 -1233652 -19700 1257547 1573770 431667 -801434 -355529 1427462 2414009 1556695
40251 1556695 150650 -163180 512955 987654 863033 700697 649906 42689 -1407599
40242 -1407599 -2866784 -3392487 -3128808 -2793376 -2364582 -1271240 125153 444605 -699544
$$ packed form
40305A658556j041486j182641m08985J35055J32740J6076j08340k81227K7251
40296a053001J208524K303349J750873m13609k108116j547141N17081J630325
40288B288285O13220j054895j240992N1381Q57464R6460j056071j188120p32782
40279a366050q17446j065254l02601J044537J283306K45530k91744M92680J120028
40270C42986L46326p72269p52703j23500k75967r74875q88199P3790Q03523R87236
40260a233652J213952J277247L16223j142103j233101M45905J782991R86547q57314
40251A556695j406045l13830O76135M74699j24621j62336n0791o07217j450288
40242a407599j459185n25703K63679L35432M28794J093342J396393L19452j144149
$$ plain form
40233 -699544 -1602060 -462030 2088601 3693702 3297260 2154010 1722960 1926132 2046221
40224 2046221 2136740 2577627 2993119 2642706 1548051 429888 -253972 -565335 -586261
40215 -586261 -244400 455311 1361190 2136134 2167444 1101564 -250044 -365435 1029618
40206 1029618 2299920 2034820 993454 776839 1338460 1372457 750814 750759 1736205 2358808
40196 2358808 1635772 399096 -31021 560861 1679133 2923341 3639614 2959680 1184107
40187 1184107 75738 630186 1490740 913841 -485938 -591699 990295 2293102 1743254
40178 1743254 61471 -1088559 -1167060 -753863 -292773 304308 1070037 1624878 1526416
40169 1526416 842790 267077 435659 1079678 1262559 637838 -121076 -465450 -716976
$$ packed form
40233f99544r02516J140030K550631J605101l96442j143250m31050K03172J20089
40224B046221R0519M40887M15492l50413j094655j118163o83860l11363k0926
40215e86261L41861O99711R05879P74944L1310j065880j351608j15391J395053
40206A029618J270302k65100j041366k16615N61621L3997o21643n5R85446O22603
40196B358808p23036j236676m30117N91882J118272J244208P16273o79934j775573
40187A184107j108369N54448Q60554n76899j399779j05761J581994J302807n49848
40178A743254j681783j150030p8501M13197M61090N97081P65729N54841r8462
40169A526416o83626n75713J68582O44019J82881o24721p58914l44374k51526
$$ plain form
40160 -716976 -1059525 -799372 301640 978816 334749 -99050 1685089 4579294 5337077
40151 5337077 3420917 2035086 3175583 4387141 2536385 -1318648 -3516651 -2956237
40143 -2956237 -1836681 -1797310 -2092691 -1728308 -928831 99588 1775012 3692909 4339734
40134 4339734 3237877 1964529 2014305 2792632 2750124 1590541 360408 28363 814858
40125 814858 2329956 3622728 3633141 2287437 711041 -133847 -458408 -844357 -1159714
40116 -1159714 -939093 -269498 349396 565194 141373 -967994 -1977511 -1508753 712775
40107 712775 3010118 3457316 1990213 123317 -890850 -865392 -237943 273935 27420
40098 27420 -714829 -795500 226111 1175471 963625 379441 796594 1728201 1419190 -310149
$$ packed form
40160g16976l42549K60153J101012O77176o44067m33799J784139K894205P57783
40151E337077j916160j385831J140497J211558j850756l855033k198003N60414
40143b956237J119556L9371k95381L64383P99477J028419J675424J917897O46825
40134D339734j101857j273348M9776P78327m2508j159583j230133l32045P86495
40125H14858J515098J292772J0413j345704j576396q44888l24561l85949l15357
40116a159714K20621O69595O18894K15798m23821j109367j009517M68758K221528
40107G12775K297343M47198j467103j866896j014167K5458O27449N11878k46515
40098B7420p42249q0671J021611R49360k11846n84184M17153R31607l09011j729339
$$ plain form
40088 -310149 -1609557 -1202914 183549 1387151 2207409 2584497 1882377 28870 -1685090
40079 -1685090 -1976728 -1019019 242931 1367655 2126216 1807452 48184 -2081536 -3013555
40070 -3013555 -2590781 -2073317 -2286188 -2725747 -2682163 -2337555 -2199551 -2011474 -1030388 590988
40060 590988 1415736 324609 -1721075 -2375814 -705986 1487979 1880773 538195 -442407
40051 -442407 161546 1508605 2452460 3026140 3623297 3937864 3548861 2668222 1543329
40042 1543329 -25881 -1750865 -2340098 -1074304 677761 760916 -1111185 -3016665 -3151951
40033 -3151951 -1727251 -473203 -775448 -2316208 -3330340 -2447975 -365019 973788
40025 973788 1022238 1325891 2926176 4428380 4024243 2397736 1806857 2812303 3836419
$$ packed form
40088c10149j299408M06643J386463J203602Q20258L77088p02120j853507j713960
40079a685090k91638R57709J261950J124724P58561l18764j759268k129720r32019
40070c013555M22774N17464k12871m39559M3584L44608J38004J88077R81086J621376
40060E90988Q24748j091127k045684o54739J669828K193965L92794j342578r80602
40051d42407O03953J347059R43855N73680N97157L14567l89003q80639j124893
40042A543329j569210j724984n89233J265794J752065Q3155j872101j905480j35286
40033c151951J424700J254048l02245j540760j014132Q82365K082956J338807
40025I73788M8450L03653J600285J502204m04137j626507n90879J005446J024116
$$ plain form
40016 3836419 3815443 3325632 2860802 1928277 465546 -565981 -795283 -1061106 -1487676
40007 -1487676 -567934 2451097 5603900 6360992 4938462 3710021 3780704 3959306 3124730
39998 3124730 1834131 1014589 446435 -521312 -1561038 -1621065 -278870 1836480 3826761
39989 3826761 5194707 5769727 5472252 4422515 3123658 2263909 2210739 2737053 3301922
39980 3301922 3545572 3462509 3257751 3221930 3564811 4036403 3859462 2525861 626944
39971 626944 -686301 -1147447 -1607470 -2588986 -3371650 -3064069 -1957883 -1065950 -712997
39962 -712997 -386913 220018 819394 1125340 1114192 654343 -403115 -1600148 -2000748
39953 -2000748 -1260478 -98489 572968 573797 267087 -65978 -237290 81455 1009687 1973525
$$ packed form
40016C836419k0976m89811m64830r32525j462731j031527k29302k65823m26570
40007a487676R19742L019031L152803P57092j422530j228441P0683J78602q34576
39998C124730j290599q19542n68154r67747j039726o0027J342195K115350J990281
39989C826761J367946N75020k97475j049737j298857q59749n3170N26314N64869
39980C301922K43650q3063k04758l5821L42881M71592j76941j333601j898917
39971F26944j313245m61146m60023r81516p82664L07581J106186Q91933L52953
39962g12997L26084O06931N99376L05946j1148m59849j057458j197033m00600
39953b000748P40270J161989O71457Q29l06710l33065j71312L18745R28232R63838
$$ plain form
39943 1973525 2130578 1409746 681945 610539 697223 5706 -1291705 -1848206 -963558 232081
39933 232081 202864 -828288 -1266076 -631802 -293664 -1207553 -2281138 -2073762 -1084371
39924 -1084371 -870095 -1495809 -1531273 -422806 836470 1610406 2495188 3690077 4090400
39915 4090400 3028507 1622389 1133444 997662 -76382 -1785738 -2609518 -2158758 -1550293
39906 -1550293 -1462334 -1409380 -1280379 -2037497 -4008762 -5605609 -4907388 -2056292 864721
39897 864721 2157080 1994115 1662591 1940150 2382806 1942972 205157 -1928844 -2917525
39888 -2917525 -2068190 -202007 1261898 1649006 1307490 872070 656621 727797 1200977
39879 1200977 2182202 3367187 3873934 2862972 578779 -1514537 -2113100 -1488024 -1009286
$$ packed form
39943A973525J57053p20832p27801p1406Q6684o91517j297411n56501Q84648J195639
39933B32081k9217j031152m37788O34274L38138r13889j073585K07376R89391
39924a084371K14276o25714l5464J108467J259276P73936Q84782J194889M00323
39915D090400j061893j406118m88945j35782j074044j709356q23780M50760O08465
39906a550293Q7959N2954J29001p57118j971265j596847O98221K851096K921013
39897H64721J292359j62965l31524K77559M42656m39834j737815k134001r88681
39888b917525Q49335J866183J463905L87108l41516m35420k15449P1176M73180
39879A200977R81225J184985N06747j010962k284193k093316n98563O25076M78738
$$ plain form
39870 -1009286 -1303750 -1557995 -849690 476414 1186814 507313 -1238898 -2956067 -3479494
39861 -3479494 -2459483 -892565 -230870 -559715 -344237 1371160 3255044 3242201 1352012
39852 1352012 -323261 -402844 301947 415401 -93445 -369413 -229034 -360565 -1272069
39843 -1272069 -2661271 -3667451 -3417565 -1687296 564443 1707922 1033669 -417142
39835 -417142 -1105302 -794330 -501736 -896127 -1566998 -1972970 -2294178 -2878159 -3377675 -3099102
39825 -3099102 -2083881 -1290734 -1556418 -2683389 -3726676 -3965094 -3358410 -2187508 -620156
39816 -620156 1210527 2922527 3958968 3960175 2962120 1312510 -441040 -1675197 -2007042
39807 -2007042 -1577086 -834475 -1390 1003255 2028269 2458935 1909669 979489 803366
$$ packed form
39870a009286k94464k54245P08305J326104P10400o79501j746211j717169n23427
39861c479494J020011J566918O61695l28845K15478J715397J883884j2843j890189
39852A352012j675273p9583P04791J13454n08846k75968J40379j31531r11504
39843a272069j389202j006180K49886J730269K251739J143479o74253j450811
39835d17142o88160L10972K92594l94391o70871m05972l21208n83981m99516K78573
39825c099102J015221P93147k65684j126971j043287k38418O06684J170902J567352
39816f20156J830683J712000J036441J207r98055j649610j753550j234157l31845
39807b007042M29956P42611Q33085J004645J025014M30666n49266r30180j76123
$$ plain form
39798 803366 1728441 2876856 3316291 3245554 3445842 3827558 3460061 2258605 1611370
39789 1611370 2520280 3876377 3789771 2270874 1163709 1375374 1750560 1223763 486437
39780 486437 421186 272583 -985144 -2339038 -1707772 989584 3448142 3798897 2386356
39771 2386356 574277 -768294 -1237713 -755456 -52173 -169210 -968113 -1225427 -622373
39762 -622373 -312149 -866117 -1111450 -95372 1055242 672333 -861065 -1516056 -234143
39753 -234143 2040543 3640369 3488834 1537737 -1027919 -2313719 -1518414 -46150 137268
39744 137268 -966083 -1549316 -583272 874478 1136718 -210657 -2119254 -3196320 -2852534
39735 -2852534 -1749853 -1115789 -1361285 -1700452 -1467523 -1161827 -1478109 -1931554 -1470701
$$ packed form
39798H03366R25075J148415M39435p0737K00288L81716l67497j201456o47235
39789A611370R08910J356097q6606j518897j107165K11665L75186n26797p37326
39780D86437o5251j48603j257727j353894O31266K697356K458558L50755j412541
39771B386356j812079j342571m69419M82257P03283j17037p98903k57314O03054
39762f22373L10224n53968k45333J016078J150614l82909j533398o54991J281913
39753b34143K274686J599826j51535j951097k565656j285800P95305J472264J83418
39744A37268j103351n83233R66044J457750K62240j347375j908597j077066L43786
39735b852534J102681O34064k45496l39167K32929L05696l16282m53445M60853
$$ plain form
39726 -1470701 -78579 1295961 2170309 2846908 3444257 3648629 3429179 3121871 2852865
39717 2852865 2650872 2878786 3646099 4125585 3567760 2723884 2980605 4201980 4796997
39708 4796997 3988240 2654468 1722099 1035319 147224 -951404 -2201514 -3462451 -3925921
39699 -3925921 -2746617 -498983 1193132 1641218 1405644 629796 -1132028 -3048666 -3028681
39690 -3028681 -612389 1891816 2377959 1534477 1178360 1483560 1475186 1099024 997075
39681 997075 942074 173867 -1089724 -1832935 -1588754 -548289 1058293 2533729 2437393
39672 2437393 253926 -2158985 -2405261 -646191 661969 121711 -1011120 -907106 421176
39663 421176 1399450 873062 -698859 -1764428 -1285055 38196 393407 -1102332 -3485347
$$ packed form
39726a470701J392122J374540Q74348O76599N97349K04372k19450l07308k69006
39717B852865k01993K27914P67313M79486n57825q43876K56721J221375N95017
39708D796997q08757j333772r32369o86780q88095j098628j250110j260937m63470
39699c925921J179304K247634J692115M48086k35574p75848j761824j916638J9985
39690c028681K416292K504205M86143q43482l56117L05200q374l76162j01949
39681I97075n5001p68207j263591p43211K44181J040465J606582J475436r6336
39672B437393k183467k412911k46276J759070J308160n40258j132831J04014J328282
39663D21176R78274n26388j571921j065569M79373J323251L55211j495739k383015
$$ plain form
39654 -3485347 -5270100 -5841560 -5109583 -2992583 -272008 1107553 49257 -1991780
39646 -1991780 -2682641 -1689748 -538396 -151330 -140028 -261741 -864584 -1778496 -2248841
39637 -2248841 -2186319 -2204943 -2292697 -1755648 -660024 7851 -75050 -106825 299831 318387
39627 318387 -762650 -2349838 -3260966 -2977214 -1861444 -768166 -589128 -1466148 -2329300
39618 -2329300 -1928102 -386065 948384 1118555 316369 -691287 -982191 289901 2868421
39609 2868421 4839553 4432535 2261003 485821 14611 73167 234075 812774 1153905
39600 1153905 -187319 -2887741 -4565664 -3967138 -2542188 -1853085 -1397014 -343602 466140
39591 466140 30097 -792483 -662724 -57274 -333935 -1373642 -1947968 -1737963 -1237960
$$ packed form
39654c485347j784753n71460P31977K117000K720575J379561j058296k041037
39646a991780o90861R92893J151352L87066J1302j21713o02843r13912m70345
39637b248841O2522j8624q7754N37049J095624O67875q2901l1775M06656J8556
39627C18387j081037j587188r11128K83752J115770J093278J79038q77020q63152
39618b329300M01198J542037J334449J70171q02186j007656k90904J272092K578520
39609B868421J971132m07018k171532j775182m71210N8556J60908N78699L41131
39600A153905j341224k700422j677923N98526J424950O89103M56071J053412Q09742
39591D66140m36043q22580J29759O05450k76661j039707n74326K10005N00003
$$ plain form
39582 -1237960 -257825 1630373 3497143 3736653 2320342 800064 44670 -510173 -1215411
39573 -1215411 -1339361 -367819 945706 1428412 723983 -623662 -1729629 -1854703 -942979
39564 -942979 140314 366403 -364194 -1214975 -1416105 -934028 -301541 -88175 -308701
39555 -308701 -174763 1080262 2919630 3821696 3307890 2716386 3249455 4247549 4426740
39546 4426740 3904588 3671624 3749538 3358954 2476280 1721602 983716 -285704 -1500230
39537 -1500230 -1258760 543163 2298970 2694326 1961025 965154 303607 525559 1865081
39528 1865081 3273219 3018893 957111 -869341 -646262 1060352 2285576 2039870 956719
39519 956719 137880 57958 313295 55927 -1019041 -2005163 -1665035 -87856 1265166
$$ packed form
39582a237960R80135J888198J866770K39510j416311j520278p55394n54843p05238
39573a215411j23950R71542J313525M82706p04429j347645j105967j25074R11724
39564i42979J083293K26089p30597q50781k01130M82077O32487K13366k20526
39555c08701J33938J255025J839368R02066n13806n91504N33069R98094J79191
39546D426740n22152k32964P7914l90584q82674p54678p37886j269420j214526
39537a500230K41470J801923J755807L95356p33301r95871o61547K21952J339522
39528A865081J408138k54326k061782j826452K23079J706614J225224k45706j083151
39519I56719q18839p9922K55337k57368j074968r86122L40128J577179J353022
$$ plain form
39510 1265166 1360427 613977 -139876 -725793 -1148842 -938548 253804 1937517 3260350
39501 3260350 3764142 3304981 1881588 11216 -1392819 -2018368 -2363912 -2552998 -1913922
39492 -1913922 -435761 443586 -340724 -1716824 -1951334 -1324937 -1699029 -3573409 -5315835
39483 -5315835 -5663846 -5339762 -5310621 -4802402 -2452096 1184300 3723377 3669741 2061092
39474 2061092 1048562 1467527 2297136 2211201 1080860 -220265 -1129362 -1962389 -2997012
39465 -2997012 -3511841 -2479803 -211124 1537324 1599682 958486 1504390 3532278 5351654
39456 5351654 5429136 4106226 2934312 2999966 4266882 5938271 6971725 6709983 5482569
39447 5482569 4220652 3229298 2019825 698725 420394 1510466 2174909 596540 -2292443
$$ packed form
39510A265166R5261p46450p53853n85917m23049K10294J192352J683713J322833
39501C260350N03792m59161j423393j870372j404035o25549l45544j89086O39076
39492a913922J478161Q79347p84310j376100k34510O26397l74092j874380j742426
39483e315835l48011L24084K9141N08219K350306L636396K539077n3636j608649
39474B061092j012530M18965Q29609q5935j130341j301125r09097q33027j034623
39465b997012n14829J032038K268679J748448O2358o41196N45904K027888J819376
39456E351654P7482j322910j171914O5654J266916J671389J033454k61742j227414
39447E482569j261917r91354j209473j321100k78331J090072O64443j578369k888983
$$ plain form
39438 -2292443 -3881065 -3471363 -2872398 -3251427 -3477924 -2393424 -854826 -221257 -203501
39429 -203501 302543 1162911 1208457 -17927 -1799195 -3121310 -3294971 -2341297 -1382147
39420 -1382147 -1770351 -3190852 -3776556 -2891847 -2320217 -3485028 -5093730 -5268984 -4541201
39411 -4541201 -4514439 -4715471 -3355683 -613555 1425028 1841568 1478305 737547 -565204
39402 -565204 -1229490 495637 3650069 5023397 3687774 2268870 2639216 3264713 2446812
39393 2446812 1394144 1786767 2572057 1871320 475925 677407 2538157 3843285 3277599
39384 3277599 1532423 -328397 -1643947 -1649414 -88335 1820268 2640054 2691110 3226113
39375 3226113 4064600 3871929 2565793 1462718 916515 -198435 -2129733 -3198341 -2083245
$$ packed form
39438b292443j588622M09702N98965l79029k26497J084500J538598O33569J7756
39429b03501N06044Q60368M5546j226384j781268j322115j73661R53674R59150
39420a382147l88204j420501n85704Q84709N71630j164811j608702j75254P27783
39411d541201K6762k01032J359788K742128K038583M16540l63263p40758j302751
39402e65204o64286J725127L154432J373328j335623j418904L70346O25497q17901
39393B446812j052668L92623P85290p00737j395395K01482J860750J305128n65686
39384C277599j745176j860820j315550n467J561079J908603Q19786N1056N35003
39375C226113Q38487j92671j306136j103075n46203j114950j931298j068608J115096
$$ plain form
39366 -2083245 130535 1245473 508092 -996708 -1946411 -1958577 -1421075 -858865 -656909
39357 -656909 -1124117 -2401339 -3975625 -4559778 -3242087 -863929 653467 663902 410127
39348 410127 780409 827155 -400361 -1852129 -1918792 -971682 -639493 -1080822 -877913 505186
39338 505186 1933649 2315344 1514927 -431031 -3302640 -5751164 -6127630 -4683805 -3410114
39329 -3410114 -3329730 -3552322 -3341321 -3195910 -3156979 -2030104 471536 2530640 2689766
39320 2689766 2087764 2530275 3508401 3138930 1361223 49766 36413 12354 -1158689
39311 -1158689 -2656660 -3053041 -2338180 -1661683 -1653406 -1869195 -1691301 -1067145 -249258 719908
39301 719908 1902593 2965632 3221826 2431212 1269604 530305 5579 -1191329 -3107028
$$ packed form
39366b083245K213780J114938p37381j504800r49703j2166N37502N62210K01956
39357f56909m67208j277222j574286n84153J317691K378158J517396J0435k53775
39348D10127L70282M6746j227516j451768o6663R47110L32189m41329K02909J383099
39338E05186J428463L81695q00417j945958k871609k448524l76466J443825J273691
39329c410114Q0384k22592K11001J45411L8931J126875K501640K059104J59126
39320B689766o02002M42511R78126l69471j777707j311457j3353k4059j171043
39311a158689j497971l96381P14861O76497Q277k15789J77894O24156Q17887R69166
39301G19908J182685J063039K56194p90614j161608p39299n24726j196908j915699
$$ plain form
39292 -3107028 -4474724 -4156863 -2534350 -999026 -462450 -785687 -1236839 -959154 615674
39283 615674 3081201 4942845 4928856 3455284 2145729 1812259 1659977 848548 61577
39274 61577 599041 2161377 2703138 1032150 -1261069 -1498562 684757 2770062 2496502
39265 2496502 559591 -574210 201979 1766411 2704062 2890920 2900986 2805775 2220765
39256 2220765 1151145 225114 57887 559269 946123 553097 -357256 -870651 -573145
39247 -573145 69544 683698 1557417 2652398 2913442 1654113 8344 -376982 256228
39238 256228 252504 -699420 -1138846 -507314 -249411 -1255683 -2040159 -1049593 626055 868231
39228 868231 4389 348689 2324001 3323925 1271573 -2379521 -4449208 -3801150 -2025817
$$ packed form
39292c107028j367696L17861J622513J535324N36576l23237m51152K77685J574828
39283F15674K465527J861644j3989j473572j309555l33470j52282q11429p86971
39274F1577N37464J562336N41761j670988k293219k37493K183319K085305k73560
39265B496502j936911j133801P76189J564432R37651J86858J0066r5211n85010
39256B220765j069620r26031j67227N01382L86854l93026r10353n13395K97506
39247e73145O42689O14154Q73719J094981K61044j259329j645769l85326O33210
39238B56228l724r51924m39426O31532K57903j006272p84476R90566J675648K42176
39228H68231q63842L44300J975312R99924k052352l651094k069687O48058J775333
$$ plain form
39219 -2025817 -988605 -1084063 -1783218 -2524001 -2634530 -1492541 420812 1381282 366968
39210 366968 -1284885 -1352969 276936 1497949 1140910 657432 1669281 3246917 3297700
39201 3297700 1855606 992030 1549894 1944793 784561 -948816 -1339902 -101032 1348868
39192 1348868 1765539 1178942 430420 218939 491687 609184 319889 301261 1059489 1683252
39182 1683252 963255 -357442 -159705 1798680 3064967 1958573 100702 -137207 723017
39173 723017 353844 -1403114 -2098209 -402265 1810189 1951210 -76708 -2121880 -2421230
39164 -2421230 -1168907 120667 181411 -940765 -2087504 -2282700 -1753609 -1417438 -1543160
39155 -1543160 -1437599 -480037 995241 1989932 1765027 472228 -905871 -1318094 -591506
$$ packed form
39219b025817J037212r5458o99155p40783j10529J141989J913353R60470j014314
39210C66968j651853o8084J629905J221013l57039m83478J011849J577636N0783
39201C297700j442094q63576N57864L94899j160232j733377l91086J238870J449900
39192A348868M16671n86597p48522k11481K72748J17497k89295j8628P58228O23763
39182A683252p19997j320697J97737J958385J266287j106394j857871k37909Q60224
39173G23017l69173j756958o95095J695944K212454J41021k027918k045172k99350
39164b421230J252323J289574O0744j122176j146739j95196N29091L36171j25722
39155a543160J05561R57562J475278R94691k24905j292799j378099m12223P26588
$$ [...]
##END NTUPLES=NMR SPECTRUM
##END=
