##TITLE=31Pdec_PR177rm_E
 D2O, 24 sc
 28.8.2019
##JCAMPDX= 6.0         $$ Bruker NMR JCAMP-DX V2.0
##DATA TYPE= NMR SPECTRUM
##DATA CLASS= NTUPLES
##ORIGIN= UXNMR, Bruker Analytische Messtechnik GmbH
##OWNER= root
$$ XWIN-NMR		Version 3.5
$$ Wed Aug 28 13:57:17 2019 Russian Standard Time (UT+4h)  she@DPX200
##.OBSERVE FREQUENCY= 81.013821
##.OBSERVE NUCLEUS= ^31P
##.ACQUISITION MODE= SIMULTANEOUS
##.ACQUISITION SCHEME= undefined
##.AVERAGES= 24
##.DIGITISER RES= 17
##SPECTROMETER/DATA SYSTEM= spect
##.PULSE SEQUENCE= zgpg30
##.SOLVENT NAME= CDCl3
##.SHIFT REFERENCE= (INTERNAL, CDCl3, 0, 182.463)
##AUDIT TRAIL= $$ (NUMBER, WHEN, WHO, WHERE, WHAT)
$$ ##TITLE= Audit trail, XWIN-NMR		Version 3.5
$$ ##JCAMPDX= 5.01
$$ ##ORIGIN= Bruker BioSpin GmbH
$$ ##OWNER= she
$$ F:/spectra/data/she/nmr/P31/1/pdata/1/auditp.txt
$$ ##AUDIT TRAIL=  $$ (NUMBER, WHEN, WHO, WHERE, WHAT)
(   1,<2019-08-28 13:56:09.95 +0400>,<she>,<DPX200>,
      <created by zg, POWCHK disabled, PULCHK disabled
       configuration hash MD5:
       00 E9 B6 7A A2 85 ED C7 34 08 36 98 17 FE 4E 26
       data hash MD5: 32K
       21 42 F1 70 3F 07 5A D2 F1 FC 2B BE DB BB 17 DC>)
(   2,<2019-08-28 13:56:12.31 +0400>,<she>,<DPX200>,
      <Start of raw data processing
       efp BC_mod = 2 LB = 1 FT_mod = 6 PKNL = 1 PHC0 = -435.9731 PHC1 = 210.2004 SI = 64K 
       data hash MD5: 64K
       2F CA 81 80 DA E2 BC 7C C1 20 89 3E 53 20 12 A0>)
(   3,<2019-08-28 13:56:44.14 +0400>,<she>,<DPX200>,
      <pk PHC0 = -30.33617 PHC1 = 44.99999 
       data hash MD5: 64K
       44 53 BD 64 8C F7 73 65 70 48 DC 7A C5 42 63 5D>)
(   4,<2019-08-28 13:56:47.56 +0400>,<she>,<DPX200>,
      <abs ABSG = 5 
       data hash MD5: 64K
       A0 86 03 D4 9C B6 11 23 5B FF 8C B0 17 BE 72 26>)
$$ ##END=
$$ 
$$ hash MD5
$$ 4F AE 02 1C 2E 71 83 89 59 DA BB 2C 25 DD 55 C8
##$RELAX= 
##$RELAX= 
##$RELAX= 
##$RELAX= 
##$RELAX= 
##$RELAX= 
##$RELAX= 
##$RELAX= 
$$ Bruker specific parameters
$$ --------------------------
##$DU= <F:/spectra>
##$EXPNO= 1
##$NAME= <P31>
##$PROCNO= 1
##$TYPE= <nmr>
##$USER= <she>
##$AMP= (0..31)
100 100 100 100 100 100 100 100 100 100 100 100 100 100 100 100 100 100 
100 100 100 100 100 100 100 100 100 100 100 100 100 100 
##$AQSEQ= 0
##$AQ_mod= 1
##$AUNM= <au_zg>
##$AUTOPOS= <>
##$BF1= 81.014009
##$BF2= 200.13
##$BF3= 200.13
##$BF4= 200.13
##$BF5= 200.13
##$BF6= 200.13
##$BF7= 200.13
##$BF8= 200.13
##$BYTORDA= 1
##$CFDGTYP= 0
##$CFRGTYP= 5
##$CHEMSTR= <none>
##$CNST= (0..31)
1 1 145 1 1 1 1 1 1 1 1 1 1 1 1 1 1 1 1 1 1 1 1 1 1 1 1 1 1 1 1 1 
##$CPDPRG= <waltz16>
##$CPDPRG1= <>
##$CPDPRG2= <waltz16>
##$CPDPRG3= <>
##$CPDPRG4= <mlev>
##$CPDPRG5= <mlev>
##$CPDPRG6= <mlev>
##$CPDPRG7= <mlev>
##$CPDPRG8= <mlev>
##$CPDPRGB= <>
##$CPDPRGT= <>
##$D= (0..31)
0 1 0 0 0 0 0 0 0 0 0 0.03 2e-05 3e-06 0 0 0 0 0 0 0 0 0 0 0 0 0 0 0 0 
0 0 
##$DATE= 1566986169
##$DBL= (0..7)
120 120 120 11 120 120 24 19 
##$DBP= (0..7)
150 150 150 150 150 150 150 150 
##$DBP07= 0
##$DBPNAM0= <>
##$DBPNAM1= <>
##$DBPNAM2= <>
$$ [...]
##$SUBNAM3= <"">
##$SUBNAM4= <"">
##$SUBNAM5= <"">
##$SUBNAM6= <"">
##$SUBNAM7= <"">
##$SUBNAM8= <"">
##$SUBNAM9= <"">
##$SW= 369.568048894756
##$SWIBOX= (0..15)
0 1 3 0 0 0 0 0 0 0 0 0 0 0 0 0 
##$SW_h= 29940.119760479
##$TD= 32768
##$TD0= 1
##$TE= 0
##$TE2= 300
##$TE3= 300
##$TEG= 300
##$TL= (0..7)
0 120 53 12 22 120 120 120 
##$TP= (0..7)
150 150 150 150 150 150 150 150 
##$TP07= 0
##$TPNAME0= <>
##$TPNAME1= <>
##$TPNAME2= <>
##$TPNAME3= <>
##$TPNAME4= <>
##$TPNAME5= <>
##$TPNAME6= <>
##$TPNAME7= <>
##$TPOAL= (0..7)
0.5 0.5 0.5 0.5 0.5 0.5 0.5 0.5 
##$TPOFFS= (0..7)
0 0 0 0 0 0 0 0 
##$TUNHIN= 0
##$TUNHOUT= 0
##$TUNXOUT= 0
##$USERA1= <user>
##$USERA2= <user>
##$USERA3= <user>
##$USERA4= <user>
##$USERA5= <user>
##$V9= 5
##$VALIST= <valist>
##$VCLIST= <CCCCCCCCCCCCCCC>
##$VD= 0
##$VDLIST= <DDDDDDDDDDDDDDD>
##$VPLIST= <PPPPPPPPPPPPPPP>
##$VTLIST= <TTTTTTTTTTTTTTT>
##$WBST= 1024
##$WBSW= 4
##$XGAIN= (0..3)
0 0 0 0 
##$XL= 0
##$YL= 0
##$YMAX_a= 27393
##$YMIN_a= -36083
##$ZGOPTNS= <>
##$ZL1= 120
##$ZL2= 120
##$ZL3= 120
##$ZL4= 120
##$ABSF1= 182.463
##$ABSF2= -187.1042
##$ABSG= 5
##$ABSL= 3
##$ALPHA= 0
##$AQORDER= 0
##$ASSFAC= 0
##$ASSFACI= 0
##$ASSFACX= 0
##$ASSWID= 0
##$AUNMP= <proc_1d>
##$AZFE= 0.1
##$AZFW= 0.5
##$BCFW= 0
##$BC_mod= 2
##$BYTORDP= 0
##$COROFFS= 0
##$CY= -3
##$DATMOD= 1
##$DC= 0
##$DFILT= <>
##$DTYPP= 0
##$F1P= 0
##$F2P= 0
##$FCOR= 1
##$FTSIZE= 65536
##$FT_mod= 6
##$GAMMA= 0
##$GB= 0
##$INTBC= 1
##$INTSCL= 5.30512e-09
##$ISEN= 30
##$LB= 1
##$LEV0= 0
##$LPBIN= 0
##$MAXI= 10000
##$MC2= 0
##$MEAN= 0
##$ME_mod= 0
##$MI= 50
##$NCOEF= 0
##$NC_proc= -5
##$NLEV= 6
##$NOISF1= 182.463
##$NOISF2= 159.3651
##$NSP= 0
##$NTH_PI= 0
##$NZP= 0
##$OFFSET= 182.463
##$PC= 4
##$PHC0= -466.3093
##$PHC1= 255.2004
##$PH_mod= 1
##$PKNL= yes
##$PPARMOD= 0
##$PSCAL= 0
##$PSIGN= 0
##$REVERSE= no
##$SF= 81.0140089999434
##$SI= 65536
##$SIGF1= 159.3651
##$SIGF2= -187.1042
##$SINO= 113.3802
##$SIOLD= 16384
##$SREGLST= <1H.CDCl3>
##$SSB= 0
##$STSI= 65536
##$STSR= 0
##$SW_p= 29940.119760479
##$SYMM= 0
##$S_DEV= 0
##$TDeff= 32768
##$TDoff= 0
##$TI= <>
##$TILT= no
##$TM1= 0
##$TM2= 0
##$TOPLEV= 0
##$USERP1= <user>
##$USERP2= <user>
##$USERP3= <user>
##$USERP4= <user>
##$USERP5= <user>
##$WDW= 1
##$XDIM= 65536
##$YMAX_p= 472120528
##$YMIN_p= -5005371
$$ End of Bruker specific parameters
$$ ---------------------------------
##NTUPLES= NMR SPECTRUM
##VAR_NAME=  FREQUENCY,     SPECTRUM/REAL,   SPECTRUM/IMAG
##SYMBOL=    X,             R,               I
##VAR_TYPE=  INDEPENDENT,   DEPENDENT,       DEPENDENT
##VAR_FORM=  AFFN,          ASDF,            ASDF
##VAR_DIM=   65536,         65536,           65536
##UNITS=     HZ,            ARBITRARY UNITS, ARBITRARY UNITS
##FACTOR=    0.456856943014862, 1,           1
##FIRST=     14782.0589164792, 0,            0
##LAST=      -15158.0608439998, 0,           0
##MIN=       -15158.0608439998, -5005371,    0
##MAX=       14782.0589164792, 472120528,    0
$$ Real data points
##PAGE= N=1
##DATA TABLE= (X++(R..R)), XYDATA
$$ [...]
43372B394000q25862j061571l98747J31347j2596k46979m6664K07658N3829j76610
$$ 2394000 1568138 506567 107820 239167 226571 -20408 -67072 140586 194415 17805
43362A7805J3082L34452J58241l98555o01306k17510K16719L06218K70963K86529
$$ 17805 30887 365339 523580 125025 -476281 -693791 -477072 -170854 100109 386638
43352C86638L0781o39668j086182o29169L68302Q59937N04427O718k6151J29959
$$ 386638 417419 -222249 -1308431 -1937600 -1569298 -709361 -204934 -198216 -224367 -94408
43342i4408j2229l08948l10865k630L14380N59980P51880O22223j0043o47575
$$ -94408 -106637 -415585 -726450 -729080 -414700 145280 897160 1519383 1509340 861765
43332H61765n79902P9728M84063K40195j56767k24449j29362j20334K973L65003
$$ 861765 281863 361591 845654 1085849 929082 704633 575271 454937 457910 822913
43322H22913M93731m6852q13512r05793j37842P17674Q61323K76228m03141n56142
$$ 822913 1316644 1269792 456280 -449513 -587355 130319 991642 1267870 864729 308587
43312C08587j11725L98146L82361j03269l92630r6141L69988M15948Q4527j94866
$$ 308587 196862 595008 977369 874100 481470 385329 755317 1171265 1255792 1060926
43302A060926l32545m91502n02319o0408N34330N58847n9232n03048j88521M29155
$$ 1060926 728381 236879 -265440 -325848 208482 767329 708097 205049 16528 445683
43292D45683N47294P6629m10890m80677j70642K50731M88661L45374m5905k58673
$$ 445683 992977 1069606 658716 178039 7397 258128 746789 1092163 1046258 787585
43282G87585j03819P8927o7630l72384m53770l20674k10066o3748K69512M73120
$$ 787585 683766 762693 695063 322679 -131091 -451765 -661831 -725579 -456067 17053
43272A7053R1203n87505p16583j27618L72921K64077Q7780M07483P24826K99092
$$ 17053 108256 -479249 -1195832 -1323450 -950529 -686452 -598672 -191189 533637 832729
43262H32729m64363n20552J17258L42479k56379p21490k95010L73236L37075j49478
$$ 832729 368366 -152186 -34928 307551 51172 -670318 -965328 -592092 -255017 -404495
43252d04495k05956J67231K41180o2972q0153L08025L79169j65830o08973l48275
$$ -404495 -610451 -443220 -202040 -265012 -345165 -37140 342029 176199 -432774 -781049
43242g81049J61817J71785k63366n26949l12464K77449J041326J529790J066300
$$ -781049 -619232 -447447 -710813 -1237762 -1550226 -1272777 -231451 1298339 2364639
43233B364639l73634j648014j578290m05813N86232P25265M48624K58996P4628
$$ 2364639 1991005 342991 -1235299 -1641112 -1054880 -329615 119009 378005 452633
43224D52633k30960m30816l78640k45537r7041J98512M64104K67459k75917m50553
$$ 452633 221673 -209143 -587783 -833320 -930361 -731849 -267745 -286 -276203 -726756
43214g26756m4591K06186k32307p85930o66114p8571K47642K78697N05858Q08642
$$ -726756 -771347 -565161 -797468 -1583398 -2249512 -2328083 -2080441 -1801744 -1295886 -487244
43204d87244M89514m81273j126475o86289L93612J019444O36058l44113j010962
$$ -487244 2270 -479003 -1605478 -2291767 -1898155 -878711 -242653 -586766 -1597728
43195a597728p46946J89069Q37764N57259k14005n51912k46771J13023J64444
$$ -1597728 -2344674 -2155605 -1317841 -760582 -974587 -1526499 -1773270 -1660247 -1495803
43186a495803J90222L97572M65630J32787l11344m87609m37777l36361j35142
$$ -1495803 -1305581 -908009 -442379 -309592 -620936 -1108545 -1546322 -1882683 -2017825
43177b017825J38865J79096p5798j47190K47136N81942K77249k96924l42537O3664
$$ -2017825 -1878960 -1699864 -1775662 -1922852 -1675716 -1093774 -816525 -1113449 -1455986 -1392322
43167a392322J05822l24370l20765N45322J346345J092587K22028j08892J67949
$$ -1392322 -1286500 -1610870 -1931635 -1386313 -39968 1052619 1274647 1165755 1333704
43158A333704J9458q70833j387630o19272O47389R51230K11121k94912N7270L67662
$$ 1333704 1353162 482329 -905301 -1524573 -877184 74046 285167 -9745 47525 415187
43148D15187k18670j041957r04880M3088M81701j14364p35490l61527O28315J125768
$$ 415187 196517 -845440 -1750320 -1707232 -1225531 -1339895 -2075385 -2436912 -1808597 -682829
43138f82829P82886J54455l08329o63382r13122p09627R6381R79376J156925M27110
$$ -682829 100057 254512 -53817 -717199 -1630321 -2339948 -2243567 -1264191 -107266 319844
43128C19844n78528r94152n29822L05921P53446N21578n3471m54191m42086j35471
$$ 319844 -258684 -1252836 -1782658 -1476737 -723291 -201713 -255184 -709375 -1151461 -1286932
43118a286932J61991J89999k9364j60186O6197M54821N53616K32718k14353n12190
$$ -1286932 -1124941 -934942 -964306 -1124492 -1058295 -603474 -49858 182860 -31493 -543683
43108e43683n89618l52185K38593P74227O59090m291l66071j7390L57055J6067
$$ -543683 -1133301 -1485486 -1246893 -472666 186424 182133 -183938 -201328 155727 171794
43098A71794o98992r29268n65619j74097L7843L21574O07514N21965J95118J84513
$$ 171794 -527198 -1456466 -2022085 -2196182 -2158339 -1836765 -1229251 -707286 -512168 -327655
43088c27655M74302M14590j14582l62043P2116N07960K61461k64911k95020O2522
$$ -327655 146647 561237 446655 84612 156728 664688 926149 661238 366218 428740
43078D28740R7963k84965m76253j64208L11637N94889O30105L36603l34410r00515
$$ 428740 526703 241738 -234515 -398723 -87086 507803 1137908 1474511 1140101 239586
43068B39586o36053L35908R01689L73812n10424o27929p2081J04924m20052p61171
$$ 239586 -396467 -60559 841130 1214942 704518 76589 4508 109432 -310620 -1071791
43058a071791k58328M65793M58229j54409m79921k78416j98467n64207p44543
$$ -1071791 -1330119 -864326 -406097 -560506 -1040427 -1318843 -1517310 -2081517 -2826060
43049b826060r6723J012296J597464J195561K56373m24231m02710J12345M62569
$$ -2826060 -2922783 -1910487 -313023 882538 1138911 714680 311970 424315 886884
43040H86884K02600l58486n49476k87947j43940l19753k46191L90248Q95401N23170
$$ 886884 1089484 730998 181522 -106425 -250365 -570118 -816309 -426061 469340 992510
43030I92510l33010p03985m20521n6967K01926O23898R64075N42046n22894j145713
$$ 992510 659500 -44485 -465006 -521973 -320047 303851 1267926 1809972 1287078 141365
43020A41365p14446J33480N78390O71768P90323P34981J07253p83603j082458
$$ 141365 -573081 -439601 138789 810557 1600880 2335861 2443114 1659511 577053
43011E77053m23354N78309R11506J80978q99743j166029l76900L82408J43238
$$ 577053 153699 732008 1643514 1824492 924749 -241280 -618180 -235772 -92534
43002i2534n27158l93458M89866Q71850L03758l05981l57574l39490m64076n8637
$$ -92534 -619692 -1013150 -523284 348566 652324 346343 -11231 -350721 -814797 -873434
42992h73434Q60278R37993l87844j490453q12073O38049Q23445j78257n91232
$$ -873434 -13156 924837 536993 -953460 -1765533 -1127484 -304039 -482296 -1073528
42983a073528M1619M30130L4270j56640L32046O01369J67678j39386J66635K60128
$$ -1073528 -1031909 -601779 -567509 -724149 -392103 209266 376944 237558 404193 664321
42973F64321m06197r79899p06676k56732m12114n92284J4599Q15962P23446j5147
$$ 664321 258124 -721775 -1428451 -1685183 -2097297 -2689581 -2674982 -1859020 -1135574 -1150721
42963a150721l09613k5160J32067J38222N70584J166106R73849N7564l93250J3575
$$ -1150721 -1460334 -1485494 -1353427 -1215205 -644621 521485 1495334 1552898 1159648 1173223
42953A173223K02447n34837j270611q87101J54624N54418J06802k00349J94229
$$ 1173223 1375670 840833 -429778 -1316879 -1162255 -607837 -501035 -701384 -507155
42944e07155P13378O62888J87564j10189k9356J12448J9867j99527k15057L5278
$$ -507155 206223 869111 1056675 946486 917130 1029578 1049445 849918 634861 670139
42934F70139J32957l42926j097331j235841l69544P25406J001568M48700p7234
$$ 670139 803096 460170 -637161 -1873002 -2242546 -1517140 -515572 -66872 -144106
42925a44106j73637k50866m95291l89332K85562P83982M58790j38238j02433L41842
$$ -144106 -317743 -568609 -1063900 -1453232 -1167670 -383688 75102 -63136 -165569 176273
42915A76273K56386l61611n34834L2154M46618J38916k21094Q8092O60780P04755
$$ 176273 432659 71048 -463786 -431632 14986 153902 -67192 20900 681680 1386435
42905A386435K32997k35190n48472p42112n46996J04090N53600K48429k93905
$$ 1386435 1619432 1384242 835770 93658 -453338 -349248 204352 452781 158876
42896A58876j95347M34147P16535L14384l11221p09013o95931j09689P97724J025550
$$ 158876 -36471 397676 1114211 1428595 1117374 408361 -287570 -397259 400465 1426015
42886A426015o7058j505050j668882m65478O02248N69704L8775j18779O2216J36366
$$ 1426015 1358957 -146093 -1814975 -2280453 -1678205 -1108501 -1069726 -1188505 -1126289 -989923
42876i89923k6502l68004p07760n32215M04559J231923Q10266m77333j048471
$$ -989923 -1016425 -1384429 -2092189 -2624404 -2219845 -987922 -177656 -654989 -1703460
42867a703460m41034J35264l3111o1873O95175J298542Q49266R4139O6142K77565
$$ -1703460 -2144494 -2009230 -2042341 -2104214 -1409039 -110497 738769 832908 899050 1176615
42857A176615k35109r91618q20782Q1355M61525M2482k58750l495K55865J53184
$$ 1176615 941506 -50112 -870894 -789539 -328014 -285532 -544282 -547777 -291912 -138728
42847a38728M91J756l2547j09333k5400J04523M0060k0283J71823K30671k90030
$$ -138728 -138237 -136481 -169028 -278361 -303761 -199238 -159178 -179461 -7638 223033 -66997
42836f6997r16522q03695m5398N22884O06254N40269L45102k05814p36423o27527
$$ -66997 -983519 -1787214 -1832612 -1309728 -703474 -163205 181897 -23917 -760340 -1387867
42826a387867j31832p353j61190J18136O68879N77813j33946l90201J15765M16666
$$ -1387867 -1519699 -1527052 -1688242 -1570106 -901227 -323414 -457360 -847561 -731796 -315130
42816c15130K7296k03888L57380J002853Q83866K69644j82026m52096o75519n28229
$$ -315130 -287834 -491722 -134342 868511 1752377 2022021 1839995 1387899 712380 184151
42806A84151O8160M10568J6690n07260l84812J65829M46728L77025L03923K23639
$$ 184151 252311 662879 679569 172309 -212503 -46674 400054 777079 1081002 1304641
42796A304641n2338l54163m36030m33174m89400l52216J42409O36250P90643P68119
$$ 1304641 1252303 898140 462110 28936 -460464 -812680 -670271 -34021 756622 1524741
42786A524741P14919L59742l36346p53034m54936R6671K66756J04957p3189k79181
$$ 1524741 2239660 2599402 2263056 1510022 1055086 1151757 1418513 1523470 1450281 1171100
42776A171100m14583l1829P23428P89082k60179j197050q21331J61460L25993
$$ 1171100 756517 724688 1448116 2237198 1977019 779969 -41362 120098 446091
42767D46091j17081J49756J059747J115942n8260r61638n22356M28158P14475
$$ 446091 329010 478766 1538513 2654455 2596195 1634557 1112201 1540359 2254834
42758B254834M70900L65411L82331M04017R59820K162843K684219J217600j379575
$$ 2254834 2725734 3091145 3473476 3877493 4837313 7000156 9684375 10901975 9522400
42749I522400k806774k204240j043695q38348j177358p90952L32316J026044Q06329
$$ 9522400 6715626 4511386 3467691 2629343 1451985 661033 993349 2019393 2825722
42740B825722M55945N47856M50806n12491j664258j730008o83712K38718L73978
$$ 2825722 3281667 3829523 4280329 3767838 2103580 373572 -310140 -71422 302556
42731C02556L51413O56931O61491j07426o93107O9487J558181J921128N83078
$$ 302556 653969 1310900 1972391 1864965 1171858 1241345 2799526 4720654 5303732
42722E303732j027703j495018j040917o31447m39276n3846L70472J95051n55788
$$ 5303732 4276029 2781011 1740094 1108647 669371 615525 985997 1181048 625260
42713F25260r77063m77088L57026M88499k54577j027003j049177l92562M19681
$$ 625260 -351803 -828891 -471865 16634 -237943 -1264946 -2314123 -2706685 -2287004
42704b287004J113264J585184J507102O49535m83610r99012o94686k22552o7802
$$ -2287004 -1173740 411444 1918546 2568081 2084471 1085459 390773 168221 100419
42695A00419l4616M5764j17297n44871n68590J92190J007010R35849J34179m74971
$$ 100419 65803 111567 -5730 -550601 -1119191 -927001 80009 1015858 1150037 675066
42685F75066m73653j53138K23246N55590N37951k9304o74064p26852k48194J71576
$$ 675066 201413 48275 271521 827111 1365062 1335758 661694 -65158 -313352 -141776
42675a41776L23810L77682K45707j87572m43863l4583N02047K30345n86511p25383
$$ -141776 182034 559716 805423 617851 173988 139405 641452 871797 285286 -440097
42665d40097M9588N55295O8725n91733m70294J06395K79148j2250k57151l14110
$$ -440097 -390509 164786 233511 -358222 -828516 -722121 -442973 -455223 -712374 -1026484
42655a026484l58932l26747m5352L73659O89108P51508L92374l49240p59417n9032
$$ -1026484 -1385416 -1712163 -1757515 -1383856 -694748 56760 449134 99894 -659523 -718555
42645g18555J201948J363984j26266j692374j649480l85890M78137L87982J28928
$$ -718555 483393 1847377 1721111 28737 -1620743 -2006633 -1528496 -1140514 -1011586
42636a011586K54466M64463M31836K33390l9684l14061k77158J75712M33529p0101
$$ -1011586 -757120 -292657 139179 372569 332885 18824 -258334 -82622 350907 280806
42626B80806p72505n86413M64603J165927P77221r0475m79947k24779J92201L32900
$$ 280806 -491699 -1078112 -613509 552418 1329639 1239164 759217 534438 726639 1059539
42616A059539J10899j88156j33250K44328K79774l37058p67491j23127R13962
$$ 1059539 1170438 982282 849032 1093360 1373134 1036076 268585 145458 1059420
42607A059420Q00347n06728j281970n38637N66447O07828n8481k22396J60477
$$ 1059420 1859767 1353039 71069 -467568 98879 706707 648226 425830 586307
42598E86307K15255j61303k47333P9555J59464j69248k67539J17310L89733J60389
$$ 586307 801562 640259 392926 472481 631945 462697 195158 312468 702201 862590
42588H62590j34190o9665R3971J8186j48513k60836n07796p32381k18068J073470
$$ 862590 728400 658735 752706 770892 622379 361543 -146253 -878634 -1096702 -23232
42578b3232J779426P32164j145280j754586n56223P99797P78788k16781q10975
$$ -23232 1756194 2488358 1343078 -411508 -967731 -167934 610854 394073 -416902
42569d16902n14489O5642K69084j6344m12110k67838P26806J786312J532277k06261
$$ -416902 -931391 -865749 -596665 -613009 -1025119 -1292957 -566151 1220161 2752438 2546177
42559B546177j782974j673287l92587M48404M33778M81903R88604J198119N81236
$$ 2546177 763203 -910084 -1302671 -854267 -420489 61414 1050018 2248137 2829373
42550B829373l30591q43470r05407o81241j82365L25915L41273r4380l52777k21069
$$ 2829373 2498782 1655312 749905 68664 -113701 212214 553487 459107 106330 -114739
42540a14739j50974k83122j82596J35142K0543m78363l26147O96750J167675J27436
$$ -114739 -265713 -548835 -731431 -596289 -575746 -1054109 -1380256 -683506 484169 611605
42530F11605j119033p82778O52351J147335J55239q03495n98657J24938L55199
$$ 611605 -507428 -1290206 -637855 509480 664719 -138776 -737433 -612495 -257296
42521b57296J00414j72627l70949m50757j42800M39781O53812K84800j5567K66151
$$ -257296 -156882 -329509 -700458 -1151215 -1294015 -854234 -200422 84378 68811 334962
42511C34962O86251N54142m9072m90060m51923j35063J25210R1089k76884o87866
$$ 334962 1021213 1575355 1526283 1036223 584300 449237 574447 665536 388652 -299214
42501b99214p30085l85809o5230k0641p4803m4433l7503j60793k83746k53100
$$ -299214 -1029299 -1415108 -1480338 -1500979 -1575782 -1620215 -1657718 -1818511 -2102257 -2355357
42491b355357n2355L06504P15379Q16130L60734k70375m06357K7831M69339N52541
$$ -2355357 -2407712 -2101208 -1385829 -569699 -208965 -479340 -885697 -857866 -388527 164014
42481A64014M01529J09976l56896o87930m53523M7796K7034m87539n34823K07952
$$ 164014 565543 675519 318623 -369307 -822830 -775034 -748000 -1235539 -1770362 -1562410
42471a562410P64133L90048k14251r4599L95116L03624k33311k37045M24934P74193
$$ -1562410 -798277 -408229 -622480 -717079 -321963 -18339 -251650 -488695 -63761 710432
42461G10432K45776m88979n41449J7005L83024Q0292n21185o84984k14786K40100
$$ 710432 956208 467229 -74220 -57215 325809 406101 -115084 -800068 -1014854 -774754
42451g74754K3011n00487l20907P02346J443617J018779j9811n74399m42981j58025
$$ -774754 -751743 -1252230 -1573137 -870791 572826 1591605 1571794 997395 554414 396389
42441C96389M6454K71484L78962K17667Q5788J97277J06905m81345q37132k21517
$$ 396389 442843 714327 1093289 1310956 1396744 1594021 1700926 1219581 382449 160932
42431A60932O49258M78232n04523p97379l4550M51105j24597p42108l61981L70833
$$ 160932 810190 1288422 783899 -13480 -48030 403075 278478 -463630 -825611 -454778
42421d54778K93808l81804n54399o173M57600L46114j8671k14794j47436J68952
$$ -454778 -160970 -542774 -1097173 -1103346 -645746 -299632 -318303 -533097 -680533 -511581
42411e11581O27045Q84389O96226K78060n4607l52407o97015p51502k58507K82447
$$ -511581 115464 999853 1696079 1974139 1919532 1567125 870110 118608 -139899 142548
42401A42548J54639m71070o94727j81763L88764L51449o1408j85730J28241M21497
$$ 142548 297187 -173883 -868610 -1050373 -661609 -310160 -371568 -557298 -429057 -7560
42391g560L20545J3084l4069K77308M84243J76991l24829l18269K06645L88811
$$ -7560 312985 326069 292000 569308 1053551 1230542 905713 587444 794089 1182900
42381A182900k83354j110402j103759l65599J68384J39117J11649N04454R34842
$$ 1182900 899546 -210856 -1314615 -1680214 -1511830 -1372713 -1261064 -756610 178232
42372A78232Q52209K55255m49315q53022o69018N8776P08870N68833k00068n91394
$$ 178232 1030441 1285696 836381 -16641 -685659 -626883 81987 650820 450752 -140642
42362a40642k8570Q76166J164201O52575j70320q85967j277427j135686n51852
$$ -140642 -169212 706954 1871155 2523730 2353410 1467443 190016 -945670 -1497522
42353a497522j39629l45489p07618m28445M18294R27877O38664Q8287q1203N3425
$$ -1497522 -1637151 -1982640 -2690258 -3118703 -2700409 -1772532 -1133868 -1045581 -1126784 -1073359
42343a073359R0833K116m071L7850l6916j28607K832L28551N97235O84941N85129
$$ -1073359 -982526 -980410 -984481 -946631 -983547 -1112154 -1109322 -780771 -183536 501405 1086534
42332A086534J83035n50660j183527j112009l63474K97862L04750j6151j4232
$$ 1086534 1269569 718909 -464618 -1576627 -1940101 -1642239 -1337489 -1353640 -1367872
42323a367872L05173L70700K1999j88733J41977O10043O01905K03390q370J13621
$$ -1367872 -1062699 -691999 -670000 -858733 -716756 -106713 495192 698582 690212 803833
42313H03833J92663J31424K85682O06299L68206o69920j461198r14695L80565
$$ 803833 996496 1127920 1413602 2019901 2388107 1718187 256989 -657706 -277141
42304b77141P43958k41903j083033n26440O61323R17781J51698l60004m4354K46204
$$ -277141 466817 224914 -858119 -1384559 -723236 194545 346243 -13761 -58115 188089
42294A88089k17102q65318q01507j79848J64823M2085L0269L84070O02094K79121
$$ 188089 -29013 -894331 -1695838 -1875686 -1710863 -1668778 -1638509 -1254439 -652345 -373224
42284c73224k15503k91538J9033K33831K27861L33334O08787N55619j25436q86350
$$ -373224 -588727 -880265 -861232 -627401 -399540 -66206 542581 1098200 972764 86414
42274H6414r33237l03590K08612J99628J15301L56848N52813K16035l31757l62201
$$ 86414 -846823 -1150413 -941801 -742173 -626872 -270024 282789 498824 167067 -195134
42264a95134J44535M70870K18436k39897m33995l23286j5854M31058O95644K85970
$$ -195134 -50599 420271 638707 398810 -35185 -358471 -374325 56733 752377 1038347
42254A038347o64644j217189p28785K59298P39725N13108J89917J75325K81395
$$ 1038347 373703 -843486 -1572271 -1312973 -573248 -60140 129777 305102 586497
42245E86497K61424J32258p8097m04114o81696o46658l85740k85935m26626m21212
$$ 586497 847921 980179 902082 497968 -183728 -830386 -1216126 -1502061 -1928687 -2349899
42235b349899k4533M65514O22732M16060J12106q8127j06587P9322L26886L42496
$$ -2349899 -2374432 -1908918 -1286186 -870126 -758020 -846147 -952734 -873412 -546526 -204030
42225b04030M0974k67701k76308j03647n7383j22072l1530J99549K16672r3002
$$ -204030 -163056 -430757 -707065 -810712 -868095 -990167 -1021697 -822148 -605476 -698478
42215f98478l14600m8276M96702P50198M88027j9723m62261o96941n40088J20213
$$ -698478 -1013078 -1061354 -564652 185546 673573 653850 191589 -505352 -1045440 -925227
42205i25227Q33720P87723q3626p05382k21735O53726N32712n87744j250405o87915
$$ -925227 -91507 696216 612590 -92792 -314527 339199 871911 284167 -966238 -1654153
42195a654153J16860J00086k26413K02457J075819J097266N1334q06267n92250
$$ -1654153 -1537293 -1437207 -1663620 -1461163 -385344 711922 763256 -43011 -635261
42186f35261O4654J65845k32115l68296j7165L13572K45266K8504R1619L93944
$$ -635261 -570607 -404762 -636877 -1005173 -1022338 -708766 -463500 -434996 -343377 50567
42176E0567M51853J3905m88670m49450R103J26972l40591o84143l75177M0747
$$ 50567 502420 516325 27655 -421795 -412692 -285720 -626311 -1310454 -1685631 -1644884
42166a644884q3189k63169L11171J178646J136915K35535k16460J97306L69626
$$ -1644884 -1728073 -1991242 -1680071 -501425 635490 871025 654565 851871 1221497
42157A221497l10845q42957l90627K22784k790m50893m8159O84593M35940n57598
$$ 1221497 910652 67695 -322932 -100148 -102938 -553831 -601990 82603 518543 -39055
42147c9055p65228J38623P56130K35683m84822k91122N17277R93369R06551N49735
$$ -39055 -804283 -665660 90470 326153 -158669 -449791 67486 1060855 1967406 2517141
42137B517141k5568p37855j007290m08572N20785Q42659M00178j59972l89294
$$ 2517141 2491573 1753718 746428 337856 858641 1701300 2101478 1941506 1552212
42128A552212m57492n78607n62979j54068M69895P76711M51405k13092n96177
$$ 1552212 1094720 516113 -46866 -200934 268961 1045672 1497077 1283985 687808
42119F87808m44186j22603m0612n1572K47923P74293R59864N09763k36420p50702
$$ 687808 243622 121019 80407 28835 276758 1051051 2010915 2520678 2284258 1533556
42109A533556p92385m40103q444R5373j72645k56139K89664R49429P90880j25138
$$ 1533556 741171 301068 292624 387997 215352 -40787 248877 1198306 1989186 1864048
42099A864048o88535l16118K52401J65805l13425m28503j45424R996p7879p1937
$$ 1864048 1175513 859395 1111796 1277601 964176 535673 390249 400245 322366 250429
42089B50429J09324K14067J77516J66497J84181Q1040j33610l46236n31578n82310
$$ 250429 359753 573820 751336 917833 1102014 1183054 1049444 703208 171630 -410680
42079d10680k50308L73453P02453M35184O9118J00234K14237k1175k10667J43548
$$ -410680 -660988 -287535 414918 850102 919220 1019454 1233691 1212516 1001849 1145397
42069A145397M29990k83849j432398j386589P0317J161159O16440n52563p05578
$$ 1145397 1575387 1291538 -140860 -1527449 -1457132 -295973 320467 -232096 -937674
42060i37674P5977M79947R6975k46049j9252L27784K81122l6459k48348j83457
$$ -937674 -861697 -381750 -284775 -530824 -550076 -222292 58830 22371 -225977 -409434
42050d09434J34862M69126L94375j49117m99954j06918M81511K88429n27246p94691
$$ -409434 -274572 194554 588929 439812 -60142 -167060 314451 602880 75634 -719057
42040g19057j46427M21456K30916N35M39075Q15464J50782q90383q06960L15806
$$ -719057 -865484 -444028 -213112 -212577 226498 1041962 1192744 302361 -504599 -188793
42030a88793Q01810j1963p56682k63206O26726N60104j60345l16533R0177Q0841
$$ -188793 613017 601054 -155628 -418834 207892 767996 607651 291118 381295 462136
42020D62136k82014R3481J158350J354839P4250j119006p87855J87564J22541
$$ 462136 180122 273603 1431953 2786792 2861042 1742036 954181 1141745 1264286
42011A264286p83004r75149k08673J94772k62534m33514M02211J226257R19766
$$ 1264286 481282 -493867 -702540 -507768 -770302 -1203816 -801605 424652 1344418
42002A344418j529l52695j05475j03500n00735o31099k21674K54396M16833L76218
$$ 1344418 1342889 990194 884719 781219 280484 -350615 -572289 -317893 98940 475158
41992D75158K62002L2049j76009q8366K15108L43277J89826K8726l0440j95361
$$ 475158 737160 769209 593200 504834 719942 1063219 1253045 1281771 1251331 1055970
41982A055970m82923n14931m4876O07021Q44559L84795m68110r90030n90501N28129
$$ 1055970 573047 58116 13240 620261 1464820 1849615 1381505 391475 -199026 329103
41972C29103J375279J172730K56575l94276m11570l12905n36721p93623o02699
$$ 329103 1704382 2877112 3133687 2739411 2327841 2014936 1478215 684592 81893
41963H1893l3791L91325L04940j97314o81836p12315k30022L55296N92546M36188
$$ 81893 48102 439427 744367 547053 -134783 -847098 -1077120 -721824 -129278 306910
41953C06910J03496k86128o01480n05470J09882O96022O64335K60470J18873J29832
$$ 306910 410406 124278 -477202 -982672 -872790 -176768 487567 748037 866910 996742
41943I96742l09291r59787q26835J56624P47400K57613l61542j15596M44652L20434
$$ 996742 687451 -272336 -1099171 -942547 -195147 62466 -299076 -414672 29980 350414
41933C50414j75195j00633L22285J04804o39529p61298r593N66751L95909J90746
$$ 350414 175219 74586 396871 501675 -137854 -899152 -908745 -341994 53915 244661
41923B44661N16405P87776L72981l06668n38088l91017k93714k03835N2802J75089
$$ 244661 761066 1548842 1921823 1615155 1077067 686050 392336 188501 241303 416392
41913D16392j34105n25089n34968l61039m11106m65884m8158O48479R64919P42034
$$ 416392 282287 -242802 -777770 -1138809 -1549915 -2015799 -2063957 -1415478 -450559 291475
41903B91475L71522L6216l58751n98662l19201J99593K13405l15215n05821J17079
$$ 291475 662997 699213 340462 -258200 -577401 -377808 -164403 -479618 -985439 -868360
41893h68360P92790N77440k71364o42457q6015O67710P34484J13544m88347n47324
$$ -868360 -75570 501870 230506 -411951 -497966 169744 904228 1017772 529425 -17899
41883a7899j78589J76947K94248L33574N36986Q38358Q58127L39350m57724r19142
$$ -17899 -196488 -19541 274707 608281 1145267 1983625 2841752 3181102 2723378 1804236
41873A804236o97812r8742K51588Q2366k94234m11678j37396K89015M98432K13975
$$ 1804236 1106424 1007682 1259270 1341636 1047402 635724 498328 787343 1285775 1499750
41863A499750m87834r95380o14824M70406J075828L94998p86421r88571k2073
$$ 1499750 1011916 16536 -598288 -127882 947946 1342944 556523 -432048 -454121
41854d54121Q11905O07552m4496k47666j28968k50899m75991l70050k15167n72232
$$ -454121 357784 965336 920840 673174 544206 293307 -182684 -552734 -767901 -1340133
41844a340133j107774r16689L9158Q09817Q56568O30356N65001M30961O5516r5915
$$ -1340133 -2447907 -3364596 -3325438 -2515621 -1659053 -1028697 -463696 -32735 32781 -63134
41834f3134K39564N88918L78807j85887m54588j89935L26261P30105P77326M57719
$$ -63134 176430 765348 1144155 958268 503680 313745 640006 1370111 2147437 2605156
41824B605156K09276N85557J370232J541317N93249o21702r95394o58006n94742
$$ 2605156 2814432 3399989 4770221 6311538 6904787 6283085 5287691 4629685 4034943
41815D034943j056963j247460o02962L84576Q31695M18500m80853j206060j254656
$$ 4034943 2977980 1730520 1127558 1512134 2343829 2762329 2281476 1075416 -179240
41806a79240o82564q4533J44970L62678R81490J454620Q07783p42545j647022
$$ -179240 -861804 -946337 -801367 -438689 542801 1997421 2805204 2062659 415637
41797D15637r31447N16983J154128O52013j24024n24320o55570p18335o29921
$$ 415637 -515810 1173 1155301 1807314 1683290 1158970 503400 -214935 -844856
41788h44856l70078r0430K01028N55367O72152J73997o03148p52538k4320O87092
$$ -844856 -1214934 -1305364 -1104336 -548969 123183 297180 -305968 -1058506 -1082826 -395734
41778c95734N32800j15406k82388J62612M12840m636n99650p25509m00628k1033
$$ -395734 137066 21660 -260728 -98116 314724 310088 -289562 -1015071 -1415699 -1436732
41768a436732K49843M12095L53614J12062R5697N00072P55107K32546o08480o12530
$$ -1436732 -1186889 -774794 -421180 -309118 -213421 286651 1041758 1274304 665824 53294
41758E3294L83407J124495O62113k96207n20494j07269j35321p84041j048100
$$ 53294 436701 1561196 2223309 1927102 1406608 1299339 1164018 379977 -668123
41749f68123m70663O9001j43324m25283J29853J016239J003628R3927m37403J8931
$$ -668123 -1138786 -1069785 -1213109 -1638392 -1508539 -492300 511328 605255 167852 186783
41739A86783N85094L77778j90964k44080J68427L29782P7182r7526j256L6369
$$ 186783 771877 1149655 958691 714611 883038 1212820 1290002 1192476 1191220 1227589
41729A227589n6169J21996N87090N92219l32140j401639j379504k61248N92145
$$ 1227589 1171420 1293416 1880506 2472725 2140585 738946 -640558 -901806 -309661
41720c09661K49486n23478l86596O00522J029243K17973p33594n43198L64121
$$ -309661 -60175 -583653 -970249 -369727 659516 877489 143895 -399303 -35182
41711c5182N53920k06198o61296j05564N50131L37123k31539j53165L40600L02072
$$ -35182 518738 312540 -348756 -454320 95811 432934 201395 48230 388830 690902
41701F90902j51971j3462P09046P49713l29623j177919n99128O15834Q63554j6793
$$ 690902 538931 525469 1234515 1984228 1654605 476686 -122442 493392 1356946 1340153
41691A340153q38076r52312p98420p10265m02159J70094M70198K72412Q7726L19412
$$ 1340153 502077 -450235 -1248655 -1958920 -2361079 -2190985 -1720787 -1448375 -1360649 -1041237
41681a041237O74713P70594O62584M15260j33453p28309n99519L30075Q82177
$$ -1041237 -366524 404070 1066654 1481914 1348461 620152 20633 350708 1232885
41672A232885J63131r34933q83948K07673P62807J18452o32751n14917p2619j82543
$$ 1232885 1396016 461083 -422865 -215192 547615 666067 33316 -481601 -554220 -736763
41662g36763n36216l09445L72909P07540N12294K42463J6760l36945m57701J92895
$$ -736763 -1272979 -1582424 -1209515 -501975 10319 252782 269542 -67403 -525104 -332209
41652c32209J126761J141446J05630o73243l41087K87643J13768n64017p00381
$$ -332209 794552 1935998 2041628 1368385 1027298 1314941 1428709 864692 164311
41643A64311j84738K04118J93911L34957R78848J775602K205780J959371Q84946
$$ 164311 -20427 183691 377602 712559 1691407 3467009 5672789 7632160 8517106
41634H517106p23182j874313j711326o30917J38445P7318k61553l90514m43514
$$ 8517106 7793924 5919611 4208285 3577368 3715813 3793131 3531578 3141064 2697550
41625B697550m72817k10822J42556j01836q76380j064166j05707R88636J018793
$$ 2697550 2224733 2013911 2156467 2054631 1178251 114085 8378 997014 2015807
41616B015807K09045m30184o40931p96314q06690k98857M14186O29746L57630
$$ 2015807 2224852 1794668 1153737 357423 -449267 -748124 -333938 295808 653438
41607F53438J44522m036m55105q40884l52668P43494J125508L25193n14310l64305
$$ 653438 797960 793924 338819 -502065 -854733 -111239 1014269 1339462 825152 460847
41597D60847K13294J05733n99997q51973k31872N55998P25855K97209j49778k10840
$$ 460847 674141 779874 179877 -672096 -903968 -347970 377885 675094 525316 314476
41587C14476O242J57445J54536K16758L43789R4183o75148j175814n53041P11435
$$ 314476 320718 478163 632699 849457 1193246 1287429 612281 -563533 -1116574 -405139
41577d05139J168050L42313o03911n43653J43867L67357j30332p39267r58971
$$ -405139 762911 1105224 501313 -42340 101527 468884 338552 -400715 -1359686
41568a359686o76080J12923J112389J569923J041634J20593k53277k4262Q9895
$$ -1359686 -2035766 -1922843 -810454 759469 1801103 1921696 1668419 1644157 1734052
41559A734052k35820n99343o47743m76416j93439K55571O78166O46556J55592
$$ 1734052 1498232 898889 251146 -225270 -418709 -163138 515028 1161584 1317176
41550A317176k22544j14565J38625O1554k04552j53294K38342L72200j31113p63821
$$ 1317176 1094632 980067 1118692 1180246 975694 822400 1060742 1432942 1301829 538008
41540E38008o53865K51216R16035M45661o67888j058300k33917Q00622R22983
$$ 538008 -115857 135359 1051394 1497055 829167 -229133 -463050 337572 1260555
41531A260555L10853l4405K16350M04745J4602n37816n27646K6794L58835J4460
$$ 1260555 1571408 1537003 1753353 2158098 2172700 1634884 1107238 1134032 1492867 1507327
41521A507327m25554m7705J028484J545619P07304o47191j128073o37797j79338
$$ 1507327 1081773 1034068 2062552 3608171 4315475 3668284 2540211 1902414 1723076
41512A723076p4230L33810J042318R22712m05539j520594j096372J26624N10848
$$ 1723076 1648846 1982656 3024974 3947686 3542147 2021553 925181 1051805 1562653
41503A562653p3578l84543J00277O29420N80023J81550j47331j38823N32639J716323
$$ 1562653 1489075 1104532 1204809 1834229 2414252 2595802 2448471 2309648 2842287 4558610
41493D558610K220518J059862p89485j310233k57742N03574r7650p60038n6646
$$ 4558610 6779128 7838990 7049505 5739272 5481530 5985104 5887454 5127416 5070770
41484E070770J192304J177453j92316j324580j264142o36032l46995m81339o73343
$$ 5070770 6263074 7440527 7248211 5923631 4659489 4023457 3676462 3195123 2521780
41475B521780p35126o13228k53848K28402N49408N49399K98989o3601l96500n32968
$$ 2521780 1786654 1173426 919578 1147980 1697388 2246787 2545776 2482175 2085675 1552707
41465A552707m21727k25990j07576j8446J26659K14550P1895k68387o06985p81262
$$ 1552707 1130980 904990 797414 778968 905627 1120177 1192072 923685 316700 -464562
41455d64562p04124l45321J75113N91071P24108O39577N09896M21423L39794J55129
$$ -464562 -1168686 -1514007 -1338894 -747823 -23715 615862 1125758 1547181 1886975 2042104
41445B042104k09638n96737o21357j20102N00473O72743L78941J24741K19649
$$ 2042104 1832466 1235729 614372 494270 994743 1667486 2046427 2171168 2390817
41436B390817M22350L31268j59993q07214j175043r18436j55507N56245Q39298
$$ 2390817 2813167 3144435 2984442 2177228 1002185 83749 -71758 484487 1323785
41427A323785Q44654P33466K81979n03223r09437m29164K81499K74778k18524
$$ 1323785 2168439 2901905 3183884 2680661 1771224 1342060 1623559 1898337 1679813
41418A679813k57465J73864K78488L5720J92637N90597J58021j006112j261891
$$ 1679813 1422348 1596212 1874700 1910420 2103057 2693654 2851675 1845563 583672
41409E83672L3069J220894P53884m79483o87432P0677L37279k38430n94753k04598
$$ 583672 616741 1837635 2591519 2112036 1424604 1495281 1832560 1594130 999377 794779
41399G94779K68006L31565L32787M93835L99577j42311n47822k18953O22439J184397
$$ 794779 1062785 1394350 1727137 2220972 2620549 2478238 1930416 1711463 2333902 3518299
41389C518299R34326O6518o98386q28291n57055m86535o08301l17012M23679P45546
$$ 3518299 4452625 4519143 3820757 2992466 2435411 1948876 1340575 1023563 1447242 2192788
41379B192788J81786n18739n79020m00410o71868r72864m13235P42349J268796
$$ 2192788 2374574 1855835 1276815 876405 204537 -768327 -1181562 -439213 829583
41370H29583O82979k47109o84425n78471l07783j31347l4071K67466R59087J513780
$$ 829583 1512562 1265453 581028 2557 -305226 -436573 -470644 -203178 755909 2269689
41360B269689J045267k90119j094413o42514k7909l72420r05661k75801J039090
$$ 2269689 3314956 3024837 1930424 1287910 1260001 887581 -18080 -293881 745209
41351G45209J394093N97175Q410J59733J41719m71766q69577n92294k84197l25092
$$ 745209 2139302 2736477 2744887 2904620 3046339 2574573 1704996 1112702 828505 503413
41341E03413j55424M26199O28904M1891n21257k93252L00524M46728O6647m31655
$$ 503413 347989 774188 1403092 1444983 923726 630474 930998 1377726 1444373 1012718
41331A012718p65195p00559j14106N49127O39712K98156K12246L51542P3621m60998
$$ 1012718 247523 -453036 -567142 -18015 621697 919853 1132099 1483641 1557262 1096264
41321A096264l83955J59089j4314r59549j144794N0539J096859P04780j39277
$$ 1096264 712309 871398 857084 -102465 -1247259 -1196720 -99861 604919 465642
41312D65642M2736P79421O85889r3018k95276K35192M98527J95204R745J23356
$$ 465642 508378 1287799 1973688 1880670 1585394 1820586 2319113 2514317 2524062 2647418
41302B647418q7994p45136j106976p75626k56353k9305J15240M86612Q58717P89883
$$ 2647418 2559424 1814288 707312 -68314 -324667 -353972 -238732 247880 1106597 1896480
41292A896480K52727l11652m84365l39339l33693o03344o40432j16977L26693
$$ 1896480 2149207 1837555 1353190 1013851 680158 76814 -563618 -680595 -353902
41283c53902l1574n78904p6987J192823J507056L36527o98759l18636N32967M60106
$$ -353902 -385476 -964380 -1041367 151456 1658512 1995039 1296280 977644 1510611 1970717
41273A970717j32313m1954N69287O41685R2719l27488m91133p58986q91754m79991
$$ 1970717 1838404 1796450 2365737 3007422 3100141 2772653 2281520 1522534 630780 150789
41263A50789J1942j9385m9952O86890J552773J289545Q8113o96639o39510m88715
$$ 150789 162731 143346 93394 780284 2333057 3622602 3710715 3014076 2374566 1885851
41253A885851n18351k56266K04405K10668r4047P0069N64563M59550k32527n34699
$$ 1885851 1367500 1111234 1315639 1526307 1432260 1502329 2066892 2526442 2293915 1759216
41243A759216l29753n29210j162643j047696J20932J015822P18757L3377l3292
$$ 1759216 1429463 900253 -262390 -1310086 -1189154 -173332 545425 578802 545510
41234E45510K44597K08074J5341N6860J39433L7093n778N6832j88159o49053n12652
$$ 545510 790107 998181 1013522 1070382 1209815 1246908 1241130 1297962 1109803 460750 -51902
41223e1902L90510J027269O60537p1107k92610j53491j72954k26840k6690J58186
$$ -51902 338608 1365877 2026414 1955307 1662697 1509206 1336252 1109412 1082722 1240908
41213A240908M4379q5605j5776q1794m00172m10196J54263O42674N10870J49678
$$ 1240908 1285287 1199682 1183906 1102112 701940 291744 446007 1088681 1599551 1749229
41203A749229L2345p3346l26745k16852M08349O77897L8798o50436m39655J64266
$$ 1749229 1781574 1708228 1381483 1164631 1572980 2250877 2289675 1639239 1199584 1363850
41193A363850J64130j88548M0870P42716R74133N33740M4464k63468o21629p76930
$$ 1363850 1527980 1339432 1380302 2123018 3097151 3630891 3675355 3411887 2790258 2013328
41183B013328j87929Q94042J600772J632551J311766O71877l86024j166386o75965
$$ 2013328 1825399 2719441 4320213 5952764 7264530 7936407 7550383 6383997 5708032
41174E708032Q06047J790655J496475P38127O01416J124991J658019J733450J179426
$$ 5708032 6514079 8304734 9801209 10539336 11140752 12265743 13923762 15657212 16836638
41165A6836638M9553j104318j425757o74634L99988R64671J114527J658931K973174
$$ 16836638 16886191 15781873 14356116 13681482 14081470 15046141 16160668 17819599 20792773
41156B0792773M228679L889340J254382k375653m525533l971299k006738q00068
$$ 20792773 25021452 28910792 30165174 27789521 23263988 19292689 17285951 16485883
41148A6485883q76767r65888r9172J092866J358503L45754j229844k468556k940761
$$ 16485883 15609116 14643228 14544056 15636922 16995425 17341179 16111335 13642779 10702018
41139A0702018k691922j973286j070419l16937o1490l51252p02298n48263O4630
$$ 10702018 8010096 6036810 4966391 4649454 4587964 4236712 3534414 2986151 3050781
41130C050781O22133R13199J055837Q18922j59060j301025j345870j63781P89756
$$ 3050781 3672914 4586113 5641950 6460872 6301812 5000787 3654917 3491136 4280892
41121D280892N45842K5942M18138J249151J332754P18304K60161l967m95812p52254
$$ 4280892 4826734 4852676 5270814 6519965 7852719 8571023 8831184 8827217 8331405 7579151
41111G579151j45578N09051q6282j381424j558959m55566J35339n87215j219359
$$ 7579151 7433573 7942624 7856342 6474918 4915959 4460393 4595732 4008517 2789158
41102B789158n95946M23158O13153K38171R2775J7411l98260o87883l04040K68060
$$ 2789158 2193212 2616370 3229523 3467694 3560469 3577880 3179620 2491737 2187697 2455757
41092B455757K78759j03679l33780m88950p66902o98494Q0158Q43694O46448k03852
$$ 2455757 2734516 2630837 2297057 1808107 1041205 342711 422869 1266563 1913011 1709159
41082A709159n20624J53404J114284J466301R01688k15835j043700r04631j43430
$$ 1709159 1188535 1341939 2456223 3922524 4824212 4608377 3564677 2660046 2516616
41073B516616J81312j97917l56250K44704P92330N13504j2341J3226J28320m26669
$$ 2516616 2697928 2500011 2143761 2388465 3180795 3694299 3681958 3695184 3823504 3396835
41063C396835j072855p34655K30009N31445O3931q5785L65991M96028j14196p44425
$$ 3396835 2323980 1589325 1819334 2350779 2414710 2328925 2694916 3190944 3076748 2332323
41053B332323q63337p45947n12611J08765P61125N82994k21071l26367O27627
$$ 2332323 1468986 723039 210428 319193 1080318 1663312 1442241 1115874 1743501
41044A743501J282771O40189m32369o99463l42473j51838k7583M42206P73951
$$ 1743501 3026272 3666461 3234092 2534629 2192156 2040318 2012735 2454941 3228892
41035C228892L14562m49116o04062l08123k90776l77956N1624N40489J05355q31496
$$ 3228892 3543454 3094338 2490276 2182153 1891377 1513421 1565045 2105534 2210889 1379393
41025A379393p98598K64511O75464l13005j198847n47314Q21437J209670N04317
$$ 1379393 580795 845306 1520770 1207765 8918 -538396 283041 1492711 1997028
41016A997028j38437k92620m59166o97849n30795r0275k6812k31510P9967Q28490
$$ 1997028 1858591 1565971 1106805 408956 -121839 -212114 -238926 -470436 -390469 438021
41006D38021Q92606j04137j002280p59695J01085N07881M64325O67235J072918
$$ 438021 1330627 1226490 224210 -535485 -434400 73481 537806 1205041 2277959
40997B277959R56602K03936m59814n80634m90563n40872n18858j42552L54806
$$ 2277959 3234561 3438497 2978683 2398049 1907486 1366614 847756 705204 1060010
40988A060010N03633K18334j24251j20346K66939O70737O46321J00014o35996
$$ 1060010 1563643 1781977 1657726 1537380 1804319 2475056 3121377 3221391 2585395
40979B585395j169808j322190j006709k03547P11950R98887L55010n31038o90879
$$ 2585395 1415587 93397 -913312 -1116859 -404909 593978 948988 417950 -272929
40970b72929r489P56848R34711M66721l31125j004150j041361l03048N96977Q32881
$$ -272929 -282418 474430 1409141 1875862 1544737 540587 -500774 -803822 -206845 626036
40960F26036L41814j78003k38862n2293j9584k12984m37101m21344K8178O93099
$$ 626036 967850 789847 550985 498692 479108 266124 -170977 -592321 -564143 128956
40950A28956R26980M69145Q942K44243O72467L01177o02491p33540J32393O26858
$$ 128956 1055936 1525081 1534023 1778266 2450733 2751910 2149419 1415879 1548272 2175130
40940B175130p3681r26889p12774J08276L54778M1105L8666M19553M77468Q5599
$$ 2175130 2101449 1174560 461786 570062 924840 965945 1004611 1424164 1901632 1987231
40930A987231k28606l96996p69395j014663l54958R07579J359181M63036n03753
$$ 1987231 1758625 1361629 592234 -422429 -777387 130192 1489373 1952409 1448656
40921A448656k31688P35226Q24177l04609j302274r59033K80367R98338O07688
$$ 1448656 1216968 1952194 2776371 2471762 1169488 210455 490822 1489160 2096848
40912B096848n8384p202N49458N75798k26845r49543p80375r7776K39467J28829
$$ 2096848 2038464 2031262 2580720 3156518 2929673 1980130 1199755 1101979 1341446 1470275
40902A470275N0170O6545j51256m93694m84186j69579r5796k99809j75228M20747
$$ 1470275 1520445 1586990 1435734 942040 457854 288275 192479 -107330 -282558 138189
40892A38189P56636L35645k97800l83338P54K83285L26929L63822L37601Q751
$$ 138189 894825 1230470 932670 549332 550086 833371 1160300 1524122 1861723 1870474
40882A870474m16948m26025n415K41375o0265n38244o33697l39601p1356j1763
$$ 1870474 1453526 1027501 1022086 1263461 1203196 664952 31255 -308346 -379702 -391465
40872c91465L7698J85819K20541K4789p5195K73528Q10538Q66101K71294l46242
$$ -391465 -353767 -167948 52593 77382 2187 275715 1086253 1952354 2223648 1877406
40862A877406l88965n7420L6435k39822m49359k74703R6743K80226R7922l36951
$$ 1877406 1488441 1431021 1467456 1227634 778275 503572 600315 880541 978463 641512
40852F41512p20771p59645m52562j28590n4694j23038r0416N0756J62979K42628
$$ 641512 -79259 -838904 -1291466 -1420056 -1474750 -1597788 -1688204 -1637448 -1474469 -1231841
40842a231841L58561M84930O18925Q32314R82154P24178J36259j20530K40639
$$ -1231841 -873280 -388350 230575 1062889 2045043 2769221 2905480 2784950 3025589
40833C025589M89874q5645r04361p91842K26341Q99477N95173Q8785J73023M85465
$$ 3025589 3515463 3429818 2525457 1733615 1959956 2859433 3454606 3543391 3716414 4201879
40823D201879L28095j32596k49513J524L9597m12823r96941j200351q34555j65201
$$ 4201879 4529974 4397378 4147865 4149389 4188986 3776163 2779222 1578871 744316 579115
40813E79115K33585K869m56334l22330N47362J277814J045553Q3535p31526r07514
$$ 579115 812700 815569 359235 36905 584267 1862081 2907634 2991169 2259643 1352129
40803A352129n64428j9114L82250L08491j95322n86979m65963j02819N9048J24225
$$ 1352129 787701 768587 1150837 1459328 1264006 677027 211064 108245 167293 291518
40793B91518M41967Q19804O92518N6732l71298j05659M34548M53198k43900j015171
$$ 291518 733485 1553289 2245807 2302539 1931241 1825582 2260130 2713328 2469428 1454257
40783A454257j085989l93387L35729M15847k550k25536j3419J89648J04064Q7489
$$ 1454257 368268 -25119 310610 726457 723907 498371 484952 674600 778664 866153
40773H66153M20321O87277M14309j21556l61543l90714o42368r14864n68907K98852
$$ 866153 1286474 1973751 2388060 2266504 1904961 1514247 871879 -42985 -611892 -313040
40763c13040P83203N02074J69812M11758P38042L58237m80717p79323k45413L04906
$$ -313040 470163 972237 1142049 1553807 2291849 2650086 2169369 1390046 1144633 1449539
40753A449539J41069m05279n03816K3519N61772N70570J61918k35402m14932l91568
$$ 1449539 1590608 1185329 681513 705032 1266804 1837374 1999292 1763890 1348958 957390
40743I57390j39227L32202P46188P68464M76895K96186L64060K97297j90223p28474
$$ 957390 818163 1150365 1896553 2665017 3141912 3438098 3802158 4099455 3909232 3180758
40733C180758p17007j81003K13093O3967k09593K1739O45819Q66657K71264n43524
$$ 3180758 2463751 2282748 2495841 2559808 2350215 2371954 3017773 3884430 4155694 3612170
40723C612170p22961k86154n997k13613l75863j03695J06345k79355p81040n49525
$$ 3612170 2889209 2603055 2597058 2383445 2007582 1903887 2010232 1730877 949837 400312
40713D00312K10662M29275j95660p04678k91718O25361J173914J155567Q90104
$$ 400312 610974 1040249 844589 139911 -151807 473554 1647468 2803035 3693139
40704C693139N23100Q1747k00905j82253j37434l37013n81873n49247k98314q1091
$$ 3693139 4216239 4297986 4097081 3914828 3777394 3440381 2858508 2309261 2010947 1929856
40694A929856J2082q5492m68144q41601o04515K27116P92060O18851L95994P71249
$$ 1929856 1941938 1856446 1388302 546701 -57814 169302 961362 1580213 1976207 2747456
40684B747456J100734M49804o81410r07275m2774O45773L70083k07263k59693
$$ 2747456 3848190 4297994 3616584 2709309 2666535 3312308 3682391 3475128 3215435
40675C215435N147l4370l95227o65842o53666l90600P9069N56002P07637N00174
$$ 3215435 3220582 3186212 2790985 2125143 1471477 1080877 1159946 1715948 2423585 2923759
40665B923759K57415J37120k5166k26483j64439K03937M50666K51170k24536o29719
$$ 2923759 3181174 3318294 3293128 3066645 2902206 3106143 3556809 3807979 3583443 2953724
40655B953724p50247m71418O5311L04703q5116m67346L3535J023572J119675R631
$$ 2953724 2203477 1732059 1797370 2102073 2016957 1549611 1583146 2606718 3726393 3736024
40645C736024r30416o34039K01845M94940M89541Q97197J217585M35446j022609
$$ 3736024 2805608 2171569 2373414 2868354 3357895 4255092 5472677 5908123 4885514
40636D885514j559011o35651N72807R16176N05438j9617l57740l22445K35842
$$ 4885514 3326503 2690852 3263659 4179835 4685273 4665656 4307916 3985471 4221313
40627D221313Q27304N68535m50207r44498k23548O71328M55970n13430q92534
$$ 4221313 5048617 5617152 5166945 4222447 3998899 4670227 5126197 4612767 3720233
40618C720233l80137Q1749m1088j96827J32804O33109Q09498O65346L86605K1121
$$ 3720233 3340096 3421845 3380757 3183930 3316734 3949843 4759341 5424687 5811292 5832413
40608E832413k11041K8234M73574L25316m83377q73891j66457P22623N88377j72229
$$ 5832413 5621372 5649606 6123180 6448496 5965119 5091228 4924771 5647394 6235771 6063542
40598F063542k04067N97642R24378J78838o08056m23442L44371Q07708Q69936
$$ 6063542 5859475 6457117 7381495 7560333 6952277 6528835 6873206 7680914 8550850
40589H550850Q51486O49305J27062k61008n2586M86475Q89614J205246J482326
$$ 8550850 9402336 10051641 10178703 9917695 9865109 10351584 11241198 12446444 13928770
40580A3928770J200293J35153p66238m38055P68364J645385J851898J922964J873213
$$ 13928770 15129063 15264216 14497978 14059923 14828287 16473672 18325570 20248534 22121747
40571B2121747J156155N223n33146j51486L11715L24054L98765R69028J556544
$$ 22121747 23277902 23283125 22749979 22598493 22910208 23234262 23633027 24602055 26158599
40562B6158599J604863J308531J081546Q71303M63313m6135l69973k07330O72968
$$ 26158599 27763462 29071993 30153539 31024842 31488155 31442020 31072047 30864717 31537685
40553C1537685J983974K830079K853029L028235M220390N543436N775320N873712
$$ 31537685 33521659 36351738 39204767 42233002 46453392 51996828 57772148 63645860
40545F3645860P890552J1583539J4750074J7172495K1279453K8316192L7275522
$$ 63645860 71536412 83119951 97870025 115042520 136321973 164638165 201913687
40538B01913687M8306686O1873204P1321032O2160201K6545718k2757646o0144729
$$ 201913687 250220373 312093577 383414609 445574810 472120528 449362882 389218153
40531C89218153p0572791o0659842m6235543l5491079k7422087k0428498j5484988
$$ 389218153 318645362 257985520 211749977 176258898 148836811 128408313 112923325
40524A12923325j2597637r972202p280230o156375o963427p885038p684147o937872
$$ 112923325 100325688 90353486 83073256 76916881 69953454 62068416 54384269 47446397
40516D7446397o094916m615597k714685j856216k545415l315995k907571j988424
$$ 47446397 41351481 36735884 34021199 32164983 29619568 26303573 23396002 21407578
40508B1407578j666076j622181j008190j73978o8034m99672l89424M55688J044091
$$ 21407578 19741502 18119321 17111131 16937153 16869119 16369447 15980023 16435711 17479802
40499A7479802P25161l0793n87530r44704j172282q48864K36164J294569J273628
$$ 17479802 18204963 18174170 17586640 16641936 15469654 14620790 14856954 16151523 17425151
40490A7425151K78783m76702k59270L45558N08510L95218O72435J233752J324884
$$ 17425151 17703934 17227232 16967962 17313520 17822030 18217248 18889683 20123435 21448319
40481B1448319Q50657O12113R95179J273512P32207j68256m12072K31927J201969
$$ 21448319 22298976 22911089 23906268 25179780 25911987 25743731 25331659 25563586 26765555
40472B6765555K191119L414413M841921N853480N836787M668031K500496l93766
$$ 26765555 28956674 32371087 37213008 43066488 48903275 53571306 56071802 55678036
40464E5678036l312302n125598n094637l587332j650684O7811J622049K956738
$$ 55678036 52365734 47240136 42145499 38558167 36907483 36975294 38597343 41554081
40456D1554081L277722J744508j262232m107953n426898n330739m772908m138381
$$ 41554081 44831803 46576311 45314079 41206126 35779228 30448489 25675581 21537200
40448B1537200l131447j849726j049652j088725j350875j177811p98900p93894
$$ 21537200 18405753 16556027 15506375 14417650 13066775 11888964 11090064 10296170
40440A0296170j077554j052398n29014Q6987L96818L06858j46612p73334j102867
$$ 10296170 9218616 8166218 7637204 7724191 8121009 8427867 8281255 7507921 6405054
40431F405054p74299o3607L88773L75930K48739K46276J65094j76070n43802n97595
$$ 6405054 5630755 5567148 5955921 6331851 6580590 6826866 6991960 6815890 6272088 5674493
40421E674493l43868o6459M1777j5317k07460n33396q43338p72352j05776P44625
$$ 5674493 5330625 5264166 5305943 5290626 5083166 4549770 3706432 2934080 2828304 3572929
40411C572929R52357K52729n56609n62499K821J12455m78944q60505m18399K19407
$$ 3572929 4525286 4778015 4221406 3658907 3661728 3774183 3295239 2434734 2016335 2235742
40401B235742K31740j82771l73772l59476m86760m86616R3376Q05470P30384q2995
$$ 2235742 2467482 2284711 1910939 1551463 1064703 578087 671463 1476933 2207317 2124322
40391B124322o19028l78813J03373L32377M38975M43302n3328r45789j260201
$$ 2124322 1505294 1126481 1229854 1562231 2001206 2444508 2391180 1445391 185190
40382A85190l87686R04949J358771P33160j28886m54976k46541J4947m1302l50239
$$ 185190 -202496 702453 2061224 2794384 2665498 2210522 1963981 1978928 1937626 1587387
40372A587387n12443k92529L5932J05856P9615L59893P58210O44096J4176l58847
$$ 1587387 1074944 782415 818347 924203 1003818 1363711 2121921 2766017 2780193 2421346
40362B421346j14670J24185k06568p16237p57225m09492j46718k6975J34749K09345
$$ 2421346 2306676 2430861 2224293 1508056 750831 341339 194621 167646 302395 511740
40352E11740L2938r0869J87376N97536N88720R7862n20074j010129j152655o13199
$$ 511740 544678 453809 641185 1238721 1827441 1925303 1405229 395100 -757555 -1370754
40342a370754M69101J145661P17399j79904m19476l5101R781m36299m51689K55654
$$ -1370754 -901653 244008 961407 781503 362027 326926 336707 -99592 -551281 -295627
40332b95627O50236K6957o72794j97821R92834J211057o6659j351639j060488
$$ -295627 354609 381566 -291228 -489049 503785 1714842 1648183 296544 -763944
40323g63944M43192J381993Q57384j47212k60874M17746O29240j22763q50904
$$ -763944 -320752 1061241 1918625 1771413 1510539 1928285 2557525 2434762 1583858
40314A583858n64677L00200N76433J5910n37725m58812n7832J05122J2587J8421
$$ 1583858 1019181 1319381 1895814 1911724 1373999 915187 857355 962477 975064 993485
40304I93485K16334K54010k46105j104064j515251q75989K99707Q07628K96358
$$ 993485 1209819 1463829 1217724 113660 -1401591 -2277580 -1977873 -1170245 -873887
40295h73887k67061n4289M84437N94436N01035P20439Q13273J33506o85198n06299
$$ -873887 -1140948 -1195237 -710800 -116364 384671 1105110 1918383 2051889 1366691 860392
40285H60392L13586L66066m09592o02330J14010K81108p27992j324740k03496
$$ 860392 1173978 1540044 1130452 528122 642132 923240 195248 -1129492 -1332988
40276a332988J398751J529881L80482l91570k77898q6612j11506P4150L06115
$$ -1332988 65763 1595644 1976126 1584556 1306658 1220046 1108540 1182690 1488805
40267A488805l47m91766k66588M13428L68465m61438q08194j65756M67368L69814
$$ 1488805 1488458 996692 730104 1143532 1511997 1050559 242365 76609 543977 913791
40257I13791J06725J45515n4458p09312q40624J30381J053197O36682m77011o68217
$$ 913791 1020516 1166031 1111573 402261 -438363 -307982 745215 1381897 904886 236669
40247B36669J66685N97997j7624o89167n23448k0600k9969l57418k41935K99707
$$ 236669 403354 1001351 983727 294560 -228888 -249488 -279457 -636875 -878810 -579103
40237e79103M70214o7879o60971n68694O8744N05641L92425J12993J67344N83615
$$ -579103 -108889 -176768 -837739 -1406433 -1337689 -832048 -439623 -326630 -159286 424329
40227D24329J018568J108142N99835m69464j487516j580167o17397M39662O71931
$$ 424329 1442897 2551039 3150874 2681410 1193894 -386273 -1003670 -564008 107923
40218A07923L46894L45771P72965R26343N08425j536k29954l24436l38620l2165
$$ 107923 454817 800588 1573553 2499896 3008321 3006785 2776831 2452395 2113775 2081610
40208B081610M55621N27853P5727k29764L1083M25688N10202N14316O78035O82329
$$ 2081610 2537231 3065084 3140811 2911047 2942130 3367818 3878020 4392336 5070371 5752700
40198E752700M09158N38308J518853K486823K183376O86102o66305r70253n93198
$$ 5752700 6161858 6700166 8219019 10705842 12889218 13575320 12909015 11938762 11345564
40189A1345564l19009l59184l83229r3250M10944P08282N38265J87071O4769o6218
$$ 11345564 11026555 10667371 10284142 10190892 10601836 11310118 11848383 12035454 12100223 12034005
40179A2034005p88871j829972k057413j116772j31742r0757m74528l89507j15651
$$ 12034005 11245134 9415162 7357749 6240977 6109235 6018478 5543950 5154443 5038792
40170E038792l17730n49480m3410O00872K07287q19789r45029p9204K02609o54453
$$ 5038792 4721062 4171582 4128172 4729044 4936331 4116542 3171513 3092309 3294918 2640465
40160B640465j208007m77017M01225J29207n97123l48102O37759Q89507M7045
$$ 2640465 1432458 955441 1356666 1485873 888750 540648 1178407 2067914 2114959
40151B114959o91520m14085L67979O57105K91819j5643L19615R48558R24322k4644
$$ 2114959 1423439 1009354 1377333 2034438 2326257 2310614 2630229 3578787 4503109 4478465
40141D478465r02332o94772J18723K72308k52941k58326M60558N69292m70017
$$ 4478465 3576133 2881361 3000084 3272392 3019451 2761125 3221683 3790975 3320958
40132C320958j174236l29630R35623R16250K1308j07094O25240Q33804J30848
$$ 3320958 2146722 1817092 2752715 3668965 3690273 3583179 4208419 5042223 5173071
40123E173071m22113l15930k20274m00761k29236L15612K66077o05793j112026
$$ 5173071 4750958 4435028 4214754 3813993 3584757 3900369 4166446 3560653 2448627
40114B448627m52206N44885P90086M49747K32668J32789j62830l68678n8304M91621
$$ 2448627 1996421 2541306 3331392 3781139 4013807 4146596 3983766 3615088 3556784 4048405
40104D048405O97999M71680L4109n05136q28677l82366O23684R26775j57677j443304
$$ 4048405 4746404 5218084 5252193 4747057 3918380 3536014 4159698 5086473 4928796 3485492
40094C485492j285842J35290J094716O86669k29826n08418r7131L55945M79952
$$ 3485492 2199650 2334940 3429656 4116325 3886499 3378081 3280950 3636895 4116847
40085D116847L51192J81095J82212M78102R54974J330865J350817Q24569k50212
$$ 4116847 4468039 4649134 4831346 5309448 6264422 7595287 8946104 9770673 9520461
40076I520461j366085j706047j074431k32651J53744L81600Q78372J129259M63101
$$ 9520461 8154376 6448329 5373898 5141247 5294991 5676591 6554963 7684222 8147323
40067H147323n24930o07787J66943N62462K18481J72243R41638J575268J345583
$$ 8147323 7622393 7014606 7181549 7744011 7962492 8134735 9076373 10651641 11997224
40058A1997224J027318J487286K203801K417301K723779M087584O113060P919396
$$ 11997224 13024542 14511828 16715629 19132930 21856709 25944293 32057353 39976749
40050C9976749R964783J2829742J4387153J0817785J555853q629144j4045328
$$ 39976749 49941532 62771274 77158427 87976212 89532065 80902921 66857593
40043F6857593j3576312j0536300q100139o637142n185410l599930k494427k084017
$$ 66857593 53281281 42744981 34644842 28007700 22822290 19222360 16727933 14643916
40035A4643916j953042j702545j375573j280591j500052j575164r12302K93965
$$ 14643916 12690874 10988329 9612756 8332165 6832113 5256949 4344647 4638612
40027D638612R35499K94496q42282j090686l34423J90666k35430q22647n93743
$$ 4638612 5574111 5868607 5026325 3935639 3601216 3791882 3556452 2733805 2140062
40018B140062J17123K43596m14748j003648q69196k59355K85759O07272P44963
$$ 2140062 2257185 2500781 2086033 1082385 213189 -46166 239593 846865 1591828
40009A591828N62034k2690o13632n84322J44204Q40368P45276K7579m06553j46083
$$ 1591828 2153862 2131172 1517540 933218 1077422 1917790 2663066 2690645 2284092 2138009
39999B138009J40221k64730r29722q41525j8803L80813j82822p07916j35589R70589
$$ 2138009 2278230 2013500 1083778 242253 223450 604263 421441 -286475 -422064 548525
39989E48525J177942K51097n70759l71306L04632M09522k14392q38766q14070
$$ 548525 1726467 1977564 1406805 1035499 1340131 1749653 1535261 696495 -117575
39980a17575j38731O66739R55881M32994n20767j125136r31751j60376O56357
$$ -117575 -256306 410433 1366314 1799308 1278541 153405 -778346 -938722 -282365
39971b82365J074337Q28335N365p34080o14228K79660R17480N77877k23595n06636
$$ -282365 791972 1620307 1625672 891592 277364 557024 1474504 2052381 1828786 1322150
39961A322150j40604K00373J21030j47911l71920n58860n57606j44584L42615
$$ 1322150 1181546 1381919 1502949 1355038 983118 424258 -133348 -277932 64683
39952F4683K25094l67774l80774O01332J453190R95360k44226q14513m71613k40423
$$ 64683 289777 -77997 -458771 142561 1595751 2591111 2346885 1532372 1060759 820336
39942H20336m73129l55047K99974L11395q96958j889637j119855O56270J395388
$$ 820336 347207 -7840 292134 603529 -293429 -2183066 -3302921 -2646651 -1251263
39933a251263O69186q1660j095J93389j04602l57034j21709P7330j20144j24633
$$ -1251263 -582077 -663737 -664832 -471443 -576045 -933079 -1054788 -977458 -1097602 -1222235
39923a222235M15615P53175L09850k20598q4465J79829k10341p52558n27046J24156
$$ -1222235 -806620 -53445 256405 35807 -48658 131171 -79170 -831728 -1358774 -1234618
39913a234618K47909L6131L53567R24646P07499r3925j76639O08613R22299J87737
$$ -1234618 -986709 -950578 -597011 327635 1035134 941209 764570 1373183 2295482 2483219
39903B483219n33678m55343k16709m02117m58195J0354K86943q9137l10297K17979
$$ 2483219 1949541 1494198 1277489 875372 417177 427531 714474 625337 315040 533019
39893E33019O20668N1752o86885m71137J74061K7405o65959o96100m7282K01125
$$ 533019 1153687 1205439 518554 47417 221478 248883 -417076 -1113176 -1160458 -959333
39883i59333j14244p2393M91495O63603J95472j5056L95479N68143J9153m07641
$$ -959333 -1073577 -1145970 -654475 9128 204600 189544 585023 1153166 1172319 764678
39873G64678J3370N97105L37898n11151q86227m29119K42270M51466N4062o05541
$$ 764678 778048 1375153 1713051 1201900 315673 -113446 128824 580290 634352 28811
39863B8811r00260m19755M03591O06045m5528o52650m56772J17518K87911J79649
$$ 28811 -871449 -1291204 -887613 -281568 -327096 -979746 -1436518 -1319000 -1031089 -851440
39853h51440M24689Q83571P53683q8125p59156o07474m9000J93178J16757K07142
$$ -851440 -426751 456820 1210503 1122378 363222 -244252 -293252 -100074 16683 223825
39843B23825N31870O51109L46718r1287m01586o87752r49406p33006K07951J157065
$$ 223825 755695 1406804 1753522 1662235 1260649 572897 -376509 -1109515 -901564 255501
39833B55501J070811K9822o85778k80120M96625N07824j47884m49715l4163M09613
$$ 255501 1326312 1356134 670356 390236 886861 1394685 1246801 797086 762923 1172536
39823A172536K59059k95055p18755p53195m48594m8525J11559j2606K3106N26692
$$ 1172536 1431595 1136540 417785 -335410 -784004 -832529 -720970 -733576 -710470 -183778
39813a83778J049486R69579M68195J93402J50871j74782o96701p58102l39889
$$ -183778 865708 1835287 2303482 2496884 2647755 2472973 1776272 1018170 678281
39804F78281j39031k64562m5049N14896L85551p19945j469588p64075N68886J045084
$$ 678281 539250 274688 229639 744535 1130086 410141 -1059447 -1823522 -1254636 -209552
39794b09552O33957L49526L95544J31052m31922n01851Q4231N13563K75236j62778
$$ -209552 424405 773931 1169475 1300527 868605 366754 450985 964548 1239784 1077006
39784A077006k26191l5807n0529m23593q74581q60941q427J193746J465939K24079
$$ 1077006 850815 815008 764479 340886 -533695 -1394636 -1403063 -209317 1256622 1480701
39774A480701j296823j337242Q4349J193634Q54482j52427n66905l01843k2613
$$ 1480701 183878 -1153364 -1069015 124619 979101 826674 259769 -42074 -64687
39765f4687R4897L32102N87538L92516k95988q85965q39413k89659J39880N7628
$$ -64687 30210 362312 949850 1342366 1046378 160413 -679000 -968659 -828779 -771151
39755g71151k46624k07056J81595L02278j06118m06509P68O62955P36271L10176
$$ -771151 -1017775 -1224831 -1043236 -740958 -847076 -1253585 -1252817 -589862 146409 456585
39745D56585J48562L26233K21579j43163J3650P29318R12327L4035r05522q77451
$$ 456585 605147 931380 1152959 1009796 1023446 1752764 2665091 2699126 1793604 916153
39735I16153l29734k67397o22410o06419j34045K05948K78167M63138P51687P15039
$$ 916153 586419 319022 -303388 -909807 -1043852 -837904 -559737 -96599 655088 1370127
39725A370127L28017L484j60593m07243o30864m36222P7197L27456J41619l9027
$$ 1370127 1698144 1701628 1541035 1133792 502928 66706 143903 471359 612978 573951
39715E73951N2039J68216J34360J34045K31462J88573m6641k02491j97149k49632
$$ 573951 625990 794206 928566 1062611 1294073 1482646 1436005 1233514 1036365 786733
39705G86733l36073j45438K22711J91019l27001n52615N9964Q99458R99902M10834
$$ 786733 450660 305222 527933 718952 391951 -160664 -100700 798758 1798660 2209494
39695B209494J07355O69562J616789K074003J699587Q80981K47610M9794m4065
$$ 2209494 2316849 2986411 4603200 6677203 8376790 9257771 9505381 9555175 9511110
39686I511110m72583j143062j527906j405823j100618q62720n15079K7K41117
$$ 9511110 9038527 7895465 6367559 4961736 3861118 2998398 2483319 2483346 2724463
39677B724463q5710n04476l68767J87151M81225K71033r3951l67573o03411o95455
$$ 2724463 2638753 2134277 1765510 1952661 2433886 2704919 2610968 2243395 1639984 944529
39667I44529l98866R5605K41123k2997q7485M08177R99531J073846O74297K44152
$$ 944529 545663 641268 882391 859394 771909 1180086 2179617 3253463 3927760 4171912
39657D171912o3591l91133p41236r49638r47519p38656k82554K94302N62394K40216
$$ 4171912 4108321 3717188 2975952 2026314 1078795 340139 57585 351887 914281 1154497
39647A154497l29920n28972k31854J21918K05522J68478K38149L13649J85247
$$ 1154497 824577 295605 63751 185669 391191 559669 797818 1111467 1296714
39638A296714m6626n2585K36278M34591J45269m63312p38665l31019K86188L71006
$$ 1296714 1250088 1197503 1433781 1868372 2013641 1550329 811664 480645 766833 1137839
39628A137839j01504m22517j87935J23774r2836o25357p14677r5253O67587Q44534
$$ 1137839 1036335 613818 425883 549657 456821 -168536 -883213 -978466 -310879 533655
39618E33655K52134o31624j017527m31407P05538J304026P79318j96094n56427
$$ 533655 785789 154165 -863362 -1294769 -589231 714795 1494113 1298019 741592
39609G41592k52035j75738p48054j304184j083837k17585N82764Q53623O11110
$$ 741592 489557 313819 -434235 -1738419 -2822256 -3039841 -2457077 -1603454 -992344
39600i92344J60592o0126J71353M55849J58999n72888p55429P7025J023872R25730
$$ -992344 -831752 -891878 -720525 -264676 -105677 -678565 -1433994 -1356969 -333097 592633
39590E92633r0841q50127o63363L8446M91797L98105o4410n12429n96896l27091
$$ 592633 501792 -348335 -1011698 -973252 -481455 -83350 -147760 -660189 -1257085 -1584176
39580a584176r3898q4275M7398M89519O68914P7345o21018l30361O79638Q84871
$$ -1584176 -1678074 -1762349 -1714951 -1225432 -556518 -479173 -1100191 -1430552 -750914 133957
39570A33957k71507j398049j053436L06909J164501J020494O00724L89456J04304
$$ 133957 -137550 -1535599 -2589035 -2282126 -1117625 -97131 503593 893049 997353
39561I97353l71620n44457j08087M88246O18262K02673l71637o98437n61261n4118
$$ 997353 625733 81276 -26811 461435 1079697 1282370 910733 212296 -348965 -403083
39551d03083L54881K22054k68009m43377l6000M43658M28445K1386k78729k61146
$$ -403083 -48202 173852 -94157 -537534 -573534 -129876 298569 319955 41226 -219920
39541b19920q5790O7344R0817j05684l93056l41774K56743Q92605Q00553n7769
$$ -219920 -305710 -238366 -147549 -253233 -646289 -988063 -731320 161285 961838 904069
39531I04069q65470r05208l18309K30098L61749K44449K03504L07341L55982J97326
$$ 904069 38599 -866609 -1184918 -954820 -593071 -348622 -145118 162223 518205 715531
39521G15531j9053j7197J55221R1765l62841p29027m95481Q5690L20724J03219
$$ 715531 696478 679281 834502 926267 563426 -165601 -661082 -575392 -254668 -151449
39511a51449p457K12181L01094K8131j05108K18906M05969j26165q25409p04114
$$ -151449 -158906 53275 354369 382500 277392 496298 902267 776102 -49307 -753421
39501g53421J42401O62376L83442j19845l29172m00191m69641k64723K06496L77933
$$ -753421 -611020 51356 434798 314953 -14219 -414410 -884051 -1148774 -942278 -564345
39491e64345K5153k50472L0825M22577K91083j88723m25501l38012k04369L0338
$$ -564345 -539192 -789664 -758839 -336262 -45179 -233902 -659403 -997415 -1201784 -1171446
39481a171446N58963J080887J086818O34368K11229l1976k98932n48989n34561
$$ -1171446 -612483 468404 1555222 2189590 2400819 2368843 2069911 1520922 986361
39472I86361l43380k63548j94367J34021M28689J05935o40695q59877j82630N79275
$$ 986361 642981 379433 185066 319087 747776 853711 213016 -646861 -829491 -250216
39462b50216N44014j26661o42850o29186l00454L7743K05675R9357j72603k37054
$$ -250216 293798 167137 -475713 -1104899 -1405353 -1367610 -1161935 -1062578 -1235181 -1472235
39452a472235J30954O15197O39576M8598o41003p22185m0466P66134R08118L60633
$$ -1472235 -1341281 -726084 -86508 -37910 -678913 -1401098 -1441564 -675430 232688 593321
39442E93321j28640p1118J49622L1732j80332j7751K32634m8477n99305n09934
$$ 593321 464681 393563 543185 574917 394585 376834 609468 560991 -38314 -548248
39432e48248K48361N73329j24440r68198q88709j04083L86492K81028J95164O17057
$$ -548248 -299887 273442 149002 -819196 -1707905 -1811988 -1425496 -1144468 -949304 -332247
39422c32247J249614J406620P68954k51177q62427p56174m84061o24813q23381
$$ -332247 917367 2323987 3092941 2841764 1979337 1223163 739102 114289 -709092
39413g09092l37752O12055R79225M51458j46687k66460l50239o75277o23343J56005
$$ -709092 -1046844 -434789 544436 995894 849207 582747 232508 -442769 -1066112 -910107
39403i10107Q60016P02483J31408k3828J58370J75700R2641O8928k91913j032827
$$ -910107 -50091 652392 783800 759972 918342 1094042 1186683 1255611 963698 -69129
39393f9129j133081q195J083437O69563n67612q02308L6322L59847k48769m49956
$$ -69129 -1202210 -1210405 -126968 542595 -25017 -827325 -791003 -431156 -679925 -1129881
39383a129881L06955P49399L7081p79915n67789J43799L27039R5940M2440K3488
$$ -1129881 -822926 -73527 -36446 -816361 -1384150 -1240351 -913312 -817372 -774932 -751444
39373g51444k24135j91013M95450J051346O23097k39629l86683J51044L60266
$$ -751444 -975579 -1166592 -671142 380204 1003301 763672 376989 528033 888299
39364H88299j07400o06542o43477l65998K56L64556M97116K50040p1637j53390
$$ 888299 780899 174357 -469120 -835118 -834862 -470306 26810 276850 205213 51823
39354E1823k05889m31070l82132L20282J032956Q47369L4138l52539j64657k53788
$$ 51823 -154066 -585136 -967268 -646986 385970 1233339 1267477 914938 750281 496493
39344D96493q18280r45699k08331M65315K22010l46779j77721N45568O84615o1763
$$ 496493 -321787 -1267486 -1475817 -1010502 -788492 -1135271 -1312992 -767424 -82809 -144572
39334a44572o59124k39609O46461P91472k0349p44262m91492L46471P62292N21124
$$ -144572 -803696 -1043305 -396844 394628 374279 -369983 -861475 -515004 247288 768412
39324G68412K37511K13803M5453m09976n42094j3992M65901J81718l60483j98722
$$ 768412 1005923 1219726 1265179 855203 313109 299117 765018 946736 586253 387531
39314C87531M81799O11181l9858n40816l21650P8981R2680o2878j04125k81256
$$ 387531 869330 1480511 1440653 899837 578187 657168 749848 686970 582845 301589
39304C01589o46792n56672L30471J207260J100480K09406n51124q80643j043830
$$ 301589 -345203 -901875 -571404 635856 1736336 1945742 1394618 513975 -529855
39295e29855r02244j59286N66017K16138r14083j157672J36469J390656R98435
$$ -529855 -1432099 -1591385 -1025368 -809230 -1723313 -2880985 -2744516 -1353860 -355425
39286c55425k23993k31885J107936J801887P89094n25226n86113m6589m44950
$$ -355425 -579418 -811303 296633 2098520 2887614 2362388 1776275 1729686 1284736
39277A284736j518733j569655j96414J048933R63613J72659k24842k05087k40729
$$ 1284736 -233997 -1803652 -2000066 -951133 12480 185139 -39703 -244790 -485519
39268d85519k26285O6280K30679r9159m00626m4944N55868N64842Q8404j00864
$$ -485519 -711804 -645524 -414845 -514004 -914630 -959574 -403706 161136 249540 148676
39258A48676P9135L2324k85133k68619J55737L31389L9947j33729R9360K08501
$$ 148676 227811 260135 -24998 -293617 -137880 193509 233456 99727 199087 407588
39248D07588j64734n22450l34966J12077K18126q3289m09978m49775q9607N31885
$$ 407588 242854 -279596 -614562 -502485 -284359 -367648 -777626 -1227401 -1317008 -785123
39238g85123Q83734M90770k69580m54710J06002N04094J56220l02805j19420L54942
$$ -785123 98611 589381 319801 -134909 -28907 475187 631407 328602 209182 564124
39228E64124L39121p1016j89178K8153m1122n97360j099090j040794m65271K60421
$$ 564124 903245 832229 643051 671204 630082 32722 -1066368 -2107162 -2572433 -2312012
39218b312012O81764M08849m08915q87043l01866Q60915J366595P71146r9605
$$ -2312012 -1630248 -1221399 -1630314 -2517357 -2819223 -1958308 -591713 179433 79828
39209G9828l31343n151J77259p3862l65585k42624K10727M71693K41772j19557
$$ 79828 -251515 -256666 -79407 -153269 -518854 -761478 -550751 -79058 162714 43157
39199D3157k4019N25510R05667P57323M45274L75723L38298k1969m79972n61759
$$ 43157 19138 544648 1450315 2207638 2652912 3028635 3366933 3344964 2864992 2303233
39189B303233l48562l38890o21461p54597m60499K3953L01032J70565k92496p01722
$$ 2303233 1954671 1615781 994320 239723 -220776 -196823 104209 274774 -17722 -719444
39179g19444n63991J22673O85984N91674J79890J14820L81017M25587R5282k19252
$$ -719444 -1283435 -1160762 -474778 116896 296786 411606 792623 1218210 1313492 1094240
39169A094240k77708k34864k57923l90615o34557p19618j75647P77454R84735
$$ 1094240 816532 581668 323745 -66870 -701427 -1421045 -1596692 -819238 165497
39160A65497p9058j081881m70547J062985J371474M3769j014869n46564L93186
$$ 165497 86439 -995442 -1465989 -403004 968470 1012239 -2630 -549194 -156008
39151a56008N28853L24483O12299Q19465J66530n33830o4959R68720R17199l28005
$$ -156008 372845 697328 1309627 2129092 2295622 1761792 1696833 2665553 3582752 3254747
39141C254747j257683j087739n32686k25454N2686L61731K94407K090J65948N90465
$$ 3254747 1997064 909325 376639 151185 203871 565602 860009 862099 1028047 1618512
39131A618512K31030q86548j254665j73990R57201P35933j00130j4665P84084
$$ 1618512 1849542 962994 -291671 -465661 491540 1227473 1127343 1112678 1896762
39122A896762Q04265j98626q78486n19219l0706l01577q60057q73466m91765l36901
$$ 1896762 2701027 2502401 1623915 1104696 1073990 772413 -87644 -961110 -1452875 -1789776
39112a789776l15915J33184R34263J364727J100909N86626K81710J01191k25756
$$ -1789776 -2105691 -1972507 -1038244 326483 1427392 2014018 2295728 2396919 2171163
39103B171163o71144j007568j095850q83987l66854K79394P40922Q88095Q28810
$$ 2171163 1500019 492451 -603399 -1487386 -1854240 -1574846 -833924 54171 882981
39094H82981N55594q2424q55843j084664n24651R9349M8231k95937m4329O69049
$$ 882981 1438575 1356151 500308 -584356 -1109007 -1009658 -961427 -1257364 -1301693 -632644
39084f32644P94097Q4123m02127L4847N97006K81000n09852o32787M0004N93139
$$ -632644 161453 245576 -156551 -121704 475302 756302 246450 -386337 -346333 246806
39074B46806N46548L36749L38569L26482P4355k31394l75647l67282k08120R6519
$$ 246806 793354 1130103 1468672 1795154 1869509 1638115 1262468 895186 687066 783585
39064G83585K88562J32702j17514r4398k3257l49166p92827o74136j57748j24184
$$ 783585 1072147 1204849 1087335 992937 969680 620514 -172313 -846449 -1004197 -1128381
39054a128381o18262n80926L94636J156024O26890n42354r08146j95720O32999
$$ -1128381 -1746643 -2327569 -1932933 -776909 -150019 -692373 -1600519 -1796239 -1163240
39045a163240Q41669N03327j05097p58171j007112m81387M46606R33299P05981
$$ -1163240 -321571 181756 76659 -681512 -1688624 -2170011 -1723405 -790106 -84125
39036h4125L29485L44533N85901N13994n4768o91165p61748j30022N77752O45660
$$ -84125 245360 589893 1175794 1689788 1635020 943855 182107 52085 629837 1275497
39026A275497J76838r5413Q5158K17368K8152o2668J42719R8264m48450p17071
$$ 1275497 1452335 1356922 1442080 1659448 1687600 1624932 1767651 1865915 1417465 700394
39016G00394o4051Q09177Q38136K04843j66465k22938n72063r72633n35971N33404
$$ 700394 636343 1445520 2283656 2488499 2322034 2099096 1527033 554400 18429 551833
39006E51833Q73415j5357r69835q63675J3180P84206J129707J003303K17323r35699
$$ 551833 1425248 1409891 440056 -423619 -410439 373767 1503474 2506777 2724100 1788401
38996A788401j470379q96280K7584L93896L29711L77883L98592k0842n70319n77885
$$ 1788401 318022 -578258 -550674 -156778 172933 550816 949408 928566 358247 -219638
38986b19638r4569K15633J09013m5822j0938L5998o3075k34496l67166l48985
$$ -219638 -314207 -98574 10439 -35383 -46321 -10323 -73398 -307894 -675060 -1024045
38976a024045m4735M22386N97451K83496o1704N6091M27827M90397J56630k02435
$$ -1024045 -1068780 -646394 -48943 234553 172849 228940 656767 1147164 1303794 1101359
38966A101359l62328l10476M7298O51369R51718M69532l80759o95372l32302r5917
$$ 1101359 739031 428555 475853 1127222 2078940 2548472 2167713 1472341 1140039 1044122
38956A044122n06775j010563p92688K5539M95310O6626o88549p75363l9514O17127
$$ 1044122 537347 -473216 -1265904 -1240365 -745055 -678429 -1366978 -2142341 -2181855 -1564728
38946a564728M23585k32934m25672p6661J5791m45108p26308k72547L68328M43173
$$ -1564728 -1141143 -1374077 -1799749 -1876410 -1860619 -2305727 -3032035 -3304582 -2936254 -2493081
38936b493081J79115L13297Q60069J132190P86526J87523j58705m2915L95717
$$ -2493081 -2313966 -2000669 -1140600 -8410 778116 965639 806934 764019 1159736
38927A159736O52406J88829q05716j381693j011443l05580j6070M2019L24371
$$ 1159736 1812142 2000971 1195255 -186438 -1197881 -1503461 -1519531 -1477512 -1153141
38918a153141M80514j2238o18952l55012N95682J048907N54851j30398l28224
$$ -1153141 -672627 -684865 -1303817 -1658829 -1063147 -14240 540611 410213 81989
38909H1989j61849N6593J98372N0527l99399n01303K11961R02882M19987p14697
$$ 81989 -79860 -23267 175105 225632 -173767 -675070 -463109 439773 859760 145063
38899A45063q37260K47960R04271L11982l17357L3472M72339j09059j064258j111754
$$ 145063 -692197 -444237 460034 772016 454659 488131 960470 851411 -212847 -1324601
38889a324601l48222K40268M29320O07806P05994N11152L84068N10846K09277
$$ -1324601 -1672823 -1432555 -1003235 -395429 310565 821717 1205785 1716631 1925908
38880A925908q00912j333462m34379P10216L87128p65150o26951Q92896J550833
$$ 1925908 1124996 -208466 -642845 67371 454499 -310651 -937602 -44706 1506127
38871A506127L05430j092739r17114Q9521L52316j6719J12979P44680Q81870K78224
$$ 1506127 1811557 718818 -198296 -108775 243541 226822 339801 1084481 1966351 2244575
38861B244575l41460n72930o56955o24362k13361L13190K84761k11239j93907
$$ 2244575 1903115 1330185 673230 48868 -164493 148697 433458 222219 28312
38852B8312P34157J527855J012223l97761j145210o35592O418l30299j050433
$$ 28312 762469 2290324 3302547 2904786 1759576 1123984 1130402 800103 -250330
38843b50330p87566L70888Q44793l9393q86749k95403R37732R74374k47844r11527
$$ -250330 -1037896 -667008 177785 138392 -748357 -1043760 -106028 868346 620502 -291025
38833b91025p4500R90626Q01253k09114n31680K00713R04665O74322k03862q92821
$$ -291025 -365525 625101 1426354 1217240 685560 886273 1790938 2465260 2261398 1368577
38823A368577r67089n38467J03009O52899P92373L57425l77660p48909l23400
$$ 1368577 401488 -136979 -33970 618929 1411302 1768727 1391067 642158 318758
38814C18758M76450P07330P5138o10741n42084o1638o1810n37738o33562r9111
$$ 318758 795208 1502538 1577676 966935 424851 363213 301403 -236335 -869897 -969008
38804i69008K79722k5890m56974l02018K65818O33710O28306L94142m9388n29286
$$ -969008 -689286 -715176 -1172150 -1474168 -1208350 -574640 53666 447808 398420 -130866
38794a30866n20754Q9962M99184R160p96834p50518K31038J043135R22297K38165
$$ -130866 -651620 -561658 -62474 -53314 -850148 -1600666 -1369628 -326493 595804 833969
38784H33969l23568n47068m25623J08389P75739Q89411K15704n42787o37533k83995
$$ 833969 510401 -36667 -462290 -353901 421838 1311249 1526953 984166 346633 62638
38774F2638k05768m50858l96091J02144L65941J1926l03075J07741O93614L49807
$$ 62638 -143130 -593988 -990079 -887935 -521994 -510068 -813143 -705402 -11788 338019
38764C38019p23010r46557M00505J863289J657595J86129n44742J77917Q77992
$$ 338019 -384991 -1331548 -931043 932246 2589841 2775970 2231228 2409145 3287137
38755C287137K41595r61619j177035l27000L69272L09511L8121J3954j2483k27414
$$ 3287137 3528732 2567113 1390078 1063078 1432350 1741861 1779982 1793936 1781453 1554039
38745A554039l20915j68952j67613m60784n17693l3080L24303j98839j130900
$$ 1554039 1233124 1064172 896559 435775 -81918 -114998 209305 10466 -1120434
38736a120434j206725j23666R37626Q88026J84017P6920P59534J105334L58638
$$ -1120434 -2327159 -2450825 -1513199 -625173 -441156 -364236 395298 1500632 1859270
38727A859270p18812r03504j59545N00161N11453K56478Q5710k24607p33791r04379
$$ 1859270 1140458 236954 77409 577570 1089023 1345501 1431211 1206604 472813 -431566
38717d31566m64184k8862j95231n67007m50329m5777k4786k48258L311N98121
$$ -431566 -895750 -924612 -1119843 -1686850 -2137179 -2182956 -2207742 -2456000 -2452689 -1854568
38707a854568N27574m27517j096602n34786O32008J155930P81631J72746k30223
$$ -1854568 -1326994 -1754511 -2851113 -3385899 -2753891 -1597961 -816330 -643584 -873807
38698h73807m42858l72434J12441O55853P12083L64401J91604L11959K39231k09437
$$ -873807 -1316665 -1689099 -1576658 -920805 -208722 155679 347283 659242 898473 689036
38688F89036n53271m44071j96236j46230k7620M87019R93098P42419k54046j055495
$$ 689036 135765 -308306 -504542 -650772 -678392 -191373 801725 1544144 1290098 234603
38678B34603q52386J34103R67929J010136M53044o4510j96097j40365k04181l44356
$$ 234603 -617783 -483680 484249 1494385 1947429 1882919 1686822 1546457 1342276 997920
38668I97920l44931k74436l71005m94309j98222M70140P68995K51087m83908n63836
$$ 997920 652989 378553 7548 -486761 -684983 -214843 554152 805239 321331 -242505
38658b42505n0055K64332N8126k33676k84015k62808k52294j5290M00818N11136
$$ -242505 -292560 -28228 29898 -203778 -487793 -750601 -1002895 -1018185 -617367 -106231
38648a06231J84353m7647J29163K53159q0243m34763k40701K06065K04741k28914
$$ -106231 78122 30475 159638 412797 332554 -102209 -342910 -136845 67896 -161018
38638a61018m53684j83183L28438Q56856J246912J118962L39812m06477m01930
$$ -161018 -614702 -797885 -469447 387409 1634321 2753283 3093095 2686618 2284688
38629B284688r3763m91810j423432j593952o05503L32193K26166l12055k47901
$$ 2284688 2190925 1699115 275683 -1318269 -1923772 -1591579 -1365413 -1677468 -1925369
38620a925369L02327N97391N67313N61397M12432j66898o75466m09113K85797
$$ -1925369 -1623042 -1025651 -458338 103059 515491 348593 -326873 -735986 -450189
38611d50189M05205j75412n88673m03328j34804j70090j75536Q5383K31027L8995
$$ -450189 -44984 -220396 -809069 -1212397 -1347201 -1517291 -1692827 -1607444 -1376417 -1337422
38601a337422j656M91164R92937P58794m5012n52026l78903l382N0474j04256
$$ -1337422 -1339078 -847914 145023 903817 858805 306779 -72124 -75506 -25032 -129288
38591a29288m8046K47431L70253P8999l09543l29871k9145J09445o9857j40432
$$ -129288 -177334 70097 440350 519349 209806 -120065 -149210 -39765 -109622 -250054
38581b50054J51902L30048j07289p34908o57864J63341P95731O70405K88689K48363
$$ -250054 -98152 231896 124607 -610301 -1268165 -1104824 -309093 361312 650001 898364
38571H98364K55925k75164j086022j284489n98029K36314M59142J82255M8698
$$ 898364 1154289 879125 -206897 -1491386 -2089415 -1853101 -1393959 -1211704 -1163006
38562a163006L12935N96365M89095J01678j32283q2433r1507m10862o96702l98612
$$ -1163006 -850071 -253706 235389 337067 204784 122351 30844 -380018 -1076720 -1475332
38552a475332L86071Q39464L93724n04312q85335l76958M44730P62593L22881
$$ -1475332 -1089261 -249797 143927 -360385 -1245720 -1622678 -1177948 -415355 -92474
38543i2474m49240q80857n59616L29268J050611R19659L8093p30347p24216k58117
$$ -92474 -541714 -1422571 -1982187 -1652919 -602308 317351 355444 -374903 -1099119 -1357236
38533a357236j24193m47088n30669M1620O87163O15245j9321l26114O8057N55915
$$ -1357236 -1481429 -1928517 -2459186 -2417566 -1730403 -1115158 -1134479 -1460593 -1392536 -836621
38523h36621M41778j70938n94053l50120M06257J015811Q01334k43902j184798
$$ -836621 -394843 -565781 -1159834 -1509954 -1103697 -87886 713448 469546 -715252
38514g15252r81871K33802J161647Q67091j16591n89370j97699L59269M11031
$$ -715252 -1697123 -1463321 -301674 565417 448826 -140544 -338243 21026 432057
38505D32057M9722k26616j90020n6192j53215n09469p76620o14763q6380M94924
$$ 432057 481779 255163 65143 8951 -144264 -653733 -1430353 -2045116 -2131496 -1636572
38495a636572R64155J223039R47371j3358r68485q97646J41108Q79225M89522
$$ -1636572 -672417 550622 1497993 1484635 516150 -381496 -240388 638837 1128359
38486A128359l74250o70392l42724L3570K65093M20725L00820j39974l49858K0540
$$ 1128359 754109 83717 -259007 -225437 39656 460381 761201 621227 271369 291909
38476B91909M00673K31586L07L17699N97722l3115r72505q16711L60823R75242
$$ 291909 692582 924168 924475 1242174 1839896 1806781 834276 17565 378388 1353630
38466A353630K99589o28212p91278m80300k95408j35196J69490K62181m4461l25674
$$ 1353630 1653219 1025007 233729 -246571 -541979 -677175 -507685 -245504 -289965 -615639
38456f15639k99774k12924j09091L41146R02942P19445l00979j064578q19867
$$ -615639 -915413 -1128337 -1237428 -896282 6660 726105 425126 -639452 -1459319
38447a459319j08271L56086O66673R40488P03205j10660n97871k20790K89145
$$ -1459319 -1567590 -1211504 -544831 395657 1098862 988202 390331 169541 458686
38438D58686K44517J43916M87490N80240k08332r91315o29489L43706N75174K4894
$$ 458686 703203 847119 1334609 1914849 1706517 715202 85713 429419 1004593 1029487
38428A029487l09418k62747m39654o33015m4586R82622J122612J28400p48594
$$ 1029487 720069 457322 17668 -615347 -659933 322689 1445301 1573701 825107
38419H25107o58016j16466K13364M01645N16398K13943m39098p37175l77905J37143
$$ 825107 167091 50625 263989 665634 1182032 1395975 956877 219702 -158203 -21060
38409b1060M47625P50024R79092N99512l41399r00170n13459J99227M00645Q9651
$$ -21060 426565 1176589 2155681 2755193 2413794 1513624 1000165 1199392 1600037 1689688
38399A689688k54406m03054l38999j12067o5391n49540j138836q90166K83149
$$ 1689688 1435282 1032228 693229 581162 515771 -33769 -1172605 -2062771 -1779622
38390a779622J275047J208593M30324k93748p35130q84007n50367P8928K64526
$$ -1779622 -504575 704018 1134342 840594 105464 -778543 -1328910 -1249982 -985456
38381i85456j98990m32375K23755J018709Q21689j44328n97956j6054P69394Q17220
$$ -985456 -1184446 -1616821 -1393066 -374357 447332 303004 -294952 -311006 458388 1275608
38371A275608J84332l93221m53013k18021k22620o12578q79905m92894K87132
$$ 1275608 1459940 1066719 613706 395685 173065 -439513 -1319418 -1812312 -1525180
38362a525180O50216L37369m4246L1075L16322L20998r76m05585p15816p43075
$$ -1525180 -874964 -537595 -581841 -550766 -234444 86554 85578 -320007 -1035823 -1778898
38352a778898l48073J78477L45161K54661M68272Q75270O35534l32673q69622
$$ -1778898 -2126971 -1948494 -1603333 -1348672 -880400 -5130 630404 297731 -571891
38343e71891k88700M69483L72244J511M29637J166181Q36040m39666j033821k92352
$$ -571891 -860591 -391108 -18864 -17353 412284 1578465 2414505 1974839 941018 648666
38333F48666N39379L27229l61398m21341O5469J92902k93258p68778p22777k79996
$$ 648666 1188045 1515274 1153876 732535 798004 990906 697648 -71130 -793907 -1073903
38323a073903K05144N64584P48497O46510J62328n32734r29004o07521J47931
$$ -1073903 -868759 -304175 444322 1090832 1253160 720426 -208578 -816099 -668168
38314f68168M84684K7708n25878l29953L68557N77210M1918m02109j28978L62279
$$ -668168 -183484 -155776 -681654 -1011607 -643050 -65840 -23922 -426031 -555009 -192730
38304a92730K51595l94152p51238l58145L55864O71650M39563J96109M19612P99635
$$ -192730 58865 -335287 -1086525 -1444670 -1088806 -417156 22407 218516 638128 1437763
38294A437763N59622l83280j042306n97846L62642N48160k59210r63574p47052
$$ 1437763 1997385 1614105 571799 -26047 336595 884755 625545 -338029 -1085081
38285a085081k2568M84677P27085Q60731N55417m11547j360915j387438n99683
$$ -1085081 -1107649 -622972 104113 964844 1520261 1108714 -252201 -1639639 -2239322
38276b239322J07356L49694M80588N94428L02468k72136k77592N22979J039914
$$ -2239322 -2131966 -1782272 -1301684 -707256 -404788 -676924 -954516 -431537 608377
38267F08377L41989p41784n90547Q47354J811359J056358n82293j444702j053503
$$ 608377 950366 208582 -381965 465389 2276748 3333106 2750813 1306111 252608
38258B52608j76262M93652Q19605O83610o5923j018213j305359o25100K91569
$$ 252608 76346 569998 1389603 2073213 2007290 989077 -316282 -941382 -649813
38249f49813N25948N166n32560m35203J60530M97711R7721n44515m85872L30372
$$ -649813 -123865 -118699 -651259 -1086462 -925932 -428221 -330500 -875015 -1360887 -1030515
38239a030515Q22387K82499m82032l20084M62077N97004r7411n16712k10378p3245
$$ -1030515 -208128 74371 -407661 -727745 -265668 331336 233925 -282787 -493165 -566410
38229e66410o02407q56464l9438J024387J104126L84034r8428j54145l31059n78814
$$ -566410 -1168817 -2025281 -2064719 -1040332 63794 447828 349400 195255 -135804 -714618
38219g14618l32260K85481N63189M32310M60096O25189K66914n88333r83226m61704
$$ -714618 -1046878 -761397 -198208 234102 694198 1319387 1586301 997968 14742 -446962
38209d46962K40354L76784J88810J89938K18520j21407n92681n96350p7653L85622
$$ -446962 -206608 170176 358986 548924 767444 646037 53356 -542994 -620647 -235025
38199b35025L40752l6037k03505J11520N51706M83035j78544p34060o05729j83275
$$ -235025 105727 69690 -133815 -22295 529411 1012446 833902 99842 -505887 -689162
38189f89162k21821o09149m94631L28919R83470P32860k1393l90880j46789K36202
$$ -689162 -910983 -1520132 -2014763 -1685844 -702374 30486 9093 -381787 -528576 -292374
38179b92374L33540J29421j80668l86285l41708p7964J90490K53526P4257j69914
$$ -292374 41166 170587 -10081 -396366 -738074 -816038 -625548 -372022 -297765 -467679
38169d67679j47061L27650Q84202Q11415O08p05361o05698j78239k95002p42827
$$ -467679 -614740 -287090 597112 1408527 1409135 703774 98076 -80163 -375165 -1117992
38159a117992n22614M51171J046808N49724l85285q21971p16388m92215j99513
$$ -1117992 -1640606 -1189435 -142627 407097 21812 -800159 -1516547 -2008762 -2208275
38150b208275K76379P04098P83228N65044K16227k12886m89273k27341M05892
$$ -2208275 -1931896 -1227798 -444570 120474 336701 123815 -365458 -592799 -186907
38141a86907O01380j4755p57462q25662l47892L5509J34228J76792K42366K93496
$$ -186907 414473 399718 -357744 -1183406 -1531298 -1495789 -1361561 -1184769 -942403 -648907
38131f48907M24661N87414M41832p6697m93921n41052n91862q16812n86308M80968
$$ -648907 -224246 363168 805000 728303 234382 -306670 -898532 -1715344 -2301652 -1820684
38121a820684J470909J198829n1857q48654n28805J74186M06798J66137j48142
$$ -1820684 -349775 849054 797197 -51457 -580262 -406076 722 166859 18717
38112A8717l52559l99662k55301m8715O4798K01534M94494O73214M22197o170
$$ 18717 -333842 -733504 -988805 -1037520 -972722 -771188 -276694 396520 818717 812547
38102H12547j48544j22224l46171o33262m12443J92434M26056J18178j00166M2214
$$ 812547 664003 541779 195608 -437654 -850097 -657663 -231607 -113429 -213595 -171381
38092a71381O7951j80038j05383N06568Q75315M10892l14732n23675m03265m75705
$$ -171381 -103430 -283468 -388851 117717 993032 1403924 1089192 565517 162252 -313453
38082c13453m90073K7307O15307M10016m10286q24131n28364k03187j74009K8549
$$ -313453 -803526 -776219 -160912 249104 -161182 -985313 -1513677 -1716864 -1890873 -1862324
38072a862324M89930M61483l05639p87991j30127Q86743Q64854j57089p98796
$$ -1862324 -1372394 -910911 -1216550 -2004541 -2134668 -1247925 -383071 -540160 -1338956
38063a338956l82326K34814J23445l80298l69333K30202O35093L35884l05794
$$ -1338956 -1721282 -1486468 -1363023 -1743321 -2112654 -1882452 -1247359 -911475 -1217269
38054a217269n65121j34830N92156Q65696L12108n68021q44489k35262N35794
$$ -1217269 -1782390 -1917220 -1325064 -459368 -147260 -715281 -1559770 -1795032 -1259238
38045a259238O52606J55735l11697l85247k09842l5950j8001k37479n17922m11436
$$ -1259238 -606632 -450897 -762594 -1147841 -1357683 -1393633 -1411634 -1649113 -2167035 -2578471
38035b578471J91974O67227M00216k65847m59563k6991L65529L39753K21582K21848
$$ -2578471 -2386497 -1719270 -1319054 -1584901 -2044464 -2071455 -1705926 -1366173 -1144591 -922743
38025i22743J4260n30497q72621n21207K46389P72815P71662M35817J61382L06927
$$ -922743 -908483 -1438980 -2311601 -2832808 -2586419 -1813604 -1041942 -606125 -444743 -137816
38015a37816P83079Q31313j49279j461418j632769l62163R58298J115501N22333
$$ -137816 645263 1476576 1327297 -134121 -1766890 -2129053 -1170755 -55254 467079
38006D67079J55432L6281k76143n12877k02589K15454L5967l24674J12353J116724
$$ 467079 622511 658792 382649 -130228 -332817 -117363 -81396 -406070 -293717 823007
37996H23007J392510N76710k26430k37494q4834m98457r93892p35674K091K14212
$$ 823007 2215517 2792227 2565797 2328303 2243469 1745012 751120 15446 17537 231749
37986B31749l13997p41560m17415K98789O59093M99550K50225J95253J36541j46354
$$ 231749 -82248 -823808 -1241223 -942434 -283341 216209 466434 661687 798228 651874
37976F51874m75586n92630n97820o24069l35842N31931J244159O71227r22153
$$ 651874 176288 -416342 -1014162 -1638231 -1974073 -1442142 -197983 473244 -448909
37967d48909j761045q46813O22135R78836L33278m8300J39214J76342l1293K04946
$$ -448909 -2209954 -3056767 -2434632 -1455796 -1122518 -1170818 -1031604 -855262 -886555 -681609
37957f81609Q59362R70373J88818o60669q96414p67658n83260j34241N45172Q18359
$$ -681609 177753 1148126 1336944 676275 -220139 -987797 -1571057 -1705298 -1160126 -341767
37947c41767M04959j01874j62094K2864J67942M24357P41313N35228l72598j188572
$$ -341767 63192 -38682 -200776 -177912 -9970 414387 1155700 1690928 1318330 129758
37937A29758j167587o04159j95333r614K37178M06250J97593j41755q0997L64891
$$ 129758 -1037829 -1641988 -1837321 -1846935 -1609757 -1203507 -1005914 -1147669 -1228666 -863775
37927h63775O12661K76265l71686o69187k14265N92467P64582j10364j097252
$$ -863775 -251114 25151 -346535 -1015722 -1229987 -637520 127062 16698 -1080554
37918a080554r50315J95385J025970R19788N59528N10938L91057j00166m88057
$$ -1080554 -2030869 -1835484 -809514 110274 669802 1180740 1571797 1471631 983574
37909I83574m94432o03925r46511p41465K60669R11109L57256m19545r2205Q33296
$$ 983574 489142 -114783 -1061294 -1802759 -1542090 -630981 -273725 -693270 -785475 47821
37899D7821Q42306j62559q56189o40308k46282j98425j11635K55224M74657L34871
$$ 47821 890127 727568 -128621 -768929 -1015211 -1213636 -1325271 -1070047 -595390 -260519
37889b60519K71578N50800P80394N45039l8032n59532o74085k73701K54957K11824
$$ -260519 11059 561859 1342253 1887292 1849260 1289728 615643 341942 596899 808723
37879H08723m46833p65984j35460N94860L52831l52942k02410O97411Q94282q2912
$$ 808723 361890 -404094 -539554 55306 408137 55195 -147215 550196 1444478 1361566
37869A361566j042337j065264o52396m40499j40938N31777J010754P54348J23493
$$ 1361566 319229 -746035 -1398431 -1838930 -1979868 -1448091 -437337 317011 440504
37860D40504k72275l59628k52057P0130L14035J6923m69523j94787P31437R38047
$$ 440504 168229 -191399 -443456 -373326 -59291 -42368 -511891 -706678 24759 962806
37850I62806p6737r53940n72310K04150J55956j77257L20298J034653N10936q56492
$$ 962806 886069 -67871 -640181 -436031 -280075 -457332 -137034 897619 1408555 552063
37840E52063j150093L5517R09864K89530p31534p18930J7620L47554J75468J61362
$$ 552063 -598030 -562513 347351 636881 -94653 -813583 -795963 -448409 -272941 -111579
37830a11579L27097J40001l75134o28514m32641j74258q0287K4258K30957L63587
$$ -111579 215518 355519 -19615 -648129 -1080770 -1255028 -1335315 -1311057 -1080100 -716513
37820g16513L08938J37674o5232j61548Q7485O18896Q12035J86699p35372q99555
$$ -716513 -407575 -269901 -335133 -496681 -409196 209700 1021735 1208434 473062 -426493
37810d26493j16684O30586M89713k25389o40660m89702k27040k74454n78694p50120
$$ -426493 -543177 87409 577122 351733 -288927 -778629 -1005669 -1280123 -1858817 -2608937
37800b608937l61653O41184J576643J484545L70562m61772K5629J093165J160729
$$ -2608937 -2970590 -2329406 -752763 731782 1102344 640572 666201 1759366 2920095
37791B920095O0041p47452l52527L52399J67315o41168r29176m02417K23809M87104
$$ 2920095 2980136 2232684 1880157 2232556 2399871 1758703 829527 427110 650919 1138023
37781A138023O60979R87515J190922R32727K76252m33332q52699q08985m62002
$$ 1138023 1799002 2786517 3977439 4910166 5186418 4753086 3900387 3091402 2629400
37772B629400k40261l79392o48338p26835o05720l85009l0585L54437M25753J47093
$$ 2629400 2389139 2009747 1361409 634574 28854 -356155 -386740 -32303 393450 540543
37762E40543k2963O7169j28826q20696j140498l76517O21789M77989n88286r99839
$$ 540543 517580 584749 455923 -364773 -1505271 -1881788 -1259999 -782010 -1370296 -2370135
37752b370135j44137Q72911R98404N07544J23122j7327j8033J85053L91965J60314
$$ -2370135 -2514272 -1641361 -642957 -135413 -12291 -29618 -47651 137402 529367 689681
37742F89681l14805k41848M25288O80846L7043o30742m99865o2031j19054m25337
$$ 689681 374876 133028 558316 1239162 1276205 645463 145598 83567 -35487 -460824
37732d60824l27192j1914n3683k75211j09188L30576N22617N12384O51802O85093
$$ -460824 -788016 -799930 -853613 -1128824 -1238012 -907436 -384819 127565 779367 1464460
37722A464460Q6952q59138j233726o84776K42701Q53912P92622P0743p52317p82407
$$ 1464460 1551412 692274 -541452 -1226228 -983527 -129615 663007 733750 -18567 -800974
37712h00974J19541Q71254N43211l03739n51711k38089j80171l42140K2098P66047
$$ -800974 -681433 189821 733032 429293 -122418 -360507 -540678 -882818 -860720 -94673
37702i4673Q66506J74174k38943J81498O43028L89596j89759l84732j64923J65345
$$ -94673 771833 946007 707064 888562 1531590 1921186 1731427 1346695 1181772 1347117
37692A347117M84838N66223P2124p29376j037210o84168l82595m55300l31523
$$ 1347117 1831955 2398178 2470302 1740926 703716 19548 -363047 -818347 -1149870
$$ [...]
##END NTUPLES=NMR SPECTRUM
##END=
