##TITLE=31Pdec_PR177rm-A
 D2O, 24 sc
 20.8.2019
##JCAMPDX= 6.0         $$ Bruker NMR JCAMP-DX V2.0
##DATA TYPE= NMR SPECTRUM
##DATA CLASS= NTUPLES
##ORIGIN= UXNMR, Bruker Analytische Messtechnik GmbH
##OWNER= root
$$ XWIN-NMR		Version 3.5
$$ Tue Aug 20 14:42:21 2019 Russian Standard Time (UT+4h)  she@DPX200
##.OBSERVE FREQUENCY= 81.013821
##.OBSERVE NUCLEUS= ^31P
##.ACQUISITION MODE= SIMULTANEOUS
##.ACQUISITION SCHEME= undefined
##.AVERAGES= 24
##.DIGITISER RES= 17
##SPECTROMETER/DATA SYSTEM= spect
##.PULSE SEQUENCE= zgpg30
##.SOLVENT NAME= CDCl3
##.SHIFT REFERENCE= (INTERNAL, CDCl3, 0, 182.463)
##AUDIT TRAIL= $$ (NUMBER, WHEN, WHO, WHERE, WHAT)
$$ ##TITLE= Audit trail, XWIN-NMR		Version 3.5
$$ ##JCAMPDX= 5.01
$$ ##ORIGIN= Bruker BioSpin GmbH
$$ ##OWNER= she
$$ F:/spectra/data/she/nmr/P31/1/pdata/1/auditp.txt
$$ ##AUDIT TRAIL=  $$ (NUMBER, WHEN, WHO, WHERE, WHAT)
(   1,<2019-08-20 14:41:10.45 +0400>,<she>,<DPX200>,
      <created by zg, POWCHK disabled, PULCHK disabled
       configuration hash MD5:
       00 E9 B6 7A A2 85 ED C7 34 08 36 98 17 FE 4E 26
       data hash MD5: 32K
       4C 85 71 5E B3 B0 7E 94 8C 4C 4B 43 89 82 EE F4>)
(   2,<2019-08-20 14:41:22.37 +0400>,<she>,<DPX200>,
      <Start of raw data processing
       efp BC_mod = 2 LB = 1 FT_mod = 6 PKNL = 1 PHC0 = -397.7437 PHC1 = 142.6004 SI = 64K 
       data hash MD5: 64K
       AB 2D AE DE 00 7A D6 6A 71 49 1B DC A5 66 48 FB>)
(   3,<2019-08-20 14:41:38.87 +0400>,<she>,<DPX200>,
      <pk PHC0 = -27.74693 PHC1 = 0 
       data hash MD5: 64K
       E1 01 55 87 A7 C1 6B 27 8E 6D 30 5C 78 84 5D EC>)
(   4,<2019-08-20 14:41:44.37 +0400>,<she>,<DPX200>,
      <abs ABSG = 5 
       data hash MD5: 64K
       0B 17 C7 2E 0B 8D E1 6C 9F 3F 12 E4 86 01 08 A3>)
$$ ##END=
$$ 
$$ hash MD5
$$ 26 BC A4 64 7B CE 9A 84 45 85 E4 FC 35 CC 6A EE
##$RELAX= 
##$RELAX= 
##$RELAX= 
##$RELAX= 
##$RELAX= 
##$RELAX= 
##$RELAX= 
##$RELAX= 
$$ Bruker specific parameters
$$ --------------------------
##$DU= <F:/spectra>
##$EXPNO= 1
##$NAME= <P31>
##$PROCNO= 1
##$TYPE= <nmr>
##$USER= <she>
##$AMP= (0..31)
100 100 100 100 100 100 100 100 100 100 100 100 100 100 100 100 100 100 
100 100 100 100 100 100 100 100 100 100 100 100 100 100 
##$AQSEQ= 0
##$AQ_mod= 1
##$AUNM= <au_zg>
##$AUTOPOS= <>
##$BF1= 81.014009
##$BF2= 200.13
##$BF3= 200.13
##$BF4= 200.13
##$BF5= 200.13
##$BF6= 200.13
##$BF7= 200.13
##$BF8= 200.13
##$BYTORDA= 1
##$CFDGTYP= 0
##$CFRGTYP= 5
##$CHEMSTR= <none>
##$CNST= (0..31)
1 1 145 1 1 1 1 1 1 1 1 1 1 1 1 1 1 1 1 1 1 1 1 1 1 1 1 1 1 1 1 1 
##$CPDPRG= <waltz16>
##$CPDPRG1= <>
##$CPDPRG2= <waltz16>
##$CPDPRG3= <>
##$CPDPRG4= <mlev>
##$CPDPRG5= <mlev>
##$CPDPRG6= <mlev>
##$CPDPRG7= <mlev>
##$CPDPRG8= <mlev>
##$CPDPRGB= <>
##$CPDPRGT= <>
##$D= (0..31)
0 1 0 0 0 0 0 0 0 0 0 0.03 2e-05 3e-06 0 0 0 0 0 0 0 0 0 0 0 0 0 0 0 0 
0 0 
##$DATE= 1566297669
##$DBL= (0..7)
120 120 120 11 120 120 24 19 
##$DBP= (0..7)
150 150 150 150 150 150 150 150 
##$DBP07= 0
##$DBPNAM0= <>
##$DBPNAM1= <>
##$DBPNAM2= <>
$$ [...]
##$SUBNAM3= <"">
##$SUBNAM4= <"">
##$SUBNAM5= <"">
##$SUBNAM6= <"">
##$SUBNAM7= <"">
##$SUBNAM8= <"">
##$SUBNAM9= <"">
##$SW= 369.568048894756
##$SWIBOX= (0..15)
0 1 3 0 0 0 0 0 0 0 0 0 0 0 0 0 
##$SW_h= 29940.119760479
##$TD= 32768
##$TD0= 1
##$TE= 0
##$TE2= 300
##$TE3= 300
##$TEG= 300
##$TL= (0..7)
0 120 53 12 22 120 120 120 
##$TP= (0..7)
150 150 150 150 150 150 150 150 
##$TP07= 0
##$TPNAME0= <>
##$TPNAME1= <>
##$TPNAME2= <>
##$TPNAME3= <>
##$TPNAME4= <>
##$TPNAME5= <>
##$TPNAME6= <>
##$TPNAME7= <>
##$TPOAL= (0..7)
0.5 0.5 0.5 0.5 0.5 0.5 0.5 0.5 
##$TPOFFS= (0..7)
0 0 0 0 0 0 0 0 
##$TUNHIN= 0
##$TUNHOUT= 0
##$TUNXOUT= 0
##$USERA1= <user>
##$USERA2= <user>
##$USERA3= <user>
##$USERA4= <user>
##$USERA5= <user>
##$V9= 5
##$VALIST= <valist>
##$VCLIST= <CCCCCCCCCCCCCCC>
##$VD= 0
##$VDLIST= <DDDDDDDDDDDDDDD>
##$VPLIST= <PPPPPPPPPPPPPPP>
##$VTLIST= <TTTTTTTTTTTTTTT>
##$WBST= 1024
##$WBSW= 4
##$XGAIN= (0..3)
0 0 0 0 
##$XL= 0
##$YL= 0
##$YMAX_a= 42232
##$YMIN_a= -53992
##$ZGOPTNS= <>
##$ZL1= 120
##$ZL2= 120
##$ZL3= 120
##$ZL4= 120
##$ABSF1= 182.463
##$ABSF2= -187.1042
##$ABSG= 5
##$ABSL= 3
##$ALPHA= 0
##$AQORDER= 0
##$ASSFAC= 0
##$ASSFACI= 0
##$ASSFACX= 0
##$ASSWID= 0
##$AUNMP= <proc_1d>
##$AZFE= 0.1
##$AZFW= 0.5
##$BCFW= 0
##$BC_mod= 2
##$BYTORDP= 0
##$COROFFS= 0
##$CY= -3
##$DATMOD= 1
##$DC= 0
##$DFILT= <>
##$DTYPP= 0
##$F1P= 0
##$F2P= 0
##$FCOR= 1
##$FTSIZE= 65536
##$FT_mod= 6
##$GAMMA= 0
##$GB= 0
##$INTBC= 1
##$INTSCL= 5.30512e-09
##$ISEN= 30
##$LB= 1
##$LEV0= 0
##$LPBIN= 0
##$MAXI= 10000
##$MC2= 0
##$MEAN= 0
##$ME_mod= 0
##$MI= 50
##$NCOEF= 0
##$NC_proc= -5
##$NLEV= 6
##$NOISF1= 182.463
##$NOISF2= 159.3651
##$NSP= 0
##$NTH_PI= 0
##$NZP= 0
##$OFFSET= 182.463
##$PC= 4
##$PHC0= -425.4906
##$PHC1= 142.6004
##$PH_mod= 1
##$PKNL= yes
##$PPARMOD= 0
##$PSCAL= 0
##$PSIGN= 0
##$REVERSE= no
##$SF= 81.0140089999434
##$SI= 65536
##$SIGF1= 159.3651
##$SIGF2= -187.1042
##$SINO= 113.3802
##$SIOLD= 16384
##$SREGLST= <1H.CDCl3>
##$SSB= 0
##$STSI= 65536
##$STSR= 0
##$SW_p= 29940.119760479
##$SYMM= 0
##$S_DEV= 0
##$TDeff= 32768
##$TDoff= 0
##$TI= <>
##$TILT= no
##$TM1= 0
##$TM2= 0
##$TOPLEV= 0
##$USERP1= <user>
##$USERP2= <user>
##$USERP3= <user>
##$USERP4= <user>
##$USERP5= <user>
##$WDW= 1
##$XDIM= 65536
##$YMAX_p= 512041828
##$YMIN_p= -14049016
$$ End of Bruker specific parameters
$$ ---------------------------------
##NTUPLES= NMR SPECTRUM
##VAR_NAME=  FREQUENCY,     SPECTRUM/REAL,   SPECTRUM/IMAG
##SYMBOL=    X,             R,               I
##VAR_TYPE=  INDEPENDENT,   DEPENDENT,       DEPENDENT
##VAR_FORM=  AFFN,          ASDF,            ASDF
##VAR_DIM=   65536,         65536,           65536
##UNITS=     HZ,            ARBITRARY UNITS, ARBITRARY UNITS
##FACTOR=    0.456856943014862, 1,           1
##FIRST=     14782.0589164792, 0,            0
##LAST=      -15158.0608439998, 0,           0
##MIN=       -15158.0608439998, -14049016,   0
##MAX=       14782.0589164792, 512041828,    0
$$ Real data points
##PAGE= N=1
##DATA TABLE= (X++(R..R)), XYDATA
$$ [...]
43417b186762N3638N96677P93097N78329L81399J54354m76490j117716q79945
$$ -2186762 -2133124 -1536447 -743350 -165021 216378 370732 -105758 -1223474 -2103419
43408b103419J06088O18284R6202n95699n36989Q7077O15080Q03710O37538P4397
$$ -2103419 -1997331 -1379047 -1282845 -1878544 -2415533 -2328456 -1713376 -909666 -272128 -197731
43398a97731n36431n27242J33848O40770M73932j008l72916p31948r55506m57912
$$ -197731 -734162 -1261404 -1127556 -486786 -12854 -13862 -386778 -1118726 -2074232 -2532144
43388b532144O91686J354256Q31293o6100l28019k55236n98637r93569n78259
$$ -2532144 -1840458 -486202 345091 278991 -49028 -304264 -902901 -1896470 -2474729
43379b474729L46909O89872L55733K90010P68806R77691M75656j36189l35605
$$ -2474729 -2127820 -1437948 -1082215 -792205 -23399 954292 1429948 1293759 958154
43370I58154l95120n72733n54122j91453L3652j81962l76017m8400N92351J034204
$$ 958154 563034 -9699 -563821 -755274 -721622 -903584 -1279601 -1328001 -735650 298554
43360B98554J082114P39869O4767n31411m94073p112N2831n34507q61511l76126
$$ 298554 1380668 2120537 2185304 1653893 1159820 1152708 1205539 671032 -190479 -566605
43350e66605O6617m18729j075177m82961J136653J964718J061404l61998n91134
$$ -566605 -499988 -918717 -1993894 -2476855 -1340202 624516 1685920 1323922 732788
43341G32788M89365J480701J173349k91103j708548j972067j078226p2023J22658
$$ 732788 1222153 2702854 3876203 3585100 1876552 -95515 -1173741 -1245764 -1123106
43332a123106l08923n03916j00756M95204Q66061R87471Q89532N34095J24912
$$ -1123106 -1432029 -1935945 -2036701 -1541497 -675436 312035 1201567 1735662 1860574
43323A860574l8304j20437n56729j162815j135133k25929P54389J004134O77713
$$ 1860574 1822270 1701833 1145104 -17711 -1152844 -1378773 -624384 379750 1057463
43314A057463L15489k5363m49001o06045k03181K50950P2057m35355l42541L95497
$$ 1057463 1372952 1347589 898588 292543 89362 340312 412369 -22986 -365527 29970
43304B9970P27838N5842q22925q13686J535N92102L85934j48424k88147O3376
$$ 29970 757808 813650 -9275 -822961 -821426 -229324 156610 8186 -279961 -216585
43294b16585M40085M55665J34940k76065n56826n28183r3980N18617P64069L74808
$$ -216585 223500 679165 814105 538040 -18786 -546969 -640949 -122332 641737 1016545
43284A016545j53474j29836K86731K11965n89933j131549n23100O61534J071212
$$ 1016545 863071 733235 1019966 1231931 641998 -489551 -1012651 -351117 720095
43275G20095L46558n74086q31266n55205k89613j90278q0048J62062N19704Q26444
$$ 720095 1066653 492567 -338699 -893904 -1183517 -1373795 -1453843 -1291781 -772077 54367
43265E4367P34272P6245o73491p77272k16469J93754r9802o47751o75618j15944
$$ 54367 788639 864884 191393 -585879 -802348 -608594 -708396 -1356147 -2031765 -2147709
43255b147709M16905M33958J3803m08251m37932j8813N08348P38509O25018M02710
$$ -2147709 -1730804 -1296846 -1283043 -1691294 -2129226 -2148039 -1639691 -901182 -276164 126546
43245A26546J65228j41109l48040j68704K54066M01779J32096j25271j13199j46495
$$ 126546 291774 150665 -197375 -366079 -112013 289766 421862 296591 183392 36897
43235C6897m86887q45046q62134o18696l05137J36536O49294Q35363N57206K95783
$$ 36897 -449990 -1295036 -2157170 -2775866 -3081003 -2944467 -2295173 -1459810 -902604 -606821
43225f06821M07053M94465J05791l96854l60284J08673L48538J63217q1694j99998
$$ -606821 -199768 294697 400488 3634 -356650 -247977 100561 263778 182084 -17914
43215a7914k91714k28672K09002O88893N50395k13860q33079p81347l83695j96713
$$ -17914 -309628 -538300 -329298 359595 909990 696130 -136949 -918296 -1301991 -1498704
43205a498704k36998j02539L77601Q30966O83756j18746p88898m77529N25234
$$ -1498704 -1735702 -1838241 -1460640 -629674 54082 -64664 -853562 -1331091 -805857
43196h05857R49305K12374p49593q45788l02796p71j7068J48201M07893K99566
$$ -805857 143448 355822 -393771 -1239559 -1542355 -1543126 -1560194 -1411993 -1004100 -704534
43186g04534K1565R2202K44355j29341o74880n45182K6340Q6858k33314M0515
$$ -704534 -682969 -590767 -346412 -475753 -1150633 -1695815 -1669475 -1582617 -1815931 -1775416
43176a775416O70433L38530q13917r08873N84254J595772N85445r86298r99299
$$ -1775416 -1104983 -766453 -1580370 -2489243 -1904989 -309217 276228 -710070 -1709369
43167a709369J36744O11856K55502K37304N83361L09373l53697j25981R18759
$$ -1709369 -1572625 -960769 -705267 -467963 115398 424771 71074 -54907 863852
43158H63852J204997K11786p11041n89480j65418k67641l68984K47368J027572
$$ 863852 2068849 2280635 1569594 980114 814696 547055 178071 425439 1453011
43149A453011R33566J0585p25857n97273J25460O34615L07898o60993j275818
$$ 1453011 2386577 2397162 1671305 1074032 1199492 1834107 2142005 1481012 205194
43140B05194q38423L5911J88526l78440n06560L03014J122210J009317K45693
$$ 205194 -633229 -597318 -408792 -787232 -1293792 -990778 131432 1140749 1386442
43131A386442l35057m54856l19419j30349j22752m43546o50391r4594Q54293R11552
$$ 1386442 1051385 596529 277110 146761 24009 -419537 -1069928 -1164522 -310229 601323
43121F01323k58202j271436q99153J97755N83595J31650j76486j6804P222k84785
$$ 601323 343121 -928315 -1827468 -1629713 -1046118 -914468 -1090954 -1107758 -1100536 -1385321
43111a385321k47448M29667J070145Q80078p3463j002204j175049m85269M62767
$$ -1385321 -1632769 -1203102 -132957 747121 673658 -328546 -1503595 -1988864 -1526097
43102a526097Q56054N04046J7514n9541O5363q546j02054J23954L57584O5334
$$ -1526097 -670043 -165997 -148483 -208024 -142661 -151207 -253261 -129307 228277 293611
43092B93611m73130m67413O5338K39605k37584m95104J18887Q80314O78151l17411
$$ 293611 -179519 -646932 -581594 -341989 -579573 -1074677 -955790 -75476 602675 285264
43082B85264q50431l41149L70959K96895l25355m74250J35781O77530M63536p0167
$$ 285264 -565167 -906316 -535357 -238462 -563817 -1038067 -902286 -224756 238780 168613
43072A68613r8581L18450M01282q0445n08114m75785l39678l98354l14679J21920
$$ 168613 70032 388482 789764 709319 201205 -274580 -614258 -1012612 -1327291 -1205371
43062a205371L77321M0742k81715J64473R33541R19686O3706n47982l47114R28
$$ -1205371 -828050 -787308 -1069023 -904550 28991 948677 1012383 464401 117287 118215
43052A18215j62176m88992l84778J053J81148J66939K18015J51163l70528j039153
$$ 118215 -43961 -532953 -917731 -916678 -735530 -568591 -350576 -199413 -569941 -1609094
43042a609094j093911l55686M77156P09955M13044J13273O0196Q4983J7724o4039
$$ -1609094 -2703005 -3058691 -2581535 -1871580 -1458536 -1345263 -1285067 -1200084 -1182360 -1246399
43032a246399j8432J36059K66578K83724J74779j3855j23730N6375M86875P38214
$$ -1246399 -1264831 -1128772 -862194 -578470 -403691 -417546 -541276 -484901 1974 740188
43022G40188M43260j40059l65044m5962L19686L09005J01833r733j54670m73897
$$ 740188 1183448 1043389 678345 632383 952069 1261074 1362907 1353174 1198504 724607
43012G24607n98537j70681L67365K32682m99044q77680l89588L77367O47865M67711
$$ 724607 126070 -44611 322754 555436 56392 -821288 -1210876 -833509 -185644 282067
43002B82067L99989O20964P79088N64175M5131m92163q07703q51754p74631p35237
$$ 282067 682056 1303020 2082108 2646283 2691414 2199251 1391548 539794 -234837 -970074
42992i70074o81916m75759k09535j18012j16438K14343R84857J642354J548599
$$ -970074 -1651990 -2127749 -2337284 -2455296 -2571734 -2357391 -1372534 269820 1818419
42983A818419P35637j75283o81495p80726p36959p20887p01522n48156k11094
$$ 1818419 2554056 2378773 1697278 916552 179593 -541294 -1242816 -1790972 -2002066
42974b002066J61140L40140K81580J60807R9391J0460j83234l33756k40894M6872
$$ -2002066 -1840926 -1500786 -1219206 -1058399 -959008 -948548 -1131782 -1465538 -1706432 -1659560
42964a659560K81412L38769L35449L95612M35854K79687o2400l46073l67599j92931
$$ -1659560 -1378148 -1039379 -703930 -308318 127536 407223 344823 -1250 -368849 -561780
42954e61780k5973N6890Q4512J322k23787l29062J4529O04113P60652K37545l41932
$$ -561780 -587753 -530863 -446351 -445029 -668816 -997878 -983349 -379236 381416 618961 277029
42943B77029l37311K571P601l37574m38150q2981K83239L16013J89191J47168
$$ 277029 -60282 -57711 -50110 -387684 -825834 -908815 -625576 -309563 -120372 26796
42933B6796J73896K18509K44782m590o98846j289324r20981K73229J058810P19545
$$ 26796 200692 419201 663983 659393 -39453 -1328777 -2249758 -1976529 -917719 -198174
42923a98174M8855R9226O27129O54612R5761k39485j04056j67997p18794j011095
$$ -198174 -149319 -50093 577036 1231648 1327409 1087924 983868 815871 97077 -914018
42913i14018m38026L97956N11843l540j57031M06192Q45439L52820o55474j069705
$$ -914018 -1352044 -954088 -442245 -445785 -602816 -196624 648815 1001635 346161 -723544
42903g23544n13764L03027O02867L75007N0662j77050l57703m12381j91623J87941
$$ -723544 -1237308 -934281 -331414 43593 94255 -82795 -440498 -852879 -1044502 -856561
42893h56561M06712L27762J05026j9068J42070N85919R09009N13914o00324j520396
$$ -856561 -449849 -122087 -17061 -36129 105941 691860 1600869 2114783 1514459 -5937
42883e937j374875m13101L78722N22593L01082j2400l75635n08198r6309M48981
$$ -5937 -1380812 -1793913 -1415191 -892598 -591516 -603916 -979551 -1487749 -1584058 -1135077
42873a135077L57222j95845j56583O71080J042020R5473j198226j336796l18939
$$ -1135077 -777855 -973700 -1130283 -459203 582817 678290 -519936 -1856732 -2175671
42864b175671O18218P78192M88806J37259k31445m43538k38864J71138L00775
$$ -2175671 -1557453 -779261 -290455 -153196 -384641 -828179 -1067043 -895905 -595130
42855e95130J44110R7105K01223J38376p4906q4560J14513J65585M0414O9641
$$ -595130 -451020 -353915 -152692 -14316 -89222 -173782 -59269 106316 146730 216371
42845B16371K49097K12003k4995j2046K67127J99113m88077j181727j185509n75941
$$ 216371 465468 677471 652476 640430 907557 1106670 618593 -563134 -1748643 -2324584
42835b324584Q9597M89651O08393M59856J36531q5742q075K37801L61119K19388
$$ -2324584 -2234987 -1745336 -1136943 -677087 -540556 -626298 -634373 -396572 -35453 183935
42825A83935j01011l45770k44331J83957N35329M99250L09379L51710M69601J74542
$$ 183935 82924 -262846 -507177 -323220 212109 711359 1020738 1372448 1842049 2016591
42815B016591n10053j000231r82610p01961l50144J57824O14136M60081l02629
$$ 2016591 1506538 506307 -476303 -1178264 -1528408 -1370584 -756448 -296367 -598996
42806e98996p76432k85139O41710R78318N46799L4225j23230k05766n19397q01998
$$ -598996 -1375428 -1660567 -1018857 -40539 506260 540485 417255 211489 -307908 -1109906
42796a109906n96328N3305N72403N04754R114l82939l91299j67234J02552M16553
$$ -1109906 -1706234 -1652929 -1080526 -575772 -566658 -949597 -1340896 -1508130 -1405578 -989025
42786i89025O61583N19059j6980m18443l39747j58060k61982k51443L69512J067442
$$ -989025 -327442 191617 174637 -243806 -583553 -741613 -1003595 -1255038 -885526 181916
42776A81916Q76994r307l95185N8790L16593l05595j030943r00121k13750J19154
$$ 181916 1058910 1049603 654418 713208 1029801 724206 -306737 -1206858 -1420608 -1301454
42766a301454j9840m6618L02967P62900J012341Q17090P3783q27249j129322o30632
$$ -1301454 -1321294 -1367912 -1064945 -302045 710296 1527386 1601169 773920 -355402 -986034
42756i86034J4032K63543K94008K57183j45704p31530n09641P67541J697926J085536
$$ -986034 -972002 -708459 -414451 -157268 -302972 -1034502 -1544143 -776602 921324 2006860
42746B006860j32461k49662N87902P99057K3240m80753r8075L21941L05660P28288
$$ 2006860 1874399 1624737 2212639 3011696 3034936 2554183 2456108 2778049 3083709 3811997
42736C811997K218478L920334M602478L912942J967275j018614l894559m724262
$$ 3811997 6030475 9950809 14553287 18466229 20433504 19414890 15520331 10796069
42728A0796069l004165p97447l84290j475411k015073j156045k059L53254R9273
$$ 10796069 7791904 6994457 6610167 5134756 3119683 1963638 1961579 2314833 2414106
42719B414106r1549N1619N84041J436576J994635J451422K177j040582q16519
$$ 2414106 2322557 2374176 2958217 4394793 6389428 7840850 7843027 6802445 5985926
42710E985926k1254R3954o38036j294953j243239q17334n39967k54630N29002
$$ 5985926 5964672 6058626 5420590 4125637 2882398 2065064 1525097 1270467 1799469
42701A799469J624174K029324J063878o20755j605273j290436m83862k26780n09381
$$ 1799469 3423643 5452967 6516845 5896090 4290817 3000381 2516519 2289739 1780358
42692A780358n94157k65188o1829k69272l60892K10798J096641J397065P89989
$$ 1780358 1186201 921013 859184 589912 229020 439818 1536459 2933524 3723513
42683C723513j02954n38588n30779o83947j264499j731033j346008j22751J082163
$$ 3723513 3620559 3081971 2551192 1867245 602746 -1128287 -2474295 -2597046 -1514883
42674a514883J455085J004347L71737P2001R4549J15830j16227n57863q59954
$$ -1514883 -59798 944549 1316286 1388287 1482836 1598666 1482439 924576 64622
42665F4622o53782k4669M08076J62319m07630m54354K31243Q37504N74211k24883
$$ 64622 -589160 -613829 -205753 -43434 -451064 -905418 -674175 163329 737540 512657
42655E12657n30321l7710M30827J32097n21314n49208K39587J053444J197102
$$ 512657 -17664 -55374 375453 507550 -13764 -562972 -323385 730059 1927161
42646A927161P63377J73350l80093p72394p75843m72389m13777q63548j213943
$$ 1927161 2690538 2863888 2483795 1711401 935558 463169 49392 -814156 -2028099
42637b028099p41970K90509R38172Q45257N34774M48851M21975K37585K4582j35569
$$ -2028099 -2770069 -2479560 -1541388 -696131 -161357 287494 709469 947054 971636 836067
42627H36067l86109o22427m47623J01399M04203J94871K397J99693L02920j47379
$$ 836067 449958 -172469 -620092 -518693 -114490 80381 82778 282471 585391 438012
42617D38012o58367n61628j84318k65881n81447k74311N72709Q93938L14872k78784
$$ 438012 -220355 -781983 -966301 -1232182 -1813629 -2087940 -1515231 -621293 -306421 -585205
42607e85205k21423l2896k81341m42950J88915J108121J164674K57874n27160
$$ -585205 -806628 -839524 -1120865 -1563815 -1374900 -266779 897895 1155769 628609
42598F28609m74193n4563J2540k30936l31990k49332k52267k51617J30869P49950
$$ 628609 154416 99853 112393 -118543 -450533 -699865 -952132 -1203749 -1072880 -322930
42588c22930P74302k33395j397559j349389q388J150780R81154J48634J2242N39147
$$ -322930 451372 217977 -1179582 -2528971 -2537359 -1386579 -405425 -256791 -244549 294598
42578B94598M61750n76564j330103q35789J77134N55835M34926N99150Q53294
$$ 294598 756348 179784 -1150319 -1986108 -1808974 -1253139 -818213 -219063 634231
42569F34231L73240o19448r32283k48244L59522R7624m68944n10324j39413J05762
$$ 634231 1007471 388023 -544260 -792504 -432982 -335358 -804302 -1314626 -1454039 -1348277
42559a348277J79469K21096r72n82418r45596n56148K46593Q16033J126178J386102
$$ -1348277 -1168808 -947712 -948684 -1531102 -2476698 -3032846 -2786253 -1970220 -844042 542060
42549E42060J238845L19605p19036q21610p3839L91442M1891n05076o64300n73601
$$ 542060 1780905 2100510 1381474 559864 486025 877467 919358 414282 -250018 -823619
42539h23619l88063O9982N94388N34528p5418k93255K66209P17997L47791k28773
$$ -823619 -1211682 -1141700 -547312 -12784 -88202 -381457 -115248 602749 950540 721767
42529G21767k43810j46820o13584r95455k48481J030356J118062k75692j465702
$$ 721767 477957 331137 -282447 -1277902 -1526383 -496027 622035 346343 -1119359
42520a119359j128038J08116Q88983Q47645M79820K09782K23413N37942P04877
$$ -1119359 -2247397 -2139281 -1250298 -402653 77167 286949 510362 1048304 1753181
42511A753181J10423r66310j361810o39704J42969J3967m04297J4788R42580J000825
$$ 1753181 1863604 897294 -464516 -1104220 -961251 -947284 -1351581 -1336793 -394213 606612
42501F06612j01327j096110r72888k15145J47668p0068k54816N5683O91228J089382
$$ 606612 505285 -590825 -1563713 -1778858 -1631190 -1701258 -1956074 -1900391 -1209163 -119781
42491a19781Q24659Q7273l74807q1410N13920O06275J56399j77183j68587k97339
$$ -119781 704878 792151 417344 335934 849854 1456129 1612528 1435345 1266758 969419
42481I69419p10819p66512j04976N32087K73639n53917q63498l40170K52039K74467
$$ 969419 258600 -507912 -612888 -80801 192838 -361079 -1224577 -1564747 -1312708 -1038241
42471a038241j3383p1014J30353K63087K05883J02618N6716L4690j8693j20507
$$ -1038241 -1051624 -1122638 -992285 -729198 -523315 -420697 -363981 -329291 -347984 -468491
42461d68491k25377k07943k874K28604K76984K20478K70063K58624k29975j005601
$$ -468491 -693868 -901811 -904685 -676081 -399097 -178619 91444 350068 120093 -885508
42451h85508j111854n2707J240235J409818M54466l28548j99265J63537j4883
$$ -885508 -1997362 -2050069 -809834 599984 1054450 725902 526637 690174 675291
42442F75291l56003j19643M44852N00797L2814j65344J31320K07638l41992q72947
$$ 675291 319288 199645 644497 1145294 1178108 1012764 1144084 1351722 1009730 136783
42432A36783p01236j99447k11711p21713q11611M2922J168891J443761O37838
$$ 136783 -564453 -763900 -975611 -1697324 -2508935 -2466013 -1297122 146639 784477
42423G84477k93861l63619K23454L85298k89657r14274o01407K21859N42293L36407
$$ 784477 490616 126997 350451 735749 446092 -468182 -1069589 -847730 -305437 30970
42413C0970L83088P24017N55342k38735p41582n60520m12140n73314j70009J032318
$$ 30970 414058 1138075 1693417 1454682 713100 152580 -259560 -832874 -1002883 29435
42403B9435J547277L18989j195193q97410P46047J364927K04762j080017j193781
$$ 29435 1576712 1895701 700508 -196902 549145 1914072 2118834 1038817 -154964
42394a54964o92595k90532L23638J155377J168940j778j054083r00554k79683
$$ -154964 -847559 -1138091 -814453 340924 1509864 1508086 454003 -446551 -726234
42385g26234k71973m49206N8922P30297N45572o6876N7680O64878M52624n98367
$$ -726234 -998207 -1447413 -1388491 -658194 -112622 -179498 -121818 543060 995684 397317
42375C97317j069003m01042L27089K90646N5882K46558M06072l6895o79475p96834
$$ 397317 -671686 -1072728 -745639 -454993 -399111 -152553 253519 216624 -462851 -1259685
42365a259685l60060J91774N63562N60069J04692l47391j53199M68427N98108
$$ -1259685 -1619745 -1427971 -864409 -304340 -199648 -547039 -700238 -231811 366297
42356C66297J15191m8901L96405M33711m52579j101860m77834N00837L99556l69606
$$ 366297 481488 432587 828992 1262703 810124 -291736 -769570 -268733 130823 -238783
42346b38783l47564M00675M41000m54582q50644q1662O63354L65582k73958k36455
$$ -238783 -586347 -185672 255328 -199254 -1049898 -1131560 -468206 -102624 -376582 -613037
42336f13037J47759M0639l57938k78054K43896N49790M94694M14453K75636k09136
$$ -613037 -465278 -424639 -782577 -1060631 -816735 -266945 227749 642202 917838 708702
42326G08702q00031r04620m50967J02090M98796P69534P50074K60447l11577l49669
$$ 708702 -91329 -995949 -1446916 -1344826 -846030 -76496 673578 934025 622448 272779
42316B72779N3860K00686j22930l69540j85858M8784r1736m39851o10077n63276
$$ 272779 326639 527325 404395 34855 -151003 -102219 -193955 -633806 -1243883 -1807159
42306a807159m75609l93418k93302k10649j12269J07757L93208N60864O06941
$$ -1807159 -2282768 -2676186 -2969488 -3180137 -3292406 -3184649 -2791441 -2230577 -1623636
42297a623636O38972N27536J02814l07216j64139L49058M16464j31970m41684
$$ -1623636 -984664 -457128 -354314 -661530 -825669 -476611 -60147 -192117 -633801
42288f33801n573M20879L7686n87979l68481N06143Q29278L09117k7775M03464
$$ -633801 -639374 -218495 -180809 -768788 -1137269 -631126 198152 507269 479494 882958
42278H82958P82252K77047n63845o76809j09765J73482j79835n14198k94987J68770
$$ 882958 1665210 1942257 1378412 701603 591838 765320 585485 71287 -223700 -54930
42268e4930L38817J72523o0614k34417l21916k36214l0410P165k41062m52229
$$ -54930 283887 456410 395796 161379 -160537 -396751 -427161 -419996 -661058 -1113287
42258a113287l09264M389J13679N8641J58802L99986M51681K62890J20257P4169
$$ -1113287 -1422551 -1418162 -1304483 -1245842 -1087040 -687054 -235373 27517 147774 221943
42248B21943j25953l93625k33984L91077P43972L28123l04242l43047J14437L56987
$$ 221943 95990 -297635 -531619 -140542 603430 931553 627311 284264 398701 755688
42238G55688J79458l8985j61639m01429o66272n71335j57403R4693L5419k4316
$$ 755688 935146 896161 734522 333093 -333179 -904514 -1061917 -967224 -931805 -956121
42228i56121M465j17599l19104k30759N5115M7168j74298M4101O94474Q46615
$$ -956121 -951656 -1069255 -1388359 -1619118 -1564003 -1516835 -1691133 -1647032 -952558 -105943
42218a05943O6863q30255r91564n92392j13455M75458J064660R45193j3363o36626
$$ -105943 -39080 -869335 -1860899 -2453291 -2566746 -2091288 -1026628 -81435 -94798 -731424
42208g31424o0163P38332L70103o78467p76768K25352Q33079L54604j91210L2533
$$ -731424 -791587 -53255 316848 -361619 -1138387 -913035 -79956 274648 83438 115971
42198A15971M16206J72774l72732n29477l36638j81613n9480J37566K02870M2387
$$ 115971 532177 704951 332219 -197258 -533896 -715509 -774989 -637423 -434553 -392166
42188c92166k5136J49201K11420l7226k27773r0430M0790j61247m33732l98714
$$ -392166 -417302 -268101 -56681 -93907 -321680 -412110 -371320 -532567 -966299 -1365013
42178a365013j39309R7143K83625L33505k2741o57305q69010k73845N58004Q02549
$$ -1365013 -1504322 -1407179 -1123554 -790049 -812790 -1470095 -2339105 -2612950 -2054946 -1252397
42168a252397L47872k97206o58005n35537j8945M47757M36583J68896K47123O23482
$$ -1252397 -904525 -1201731 -1859736 -2395273 -2414218 -1966461 -1529878 -1360982 -1113859 -490377
42158d90377N77260n5160n19659l94612k30794l99848l51108K03574M14944l19721
$$ -490377 86883 31723 -487936 -882548 -1113342 -1513190 -1864298 -1660724 -1245780 -1565501
42148a565501r99065l57034J070736J624654Q94915J3232k61785l41067o00796
$$ -1565501 -2564566 -2921600 -1850864 -226210 668705 681937 420152 79085 -521711
42139e21711p01350m41029k06135j69137N7737N69478P78926L29436k69322l72743
$$ -521711 -1223061 -1664090 -1870225 -2039362 -1981625 -1412147 -633221 -303785 -573107 -945850
42129i45850m9428K08072K06765J20912J19340J92381J87679n0658m05529m60768
$$ -945850 -995278 -787206 -580441 -459529 -340189 -147808 39871 -10787 -416316 -877084
42119h77084m5119L81574K93639j48610l97366l35246j94152J04054P40659J237294
$$ -877084 -922203 -540629 -246990 -395600 -792966 -1128212 -1322364 -1218310 -477651 759643
42109G59643Q00282m27831j270325r53337P809O28530N65293J13821l60326o26980
$$ 759643 1559925 1132094 -138231 -1091568 -1083759 -455229 110064 223885 -136441 -763421
42099g63421n89608l64443j58778j9540N9033o9294l76089l37398M35211J369898
$$ -763421 -1353029 -1717472 -1876250 -1895790 -1836757 -1906051 -2282140 -2619538 -2184327 -814429
42089h14429J464457O15966l04307o76474o26425l11342L09063Q20713N09974
$$ -814429 650028 1265994 961687 285213 -341212 -652554 -343491 477222 987196
42080I87196m47877r10710l67960K92652K03959j98151j05144K26932j2605o93526
$$ 987196 539319 -371391 -739351 -446699 -242740 -440891 -546035 -319103 -331708 -1025234
42070a025234q19163k8878Q36524Q55216J53940l57039j37727L51762K77277l90814
$$ -1025234 -1844397 -1873275 -1036751 -181535 -27595 -384634 -522361 -170599 106678 -284136
42060b84136p14336q6518P76505Q08066J81826m1036L17834L39537l13969p99990
$$ -284136 -998472 -1084990 -308485 499581 681407 640371 958205 1297742 983773 183783
42050A83783n87153k79168l23540j53173N29464Q21595Q8611o99032m13128L36280
$$ 183783 -403370 -682538 -1006078 -1159251 -629787 191808 280419 -418613 -831741 -495461
42040d95461K46822m17381l04737O21676R16902l4538j135974j342272r02929
$$ -495461 -248639 -666020 -970757 -349081 567821 533283 -602691 -1944963 -2847892
42031b847892l59082M10783J415801J857549J118885j61011p97867n04952j0570
$$ -2847892 -3206974 -2796191 -1380390 477159 1596044 1435033 637166 132214 121644
42022A21644L2511k72922m26906k26582N830j11476l79686j71755N54454Q66770
$$ 121644 154155 -118767 -545673 -772255 -766425 -877901 -1257587 -1429342 -874888 -8118
42012h118O0323j123876j307378l43315N42651N19071R9645P2019L80860N46594
$$ -8118 52205 -1071671 -2379049 -2722364 -2179713 -1660642 -1560997 -1488978 -1108118 -561524
42002e61524M77058L25016P8809k11770k54890M918J65346K4178j8110L27650
$$ -561524 -84466 240550 319359 107589 -147301 -142383 22963 47141 29031 356681
41992C56681O02072K50305m56969p78058n33707j85493m8425k8510p0862k64387
$$ 356681 958753 1209058 752089 -25969 -559676 -745169 -793594 -822104 -892966 -1157353
41982a157353m42802k33957L06916N60531J33284m95466m48908M95695J575899
$$ -1157353 -1600155 -1834112 -1527196 -966665 -833381 -1328847 -1777755 -1282060 293839
41973B93839J820777J046349j5238n54030n08156m32153o53625q56725o03718
$$ 293839 2114616 3160965 3145727 2591697 2083541 1651388 997763 141038 -462680
41964d62680m315L94994K79691j29360m13922l62553j1363M72629Q17690P42725
$$ -462680 -466995 -72001 207690 78330 -335592 -698145 -709508 -236879 580811 1323536
41954A323536K33869l48081o20168n86799n12569m75893l63473k76083m59247
$$ 1323536 1557405 1209324 589156 2357 -510212 -986105 -1349578 -1625661 -2084908
41945b084908o74707k31517R03219J587286Q76968m47766p52750J43875P23133
$$ -2084908 -2759615 -2991132 -2087913 -500627 376341 -71425 -824175 -680300 42833
41936D2833R1117p04643m05368N12990P25540J25557k84877j61900j35588m35240
$$ 42833 133950 -570693 -976061 -463071 262469 388026 103149 -58751 -194339 -629579
41926f29579m81750n6258K55791J54403J60598N76195P93141K70675m95513o71435
$$ -629579 -1111329 -1167587 -911796 -757393 -596795 -20600 772541 1043216 547703 -123732
41916a23732k48686J50590K43207K06557J10277j20359l01447j33731K58700L86050
$$ -123732 -372418 -221828 21379 227936 338213 217854 -83593 -217324 41376 427426
41906D27426J7948n72756r52769q16431n3423J050270J722335J319780J78359
$$ 427426 445374 -127382 -1080151 -1896582 -1950005 -899735 822600 2142380 2320739
41897B320739n92424m12146O6777p2844p02749r12478m26606K9114l8419j13877
$$ 2320739 1728315 1316169 1382946 1310102 607353 -305125 -731731 -702617 -741036 -854913
41887h54913L12245O75536K10206n63519m17804N93250J024449K26820o50754
$$ -854913 -542668 132868 343074 -220445 -638249 -44999 979450 1206270 555516
41878E55516n21728k9400l14212j055058j049952j95338M64596M28867K24757
$$ 555516 33788 4388 -309824 -1364882 -2414834 -2610172 -2145576 -1716709 -1491952
41869a491952K49611K76602K00119K60027M02600L18821J72621L79731O57827
$$ -1491952 -1242341 -965739 -765620 -505593 -102993 215828 388449 768180 1426007
41860A426007L13963m68264p36798l17735q5005m08327n46919m2831M66212M26767
$$ 1426007 1739970 1271706 534908 217173 132168 -276159 -823078 -865909 -399697 27070
41850B7070K53378L43578K76442k07800m45302J0669M18835N3928m63766k13687
$$ 27070 280448 624026 900468 692668 247366 258035 676870 730798 267032 53345
41840E3345L65250J95069n29052n73649L11587R58115N54616k68196n15281j37517
$$ 53345 418595 613664 84612 -489037 -177450 780665 1335281 1067085 551804 414287
41830D14287K14395J89845J8805L2696K17475K44781o8456l77765j48072N57082
$$ 414287 628682 818527 837332 870028 1087503 1332284 1263828 886063 737991 1295073
41820A295073J020102Q03791L08925J32522L38253O68390R32897Q06244j17349
$$ 1295073 2315175 3118966 3427891 3560413 3898666 4567056 5499953 6306197 6188848
41811F188848j502538k130334j308368N9688N65933L7638n80680o70714l97185
$$ 6188848 4686310 2555976 1247608 1307296 1873229 1910867 1330187 659473 262288
41802B62288j5676L72414M94827J26358m22835o47815n17207k71647Q3974M56590
$$ 262288 246612 619026 1113853 1240211 817376 169561 -347646 -619293 -535319 -78729
41792g8729L30842m04438q03756q8840R08983P90549j95097m27438N57781J325616
$$ -78729 252113 -152325 -956081 -1044921 -135938 654611 459514 32076 589857 1915473
41782A915473P34196m78060r68990n78267n4988J88636K50104J97255L9771q8069
$$ 1915473 2649669 2171609 1202619 624352 569364 758000 1008104 1205359 1245130 1157061
41772A157061j58886l40101n69996m67188O9039N94783O90716L87580r7767n45054
$$ 1157061 998175 658074 88078 -379110 -310071 284712 975428 1363008 1265241 720187
41762G20187n69112O9042Q18261P24725k41502r49434n82777L04093O66680L14310
$$ 720187 151075 220117 1038378 1763103 1521601 572167 -10610 293483 960163 1274473
41752A274473j70352m00639m97263o54718q11685o80148k7541Q51970J101419
$$ 1274473 1104121 703482 206219 -448499 -1260184 -1940332 -1967873 -1115903 -14484
41743a4484K78921p57084p43942J94594O52619N8012m67309O5057R36144R09096
$$ -14484 264437 -492647 -1236589 -1041995 -389376 -331364 -798673 -733616 202528 1111624
41733A111624J39238k44200M0241J86151k84796q77653r59309m89357J78192O60541
$$ 1111624 1250862 1006662 1046903 1233054 948258 70605 -888704 -1378061 -1199869 -539328
41723e39328O70444K51562r5467P4156N38678O80209L05623j68215l07235j03818
$$ -539328 131116 382678 287211 361367 900045 1580254 1885877 1717662 1410427 1306609
41713A306609J63764K53599J21014j17725l91988p73679j160069j044545j41580
$$ 1306609 1470373 1723972 1844986 1727261 1335273 561594 -598475 -1643020 -1784600
41704a784600Q24690P51771k20386o21404L13197J402054J135153j78439r44291
$$ -1784600 -959910 -208139 -428525 -1049929 -736732 665322 1800475 1622036 677745
41695F77745n51042P0476R8414j08803P9758M60474L79108k05804n92583k37258
$$ 677745 126703 197179 295593 186790 266548 727022 1106130 900326 307743 70485
41685G0485M98124O62754j63611j221364j360151m48822M80336O05538K38504
$$ 70485 568609 1231363 1067752 -153612 -1513763 -1962585 -1482249 -876711 -638207
41676f38207Q2539K08391K77269K42460K25823J32858k6713J01954N23775N10135
$$ -638207 -555668 -347277 -70008 172452 398275 531133 504420 606374 1130149 1640284
41666A640284l04545r98250n45456N04228P29807k038m07657J31646P20879N58464
$$ 1640284 1335739 337489 -207967 296261 1026068 1024030 616373 748019 1468898 2027362
41656B027362J36141J79668M23180K67218r8402j07251J44014R0681l58559p69571
$$ 2027362 2163503 2343171 2766351 3033569 2935167 2827916 2971930 3062611 2704052 1934481
41646A934481q72680p24603l69128J17930M05143K63058K8689J86732N79740O20994
$$ 1934481 1061801 337198 -31930 86000 491143 754201 782890 969622 1549362 2170356
41636B170356L02919L34826J023137J587630J089959k65937j313653j321837o88825
$$ 2170356 2473275 2808101 3831238 5418868 6508827 6242890 4929237 3607400 2918575
41627B918575j76592L590M6557l3126l07389m89046j86079M06114O05505J33713
$$ 2918575 2741983 2745573 2792130 2759004 2451615 1962569 1776490 2182604 2788109 2921822
41617B921822n55392r31597q94155n15442J55627P98553Q72056K86645m15253
$$ 2921822 2366430 1434833 540678 25236 180863 979416 1851472 2138117 1722864
41608A722864p91675q89547o94337N3393J059497J313087M26027n66447n79187
$$ 1722864 931189 41642 -652695 -599302 460195 1773282 2199309 1632862 1053675
41599A053675k5537j9146n62085o88766j27693L70551L09633j7990k94944n03311
$$ 1053675 1028138 1008992 446907 -241859 -369552 999 310632 292642 -2302 -505613
41589e05613m69623l3491L43859J23192k18660K32704J161325J244846K40512
$$ -505613 -975236 -1008727 -664868 -541676 -760336 -527632 633693 1878539 2119051
41580B119051n53509l46903N7864j00195k30336K99128P78668L37809m30054l81260
$$ 2119051 1565542 1218639 1276503 1176308 945972 1245100 2023768 2361577 1931523 1550263
41570A550263K87552M34946j31647m94735k08921J87216K80588L18083M62305
$$ 1550263 1837815 2272761 2141114 1646379 1437458 1624674 1905262 2223345 2685650
41561B685650M43671K10562J66326M81742P78823P33079M70180J85496j19997
$$ 2685650 3129321 3339883 3506209 3987951 4766774 5499853 5970033 6155529 6035532
41552F035532l38090j91253K71122N37851L01210n6861L3891N32507Q02216L91197
$$ 6035532 5697442 5506189 5777311 6315162 6616372 6559511 6593402 7125909 7928125 8319322
41542H319322m35211j027265j088895q98942p85907o65339l47740n6336j65396
$$ 8319322 7884111 6856846 5767951 4869009 4083102 3417763 3070023 3013687 2848291
41533B848291n12205n36746j60608P9137o9639j94638k4198O8386j96987m12001
$$ 2848291 2336086 1799340 1638732 1717869 1648230 1453592 1429394 1497780 1300793 888792
41523H88792j95928O3705j45252n56014n89257l20701k07322j76617J69717O49583
$$ 888792 692864 756569 611317 55303 -533954 -854655 -1061977 -1238594 -1068877 -419294
41513d19294O55613J51234k66779k82741j19750Q6161M23830O98762N35558P4925
$$ -419294 236319 387553 120774 -161967 -281717 -195556 228274 927036 1462594 1537519
41503A537519j38753n4645j65891n34656n65274l2440M22367K57731j24449k4688
$$ 1537519 1398766 1344121 1178230 643574 78300 45860 468227 725958 601509 576821
41493E76821M96644P28826K53281o08103j165925r73020j95253N20093O81531
$$ 576821 1073465 1802291 2055572 1447469 281544 -691476 -886729 -366636 314895
41484C14895M32463K08853J14950K5868P7584M33034O82405K52127n35459o58136
$$ 314895 747358 956211 1071161 1097029 1174613 1607647 2290052 2542179 2006720 1348584
41474A348584R4863O43510J23833q34545r82146j33067O97457O38672q3082n27647
$$ 1348584 1443447 2086957 2210790 1376245 394099 261032 958489 1597161 1514079 986432
41464I86432j25053O34729O74953k98187j185933q39728K51317N69707j83843
$$ 986432 861379 1496108 2171061 1872874 686941 -152787 98530 668237 484394
41455D84394o90882j77035L91763L8922n62833l05426M80361P05647L34015Q6489
$$ 484394 -206488 -383523 8240 47162 -515671 -821097 -340736 364911 698926 785415
41445G85415p2262n86314q70127N055J302990J229737j62595o65516P12319J958658
$$ 785415 713153 126839 -743288 -738233 564757 1794494 1631899 966383 1678702 3637360
41435C637360R94055j134606j797083n74652M82343Q9946p37743p23352k08557
$$ 3637360 4631415 3496809 1699726 1125074 1607417 1697363 959620 236268 27711
41426B7711j42951l66143l5046Q07281J189323O45009j76376m95593l39618j74032
$$ 27711 -115240 -481383 -516429 290852 1480175 2125184 1948808 1453215 1113597 939565
41416I39565j03403O7064K49953J45539j45793j71488Q6192Q8954k85976l26405
$$ 939565 836162 903226 1153179 1298718 1152925 981437 1067629 1156583 870607 544202
41406E44202L61179Q91314K39471j011980j240962j04491R37224P51983P6j73725
$$ 544202 905381 1796695 2036166 1024186 -216776 -321267 615957 1367940 1368016 1194291
41396A194291J65012K78474J42259K07285L66225K59007J67173M90118P14824
$$ 1194291 1359303 1637777 1780036 1987321 2353546 2612553 2779726 3269844 3984668
41387C984668J36822o67230m74091N48890R42053K81435j67000L52697P94140
$$ 3984668 4121490 3454260 2980169 3529059 4471112 4752547 4585547 4938244 5732384
41378E732384J40635q30664q52028j93449p824l90123n29948l18791l44850n30359
$$ 5732384 5873019 5042355 4190327 3996878 3989054 3598931 3068983 2750192 2405342 1874983
41368A874983k22173L89808L57479l61529o87597k08380J31181l24780q33576
$$ 1874983 1652810 2042618 2400097 2038568 1350971 1142591 1273772 948992 115416
41359A15416n54623R4035K83889J03593M9515o2914n63057q80263k87123O37249
$$ 115416 -439207 -345172 -61283 42310 91825 28911 -534146 -1414409 -1701532 -1064283
41349a064283N96988m16147r99362m28870L60196L59531n4563J8068N61916R56614
$$ -1064283 -467295 -883442 -1882804 -2311674 -1951478 -1591947 -1646510 -1628442 -1066526 -109912
41339a09912J092587J208810J038977J62530r55568j304273p63222k41210j96999
$$ -109912 982675 2191485 3230462 3392992 2437424 1133151 369929 128719 -68280
41330f8280k8126O28927R86088L02075p44127r14902k45586R0551l66402p72413
$$ -68280 -96406 532521 1518609 1820684 1076557 161655 -83931 6620 -359782 -1132195
41320a132195m31905J98177M08152K76973K18053J85453J7996P817L73718O24790
$$ -1132195 -1564100 -1365923 -957771 -680798 -462745 -277292 -259296 -251479 122239 747029
41310G47029K71632j88164O8683P44194O76827l89053j320211j203389n16503
$$ 747029 1018661 830497 899180 1643374 2320201 1931148 610937 -592452 -1108955
41301a108955j63407j21626J89951O96484P01575L6202n68707m45212J43835L93943
$$ -1108955 -1272362 -1393988 -1204037 -507553 194022 230224 -338483 -783695 -639860 -245917
41291b45917J7714l85100r7956P30649J161075O22301l15044o68020l18026l3630
$$ -245917 -228203 -613303 -711259 19390 1180465 1802766 1487722 819702 501676 468046
41281D68046k66247n36743k24212N40860J099283J041981M68351k72877q25018
$$ 468046 201799 -334944 -559156 -18296 1080987 2122968 2591319 2318442 1493424
41272A493424r81482q04238m84831q6041L49494N24158J65157m04670n02120j6859
$$ 1493424 511942 -292296 -777127 -863168 -513674 10484 175641 -229029 -731149 -748008
41262g48008M12079L20609j7733j56012m5654J78575M04203L27247k75792q26501
$$ -748008 -335929 -15320 -33053 -189065 -234719 -56144 348059 675306 399514 -426987
41252d26987l65896Q96200J444840N34007o17020o30693N989j7274n77583m87756
$$ -426987 -792883 103317 1548157 2082164 1465144 834451 840440 823166 245583 -242173
41242b42173L00469N75586l3188m50416O923O09066N77214K44819J79802J70717
$$ -242173 58296 633882 600694 150278 157201 766267 1343481 1588300 1768102 1938819
41232A938819j42051m17010j77434L19382M44900N4065m78128p06011l27239N60780
$$ 1938819 1796768 1379758 1202324 1521706 1966606 2020671 1542543 836532 509293 1070073
41222A070073J207628Q44048j87658o65607j44009M58715L21623j77896m21318
$$ 1070073 2277701 3121749 2934091 2268484 2124475 2583190 2904813 2726917 2305599
41213B305599o24254j088266j242236n17980M44799O22176J92928J24544M79953
$$ 2305599 1681345 593079 -649157 -1167137 -722338 -100162 92766 217310 697263
41204F97263M05850k42293n23885Q9629Q95192J030371N46015J7802k25558j08890
$$ 697263 1103113 860820 336935 426564 1321756 2352127 2898142 2915944 2690386 2581496
41194B581496L47819Q03812P18354O5716m91284m50080p8234J18400J08191J55865
$$ 2581496 2929315 3733127 4451481 4517197 4025913 3575833 3497599 3615999 3724190 3880055
41184C880055L04345M51438O90677J157972J654242J767358J374058Q36832O95134
$$ 3880055 4184400 4635838 5326515 6484487 8138729 9906087 11280145 12116977 12812111
41175A2812111J196758K040535K570318K359490J595373P57101O1180m74305n84117
$$ 12812111 14008869 16049404 18619722 20979212 22574585 23331686 23392866 22918561 22334444
41166B2334444Q0765J285983K253433K558963K483547K224180J348689m44221
$$ 22334444 22415209 23701192 25954625 28513588 30997135 33221315 34570004 34125783
41158C4125783k435341l410791k965011j788821p56907k06787o0406j28411j90914
$$ 34125783 31690442 28279651 25314640 23525819 22768912 22562125 22501719 22373308 22182394
41149B2182394j88928m44533j308453k470933l044394k568134j573871q62557
$$ 22182394 21993466 21548933 20240480 17769547 14725153 12157019 10583148 9720591
41141I720591n63091l20703j21126k84772o61412n48271K43001Q11134K90748
$$ 9720591 9157500 8836797 8715671 8430899 7769487 7221216 7464217 8275351 8566099
41132H566099p44630q16060M54598J692595J556484M80673j16799J06041J96143
$$ 8566099 7821469 7005409 7460007 9152602 10709086 11189759 11072960 11179001 11375144
41123A1375144l23577o46086r4901O62863O33857k21m10324o41334j356301k222500
$$ 11375144 11051567 10405481 10310580 10973443 11607300 11607079 11196755 10555421 9199120 6976620
41113F976620j980166m85210O34688J61609r21369q99185J64955P08127J16005
$$ 6976620 4996454 4511244 5145932 5307541 4386172 3486987 3651942 4360069 4476074
41104D476074n37012l53502Q5572j16885o77373o54904M1590N26931K15997m17177
$$ 4476074 3939062 3585560 3671132 3554247 2876874 2221970 2263560 2790491 3006488 2589311
41094B589311m90424K10491R77317R45403N9353q42000j013657o53192m20378
$$ 2589311 2098887 2309378 3286695 4232098 4291451 3449451 2435794 1782602 1362224
41085A362224l42411J37178R82803J241943L38172q96536j120852j56940Q20501
$$ 1362224 1019813 1156991 2139794 3381737 3719909 2823373 1702521 1545581 2366082
41076B366082P44820j22133n80958M5517J033587J054987j24406j213349j054008
$$ 2366082 3110902 2988769 2407811 2453328 3486915 4541902 4417496 3204147 2150139
41067B150139j69667J40244k05994j88537L77168N13169p3267l86377K4716J99581
$$ 2150139 1980472 2120716 1914722 1726185 2103353 2616522 2543255 2156878 2181594 2381175
41057B381175l91939p22460j07369L41051k85172p36732L43791J684871J121834
$$ 2381175 1989236 1266776 1159407 1500458 1215286 478554 822345 2507216 3629050
41048C629050p67943j436858l94173L39655j21506l11777N37508R95939J21536
$$ 3629050 2861107 1424249 1030076 1369731 1248225 936448 1473956 2469895 2591431
41039B591431p68767m33507K66811J98469o3512K72742M32918m10336j267412
$$ 2591431 1822664 1389157 1655968 1854437 1790925 2063667 2496585 2086249 818837
41030H18837q42425K51010N99647K81814K48428L68468m3066n51129l18422K04591
$$ 818837 -23588 227422 827069 1108883 1357311 1725779 1682713 1131584 813162 1017753
41020A017753J41211J2466P20295J386025M59648j393128j898307o52983L58763
$$ 1017753 1158964 1171430 1891725 3277750 3737398 2344270 445963 -207020 151743
41011A51743J6065m92859j25273K90877j52640p04774k79131P45373J226840Q74474
$$ 151743 167808 -325051 -450324 -159447 -312087 -1016861 -1295992 -550619 676221 1550695
41001A550695K33692k11245k21732K16592N82411K04919o62541r69301l78115
$$ 1550695 1784387 1573142 1351410 1568002 2150413 2355332 1692791 723490 345375
40992C45375K82746L89534K83994K62570l9425o61708q22652j45316N81042O08642
$$ 345375 628121 1017655 1301649 1564219 1524794 863086 40434 -104882 476160 1084802
40982A084802K99585K28782J15162m56251r82964o74563L32679J171356J295725
$$ 1084802 1384387 1613169 1728331 1272080 289116 -385447 -52768 1118588 2414313
40973B414313P88161M1219m22711k94310M0921m8787l49855n6718O70958O39180
$$ 2414313 3202474 3243693 2820982 2526672 2567593 2518806 2168951 2112233 2783191 3422371
40963C422371l76734r52268k38357N10120q1400j202302j177204k11902O0551
$$ 3422371 3045637 2093369 1855012 2365132 2283732 1081430 -95774 -307676 -247125
40954b47125o55736r54121j72152O06294M57753K895J36608N49654M44418m0254
$$ -247125 -902861 -1856982 -2029134 -1422840 -965087 -962192 -825584 -275930 168488 128234
40944A28234q9117M38654P53235K58820o18157r58736m67788K34938M53168K24321
$$ 128234 39117 477771 1231006 1489826 871669 -87067 -554855 -319917 133251 357572
40934C57572K7167k2558j42909k17011Q4310M70243K20339n24611o44103K60712
$$ 357572 384739 362181 219272 2261 86571 556814 777153 252542 -391561 -130849
40924a30849J030333O06604l65203o18976j99719p4640l40922k26117L12528L96548
$$ -130849 899484 1506088 1140885 521909 322190 247550 -93372 -319489 -6961 389587
40914C89587k26935o92369m10600R4279J85534O5149J97913M73406M88151J87534
$$ 389587 162652 -529717 -940317 -846038 -660504 -595355 -397442 75964 564115 751649
40904G51649k10369n38327n88525j17585O72604J020190M22835o20534j098428
$$ 751649 541280 2953 -585572 -703157 -30553 989637 1412472 791938 -306490
40895c06490o56856O5157L18092J43398J28072M15206M59420q773l06248K66164
$$ -306490 -963346 -898189 -580097 -436699 -308627 106579 565999 557226 250978 517142
40885E17142J138338J081224R5759m35325J64433Q04889L85315m92998o50823
$$ 517142 1655480 2736704 2832463 2397138 2561571 3366460 3751775 3258777 2607954
40876B607954k59317k80560o06623l24724M18810M56532l69174p67556n5393P24377
$$ 2607954 2348637 2068077 1461454 1136730 1555540 2012072 1642898 875342 819949 1544326
40866A544326M73316k89971l55479L44551P89363L50783n87976j302890j407105
$$ 1544326 2017642 1727671 1372192 1716743 2506106 2856889 2268913 966023 -441082
40857d41082r53881l01715J62182L89844O35432R40551R52573M45666k86694p96651
$$ -441082 -1394963 -1696678 -1534496 -1144652 -509220 431331 1383904 1829570 1542876 746225
40847G46225r61388q65662n07259N9155N03152N16643K71190K71646P01300J109391
$$ 746225 -215163 -1080825 -1588084 -1528929 -1025777 -509134 -237944 33702 735002 1844393
40837A844393Q73571p6755j108521j503382j139850m45710K04575P47154J092310
$$ 1844393 2717964 2641209 1532688 29306 -1110544 -1556254 -1351679 -604525 487785
40828D87785R47878K24344o33187r85706n97265J71013O23013K69004n76487q65012
$$ 487785 1435663 1660007 1026820 41114 -556151 -385138 237875 506879 -69608 -934620
40818i34620P725J203359J336942L46891m52063l08649J02319J41325K53092P80063
$$ -934620 -926895 276464 1613406 1960297 1508234 1199585 1301904 1443229 1696321 2476384
40808B476384R35894Q5527r03018q36095Q888M97145L79720J57110j46458o82918
$$ 2476384 3412278 3497805 2594787 1758692 1767580 2264725 2644445 2801555 2655097 1972179
40798A972179q22564R027R71679Q03171j99549p23084n63308n35714o35086j75355
$$ 1972179 1149615 1158642 2130321 2933492 2733943 2010859 1447551 911837 276751 101396
40788A01396M58729K59124k65618L59447J714117J630218k07346j319221j79624
$$ 101396 560125 819249 553631 913078 2627195 4257413 4050067 2730846 2551222
40779B551222J429691J296822l0466o94173m77793l73289m69797k18207P1914
$$ 2551222 3980913 5277735 5247269 4553096 4075303 3702014 3232217 3014010 3085924
40770C085924k35638p21348n84717r7650j3186j70116k1113J27587k29282n69202
$$ 3085924 2850286 2128938 1544221 1446571 1433385 1263269 1242156 1369743 1140461 571259
40760E71259j76179M32175L61989J1907L20040Q68980M61268o89375j081043k49600
$$ 571259 395080 827255 1189244 1201151 1521191 2390171 2851439 2162064 1081021 831421
40750H31421O11156N39522o8068m75066n41595l60789K3505K97995J16359k65228
$$ 831421 1442577 1982099 1914031 1438965 897370 536581 560086 858081 974440 709212
40740G09212l45140k31461l00715k94271K01761O71179L05650m55556l96788M86877
$$ 709212 364072 132611 -168104 -462375 -260614 410565 716215 260659 -136129 350748
40730C50748R21517M38626N1239M44087Q89599O03526j7937k56369j86577k01655
$$ 350748 1272265 1710891 1762130 2206217 3095816 3699342 3681405 3425036 3238459 3036804
40720C036804k43785j90548k78011n02793l04747M95438J091994P43554r8438
$$ 3036804 2793019 2602471 2324460 1821667 1516920 2012358 3104352 3847906 3749468
40711C749468m37738j16998J66407j66k56371j04688M21201P99485N44299k89498
$$ 3749468 3311730 3194732 3361139 3360973 3104602 2999914 3421115 4220600 4764899 4475401
40701D475401j062940j134105m92706L39615R29728J150013R14879K05057n92695
$$ 4475401 3412461 2278356 1785650 2125265 3054993 4205006 5119885 5324942 4732247
40692D732247q40555l21656N31393J145126J270427R65632M57595L2223k16783
$$ 4732247 3891692 3570036 4101429 5246555 6516982 7482614 7940209 7972432 7755649
40683G755649m77570q17529r01776m81444P4998K10677o0245l16030m26142n25696
$$ 7755649 7278079 6460550 5558774 5077330 5152328 5363005 5302760 4986730 4560588 4034892
40673D034892n13669k19444R2431M6443j49501j1082L46172L55563n4872l83779
$$ 4034892 3521223 3301779 3394210 3440653 3291152 3280070 3626242 3981805 3926933 3543154
40663C543154l72998k04873M8244M55021P70416O65379L31737J67013M8381k90384
$$ 3543154 3170156 2965283 3013527 3468548 4238964 4904343 5236080 5403093 5451474 5161090
40653E161090m34131J68768J046569J213807P15688M39163M55398k1643q85136
$$ 5161090 4726959 4895727 5942296 7156103 7871791 8310954 8766352 8744709 7859573
40644G859573r07195K58112J306909J229019P19677Q28092J377998J681582J811617
$$ 7859573 6952378 7210490 8517399 9746418 10466095 11294187 12672185 14353767 16165384
40635A6165384K140059K417802K297351K106701K209033K211643J670591J016435
$$ 16165384 18305443 20723245 23020596 25127297 27336330 29547973 31218564 32234999
40627C2234999R58893J467970K042168K420851K381825J551528K06389m68824
$$ 32234999 33193892 34661862 36704030 39124881 41506706 43058234 43264623 42795799
40619D2795799J38777R66621O52586n36253j195511p29802K96076J379040K474179
$$ 42795799 42934576 43901197 44553783 44017530 42822019 42092217 42388293 43767333 46241512
40610D6241512L351293L713135L991247N033496O883165Q700464J0012151J1327315
$$ 46241512 49592805 53305940 57297187 62330683 69213848 77914312 87926463 99253778
40602I9253778J3456368J6881957K1788449K8000285L4865502M1834616M8925718
$$ 99253778 112710146 129592103 151380552 179380837 214246339 256080955 305006673
40595C05006673N5470887N8188524N1944317L3958018P473409j9354173l8675297
$$ 305006673 360477560 418666084 470610401 504568419 512041828 492687655 454012358
40588D54012358m7479571m7854708m3877624l8678651l3735756k9482184k5689192
$$ 454012358 406532787 358678079 314800455 276121804 242386048 212903864 187214672
40581A87214672k1768602j7633871j4153148j2035520j0558399q461638n998188
$$ 187214672 165446070 147812199 133659051 121623531 111065132 102603494 96605306
40574I6605306m745997n119649n547714m833993l923007m178379n074596n083833
$$ 96605306 91859309 86739660 81191946 76357953 72434946 68256567 63181971 58098138
40566E8098138m116900l485623l722374l910665l248820k095132j246045j031694
$$ 58098138 53981238 50495615 46773241 42862576 39613756 37518624 36272579 35240885
40558C5240885j268733j464212j093893k47016K28757j60272o96349m94016P6873
$$ 35240885 33972152 32507940 31414047 31167031 31395788 31235516 30539167 30045151 30122024
40549C0122024O0687l87655k73037M20839O02630m9607m46477J83852J080800
$$ 30122024 30182711 29795056 29522019 29942858 30545488 30495881 30049404 30233256 31314056
40540C1314056J152553N14722P8631K04031M84792N51085N05697O62438J155567
$$ 31314056 32466609 32981331 33059962 33263993 33748785 34299870 34805567 35468005 36623572
40531C6623572J769398K124998K149200K190319K442051K607965K575516K945490
$$ 36623572 38392970 40517968 42667168 44857487 47299538 49907503 52483019 55428509
40523E5428509M114933N196849M865824L151416J336343R4014j070907k312934
$$ 55428509 59543442 64740291 69606115 72757531 74093874 74187888 73116981 70804047
40515G0804047k690592j602666J1822P54306M05367k67178q06663j385028k143100
$$ 70804047 68113455 66510789 66522611 67276917 67682284 67415106 66608443 65223415 63080315
40506F3080315k954347l749153m514085m985560m787817l966185l111807k789884
$$ 63080315 60125968 56376815 51862730 46877170 42089353 38123168 35011361 32221477
40498C2221477k882852k656597j678812n92392n01153j427292k031676j366705
$$ 32221477 29338625 26682028 25003216 24410824 23909671 22482379 20450703 19083998
40490A9083998k40804r761n72279p09045j12260K52798j43402o31921o05040l70955
$$ 19083998 18843194 18833433 18261154 17552109 17439849 17692647 17549245 16917324 16312284 15941329
40480A5941329l19135k95925k88978o92294j336143j294524l39969M10483J08522
$$ 15941329 15622194 15326269 15037291 14344997 13008854 11714330 11374361 11784844 11893366
40471A1893366n13292m03553Q0692j29668r79173j380918q78998j17350K59796
$$ 11893366 11380074 10976521 11057213 10927545 9948372 8567454 7688456 7571106 7830902
40462G830902K31203n2882m94340p57094m74113J41474M39305J38763m42784q90785
$$ 7830902 8062105 8009223 7514883 6757789 6283676 6425150 6864455 7003218 6560434 5669649
40452E669649r64654n20148K91729Q60813P27351K78628K45761N66553M35671
$$ 5669649 4704995 4184847 4476576 5337389 6064740 6343368 6589129 7155682 7591353
40443G591353m22314j217026j115854k78737M78760O66058L88817o8007m82276
$$ 7591353 7169039 5952013 4836159 4557422 5036182 5702240 6091057 6023050 5540774
40434E540774o12064k92043K68824N56103L18158r2933j96889q0652k16138n68904
$$ 5540774 4928710 4636667 4905491 5461594 5779752 5686819 5489930 5409278 5193140 4624236
40424D624236m67337L15760R37945N86818k38232m25347J9610M0329o20738q69210
$$ 4624236 4156899 4472659 5410604 5997422 5759190 5333843 5353453 5393782 4773044 3903834
40414C903834l7501Q96566P11198k53186o92020k38983K63591J88981j39390j99644
$$ 3903834 3866333 4762899 5474097 5220911 4528891 4289908 4553499 4742480 4603090 4403446
40404D403446j0719Q9746n1017k93658l84044k35040j32158m20379q34729n84069
$$ 4403446 4392727 4482473 4431456 4137798 3753754 3518714 3386556 2966177 2131448 1547379
40394A547379N33371J549590J409299L11695o00584o38283q3655M41541N10591
$$ 1547379 2080750 3630340 5039639 5351334 4750750 4112467 4028812 4470353 4980944
40385D980944r245p58310r46066k55894M86883K94765m76556n32833L73920R06843
$$ 4980944 4971699 4213389 3267323 3011429 3498312 3793077 3316521 2783688 3157608 4064451
40375D064451N4140j306027j535318m08750P29996Q35892L23307J36288L53581
$$ 4064451 4118591 2812564 1277246 868496 1598492 2434384 2757691 2893979 3247560
40366C247560L09197j95449n35802k78126Q3673r5680n28046m23523J58825K91396
$$ 3247560 3556757 3361308 2825506 2547380 2631053 2535373 2007327 1583804 1742629 2034025
40356B034025l22713p52665k57344M84908L55930n10788r40248m10732L47523
$$ 2034025 1711312 958647 701303 1186211 1542141 1031353 91105 -319627 27896
40347B7896M99949J18418j74829o5441K13587K49773p4035l85799k16403L10828
$$ 27896 527845 646263 471434 405993 619580 869353 795318 409519 193116 503944
40337E03944N10028J04174k80969n6441L59411K06568l27564l60121K70318P53038
$$ 503944 1013972 1118146 837177 780736 1140147 1346715 1019151 659030 929348 1682386
40327A682386N56414P5526j88329k99730m00608k63907J99703N50385M37421J81728
$$ 1682386 2238800 2314326 2125997 1826267 1425659 1161752 1361455 1911840 2349261 2530989
40317B530989K41395M33981K30768l54624o96107l96966J69533L09416j49448
$$ 2530989 2772384 3206365 3437133 3082509 2386402 1989436 2158969 2468385 2318937
40308B318937o12250l81800M69735J103856R20425K92845r790J18670J37056k05458
$$ 2318937 1706687 1324887 1794622 2898478 3818903 4111748 4101958 4220628 4357684 4152226
40298D152226n60740o44632n82319m32192N482O09066P65212K22389l79861l60286
$$ 4152226 3591486 2946854 2364535 1932343 1937825 2546891 3312103 3534492 3154631 2794345
40288B794345L4936J23635p3408N7646N72774P44256J92378m49713m30491N3684
$$ 2794345 2829281 2952916 2879508 2937154 3509928 4254184 4446562 3996849 3566358 3620042
40278C620042K37183o1845l01211j70479l1683j92150k99796Q4924O70630P61879
$$ 3620042 3857225 3795380 3494169 3323690 3292007 3099857 2800061 2884985 3555615 4317494
40268D317494K82019j06785K7692L17197J94755l54010r12830j174173j059953
$$ 4317494 4599513 4492728 4520420 4837617 5032372 4678362 3765532 2591359 1531406
40259A531406n86695M8060M46435M28674L50768O79102J313816J643323J287099
$$ 1531406 944711 992771 1439206 1867880 2218648 2897750 4211566 5854889 7141988
40250G141988N52435R3833K51467P87365J232945J421623J540255J619100J286250
$$ 7141988 7694423 7788256 8039723 8827088 10060033 11481656 13021911 14641011 15927261
40241A5927261L63660n48379o42724J1439N73566O39847O36945Q57484Q99741
$$ 15927261 16290921 15742542 15099818 15111257 15684823 16324670 16961615 17819099 18718840
40232A8718840M46730j30728m61963q11987j429117j844423j522118p67208l03046
$$ 18718840 19165570 19034842 18572879 17760892 16331775 14487352 12965234 12198026 11894980
40223A1894980l01322m43970n64615o02518l18667K68038N27811j6701r12515
$$ 11894980 11593658 11149688 10585073 9982555 9663888 9931926 10459737 10443036 9530521
40214I530521j393634j370496j160054p49374j12628K63447O9906j04648K99807
$$ 9530521 8136887 6766391 5606337 4856963 4744335 5007782 5077688 4973040 5272847
40205E272847P09351L33087l70032m38796j25750l50061q08446l91283O25756
$$ 5272847 5982198 6315285 5945253 5506457 5380707 5030646 4222200 3830917 4456673
40196D456673P17583l41613r90486m48310J35844j08427k87675L86090R45065
$$ 4456673 5174256 4832643 3842157 3393847 3529691 3421264 3133589 3519679 4464744
40187D464744L66532m68934k09903O26489N61587k89161m49488L92059R00000
$$ 4464744 4831276 4362342 4152439 4778928 5340515 5051354 4601866 4993925 5893925
40178E893925L03590m81772m51608L048m1634m92184m12062N02406J310752R16428
$$ 5893925 6197515 5715743 5264135 5267183 5225549 4733365 4321303 4823709 6134461 7050889
40168G050889m82610j426087q77357M57526J036469N13016J8085L14739P03831
$$ 7050889 6568279 5142192 4264835 4722361 5758830 6271846 6289931 6604670 7308501
40159G308501L24655l55307k60653O01979J125591O08208m73629j171215j001614
$$ 7308501 7633156 7277849 7017196 7619175 8744766 9352974 8879345 7708130 6706516
40150F706516j80615P03344J228794J475534J675165J606521Q58105k57320p88455
$$ 6706516 6525901 7229245 8458039 9933573 11608738 13215259 14073364 13816044 13027589
40141A3027589m41121n4699l62841r99491j251334j082878q08356m41015n5401
$$ 13027589 12586468 12531769 12168928 11169437 9918103 8835225 8026869 7585854 7530453
40132G530453j22297p05274r52533k51572O70918P33747R8624k28347k8914k8594
$$ 7530453 7408156 6702882 5750349 5498777 6169695 6903442 7002066 6773719 6744805 6716211
40122F716211n68919j129250j206813q58941l04381L37103Q28209Q66910M32135
$$ 6716211 6147292 5018042 3811229 2952288 2647907 2985010 3813219 4680129 5112264
40113E112264k09281p18997p50039j98029M02435L43008j23701M0064R25914J234367
$$ 5112264 4902983 4183986 3433947 3235918 3638353 3981361 3857660 3897724 4823638 6058005
40103F058005L24118n16059k7174R34483Q37829O3150J51766J072221J350747
$$ 6058005 6382123 5866064 5838890 6773373 7611202 7674352 7826118 8898339 10249086
40094A0249086P65261P46168J807873K615669K267261J733056K146434L140858
$$ 10249086 11014347 11760515 13568388 16184057 18451318 20184374 22330808 25471666
40086B5471666L874552M508702N660261P314062R153529J1107024J2672230J2438553
$$ 25471666 29346218 33854920 39515181 46829243 55982772 67089796 79762026 92200579
40078I2200579R272310L691973k454771p324858r912008j0337998r764892r351563
$$ 92200579 101472889 105164862 102710091 95385233 85473225 75135227 65370335 56018772
40070E6018772q936586p469585m974480l021665k704234l197427l114799k371278
$$ 56018772 47082186 39612601 34638121 31616456 28912222 25714795 22599996 20228718
40062B0228718j768194j517779j272516j104475j355685j747746j588629q12802
$$ 20228718 18460524 16942745 15670229 14565754 13210069 11462323 9873694 9060892
40054I060892r5694M9274k44207n54794o12076m59903m17105o64337p77789j68996
$$ 9060892 8965198 9014472 8770265 8215471 7603395 7143492 6726387 6062050 5284261 5115265
40044E115265Q34439J062512Q2806j022241j088121m15394q2381k53424j58994
$$ 5115265 5949704 7012216 7095022 6072781 4984660 4569266 4486885 4233461 4074467
40035D074467M81969R95737P70870J3145o55207q40007n32623l4550K08748k527
$$ 4074467 4556436 5552173 6323043 6336188 5680981 4840974 4308351 4273801 4482549 4480022
40025D480022l94093n81794n35916m54116l69665j86830N2574K26047L18822L25891
$$ 4480022 4085929 3504135 2968219 2514103 2144438 1957608 2010182 2236229 2555051 2880942
40015B880942J42391k18995m83782m12876r2132K22102L58864K46860o7379l33961
$$ 2880942 3023333 2804338 2320556 1907680 1815548 2037650 2396514 2643374 2575995 2242034
40005B242034l12009r8743O0233J90185L53008J84050n80962j214921o68968O99465
$$ 2242034 1930025 1831282 1891515 2081700 2434708 2618758 2037796 822875 153907 853372
39995H53372J229827K62908q18376o06187L61399O78020K10319r7349N4474J40343
$$ 853372 2083199 2346107 1527731 921544 1282943 1960963 2171282 2073933 2128407 2268750
39985B268750N1392K20584N54111L98928k95667p67075n92534k29700j76009k80066
$$ 2268750 2320142 2540726 3094837 3493765 3198098 2431023 1838489 1608789 1432780 1152714
39975A152714j43939L02024P99878R64071M92570m20544j003934p15777J6113
$$ 1152714 1008775 1310799 2110677 3074748 3567318 3146774 2142840 1427063 1443176
39966A443176L61071J72811p9743k02101l37393l26820J15070O22771M87428j60430
$$ 1443176 1804247 1977058 1897315 1695214 1357821 1031001 1146071 1768842 2256270 2095840
39956B095840l84893J18634N33847K55157j72799n9027K20917j51676j015634
$$ 2095840 1710947 1829581 2363428 2618585 2445786 2386759 2607676 2456000 1440366
39947A440366j330166o61665J91289K96080k29144n30048k15098K65782M08160
$$ 1440366 110200 -551465 -360176 -64096 -293240 -823288 -1038386 -772604 -364444
39938c64444K92790K12985J37459n688R7252O20342R14593K37426q82085j046906
$$ -364444 -71654 141331 278790 273102 370354 990696 1905289 2142715 1260630 213724
39928B13724O857Q96869N81652k11158l19562O4660l929n50801p71183l74736
$$ 213724 220581 1117450 1699102 1487944 1168382 1233042 1229113 678312 -92871 -467607
39918d67607K06270O37483P95470M41738l01904o14108r6899L21833k21130q57022
$$ -467607 -261337 376146 1171616 1613354 1311450 697342 600443 922276 701146 -155876
39908a55876k25157J094727J239257L4390p03077j41496L35689l48176j112310
$$ -155876 -381033 713694 1952951 1987341 1284264 1142768 1478457 1130281 17971
39899A7971o26787M45688O15835p3039l94855j5663K52305J9370j29654K79872
$$ 17971 -608816 -163128 452707 379668 -15187 -30850 221455 240825 111171 391043
39889C91043Q90211J072762O86206J34814j10880n6225j95449p16882r41190k37200
$$ 391043 1281254 2354016 3040222 3175036 3064156 3007931 2812482 2095600 1154410 917210
39879I17210P09776O27877l17790n90030K83381Q69992J84663o81515m71166J37828
$$ 917210 1626986 2254863 1937073 1347043 1630424 2500416 2685079 2003564 1532398 1670226
39869A670226q0997o03053j44355Q63792Q82097n9220m12829K16924N68798J33078
$$ 1670226 1589229 986176 841821 1705613 2587710 2528490 2115661 2332585 2901383 3034461
39859C034461m0115M60213M34135p03518j542730q51518L67969N13449j35732
$$ 3034461 2994346 3454559 3888694 3185176 1642446 790928 1158897 1672346 1536614
39850A536614k33386K67301L66754L7212J11766M31318J5646q59579o96296O66256
$$ 1536614 1303228 1570529 1937283 1974495 2086261 2517579 2533225 1673646 977350 1643606
39840A643606J398074M44518p60325n90674K40792J04818p01541n67664M99382
$$ 1643606 3041680 3486198 2725873 2135199 2375991 2480809 1779268 1211604 1710986
39831A710986P57443l05928r90201j25715R89848O47855n98320q68371J76418
$$ 1710986 2468429 2162501 1172300 1046585 2036433 2684288 2085968 1217597 1394015
39822A394015R96756N36015m55467o92887L953P07436N01998n75439j454526j055750
$$ 1394015 2390771 2926786 2471319 1778432 1782385 2489821 2991819 2416380 961854 -93896
39812i3896L14263J060295L18618p56919o15538M10177P46460J17114k00371K76471
$$ -93896 220367 1280662 1599280 842361 226823 637000 1383460 1500574 1300203 1576674
39802A576674M04171m57528j114451m08789Q44350J096072L56947j22493Q9758
$$ 1576674 1980845 1523317 408866 77 844427 1940499 2297446 2174953 2264711
39793B264711K45840j04757n30079o45396n93151m49148r330O28702R70943Q19071
$$ 2264711 2510551 2405794 1875715 1230319 637168 188020 178690 807392 1778335 2597406
39783B597406M94775K35565q5701m84545o40392l96898q8153r5094l16273k97433
$$ 2597406 3092181 3327746 3242045 2757500 2117108 1720210 1632057 1536963 1220690 923257
39773I23257K04905Q74170J046640L92332n73461r30313m52787R2308K2582l21439
$$ 923257 1128162 2002332 3048972 3441304 2867843 1937530 1484743 1577051 1599633 1278194
39763A278194k04430L03021M46177q266l92601j01767N81951Q65808L72094m73060
$$ 1278194 1073764 1376785 1822962 1814696 1422095 1320328 1902279 2768087 3140181 2667121
39753B667121q64519m39263K75219M32772l2295k91515J42931O23066L49559l44230
$$ 2667121 1802602 1363339 1638558 2071330 2039035 1747520 1890451 2513517 2863076 2518846
39743B518846m95400j4185K41186j39056n59472m50393m4673K19939M02941P16350
$$ 2518846 2023446 2009261 2250447 2111391 1551919 1101526 1056853 1276792 1679733 2396083
39733B396083R66107Q16043L32433j06515k70333j96587q137K03155M14638O67289
$$ 2396083 3362190 4178233 4510666 4404151 4133818 3937231 3929094 4132249 4546887 5214176
39723E214176R21922R96914Q60623Q50012J244738J706393J557691O15153o24536
$$ 5214176 6136098 7133012 7993635 8843647 10088385 11794778 13352469 13967622 13343086
39714A3343086j571004j916167j569128p80008k53361m78244r38249p15594N4520
$$ 13343086 11772082 9855915 8286787 7506779 7253418 6775174 5836925 5121331 5175851
39705E175851K10637o86489j563725j335100l68874K67859L38910L25261K89328
$$ 5175851 5386488 4699999 3136274 1801174 1432300 1700159 2039069 2364330 2653658
39696B653658j15010o93858p60607j87436L89723N25372M14700K73861N425k79722
$$ 2653658 2538648 1844790 1084183 896747 1286470 1811842 2226542 2500403 2505828 2226106
39686B226106j16176N42046R85967O76878N5145j02052K20663M01437J76423j15831
$$ 2226106 2109930 2651976 3637943 4314821 4369966 4267914 4488577 4890014 5066437 4950606
39676D950606k27893l40486n98546q01782p46367n06116k09928J10526K92974
$$ 4950606 4722713 4382227 3783681 2981899 2235532 1729416 1519488 1630014 1922988
39667A922988O4994m54884o59678k07018M41493O10289K48232k32511o20209q44261
$$ 1922988 1987982 1533098 873420 666402 1107895 1718184 1966416 1733905 1113696 269435
39657B69435n57095M37288J419408J295581R2893q80744p06879M1492L26383Q8298
$$ 269435 -287660 149628 1569036 2864617 2957510 2076766 1369887 1411379 1737762 1826060
39647A826060L829K84164M65164J97662l52362p96717q05478k71223M51859P39145
$$ 1826060 1829889 2114053 2579217 2776879 2424517 1627800 822322 551099 1002958 1742103
39637A742103M76374K68058M51273M31495l41362j247849j262657n11537j8858
$$ 1742103 2218477 2486535 2937808 3369303 3027941 1780092 517435 5898 -12960
39628a2960m4296J61124Q08879R91392J58888q07164p43792K05862Q86282O19716
$$ -12960 -57256 103868 912747 1904139 2063027 1255863 512071 717933 1604215 2223931
39618B223931k22033q72685q71953k87750L46697M53866N0903k35724k2975K80716
$$ 2223931 2001898 1129213 257260 -30490 316207 770073 820976 585252 562277 842993
39608H42993J07935m03699o28131l50103J2329N3076j31213j68588J07207N05411
$$ 842993 950928 547229 -80902 -431005 -418676 -365600 -496813 -665401 -558194 -52783
39598e2783P15696O26159L70380O2698l42224p63267p87993j44200P15817R90149
$$ -52783 662913 1289072 1659452 1722150 1379926 616659 -171334 -315534 400283 1390432
39588A390432N44796P6310J19107L83137L34746j4735k68787k72704j99349k00948
$$ 1390432 1935228 2011538 2130645 2513782 2848528 2833793 2565006 2292302 2092953 1892005
39578A892005k79658l66550l27082o5867K13156R6060m84678j009389r07072j63306
$$ 1892005 1612347 1245797 918715 852848 1066004 1162064 677386 -332003 -1239075 -1402381
39568a402381P38617J258580J086822L25423m36768n66154j22597J69672r0474
$$ -1402381 -663764 594816 1681638 2007061 1570293 1004139 881542 1051214 960740
39559I60740m15595j80903M37055P34227M48033l6808l42866m99710o57232p48792
$$ 960740 545145 364242 801297 1535524 1983557 1946749 1603883 1104173 446941 -301851
39549c01851n77404j04427M24074O56456M99964K39221J36612N5534j99652l36739
$$ -301851 -879255 -983682 -559608 96848 596812 836033 972645 1028179 828527 491788
39539D91788O9338P08257P52804J28471k38117J45482M71673r5290r75227r67478
$$ 491788 561126 1269383 2022187 2150658 1912541 2058023 2529696 2434406 1459179 491701
39529D91701q5800M65523N5996o34240p73801l87415Q4937M72194O98263N28892
$$ 491701 405901 871424 927420 293180 -480621 -868036 -783099 -310905 387358 916250
39519I16250j4197m09617k80382L9755M0586j52722m9793K92040K81122j97269
$$ 916250 902053 492436 212054 251809 292395 139673 89880 381920 663042 465773
39509D65773m27151J01127P74290N83104m19723j069744o11375L41128O79722
$$ 465773 38622 139749 914039 1497143 1077420 7676 -603699 -262571 417151
39500D17151J48962o13919r92990q31790k49630M14577O64620L89541J51943L97498
$$ 417151 566113 -47806 -1040796 -1872586 -2122216 -1707639 -1043019 -653478 -501535 -104037
39490a04037O72876L42292k26099j53823M33565N45695L8057j21228L45360L24037
$$ -104037 568839 911131 685032 531209 964774 1510469 1548526 1427298 1772658 2096695
39480B096695q20932j884863j427355J17352J111650R27569L43080R3194J35011
$$ 2096695 1275763 -609100 -2036455 -1919103 -807453 120116 463196 556390 691401
39471F91401K28467L19412L44745K99972L70779M98452K06670n27483p89385N476
$$ 691401 919868 1239280 1584025 1883997 2254776 2753228 2959898 2432415 1643030 1648506
39461A648506Q73588M30208r88943j620429p00814N84771Q40899J28968n35884
$$ 1648506 2522094 2952302 1963359 342930 -357884 226887 1067786 1196754 660870
39452F60870n83351k71368j00228k21953l01132M6453N71951N12037k82080q75689
$$ 660870 77519 -193849 -294077 -516030 -817162 -770709 -198758 313279 31199 -844490
39442h44490n06923K66263M95844L38063N32206Q61366M77495m41207p83309l08831
$$ -844490 -1351413 -1085150 -589306 -251243 280963 1142329 1619824 1178617 395308 86477
39432H6477K0264k64745m49756k4634M76205N09131L07673J60754o3400k35935
$$ 86477 106741 -158004 -607760 -632394 -156189 352942 660615 821369 757969 522034
39422E22034J25874Q03815Q24967q319o41302m06363P779q0497j98810J77575
$$ 522034 647908 1451723 2276690 2268371 1627069 1220706 1228485 1147988 949178 1126753
39412A126753M95601J64905k21380J30149P64541O83185q0283o74623p31924m72765
$$ 1126753 1622354 1787259 1565879 1696028 2460569 3143754 3063471 2388848 1656924 1184159
39402A184159k2014M21528K81702n23279r67876k66519P15150O14300l35045p29548
$$ 1184159 1162145 1583673 1865375 1342096 374220 107701 822851 1437151 1102106 372558
39392C72558k21063J69602n8719j78644K67912N78000Q2885p36272r71787m78307
$$ 372558 151495 321097 262378 83734 351646 929646 1012531 276259 -695528 -1173835
39382a173835J92604N66473N17391J17531m06668p21421n88482k3821O36796Q07204
$$ -1173835 -981231 -414758 102633 220164 -186504 -907925 -1496407 -1520228 -883432 -76228
39372g6228J79683o27532n30694N07401J114901L25819r44686j172950l56052
$$ -76228 103455 -524077 -1054771 -547370 567531 893350 -51336 -1224286 -1580338
39363a580338L01041L55980L93809N35108K07303m61035m94176K81886P79960
$$ -1580338 -1279297 -923317 -529508 5600 212903 -248132 -742308 -460422 319538
39354C19538L89875n8873K35093P44606O31371J03078j91943l31178o61767q10711
$$ 319538 709413 650540 885633 1630239 2261610 2364688 2172745 1841567 1179800 369089
39344C69089k55473N07984M76276l14994p62301k73153M96625O92219L20818p3021
$$ 369089 113616 621600 1097876 782882 20581 -252572 244053 936272 1257090 1184069
39334A184069k45613l29639l79831k85873o9583N8610o062j24515j51015j15134
$$ 1184069 938456 608817 228986 -56887 -126470 -67860 -73922 -198437 -349452 -464586
39324d64586l1515K36643O31207O50111j8395p07057l76802Q07257J370110M90391
$$ -464586 -496101 -259458 371749 1021860 1003465 296408 -80394 726863 2096973 2587364
39314B587364p66505r35799j14686N48655O49586N54278J42257r29895j865667
$$ 2587364 1820859 885060 770374 1319029 1968615 2522893 2665150 1735255 -130412
39305a30412j308544M62951J507631Q90551j21734k11473J56271M2113k22502
$$ -130412 -1438956 -976005 531626 1422177 1300443 1088970 1245241 1287354 1064852
39296A064852N5055L46600k26171j108922r49078K92831J246266J039864J22425
$$ 1064852 1119907 1466507 1240336 131414 -817664 -524833 721433 1761297 1883722
39287A883722p52824j231855j045353j08009Q98202J011582K94823j75364J80595
$$ 1883722 1130898 -100957 -1146310 -1254319 -356117 655465 950288 774924 955519
39278I55519P46811P49661K11322m25442q90483r43839l27543O56173J057075
$$ 955519 1702330 2451991 2663313 2237871 1347388 403549 76006 732179 1789254
39269A789254L24529q69499j335462p17531K40284O59038L96546o2416l03743
$$ 1789254 2113783 1244284 -91178 -808709 -568425 90613 487159 424743 121000
39260A21000l59139m05706l43840L3666N26279O21983K43735n6696Q7119L21076
$$ 121000 -238139 -643845 -987685 -954019 -427740 194243 437978 381282 468401 789477
39250G89477K28983L4090J03130J89118j47490o69132p37263k67374K61164N46103
$$ 789477 1018460 1052550 1155680 1344798 1197308 528176 -209087 -476461 -215297 330806
39240C30806N43154R3480p12575j071006l51400P12997Q26178O1918k63216K35740
$$ 330806 873960 967440 254865 -816141 -1167541 -454544 371634 433552 170336 406076
39230D06076M15288l26463q40252l3630J275890J506818N23554m96711q56236
$$ 406076 821364 494901 -345351 -378981 896909 2403727 2927281 2430570 1574334
39221A574334q09423n88650j24218L54844M25968J79788K5433j14039n78441j036188
$$ 1574334 764911 176261 52043 406887 832855 1012643 1038076 924037 345596 -690592
39211f90592p24279K73566Q89582M86066l36184o54586l09320K61869P02932Q59303
$$ -690592 -1414871 -1141305 -251723 234343 -101841 -756427 -1065747 -803878 -100946 758357
39201G58357O48854K03288j27676j70628r8180p1408r039J55276K83832K31806
$$ 758357 1407211 1610499 1482823 1312195 1214015 1142607 1133568 1288844 1572676 1804482
39191A804482n763l54857n88856l17408M78870J017992M89737p20823j347769
$$ 1804482 1798719 1443862 855006 537598 1016468 2034460 2524197 1803374 455605
39182D55605r25642k95970j38422N356O09167J013699L98157p39474j187955p40741
$$ 455605 -470037 -766007 -904429 -899073 -289906 723793 1121950 382476 -805479 -1546220
39172a546220k12252K0493L20290O90250O03992J34222P4338N51132O49924j4943
$$ -1546220 -1758472 -1737979 -1417689 -727439 -123447 10775 85113 636245 1286169 1271226
39162A271226m70269N7156P60379N31231j65189m3821Q04829R56904q6402j083854
$$ 1271226 800957 858113 1618492 2149723 1984534 1940713 2745542 3702446 3616044 2532190
39152B532190r09061o5074K99993J0285k75840k24086m7394J10811L19656N11574
$$ 2532190 1623129 1558055 1858048 1868333 1592493 1368407 1321013 1431824 1751480 2263054
39142B263054N07894L29231J32876l3996j46102q4738J00668Q8040k34832m93400
$$ 2263054 2770948 3100179 3233055 3199059 3052957 2968219 3068887 3156927 2922095 2428695
39132B428695m00675k39150k96988k32996L36598R51571Q31040J18926k76719
$$ 2428695 2028020 1788870 1491882 1258886 1595484 2547055 3378095 3497021 3220302
39123C220302o4650J38461L620l0917K00190Q2260o60942j231752r16574k54519
$$ 3220302 3155652 3294113 3297733 3266816 3467006 3549266 2888324 1656572 739998 485479
39113D85479j52079m06536j49236N88999Q69937L43662k80445l95228k18113j03174
$$ 485479 333400 -73136 -222372 366627 1236564 1580226 1299781 904553 686440 583266
39103E83266M0288K57810J79771l57327q13967n76827K12112Q42674Q34302K85223
$$ 583266 623554 881364 1061135 703808 -110159 -686986 -474874 367800 1202102 1487325
39093A487325l32096n07180q6398M70091M96002n3734n05132l71182K0403O3016
$$ 1487325 1155229 648049 561651 1031742 1527744 1474010 968878 597696 618099 681115
39083F81115l14152o82404o99639l71433O4127K97916K04909N7775K06996N09915
$$ 681115 366963 -315441 -1015080 -1386513 -1322386 -1024470 -819561 -761786 -554790 -44875
39073d4875N13113K39642J70362L17531J30856l67605l31835M23542P21573k22697
$$ -44875 468238 707880 878242 1195773 1326629 959024 627189 1050731 1772304 1549607
39063A549607j276777r33982L15844P38660Q9151j88620M91479R59631M15557
$$ 1549607 272830 -661152 -345308 393352 482503 293883 785362 1744993 2160550
39054B160550k63296j77232J10798j78545n41367j88101M07813K90982l15002
$$ 2160550 1897254 1720022 1830820 1652275 1110908 922807 1330620 1621602 1306600
39045A306600m42632k8901J22486k50797o41730p59944p12839m15224J69863M60322
$$ 1306600 863968 835067 957553 706756 65026 -694918 -1407757 -1822981 -1653118 -1192796
39035a192796R579m45832P7475J064977J139168L49453J37598P82303P51895o33034
$$ -1192796 -1183217 -1629049 -1551574 -486597 652571 1002024 1139622 1921925 2673820 2040786
39025B040786j694483q66567P61061J035762o8540o79195m922P34291M45955l50857
$$ 2040786 346303 -520264 240797 1276559 1208019 528824 523902 1258193 1704148 1353291
39015A353291o54588l96529r4962Q4601K98346N47720O85421N76528O9731p71625
$$ 1353291 698703 302174 207212 291813 590159 1137879 1823300 2399828 2469559 1697934
39005A697934j317820q52002L67990J136624P47355j28317m30360p4826K11069
$$ 1697934 380114 -471888 -103898 1032726 1780081 1651764 1221404 1146578 1357647
38996A357647L2492l21015m74432l29668J05838P21890J109048Q32912K7487o45189
$$ 1357647 1390139 1069124 594692 265024 370862 1092752 2201800 3034712 3062199 2417010
38986B417010p51185m90494k40770n8097J27707J28915k82278q50730r33258k58739
$$ 2417010 1665825 1175331 934561 876464 1004171 1133086 850808 78 -933180 -1191919
38976a191919O45577R91635N80444q3603m52876m47040k82988j18377n5652k10960
$$ -1191919 -546342 445293 1025737 942134 489258 42218 -240770 -359147 -414799 -625759
38966f25759m38614k10879P19103J607478J328294j04913j277255j094318k02308
$$ -625759 -1064373 -1275252 -556149 1051329 2379623 2274710 997455 -96863 -299171
38957b99171J3771n68954p95289j45883M50114J28584n36628m48073L49062Q41808
$$ -299171 -285400 -854354 -1649643 -1795526 -1345412 -1216828 -1753456 -2201529 -1852467 -1010659
38947a010659O04610K43922K84476M59695L45096J6224k73027n38145p88584p18852
$$ -1010659 -406049 -162127 122349 582044 927140 943364 670337 132192 -656392 -1375244
38937a375244j42844N08491N90048Q0722l40233j01705N86587R51619M94412m27506
$$ -1375244 -1518088 -1009597 -419549 -338827 -679060 -780765 -194178 757441 1251853 824347
38927H24347r35103o13411L635J42254k25552m96997l72677j00399J87018O75934
$$ 824347 -110756 -724167 -720532 -578278 -803830 -1300827 -1673504 -1773903 -1586885 -910951
38917i10951J227483J229693M71796m10111p64851o68408m52160j18642K70590
$$ -910951 316532 1546225 2018021 1607910 843059 174651 -277509 -396151 -125561
38908a25561K86270j36335k81308K76853Q04782N05059j26334j26304K73321J12238
$$ -125561 160709 24374 -256934 19919 824701 1329760 1203426 1077122 1350443 1462681
38898A462681n12280n97974q5240N998n34615o57206N6253N66129J51840l65262
$$ 1462681 950401 352427 267187 273185 -261430 -918636 -862383 -296254 -144414 -509676
38888e09676p6724N42435O33131L74571L27199K73474j53479m90699k55285M572
$$ -509676 -586400 -43965 589166 963737 1290936 1564410 1410931 920232 664947 669519
38878F69519l27586o39972j06712O26655L08108p68841j116809m31832M2576l09463
$$ 669519 341933 -298039 -404751 221904 530012 -238829 -1355638 -1787470 -1744894 -2054357
38868b054357n54607L7651P27261N48297k15329n92379k57034L61573P90313Q31748
$$ -2054357 -2608964 -2571313 -1844052 -1295755 -1511084 -2103463 -2360497 -1998924 -1208611 -376863
38858c76863N60785L03775K82081K35635j26177m34137j49729L83089L26142k35768
$$ -376863 183922 487697 769778 1005413 879236 445099 295370 678459 1004601 768833
38848G68833l61186J62381N10660L38130K66167M35783M2369r59258j189198K4134
$$ 768833 407647 570028 1080688 1418818 1684985 2120768 2163137 1203879 14681 38815
38838C8815J216085Q85824j52432j78426O00270N49181n75469j334333j048941
$$ 38815 1254900 2140724 1988292 1809866 2410136 2959317 2383848 1049515 574
38829E74n92430m95950j19666P28519J045203L38599l70554k30520N5784l35119
$$ 574 -591856 -1087806 -1207472 -478953 566250 904849 534295 303775 359559 24440
38819B4440o98693j2613J062728J018975q9172o99415j63286M46350K47093j64939
$$ 24440 -674253 -686866 375862 1394837 1305665 606250 442964 889314 1136407 971468
38809I71468J5984M22276K90630k20537m68060m96296p52525j000640o08792J83893
$$ 971468 987452 1409728 1700358 1479821 1011761 515465 -237060 -1237700 -1846492 -1662599
38799a662599L91187j53007l96051L10056J106034Q79125n2626m33637R2936O10973
$$ -1662599 -1271412 -1424419 -1820470 -1510414 -404380 474745 422119 -11518 81418 692391
38789F92391L83218k00267l86892r6773K23585L39406L53359L05232O8485l50514
$$ 692391 1075609 875342 488450 391677 615262 954668 1308027 1613259 1681744 1331230
38779A331230o70024n97638j80312J94531K24927P8238J47470L98648L09627l31782
$$ 1331230 661206 63568 -116744 77787 302714 380952 528422 927070 1236697 904915
38769I04915r50977r00782l34886J26379L23928N45062P91351P75085N49541L96815
$$ 904915 -46062 -946844 -1281730 -1155351 -831423 -286361 504990 1280075 1829616 2226431
38759B226431J41865n80159j349329j227962k14787N64393M81604K01770L36200
$$ 2226431 2368296 1788137 438808 -789154 -1003941 -439548 42056 243826 580026
38750E80026L77624k08573p82040m71929L55386O65847L11135m3864j54373k90423
$$ 580026 957650 749077 -32963 -504892 -149506 516341 827476 783612 629239 338816
38740C38816l92423j92926K5066j83836m72847j80507M22467M86427M6921p9835
$$ 338816 -53607 -246533 -221467 -405303 -878150 -1058657 -636190 -149763 -102842 -182677
38730a82677J91574J37361k67366k04600L38320K76623o73421j262341o41904
$$ -182677 8897 146258 -121108 -325708 12612 289235 -384186 -1646527 -2288431
38721b288431L29344O34778O33763R23897R37893R9629o76778k90285N32398L05559
$$ -2288431 -1959087 -1324309 -690546 233351 1171244 1270873 594095 303810 836208 1141767
38711A141767o75175p97388Q9402M28680k99431o57902K23689J086744O45005
$$ 1141767 466592 -330796 -241394 187286 -112145 -770047 -546358 540386 1185391
38702A185391k83559k01741N91402N72834n10907j289116q42098J40814M93172
$$ 1185391 901832 700091 1291493 1864327 1353420 64304 -777794 -636980 -143808
38693a43808l9620q09795j070207n84782J83669M89113J78773r0981J44704M24822
$$ -143808 -183428 -993223 -2063430 -2648212 -2464543 -1975430 -1796657 -1887638 -1742934 -1318112
38683a318112K31118K4375M47701R27960L71287q41756j034349K46198J329407
$$ -1318112 -1086994 -1062619 -614918 313042 684329 -157427 -1191776 -945578 383829
38674C83829Q05797m43009p02167L7515L59279k66678q63133o07658R1128M52774
$$ 383829 1189626 746617 44450 81965 441244 174566 -688567 -1296225 -1205097 -752323
38664g52323L68842J99565J15047J3980k00334m71123o00418m72525l48892n83959
$$ -752323 -383481 -183916 -68869 -54889 -255223 -726346 -1326764 -1799289 -2148181 -2732140
38654b732140q47119k70218J111912J842197R05394n56390o89145L62466P91604
$$ -2732140 -3579259 -3849477 -2737565 -895368 10026 -546364 -1235509 -873043 -81439
38645h1439N2010m18170K07756P16942j744j004777q54168O6147L28152k48321
$$ -81439 -29429 -447599 -239843 477099 475355 -529422 -1383590 -1317443 -989291 -1237612
38635a237612o24501l76855k6606K19448O83801J225802J258044Q12340N24202
$$ -1237612 -1862113 -2238968 -2265574 -2046126 -1362325 -136523 1121521 1933861 2458063
38626B458063M93209J66353n49844j026693r17246n65422k88280o3417n751l02435
$$ 2458063 2951272 3117625 2567781 1541088 623842 58420 -229860 -293277 -299028 -601463
38616f01463n76198j89382O71834J073610O54688K7767k78343l81831l88220j33287
$$ -601463 -1177661 -1367043 -695209 378401 1033089 1060856 782513 400682 12462 -120825
38606a20825J57983o8753o49345o85358M7522O71220O16564M06731M86918L88778
$$ -120825 37158 -31595 -680940 -1366298 -1318776 -647556 -30992 375739 862657 1251435
38596A251435j85507n15580m6694N11777L21685j79306j61108N8411l11566q77603
$$ 1251435 1065928 550348 503654 1015431 1337116 1157810 996702 1055113 743547 -134056
38586a34056n75426L94982O63393j71734q85208m94929L77564N98596Q4459m01724
$$ -134056 -709482 -314500 348893 177159 -708049 -1202978 -825414 -226818 -142359 -544083
38576e44083m27304k15759j01872j63225k75690k44068N0712M93613P87882P03711
$$ -544083 -971387 -1187146 -1289018 -1452243 -1727933 -1972001 -1921289 -1427676 -639794 63917
38566F3917K46781l12567n32174j75879L76939M49014k2275l57369j97840p3531
$$ 63917 310698 -1869 -534043 -709922 -332983 116031 93756 -263613 -461453 -534984
38556e34984m06742o39837j50943N54078N73192Q0586q6554K9150k56294o25918
$$ -534984 -941726 -1581563 -1732506 -1178428 -605236 -524650 -611204 -582054 -838348 -1464266
38546a464266L3296J507269J990223O83529q14094p96625J03816J44860p52192
$$ -1464266 -1430970 76299 2066522 2750051 1935957 1139332 1243148 1388008 635816
38537F35816j094800l09088M98745M08982o6380p4923K83670L87432J17421j82889
$$ 635816 -458984 -768072 -269327 139655 73275 -1648 282022 669454 786875 603986
38527F03986l53296m69849m88674k84376O0546L13352L74104L07859J91731R6586
$$ 603986 250690 -219159 -707833 -992209 -931663 -618311 -244207 63652 255383 351969
38517C51969J13611K28302K57141Q0957j32904j43309m6831k22964p40110j032284
$$ 351969 465580 693882 951023 1031980 899076 755767 708936 485972 -254138 -1286422
38507a286422m96716N82358J098331L94723p97627j165115m56443K80237K41459
$$ -1286422 -1783138 -1200780 -102449 292274 -505353 -1670468 -2126911 -1846674 -1605215
38498a605215m5604L09840J069741J188652M36027k43571j71619J28392q5261
$$ -1605215 -1650819 -1340979 -271238 917414 1353441 1109870 938251 1066643 981382
38489I81382n56143n26091j7950K30096j0183j35993K39270O49518N27875L7513
$$ 981382 425239 -100852 -118802 111294 101111 -34882 204388 853906 1381781 1419294
38479A419294k73290k37039m7605J99158M71663N45892K70080o8901j12910k6285
$$ 1419294 1146004 908965 861360 1060518 1532181 2078073 2348153 2279252 2166342 2140057
38469B140057k04337m87633k91071M13464Q64032N01714l01546q04410p69005
$$ 2140057 1935720 1448087 1157016 1570480 2434512 2936226 2634680 1830270 1061265
38460A061265m48476p3120K52738L82198K38253k4795k31189m02105n45123m51783
$$ 1061265 612789 539669 792407 1174605 1412858 1388063 1156874 754769 209646 -242137
38450b42137j1801M46561M79883J14359k05863k26676j51491k56114m69179m80701
$$ -242137 -253938 192623 672506 786865 581002 354326 202835 -53279 -522458 -1003159
38440a003159j96756P0978q129k73857k46977Q1699P0616n59947r70673k07655
$$ -1003159 -1199915 -1128937 -1137066 -1410923 -1657900 -1576201 -1505585 -2065532 -3036205 -3243860
38430c243860J250148J881207J114839k4487m82845l61162j25713K69082P66878
$$ -3243860 -1993712 -112505 1002334 977847 495002 133840 8127 277209 1044087
38421A044087P38092M7771l10131K67709O89976k61993j736672j804958l28172
$$ 1044087 1782179 1829950 1519819 1787528 2477504 2215511 478839 -1326119 -1654291
38412a654291Q82731P85795K46869J22827n3827o95278r88958k67211N65492K91260
$$ -1654291 -771560 14235 261104 383931 330104 -365174 -1354132 -1621343 -1055851 -764591
38402g64591o33629o84646M46576J421321J167062J92096l54457j99670L0226
$$ -764591 -1398220 -2082866 -1636290 -214969 952093 1144189 789732 590062 620288
38393F20288m3578l3851M28047Q69839N18215m38853r02003m62431j09156o47558
$$ 620288 576710 542859 970906 1840745 2358960 1920107 1018104 555673 446517 -201041
38383b01041j235430o43463O13121R13028R3117l32424K61877O14251j43127q73754
$$ -201041 -1436471 -2079934 -1466813 -553785 -460668 -793092 -531215 83036 -60091 -933845
38373i33845k91117Q89846J093828K76901l12018j97213l5201j56549j14044K51935
$$ -933845 -1224962 -335116 758712 1035613 723595 526382 491181 334632 220588 472523
38363D72523M01510j6438o11574p71266k76787N57775J014084N25847n00409q92129
$$ 472523 874033 857595 246021 -525245 -802032 -244257 769827 1295674 795265 -96864
38353i6864k38055M13000O3650p36963q59925l79485j63997j96711K40076R17799
$$ -96864 -334919 78081 141731 -595232 -1455157 -1834642 -1998639 -2195350 -1955274 -1037475
38343a037475P50589l17373r52377l74211N61856P47086K44844k31637l85443
$$ -1037475 -286886 -604259 -1556636 -1930847 -1368991 -621905 -377061 -608698 -994141
38334i94141k97337k6992K44750K58058J77957M12573P31402M21719l86456n75650
$$ -994141 -1291478 -1318470 -1073720 -815662 -637705 -225132 506270 927989 541533 -34117
38324c4117K40471Q83960L16690p08860p63276J03409N19154j17314q53869o66512
$$ -34117 206354 1090314 1407004 698144 -65132 38277 557431 440117 -413752 -1080264
38314a080264J72806O45998L91839L5534K02341O11465M64031l33294q43913l74663
$$ -1080264 -907458 -261460 130379 165913 368254 979719 1443750 1110456 266543 -108120
38304a08120L87185K63644o27830r84880k89795M50622L53478m4239J08174M97114
$$ -108120 279065 542709 -85121 -1070001 -1359796 -909174 -555696 -599935 -491761 5353
38294E353K93668l39988n07640l6953L56273K55168j9291j46482j71198q9997
$$ 5353 299021 -40967 -548607 -585560 -229287 25881 6590 -139892 -311090 -401087
38284d01087J92564M33941K65175j14501j47546J18583M8602m38586n83166j6602
$$ -401087 -208523 225418 490593 376092 228546 347129 395731 -42855 -626021 -642623
38274f42623M99709J67772o07399p99291k13957M07080N76561N56672N73443K96631
$$ -642623 -142914 24858 -582541 -1381832 -1595789 -1188709 -612148 -55476 517967 814598
38264H14598m81407j159790r17872J68296J114214J154605M71868k71614o91772
$$ 814598 333191 -826599 -1744471 -1576175 -461961 692644 1164512 892898 201126
38255B01126p58386n13771r8885J77336J84627K21397N42697Q33618O33584J30238
$$ 201126 -557260 -1071031 -1169916 -992580 -807953 -586556 -43859 789759 1423343 1553581
38245A553581p4717N6555l9760m79277o14528j08818M00581K57693j89724k12380
$$ 1553581 1478864 1535419 1495659 1016382 401854 293036 693617 951310 761586 549206
38235E49206R1170J1067n52241q97946n93699l5752K42756K64912L39361M99238
$$ 549206 640376 651443 99202 -798744 -1392443 -1428195 -1185439 -920527 -581166 -81928
38225h1928N20161K80219j21280m68141n27171k07931K42907L55037p4760o60328
$$ -81928 438233 718452 597172 129031 -398140 -606071 -363164 -8127 -82887 -743215
38215g43215p77961k96458J91984N8485m98137o06611R5541Q24195O50368j22732
$$ -743215 -1521176 -1817634 -1625650 -1567165 -2065302 -2671913 -2576372 -1752177 -1101809 -1224541
38205a224541k87138N44235J310956R37182k52440j061021r02287j85415M65387
$$ -1224541 -1511679 -967444 343512 1280694 1028254 -32767 -935054 -1120469 -655082
38196f55082P69021O90712L20077j01849l20329k43481R7148N53714P49901L42123
$$ -655082 113939 804651 1124728 1022879 702550 459069 556217 1109931 1859832 2201955
38186B201955m21996q38904o74504m43787m77936l55481K56372Q43188P81680
$$ 2201955 1779959 941055 266551 -177236 -655172 -1010653 -754281 88907 870587
38177H70587K80423j16556m03395o95263n28459M20105J366711J266196L09604
$$ 870587 1151010 1034454 631059 -64204 -592663 -172558 1194153 2460349 2769953
38168B769953m87627q41074j145329j217457n40819L76484M48593j27359q4696
$$ 2769953 2282326 1441252 295923 -921534 -1462353 -1085869 -637276 -764635 -849331
38159h49331O41770O57066l83880r04916K6585J047689O98326k88955m40401L6522
$$ -849331 -207561 449505 65625 -839291 -812706 234983 933309 644354 203953 240475
38149B40475M4058k27714J39762P25995K92241q86058j157901o9267R52992Q20720
$$ 240475 284533 56819 196581 922576 1214817 328759 -829142 -898409 54583 875303
38139H75303J51826o7384J27797K17821Q2504j99506n93653p55653k41867O18397
$$ 875303 1027129 959745 1087542 1305363 1387867 1188361 594708 -160945 -402812 215585
38129B15585Q87556L29884k89363m39359m10853m13044j59695K33272N1045p34238
$$ 215585 1103141 1433025 1143662 704303 293450 -119594 -279289 -46017 5028 -729210
38119g29210j053531l33961N24720O02749L71967O15248Q84705L70138l86218
$$ -729210 -1782741 -2116702 -1591982 -989233 -617266 -2018 882687 1252825 866607
38110H66607j84829P30513Q57548j84808r74365m79170L68430J65222q11868j084455
$$ 866607 681778 1412291 2269839 2085031 1110666 631496 999926 1165148 353280 -731175
38100g31175k28632N17383J15239p37273o37704M27380J014104L54398m70296
$$ -731175 -959807 -442424 -327185 -1064458 -1702162 -1274782 -260678 93720 -376576
38091c76576j78015P17045P36241j70957n71895M4655M43885j75781p50335j90647
$$ -376576 -554591 162454 898695 727738 155843 200498 644383 468602 -281733 -472380
38081d72380O74338M65989m03718m45722M41155R66062O36815K14909K927n69844
$$ -472380 201958 667947 264229 -181493 259662 1225724 1862539 2077448 2080375 1510531
38071A510531j381969j333490j97008P22906M87725k08947l94938j85490J9705
$$ 1510531 128562 -1204928 -1401936 -679030 -191305 -400252 -795190 -980680 -960975
38062i60975M68135J174756J223729J29368r98717q76029R3732N95567M05331
$$ -960975 -492840 681916 1905645 2035013 1036296 160267 253999 849566 1254897
38053A254897L16829N45316N48147J90445j39804m12668q20461r68078l82708
$$ 1254897 1571726 2117042 2665189 2855634 2715830 2303162 1482701 514623 131915
38044A31915L47087K21287m70503m76095L37014P18561J56930k75036J69931O07331
$$ 131915 479002 700289 229786 -246309 90705 809266 966196 691160 861091 1468422
38034A468422J01779o52459m81048K72311K76317o42496j191625m84550P99804
$$ 1468422 1570201 917742 436694 709005 985322 342826 -848799 -1333349 -533545
38025e33545J380330Q01109l82716j355873j653879j272636m99710K73657O62616
$$ -533545 846785 1647894 1265178 -90695 -1744574 -3017210 -3516920 -3243263 -2580647
38016b580647M63428n7694k35441K56999Q74184Q90838M93599M81195Q92969Q50239
$$ -2580647 -2117219 -2174913 -2410354 -2153355 -1279171 -388333 105266 586461 1479430 2329669
38006B329669K7204o84142n27791k4892n282k62619j29396J90993j6592o00810
$$ 2329669 2356873 1672731 1144940 1120048 1114766 852147 722751 913744 897152 296342
37996B96342o74598q2535L34145R8111k37504j00357K40411K71960P2159L7636
$$ 296342 -378256 -460791 -126646 -28535 -266039 -366396 -125985 145975 218134 255770
37986B55770J77499J47641k05316o49905q12790m84210J59034N84240L88068j94507
$$ 255770 433269 580910 375594 -274311 -1087101 -1571311 -1412277 -828037 -439969 -634476
37976f34476n08987k46436K72006N99061O41955N64339M95370M53725L67273J21039
$$ -634476 -1143463 -1389899 -1117893 -518832 123123 687462 1182832 1636557 2003830 2124869
37966B124869k49315m71736l76204k08193k86275m72327m06825j74429j84680
$$ 2124869 1875554 1403818 1027614 819421 533146 60819 -346006 -520435 -705115
37957g05115l74187j66508N59491J065147P10617j38390o29856n25829k69692
$$ -705115 -1079302 -1245810 -686319 378828 1089445 951055 321199 -204630 -474322
37948d74322j45241N6158M67919P28425M29701k09771m61196L8948P43313P72460
$$ -474322 -619563 -563405 -95486 632939 1062640 852869 391673 430621 1173934 1946394
37938A946394j2032q32906r84973o27009l34581k45825j15324N5639N2362J0586
$$ 1946394 1934362 1101456 116483 -510526 -845107 -1090932 -1206256 -1150617 -1098255 -1087669
37928a087669K97216P70380P98740K15329l35394l05431J5467M6412k29529m10335
$$ -1087669 -790453 -20073 778667 993996 658602 353171 368638 415050 185521 -224814
37918b24814l59089k49544j00254K52212P17371Q68092M21636l67896q98986p81082
$$ -224814 -583903 -833447 -933701 -681489 35882 903974 1325610 957714 58728 -722354
37908g22354k00146K95322M04570L58250M69918N97476L67913j64953m93523l19028
$$ -722354 -922500 -627178 -222608 135642 605560 1203036 1570949 1405996 912473 593445
37898E93445J08879L62239K37123j95839n87527m23741L84862J064934P24371
$$ 593445 702324 1064563 1301686 1105847 518320 94579 479441 1544375 2268746
37889B268746l97335j067830o39056J59595L01123k68170q13956p62850j11964
$$ 2268746 1871411 803581 164525 324120 625243 357073 -456883 -1219733 -1331697
37880a331697O42691P13934k74589j498513j520574q2243J391962J577122P83025
$$ -1331697 -689006 24928 -249661 -1748174 -3268748 -3350991 -1959029 -381907 401118
37871D01118R5259j81753l41740k84056J64737M25838j43369j002792j019646
$$ 401118 496377 314624 -27116 -311172 -146435 279403 136034 -866758 -1886404
37862a886404j57146N45329O01486N32175O41781N15603p115l97337l11798l7880
$$ -1886404 -2043550 -1498221 -896735 -364560 277221 792824 785709 388372 76574 38694
37852C8694J80445L95491L70460k51797r59139o78852N18972J199427O28117j34232
$$ 38694 219139 614630 985090 733293 -225846 -904698 -385726 813701 1441818 1307586
37842A307586m834M37979J61987m47545l44420K22054P4006q30422j230374n70133
$$ 1307586 1302752 1740731 1902718 1455173 1110753 1332807 1406813 576391 -653983 -1224116
37832a224116J91402J62249k33508j72104K66321M05213N8000l27749l61003r2133
$$ -1224116 -1032714 -870465 -1103973 -1276077 -1009756 -604543 -546543 -874292 -1235295 -1327428
37822a327428J70181J71307n9665k02317k5016K48467K26868l6032j05787J38934
$$ -1327428 -1157247 -985940 -1045605 -1247922 -1272938 -1024471 -797603 -833635 -939422 -800488
37812h00488L26907K10314J531p9137j41879k72741k69990m3173J19900N6404
$$ -800488 -473581 -263267 -261736 -340873 -482752 -755493 -1025483 -1068656 -948756 -892352
37802h92352J33271O73765J249625J114162K55750n21451o17015k57922L3083
$$ -892352 -759081 -85316 1164309 2278471 2534221 2012770 1395755 1137833 1170916
37793A170916J58066L58535O93098R25190Q39934M55179l7609m02471m88948l58653
$$ 1170916 1328982 1687517 2380615 3305805 4145739 4600918 4563309 4160838 3671890 3313237
37783C313237k39216k74883m01998n28375o73850q05822p33180l99058j14290
$$ 3313237 3074021 2799138 2397140 1868765 1194915 389093 -344087 -743145 -857435
37774h57435j77927l72357k31440K23573M88585L87984L37110N56934N97739J05250
$$ -857435 -1035362 -1407719 -1639159 -1415586 -927001 -539017 -201907 355027 952766 1058016
37764A058016m30819l55581M8344n7768o79053q52914r9963P85423Q33415J86515
$$ 1058016 627197 271616 319960 262192 -416861 -1269775 -1369738 -584315 249100 435615
$$ [...]
##END NTUPLES=NMR SPECTRUM
##END=
