##TITLE=31Pdec_PR177K4
 DMSO-d6, 24 sc
 20.8.2019
##JCAMPDX= 6.0         $$ Bruker NMR JCAMP-DX V2.0
##DATA TYPE= NMR SPECTRUM
##DATA CLASS= NTUPLES
##ORIGIN= UXNMR, Bruker Analytische Messtechnik GmbH
##OWNER= root
$$ XWIN-NMR		Version 3.5
$$ Tue Aug 20 14:53:20 2019 Russian Standard Time (UT+4h)  she@DPX200
##.OBSERVE FREQUENCY= 81.013821
##.OBSERVE NUCLEUS= ^31P
##.ACQUISITION MODE= SIMULTANEOUS
##.ACQUISITION SCHEME= undefined
##.AVERAGES= 24
##.DIGITISER RES= 17
##SPECTROMETER/DATA SYSTEM= spect
##.PULSE SEQUENCE= zgpg30
##.SOLVENT NAME= CDCl3
##.SHIFT REFERENCE= (INTERNAL, CDCl3, 0, 182.463)
##AUDIT TRAIL= $$ (NUMBER, WHEN, WHO, WHERE, WHAT)
$$ ##TITLE= Audit trail, XWIN-NMR		Version 3.5
$$ ##JCAMPDX= 5.01
$$ ##ORIGIN= Bruker BioSpin GmbH
$$ ##OWNER= she
$$ F:/spectra/data/she/nmr/P31/1/pdata/1/auditp.txt
$$ ##AUDIT TRAIL=  $$ (NUMBER, WHEN, WHO, WHERE, WHAT)
(   1,<2019-08-20 14:52:13.89 +0400>,<she>,<DPX200>,
      <created by zg, POWCHK disabled, PULCHK disabled
       configuration hash MD5:
       00 E9 B6 7A A2 85 ED C7 34 08 36 98 17 FE 4E 26
       data hash MD5: 32K
       7C DC 1E F3 1C A1 68 A2 56 9A 4D 97 F7 10 55 EF>)
(   2,<2019-08-20 14:52:16.43 +0400>,<she>,<DPX200>,
      <Start of raw data processing
       efp BC_mod = 2 LB = 1 FT_mod = 6 PKNL = 1 PHC0 = -425.4906 PHC1 = 142.6004 SI = 64K 
       data hash MD5: 64K
       58 63 54 48 0C AC 70 5F 46 9F 80 16 B0 DB 74 D8>)
(   3,<2019-08-20 14:52:29.26 +0400>,<she>,<DPX200>,
      <pk PHC0 = 6.88223 PHC1 = 0 
       data hash MD5: 64K
       01 7D 48 3D B3 91 89 4E 7C 7C 74 8C FA F1 58 26>)
(   4,<2019-08-20 14:52:34.00 +0400>,<she>,<DPX200>,
      <abs ABSG = 5 
       data hash MD5: 64K
       CE 4A C7 57 57 24 F6 A0 19 96 B0 2B B4 09 56 A3>)
(   5,<2019-08-20 14:52:55.98 +0400>,<she>,<DPX200>,
      <pk PHC0 = 13.55755 PHC1 = -60.8 
       data hash MD5: 64K
       96 B6 2E 7F 2E 48 FA 2F C0 41 5C EB DF 34 35 19>)
$$ ##END=
$$ 
$$ hash MD5
$$ 9E E5 C6 AE F7 17 A6 9E F0 22 F9 F1 66 E2 AE 6C
##$RELAX= 
##$RELAX= 
##$RELAX= 
##$RELAX= 
##$RELAX= 
##$RELAX= 
##$RELAX= 
##$RELAX= 
$$ Bruker specific parameters
$$ --------------------------
##$DU= <F:/spectra>
##$EXPNO= 1
##$NAME= <P31>
##$PROCNO= 1
##$TYPE= <nmr>
##$USER= <she>
##$AMP= (0..31)
100 100 100 100 100 100 100 100 100 100 100 100 100 100 100 100 100 100 
100 100 100 100 100 100 100 100 100 100 100 100 100 100 
##$AQSEQ= 0
##$AQ_mod= 1
##$AUNM= <au_zg>
##$AUTOPOS= <>
##$BF1= 81.014009
##$BF2= 200.13
##$BF3= 200.13
##$BF4= 200.13
##$BF5= 200.13
##$BF6= 200.13
##$BF7= 200.13
##$BF8= 200.13
##$BYTORDA= 1
##$CFDGTYP= 0
##$CFRGTYP= 5
##$CHEMSTR= <none>
##$CNST= (0..31)
1 1 145 1 1 1 1 1 1 1 1 1 1 1 1 1 1 1 1 1 1 1 1 1 1 1 1 1 1 1 1 1 
##$CPDPRG= <waltz16>
##$CPDPRG1= <>
##$CPDPRG2= <waltz16>
##$CPDPRG3= <>
##$CPDPRG4= <mlev>
##$CPDPRG5= <mlev>
##$CPDPRG6= <mlev>
##$CPDPRG7= <mlev>
##$CPDPRG8= <mlev>
##$CPDPRGB= <>
##$CPDPRGT= <>
##$D= (0..31)
0 1 0 0 0 0 0 0 0 0 0 0.03 2e-05 3e-06 0 0 0 0 0 0 0 0 0 0 0 0 0 0 0 0 
0 0 
$$ [...]
##$SUBNAM3= <"">
##$SUBNAM4= <"">
##$SUBNAM5= <"">
##$SUBNAM6= <"">
##$SUBNAM7= <"">
##$SUBNAM8= <"">
##$SUBNAM9= <"">
##$SW= 369.568048894756
##$SWIBOX= (0..15)
0 1 3 0 0 0 0 0 0 0 0 0 0 0 0 0 
##$SW_h= 29940.119760479
##$TD= 32768
##$TD0= 1
##$TE= 0
##$TE2= 300
##$TE3= 300
##$TEG= 300
##$TL= (0..7)
0 120 53 12 22 120 120 120 
##$TP= (0..7)
150 150 150 150 150 150 150 150 
##$TP07= 0
##$TPNAME0= <>
##$TPNAME1= <>
##$TPNAME2= <>
##$TPNAME3= <>
##$TPNAME4= <>
##$TPNAME5= <>
##$TPNAME6= <>
##$TPNAME7= <>
##$TPOAL= (0..7)
0.5 0.5 0.5 0.5 0.5 0.5 0.5 0.5 
##$TPOFFS= (0..7)
0 0 0 0 0 0 0 0 
##$TUNHIN= 0
##$TUNHOUT= 0
##$TUNXOUT= 0
##$USERA1= <user>
##$USERA2= <user>
##$USERA3= <user>
##$USERA4= <user>
##$USERA5= <user>
##$V9= 5
##$VALIST= <valist>
##$VCLIST= <CCCCCCCCCCCCCCC>
##$VD= 0
##$VDLIST= <DDDDDDDDDDDDDDD>
##$VPLIST= <PPPPPPPPPPPPPPP>
##$VTLIST= <TTTTTTTTTTTTTTT>
##$WBST= 1024
##$WBSW= 4
##$XGAIN= (0..3)
0 0 0 0 
##$XL= 0
##$YL= 0
##$YMAX_a= 13936
##$YMIN_a= -15250
##$ZGOPTNS= <>
##$ZL1= 120
##$ZL2= 120
##$ZL3= 120
##$ZL4= 120
##$ABSF1= 182.463
##$ABSF2= -187.1042
##$ABSG= 5
##$ABSL= 3
##$ALPHA= 0
##$AQORDER= 0
##$ASSFAC= 0
##$ASSFACI= 0
##$ASSFACX= 0
##$ASSWID= 0
##$AUNMP= <proc_1d>
##$AZFE= 0.1
##$AZFW= 0.5
##$BCFW= 0
##$BC_mod= 2
##$BYTORDP= 0
##$COROFFS= 0
##$CY= -3
##$DATMOD= 1
##$DC= 0
##$DFILT= <>
##$DTYPP= 0
##$F1P= 0
##$F2P= 0
##$FCOR= 1
##$FTSIZE= 65536
##$FT_mod= 6
##$GAMMA= 0
##$GB= 0
##$INTBC= 1
##$INTSCL= 5.30512e-09
##$ISEN= 30
##$LB= 1
##$LEV0= 0
##$LPBIN= 0
##$MAXI= 10000
##$MC2= 0
##$MEAN= 0
##$ME_mod= 0
##$MI= 50
##$NCOEF= 0
##$NC_proc= -6
##$NLEV= 6
##$NOISF1= 182.463
##$NOISF2= 159.3651
##$NSP= 0
##$NTH_PI= 0
##$NZP= 0
##$OFFSET= 182.463
##$PC= 4
##$PHC0= -405.0508
##$PHC1= 81.8004
##$PH_mod= 1
##$PKNL= yes
##$PPARMOD= 0
##$PSCAL= 0
##$PSIGN= 0
##$REVERSE= no
##$SF= 81.0140089999434
##$SI= 65536
##$SIGF1= 159.3651
##$SIGF2= -187.1042
##$SINO= 113.3802
##$SIOLD= 16384
##$SREGLST= <1H.CDCl3>
##$SSB= 0
##$STSI= 65536
##$STSR= 0
##$SW_p= 29940.119760479
##$SYMM= 0
##$S_DEV= 0
##$TDeff= 32768
##$TDoff= 0
##$TI= <>
##$TILT= no
##$TM1= 0
##$TM2= 0
##$TOPLEV= 0
##$USERP1= <user>
##$USERP2= <user>
##$USERP3= <user>
##$USERP4= <user>
##$USERP5= <user>
##$WDW= 1
##$XDIM= 65536
##$YMAX_p= 404381634
##$YMIN_p= -68678549
$$ End of Bruker specific parameters
$$ ---------------------------------
##NTUPLES= NMR SPECTRUM
##VAR_NAME=  FREQUENCY,     SPECTRUM/REAL,   SPECTRUM/IMAG
##SYMBOL=    X,             R,               I
##VAR_TYPE=  INDEPENDENT,   DEPENDENT,       DEPENDENT
##VAR_FORM=  AFFN,          ASDF,            ASDF
##VAR_DIM=   65536,         65536,           65536
##UNITS=     HZ,            ARBITRARY UNITS, ARBITRARY UNITS
##FACTOR=    0.456856943014862, 1,           1
##FIRST=     14782.0589164792, 0,            0
##LAST=      -15158.0608439998, 0,           0
##MIN=       -15158.0608439998, -68678549,   0
##MAX=       14782.0589164792, 404381634,    0
$$ Real data points
##PAGE= N=1
##DATA TABLE= (X++(R..R)), XYDATA
$$ [...]
46069 118012 313157 1074576 2304310 3188537 3270061 3178674 3466327 3323146 1735600 -439732
46059 -439732 -1170902 -76726 1084778 1051175 450800 29856 -619651 -1579564 -1703522
46050 -1703522 -601295 99509 -872560 -2239818 -2200092 -1309459 -1222033 -1723672 -1476889
46041 -1476889 -839047 -1179239 -1874138 -976740 1120513 1802289 519001 -209344 810150
46032 810150 1180421 -1023023 -3610306 -3325630 -727342 799633 -69322 -1384177 -1285181
46023 -1285181 -201033 606647 908621 1318265 2205950 3115478 2841222 495262 -2895061
46014 -2895061 -4651196 -3339309 -631488 973651 1413802 2293022 3522764 3150019 812981
46005 812981 -964504 -61264 2344953 3590165 3065960 2346205 2418179 2531232 1897748
45996 1897748 1035781 724684 633718 -17803 -980313 -1318498 -1117005 -1513296 -2602590
45987 -2602590 -2679025 -650796 1904636 2716046 2129483 2408515 3934395 4473179 2759084
45978 2759084 468636 -530892 -779709 -1453217 -1860121 -804584 922476 1675598 1627372
45969 1627372 2056039 2716826 2322709 1184521 860911 1294498 833104 -698433 -1511599
45960 -1511599 -997208 -813260 -1804507 -2178537 -276575 2662524 4191167 3793683 2774601
45951 2774601 2057561 1634103 1485089 1639977 1692356 1268375 619651 57609 -644979 -1658985
45941 -1658985 -2579746 -3113995 -3526800 -3792956 -3176273 -1382287 704202 2153369 3013678
45932 3013678 3541359 3443415 2723594 2216043 2272998 1933710 497276 -1069291 -1505378
45923 -1505378 -1088582 -783333 -515271 160279 490865 -550180 -2174045 -2381003 -626417
45914 -626417 1554097 2573613 2221595 1197331 440328 795481 2189214 3322246 3241351
45905 3241351 2757988 3028609 3359270 2205897 20287 -964230 54351 1392615 1470709
45896 1470709 668396 1779 -393531 -704922 -811145 -931646 -1540195 -1965635 -609916
45887 -609916 2482607 4704685 3780349 541341 -2328846 -3380669 -3068248 -2215257 -1209316
45878 -1209316 -348077 165429 510814 913494 1285745 1600513 2080477 2594957 2549929 1820826
45868 1820826 978904 112312 -1531316 -3978853 -5689656 -5346069 -3655507 -2282560 -1722100
45859 -1722100 -1347171 -864435 -473100 -99812 299345 95387 -1188728 -2823110 -3811110
45850 -3811110 -4459559 -5752987 -7529482 -8628634 -8604634 -7923191 -6668286 -4562056 -2232723
45841 -2232723 -877715 -466079 176780 1142925 920335 -1162170 -3368400 -3496965 -1503179
45832 -1503179 752262 1723956 1351832 523617 84020 107063 -199624 -1503309 -3181420
45823 -3181420 -3855966 -3232616 -2457438 -2298264 -2055435 -937220 505119 1251306 1340475
45814 1340475 1506007 1845626 1871565 1493589 994883 337715 -572731 -1173877 -752378 416913
45804 416913 1271316 1231502 521272 -599649 -1989630 -3062871 -3112201 -2411254 -2072963
45795 -2072963 -2477552 -2693267 -1910740 -661645 19507 34908 98583 570266 1148163 1520237
45785 1520237 1635868 1394382 703597 -78823 -327511 34304 348586 101843 -375816
45776 -375816 -408173 91481 541293 409004 -323784 -1315549 -2102930 -2198606 -1396328 -174409
45766 -174409 532504 261013 -430869 -558748 257477 1494380 2254938 1934011 660908
45757 660908 -599838 -692187 469987 1433267 591499 -1932501 -4344997 -5177435 -4584229
45748 -4584229 -3493586 -2323841 -1179283 -643178 -1299492 -2551008 -2932792 -1958611 -894962
45739 -894962 -1115871 -2229585 -2650027 -1799208 -752173 -467218 -376126 489778 1693278
45730 1693278 1924775 1117320 612529 889646 582931 -1280627 -3258637 -3184160 -1217369
45721 -1217369 440124 662823 512517 1027199 1635359 1506668 1007483 731721 213727
45712 213727 -1118493 -2470786 -2508122 -1290521 -195209 -41542 -301975 -153162 557385
45703 557385 1462314 2130305 2333881 2314799 2594062 3061310 2687053 868167 -1344525
45694 -1344525 -2300509 -1804433 -1139535 -1160420 -1408836 -1183655 -467558 420058 1170493 1223757
45684 1223757 26112 -2115422 -4172007 -5634311 -6828603 -7755495 -7591764 -5940960
45676 -5940960 -3830442 -2735637 -3000754 -3734191 -3933270 -3315218 -2325875 -1624644 -1372239
45667 -1372239 -1028005 -190095 604597 622475 256908 567483 1493478 1759179 841833 -240839
45657 -240839 -600758 -648923 -919075 -1030600 -729423 -701704 -1255403 -1419623 -668198 -339774
45647 -339774 -1698984 -3589057 -3952265 -3029774 -2986322 -4666124 -6774073 -8171589 -8855298
45638 -8855298 -8524967 -6489146 -3667093 -2541437 -3978173 -5763117 -5477328 -3399247
45630 -3399247 -1390119 -283244 268253 525357 702434 1365788 2441503 2679336 1439237
45621 1439237 94260 130265 732145 87996 -1561939 -2262747 -1438590 -450252 22553
45612 22553 863874 2224298 2607390 1398519 350445 973029 1999528 1345135 -513941
45603 -513941 -1264989 -362169 267749 -739576 -2362351 -2991554 -2510222 -1744007 -1019580
45594 -1019580 -220528 551980 1250601 2127264 2891178 2356095 -22674 -2802440 -3939498
45585 -3939498 -3238411 -2214020 -1699842 -1054643 42487 593758 -78432 -922064 -552390
45576 -552390 737973 1599726 1734510 2037304 2793864 3084986 2266714 989142 292065
45567 292065 439657 1039215 1642745 1831190 1324068 481090 210239 910145 1860356 2035172
45557 2035172 1200241 -71352 -1078786 -1422341 -1211219 -1155228 -1975912 -3395927 -4238161
45548 -4238161 -3901211 -3117066 -2740893 -2499165 -1737790 -824257 -738055 -1493450 -1990202 -1440970
45538 -1440970 -109840 1349936 2431589 2635304 1757695 524807 21554 196452 -127634
45529 -127634 -1333553 -2144547 -1469871 -233343 -228180 -1640544 -2942733 -3099878 -2619205
45520 -2619205 -2208862 -1654023 -678736 105287 115476 -23016 569093 1256029 528159 -1469157
45510 -1469157 -2629598 -1840772 -766957 -1325410 -2553249 -1970983 460911 2098680 1604882
45501 1604882 798414 1448328 2392378 1696134 57589 -310994 698794 1138654 441819
45492 441819 269805 1500676 2704859 2586659 1990287 2178295 2672320 2322461 1418439
45483 1418439 1198544 1956748 2969050 3704288 3851505 2743069 179866 -2493903 -3541269
45474 -3541269 -2990127 -2447753 -2829094 -3455065 -3419289 -2651900 -1481642 -294390 139936
45465 139936 -837804 -2539164 -3242977 -2290555 -951444 -613616 -986428 -849219 141327
45456 141327 1279163 1964231 2106661 1581959 189161 -1646990 -2710079 -1969284 258520
45447 258520 2272635 2390694 625334 -1239202 -1590803 -720965 -41921 34603 337043
45438 337043 1095161 1293852 454062 -247798 308599 1339922 1294587 147288 -848277
45429 -848277 -1283553 -1937062 -3057816 -3860606 -4038928 -4323714 -4906237 -4633628 -2801910
45420 -2801910 -774786 -513037 -1925417 -2946612 -2246686 -754186 -133770 -635239 -1171615
45411 -1171615 -1083722 -896976 -1141848 -1203477 -115848 1743946 2730079 2013058 716958
45402 716958 277354 423557 -88098 -1224491 -1699742 -1335805 -1741106 -3846528 -6097613
45393 -6097613 -6314896 -4517258 -2621739 -1871420 -1882994 -1986361 -2124511 -2267308 -2096163
45384 -2096163 -1652916 -1444460 -1562982 -1454882 -873445 -305485 -76453 209256 800156
45375 800156 1029274 139931 -1459435 -2427390 -1895947 -252291 1374833 2136943 2144297
45366 2144297 2356643 3595132 5470029 6557195 5854787 3789970 1606924 159168
45358 159168 -408861 -263913 267341 670536 608680 312765 286146 679504 1219518 1634926
45348 1634926 1845275 1776482 1256215 166182 -1304508 -2490032 -2521016 -1189387 523637
45339 523637 1389514 1465907 1895034 2897463 2986631 1000243 -1864249 -3190338 -2197034
45330 -2197034 -389847 504529 201776 -605461 -1352459 -1852260 -2094170 -2149582 -1936488
45321 -1936488 -1074722 534219 2062035 2353476 1233505 -354196 -1477086 -1859708 -1570358
45312 -1570358 -965428 -918212 -2027142 -3382494 -3235362 -1342246 421391 421556 -753312
45303 -753312 -1488828 -1412709 -1356010 -1625034 -1561385 -760511 252346 759038 677536 494545
45293 494545 664467 1069905 974567 -187926 -1839202 -2614748 -2039008 -1217480 -1300001 -1853661
45283 -1853661 -1549888 -72168 1503577 2057871 1466627 458095 45577 887977 2577652
45274 2577652 3735919 3370867 1897243 339141 -925959 -1858550 -1837878 -314381 1833132
45265 1833132 2894158 2394531 1438811 836022 98220 -1251421 -2459982 -2370530 -847972
45256 -847972 1159954 2542463 2727549 1999245 1347327 1492957 2003895 2001102 1606219 1668388
45246 1668388 2079214 1769079 785394 855426 2958835 5611516 6726702 6145885 5061712
45237 5061712 3905074 2382801 959475 553453 963910 1184802 1207283 1909633 3071854
45228 3071854 3232506 2007687 923386 1097464 1497023 618365 -1223910 -2632144 -3396253
45219 -3396253 -4518334 -6143807 -6802463 -5070168 -1301501 2519676 4312150 3421932
45211 3421932 1123875 -479750 -448506 320613 693987 894768 1679247 2596594 2490975
45202 2490975 1570864 1339568 2087007 2103450 357968 -1448759 -998620 1328459 2903693
45193 2903693 2272768 529744 -734207 -1263195 -1477905 -1390503 -1028345 -979608 -1557765
45184 -1557765 -1976546 -1228735 474784 1817670 1822617 754546 -306122 -518655 -27562
45175 -27562 277344 -57821 -354031 100914 554616 -410012 -2456912 -3358530 -1968563
45166 -1968563 51872 537005 -419091 -1352059 -1882438 -2458794 -2500727 -1007383 1191877
45157 1191877 1943359 757943 -624901 -1042889 -1372443 -2518630 -3744834 -3980483 -3306570
45148 -3306570 -2171036 -547133 1086942 1375490 -4010 -1306486 -996610 87873
45140 87873 388270 313244 1319270 3031097 3501091 2271133 1099107 1189473 1461140
45131 1461140 427704 -1456750 -2402066 -1654847 -388054 -233140 -1291590 -1851831 -380527
45122 -380527 2279905 3514860 2133522 -26965 -553444 463544 1100872 548319 -314031
45113 -314031 -851444 -1280433 -1329478 -217073 1585763 2282254 1126243 -559702 -1410312
45104 -1410312 -1680221 -2164099 -2842307 -3456816 -4109138 -4368914 -3201403 -946894 57818
45095 57818 -1582692 -3897279 -3890097 -1566799 271851 -129584 -1709222 -2571472 -1981760
45086 -1981760 -221256 1913883 3090385 2350910 530051 -464187 -160215 -16958 -976644
45077 -976644 -2005592 -1894654 -1145645 -899762 -1051417 -774731 -211825 -251190 -994213 -1672205
45067 -1672205 -1847174 -1561217 -547944 1401841 3291007 3459221 1600378 -841617 -2606335
45058 -2606335 -3834601 -4936538 -5506922 -5238758 -4876592 -5077558 -5000023 -3354272 -602142
45049 -602142 1165123 660607 -1276476 -2955755 -3536779 -3236201 -2733043 -2789060 -3734100
45040 -3734100 -4835739 -4759523 -3148955 -1240829 -397771 -507724 -462277 150003 609674
45031 609674 280264 -427714 -573992 137623 954768 846484 -353285 -1665994 -2002843
45022 -2002843 -1401584 -914970 -1281396 -2120258 -2524496 -2016921 -810049 418837 909023
45013 909023 515907 125322 699534 1824150 2150868 1533237 1431660 2448571 2847149
45004 2847149 963206 -1898558 -2855075 -1383890 26365 -648797 -2559350 -3608723
44996 -3608723 -3026385 -1459134 362589 1960308 2753111 2408008 1400898 619435 491924
44987 491924 826186 1297288 1772381 2236752 2544679 2275846 1118217 -359754 -803059
44978 -803059 398506 2028010 2360134 1327511 347452 127762 -70571 -784430 -1309406
44969 -1309406 -926018 -85744 398181 519693 638668 493838 -496516 -2184691 -3495421
44960 -3495421 -3260084 -1275888 1133102 1907732 394130 -1550525 -1662950 -254435 378348
44951 378348 -557944 -1441255 -1287367 -1460895 -3037763 -4447428 -3654200 -1273933 554001
44942 554001 1362475 2211941 3035967 2552731 808730 -379772 32048 1090185 1683588
44933 1683588 2047451 2696708 3142157 2586842 1102394 -635041 -2191056 -3310081 -3458122
44924 -3458122 -2155855 182187 2112681 2219448 529707 -1304132 -1701954 -888041 -194099
44915 -194099 149382 1148436 2753827 3247664 1900061 505746 767448 1727788 1761766
44906 1761766 1697441 3350904 5767026 5855543 2843015 -496219 -1508206 -361350 1389216
44897 1389216 2804244 3441699 3131492 2632672 2964408 3659342 3356600 2320024 2220588
44888 2220588 3017509 2576290 285952 -1537184 -1238894 -332073 -625247 -1206167 -588739
44879 -588739 150518 -827373 -2551956 -2432028 -384707 992941 295336 -1056422 -1285529
44870 -1285529 -332178 958902 2048506 2589725 2380423 1860528 1722045 1872066 1667237
44861 1667237 1159439 1143666 1913897 2796789 2955063 2075730 520691 -643840 -336827
44852 -336827 1066946 1693666 591000 -632552 94022 2301886 3682797 3289028 2248103
44843 2248103 1479896 595161 -639841 -1381516 -877923 493809 1736939 1978359 740779
44834 740779 -1504668 -3131209 -2839860 -1331205 -390066 -437688 -273864 813362 2068166
44825 2068166 2483846 1739234 -41684 -2102511 -2742916 -826807 2307297 4075773 3879314
44816 3879314 3337792 3252412 2578821 968877 -46165 441159 1116195 759712 302908
44807 302908 931637 1767857 1319094 11670 -591757 -158132 596281 1593702 3065735
44798 3065735 4172398 3803639 2456411 1727628 2203842 3233230 4304602 5080056 4553247
44789 4553247 2099835 -716487 -1322508 544634 2352286 2075223 497943 -356662 288788
44780 288788 1851210 3627457 5169877 6058930 6088454 5379079 3985225 1858108 -586096
44771 -586096 -2479554 -3397302 -3722384 -3906109 -3920565 -3628240 -3087371 -2277252 -1103477
44762 -1103477 163403 1078698 1742038 2542215 3070110 2330268 456784 -882526 -590156
44753 -590156 266267 -20883 -1393949 -2382292 -2431842 -2457774 -3032441 -3420700 -2946203 -2190606
44743 -2190606 -1993087 -2039528 -1446342 -287863 533973 765098 1003419 1308020 817313
44734 817313 -678120 -1856341 -1517113 -356074 54700 -453393 -687182 -141849 473960
44725 473960 836006 1553713 2645090 2977387 2071896 1126271 1155031 1326113 520502 -476160
44715 -476160 -63542 1463643 2132770 1172134 20585 154899 1241570 1911717 1398496
44706 1398496 24557 -1202484 -1313406 -342441 555374 682941 1003884 2540115 4078747
44697 4078747 3337256 424855 -1915209 -2034376 -1330136 -1596774 -2442687 -2704904 -2624055
44688 -2624055 -2823962 -2551272 -955172 886274 1287416 597095 455100 941835 686011
44679 686011 -407960 -873798 -330224 -147686 -882997 -1165934 -75528 1244053 1490067
44670 1490067 1104682 1032417 1080827 941842 1436632 2981993 3928221 2490083 -250862
44661 -250862 -1368121 -33682 1463309 908098 -1268639 -3076667 -3256355 -1964822 -340033
44652 -340033 137079 -1079970 -2557220 -2248746 -286064 995015 429889 -213762 957220
44643 957220 2931290 3390563 2297010 1677174 2195911 2244232 795388 -878035 -1212709
44634 -1212709 -449043 416388 1485194 3359381 5443914 6235284 5070055 2640743 102074
44625 102074 -1451040 -1129817 823106 2393980 1503136 -1301011 -3073543 -2019136 260141
44616 260141 989668 -166739 -1086087 -478299 396741 -130633 -1537632 -1865917 -538441
44607 -538441 985922 1491414 1579577 2229974 2891693 2327730 854409 186382 892221
44598 892221 1438292 429469 -1340634 -2066933 -1398517 -604504 -659124 -1265314 -1730804
44589 -1730804 -1848755 -1708408 -1332243 -787348 -275839 -1539 -173227 -925036 -1806135
44580 -1806135 -1677170 124375 2589273 3797395 3014765 1393338 460172 570984 1052199
44571 1052199 1187621 684538 -332139 -1382145 -1988010 -2204631 -2484592 -2900958 -2953262
44562 -2953262 -2371658 -1693019 -1699671 -2487731 -3297955 -3191446 -1954103 -500600 -125418
44553 -125418 -1001719 -1797362 -1347440 -228543 245163 144671 671226 1864528 2199289
44544 2199289 932774 -653761 -1131736 -690944 -94184 786322 2090458 2753982 1796298
44535 1796298 195440 -82834 1379110 3204932 4173877 4066139 2878111 750125 -1295570
44526 -1295570 -2004140 -1543102 -1306421 -1853764 -2246582 -1715480 -774732 -228358 -150001 -364459
44516 -364459 -961251 -1748112 -2028391 -1499245 -691796 -86701 473447 1049342 1051070 6372
44506 6372 -1631532 -2856521 -2882241 -1493655 654430 2079935 1824053 896959 1179857
44497 1179857 2633057 3088650 1449824 -509575 -646667 683355 1676646 1750521 1450488
44488 1450488 679058 -942818 -2424232 -2189608 -525302 596467 337535 -88686 324611
44479 324611 919495 846934 461450 316206 47037 -639067 -875310 191474 1733244
44470 1733244 1986164 466835 -1551547 -2730944 -2948016 -2715610 -2096966 -771576 1024122
44461 1024122 2195481 1798282 218919 -1139799 -1505491 -1528791 -2054768 -2742652 -2675430
44452 -2675430 -1857278 -1081140 -572834 60056 578844 109865 -1349397 -2636809 -3067256
44443 -3067256 -3228112 -3620533 -3665894 -2776559 -1377018 -95127 1058352 1912655 1670615
44434 1670615 279488 -790925 -442607 267289 -296877 -1707404 -2060106 -784048 825940
44425 825940 1732816 2141836 2263368 1703239 510888 -437288 -532305 74236 1189868
44416 1189868 2634485 3489445 2685894 672102 -826056 -1042107 -772533 -443451 643647
44407 643647 2373982 2980295 1485810 -477372 -814455 246281 1068734 1188145 1158545
44398 1158545 731914 -679031 -2129590 -1879592 -48678 1379587 1412739 1051365 1064750
44389 1064750 704442 -539949 -1637561 -1663870 -1394877 -1884044 -2459263 -1690482 137885
44380 137885 1012657 -288467 -2698820 -4119917 -3585264 -2031169 -1233243 -1959709 -3073051
44371 -3073051 -2783838 -870703 1053861 1831541 2329067 3788291 5399434 4999778 2102167
44362 2102167 -1163211 -2506936 -1807806 -491528 423078 853119 924603 742348 692974
44353 692974 1107571 1550070 1134476 -230717 -1462032 -1471668 -276890 1417923 3231298
44344 3231298 4943946 5577890 3810859 -92198 -3568649 -4037597 -1731989 650914
44336 650914 1137320 357012 20982 652344 1627848 2631313 3837103 4850765 4615616
44327 4615616 2710596 136218 -1465229 -1126385 733478 2425851 2104488 -410701
44319 -410701 -2970848 -3164734 -1157401 485058 4953 -1643301 -2558637 -2278669 -1454088
44310 -1454088 -316350 1062463 1718852 740204 -936168 -1336397 -204001 646630 92217
44301 92217 -797921 -715232 -873 493162 1028758 1996783 2371662 931408 -1481198 -2616177
44291 -2616177 -1583010 489905 2336254 3462482 3283669 1338713 -1131760 -1708145
44283 -1708145 108009 1827664 1175046 -921424 -1851379 -760231 1018286 2156160
44275 2156160 2355807 1679798 484988 -146661 563186 1572830 919419 -1646822 -4145915
44266 -4145915 -4756334 -3602405 -1883129 -392504 591721 971919 1057926 1444092 2156483
44257 2156483 2513819 2150085 1462316 747695 -221885 -1275300 -1384038 95363 2286149
44248 2286149 3613753 3398701 2124455 571704 -728188 -1490631 -1686000 -1511149 -1229664
44239 -1229664 -1223773 -1970044 -3303513 -3922206 -2721215 -683092 -105802 -1556390 -3031158
44230 -3031158 -2839013 -1765340 -1239381 -901241 270861 1556062 1349797 -49017 -585423
44221 -585423 585226 2054147 2312334 1407008 158811 -849915 -1146134 -556393 53327
44212 53327 -544462 -2104550 -2961345 -2339738 -1325402 -967245 -784187 -63533 567590
44203 567590 95734 -1113986 -1714549 -1175892 -245524 159585 -194136 -898780 -1248318
44194 -1248318 -783820 85423 342267 -387184 -1260864 -1262274 -341380 831177 1667975 1798287
44184 1798287 1035341 -214367 -1008589 -845022 -118719 707678 1638935 2429116 2333145
44175 2333145 1362026 814060 1481811 2182817 1394941 -325204 -1128061 -706206 -614819
44166 -614819 -1676499 -2715956 -2369109 -804922 960775 2282554 2696532 1605455 -833753
44157 -833753 -3163199 -3918826 -3154922 -2053667 -1463626 -1485669 -1986974 -2573954 -2291023
44148 -2291023 -407624 2301775 3909183 3370382 1602332 71745 -1085939 -2713475
44140 -2713475 -4668153 -5355602 -3737020 -1022172 530256 194875 -740184 -955968 -473358
44131 -473358 207655 1139320 2269840 2655489 1523727 -266812 -997830 -246328 773880
44122 773880 1054249 883868 819156 612951 -195974 -1339485 -2169928 -2540419 -2732697 -2773837
44112 -2773837 -2376386 -1493773 -589166 -335820 -1077247 -2353253 -2972386 -2030633 -45930
44103 -45930 1388669 1355201 558616 216197 547429 912639 1002642 1104751 1282853 1028641
44093 1028641 -40344 -1526377 -2507099 -2326410 -1182017 -83764 -16334 -819959 -1139318
44084 -1139318 -6710 1658579 1854689 -16965 -2168204 -2431713 -799140 692913
44076 692913 424087 -1141509 -2315567 -2080035 -784295 598613 1373537 1400940 975759
44067 975759 603532 686294 1284144 2194772 3159982 3851135 3843541 2997338 1866809 1309082
44057 1309082 1504527 1689590 1106701 -19057 -718999 -360810 711014 1507367 1251873
44048 1251873 79198 -1009099 -1082448 -239628 663971 1260832 2046568 3199821 3725565
44039 3725565 2583985 371377 -1027479 -546006 1000717 2099733 2107271 1338633 264363
44030 264363 -730182 -1078311 -303951 1197805 2140914 1647450 491740 450958 2113162
44021 2113162 3860108 3679479 1657712 -231368 -729502 -559888 -819522 -1318377 -1251323
44012 -1251323 -536690 410974 1391155 1949277 1123889 -1102754 -2938733 -2866039 -1911467
44003 -1911467 -2127242 -3374021 -3696782 -2670347 -1969770 -2274645 -2064287 -434942 1115589
43994 1115589 1078871 220662 -71181 -39421 -393580 -372981 965986 2590067 2742914 1656479
43984 1656479 974695 1032921 812248 224965 208690 592260 114007 -1160828 -1619594 -811426
43974 -811426 -200489 -383640 219863 2471902 4258819 3185685 306155 -1104776 -39482
43965 -39482 1159040 387712 -1504409 -2463514 -2254995 -2344881 -3350340 -4089543 -3442820
43956 -3442820 -2049235 -1353302 -1601528 -1865672 -1843067 -2299026 -3347306 -3645167 -2299511
43947 -2299511 -530594 -48977 -440466 190544 2176417 3586304 2845776 597769 -1505365
43938 -1505365 -2561550 -2433207 -1291787 72425 543306 89649 -33980 764453 1294032
43929 1294032 387338 -1101303 -1367808 -202840 768197 230230 -1382579 -2552017 -2145555
43920 -2145555 -364684 1316421 1457702 247307 -729431 -610723 -235026 -438736 -603406
43911 -603406 -52360 241861 -916198 -2474043 -2127663 213371 1885226 894877 -1699991
43902 -1699991 -3539071 -3740195 -3043056 -2258362 -1665194 -1354590 -1204089 -742469 320784
43893 320784 1562747 2182075 1689718 210548 -1446654 -1997031 -730758 1326954 2067335
43884 2067335 640599 -1445425 -2109646 -1013636 550454 1584003 2318905 3329887
43876 3329887 4458861 4889049 4049651 2337008 915011 603314 946954 731108 -507868
43867 -507868 -1935335 -2546153 -2325468 -1974435 -1951649 -2209622 -2546284 -2799603 -2875739 -2817294
43857 -2817294 -2650062 -2169153 -1340942 -869058 -1552016 -2932254 -3648720 -3606276 -4539041
43848 -4539041 -7361187 -10028869 -9641027 -6222251 -2795368 -1697324 -2313402 -2734585 -2223129
43839 -2223129 -1334982 -662251 -372570 -491919 -960274 -1595264 -2232179 -2615178 -2245909
43830 -2245909 -1010403 112532 -16130 -841934 -350459 2287425 5407391 6997526 7093965
43821 7093965 6899509 6424915 4602750 1442624 -1495883 -2953698 -3047980 -2274034 -690441
43812 -690441 1383536 2941356 3315019 2903268 2261592 1248216 -139853 -833493 252365
43803 252365 2526325 4188930 4375086 3861282 3592078 3559041 3421336 3147348 2467691
43794 2467691 779221 -1426018 -1984001 569530 4424147 5991107 4193807 1650721
43786 1650721 964366 1499812 1166337 41476 177218 2233641 4375162 4856943 4036237
43777 4036237 3158483 2555944 1982732 1652452 1837374 2089797 1819718 1182511 644315
43768 644315 221137 -88172 222633 1278021 1982976 1242608 -329051 -1096237 -557445
43759 -557445 402451 1210650 2081058 2671732 1892114 -244060 -1876566 -1432965 325703
43750 325703 1394131 1103783 631251 1187095 2578821 3638844 3526393 2447188 1301297
43741 1301297 709998 480644 184296 -16901 323561 943907 985293 228057 -550217 -670343
43731 -670343 -225847 585642 1884072 3388415 4155914 3685406 2579123 1534099 439947
43722 439947 -891637 -1934742 -2177963 -1892261 -1380921 -309694 1272308 2165787 1550130
43713 1550130 563683 919486 2400331 3171561 2310565 666109 -554089 -719500 365065
43704 365065 2023175 2403464 331284 -2618879 -3708546 -2723823 -2084200 -3031755 -3984529
43695 -3984529 -3425751 -2135293 -1257089 -215893 1710915 3412120 3485978 2523501 1908317
43686 1908317 1402110 36879 -1391069 -1090635 680934 1589946 476417 -1304297 -2217783
43677 -2217783 -2456839 -2806139 -3085323 -2678159 -1655788 -570168 220036 502117 134196
43668 134196 -568073 -973528 -953472 -928571 -949718 -580032 43542 17508 -910340 -1595659
43658 -1595659 -904195 771698 2156792 2765765 3128964 3615517 3827263 3233385 1931280
43649 1931280 658802 224826 842115 1855197 2261463 1655673 525044 -453505 -1133471
43640 -1133471 -1753929 -2349094 -2602772 -2244498 -1421372 -624183 -221866 -102736 46262
43631 46262 115068 -355899 -1276421 -1729021 -1110409 -112311 112699 -549633 -1215646 -1227010
43621 -1227010 -544787 700536 2023204 2267872 811688 -979215 -973111 842600 2252293
43612 2252293 1990842 1270434 1309349 1236795 2984 -1205648 -574955 1275471 2156367
43603 2156367 1809651 2085839 3451422 3878476 2272432 804754 1958558 4599416 5195189
43594 5195189 2560725 -650047 -1482757 6368 1757835 2594952 2736801 2266852 873142
43585 873142 -806253 -1218817 -61215 796042 -316883 -2395237 -3053098 -1862593 -811098
43576 -811098 -1324540 -2374270 -2147249 -401528 1625665 2788518 2781978 2034340 1476227
43567 1476227 1749550 2176986 1361948 -711261 -2272975 -2158640 -1374291 -1288523 -1548353
43558 -1548353 -1157833 -451095 -286111 -208369 690352 1823127 2076488 2141431 3553816
43549 3553816 5682308 6181687 4573254 2867549 2260470 1807835 992434 775741 992365
43540 992365 -368025 -3537443 -5415826 -3975514 -1735006 -1967167 -3546162 -3019406 -341285
43531 -341285 1340120 996542 825506 1802433 1979714 331578 -1055968 -309251 1427056
43522 1427056 2356715 2912190 4210947 5459202 5076829 3164727 943363 -1168183 -3120469
43513 -3120469 -3996338 -3183526 -1938838 -1801886 -2123536 -1199730 670749 1488580 774710
43504 774710 266675 1079301 2136700 2046914 941832 -213279 -843845 -748145 -14165
43495 -14165 650263 653293 780957 2299606 4536757 5100216 3165271 809676 155933
43486 155933 915196 1944709 3390583 5466072 6589037 5035252 1722117 -749369
43478 -749369 -1375324 -1125861 -534357 777876 2151517 1840682 -385614 -2455001 -2632418
43469 -2632418 -1462762 -405620 -47986 -422823 -1544651 -2657941 -2420536 -951357 -268806
43460 -268806 -1376830 -2329972 -903252 1968392 3430424 2634900 1272372 540671 -130760
43451 -130760 -1147950 -1749039 -1657111 -1891068 -2923633 -3542497 -2701788 -1241216 -455874
43442 -455874 -27612 1031582 2079475 1357306 -1201563 -3410632 -3673183 -3017651 -3263879
43433 -3263879 -4084830 -3376356 -484122 2363031 2619519 600433 -1035349 -752311 164415
43424 164415 -238796 -1872897 -3007092 -2683681 -1521736 -362401 601969 1157813 720765
43415 720765 -718347 -2061966 -2197189 -1215495 -102844 398814 266233 -69027 -134011
43406 -134011 93178 -29764 -999066 -2059061 -1758368 34928 1596376 1423108 -17874
43397 -17874 -1308482 -1837024 -1516030 186542 3252893 5657262 4829278 845911 -3320357
43388 -3320357 -5129944 -4746417 -3600439 -2224133 -525719 887760 1029796 -106067
43380 -106067 -1410040 -1824025 -1198688 -202363 297565 36475 -284160 170052 1154800
43371 1154800 1683498 1640724 1985056 2936566 3181774 1732101 -483258 -1930167 -2414243
43362 -2414243 -2492297 -1905750 -240580 1499647 1870787 1297592 1466817 2354960 1938066
43353 1938066 -564276 -3107146 -3506456 -2129608 -739014 -21520 368129 391717 -231601
43344 -231601 -1108934 -1660909 -1989839 -2240312 -1862527 -685059 139944 -281892 -853722
43335 -853722 -95369 1101169 405624 -2378002 -4791495 -5088189 -4156026 -3525705 -3334084
43326 -3334084 -3106334 -2885982 -2564872 -1513597 114944 1046402 801690 522969 848826
43317 848826 602858 -977831 -2349189 -1878852 -550922 -238259 -443550 606538 2348376
43308 2348376 2353069 392336 -947455 -326543 472291 -140963 -940274 -271310 1014523
43299 1014523 1089938 193855 14854 890499 1619518 1652219 1708908 2300154 3008001 3220822
43289 3220822 2550905 775913 -1556772 -2786429 -1650161 940594 2730505 2644874 1460923
43280 1460923 200111 -812459 -1260159 -684986 458686 768316 -377096 -1851337 -2175526
43271 -2175526 -1218987 96419 1178994 2073810 2691625 2560909 1565240 515457 569269
43262 569269 1946335 3421312 3492032 2110199 783738 761495 1681145 2355917 2178890
43253 2178890 1124943 -836409 -3246074 -4599244 -3614574 -998140 1171229 1789723
43245 1789723 1413826 758049 -113368 -923237 -925420 -51222 804492 1155938 1532908 2207619
43235 2207619 2424716 1603582 376321 -276914 -137331 539957 1497007 2089506 1451411
43226 1451411 -273362 -1845512 -2685046 -3505246 -4472062 -4284192 -2372463 -547135 -657097
43217 -657097 -1692106 -1257823 755169 2133943 1678517 427996 -517011 -1329556 -2162037
43208 -2162037 -2338934 -1594137 -760566 -570521 -861151 -1365274 -2092607 -2532972 -1769660
43199 -1769660 49315 1475184 1494573 469911 -914318 -2324407 -3069430 -2327631 -746114
43190 -746114 -207740 -1125839 -1610944 -447624 819839 334444 -1107953 -1533800 -1038883
43181 -1038883 -1272593 -2376369 -2824793 -2132922 -1436049 -1188586 -456792 962904 1732707
43172 1732707 1176640 603978 1310794 2581455 2855573 1842804 325509 -1221659 -2555298
43163 -2555298 -2963881 -2101759 -1142443 -1610707 -3050629 -3259740 -1223869 1413632 2509730
43154 2509730 2031262 1476654 1395822 921306 -259636 -944963 -125109 1418035 2233798
43145 2233798 2183419 2079559 1878517 820709 -686698 -1122505 -321705 -158309 -1694251
43136 -1694251 -3186158 -2509135 -429711 460282 -530119 -1564246 -1295109 -540988 -509107
43127 -509107 -985656 -1037456 -341318 875199 2311179 3476482 3912261 3912827 4186572 4523545
43117 4523545 3828768 1880398 -34814 -807122 -803244 -847533 -918731 -657904 -303657 -245993
43107 -245993 -299007 -159970 16489 118387 441869 924694 778135 -407129 -1894241
43098 -1894241 -2791695 -3068382 -3010209 -2611341 -2166021 -2329973 -2715341 -1677539 1297949
43089 1297949 4184903 4833694 3729160 2733489 2134949 924905 -741391 -1554306 -1207160
43080 -1207160 -522589 330995 1705558 2787769 2340287 1165455 1401920 3018703 3546727
43071 3546727 2048787 785555 1639080 3200750 3146387 1635608 444479 177234 273171
43062 273171 654872 1455498 1915658 1303839 304041 -38334 -35104 -489657 -924116 -427828
43052 -427828 404364 327793 -212462 308805 1673939 1860725 96698 -2013138 -2964872
43043 -2964872 -3101318 -3074283 -2352065 -569007 946567 555670 -1414846 -3083505 -3321131
43034 -3321131 -2496717 -1208492 424343 2038039 2810681 2658872 2826966 4287699 5943130
43025 5943130 5649718 3192109 912971 603864 1011067 -96310 -2265015 -2879960 -1185601
43016 -1185601 586444 701667 207806 551595 1135600 1043345 1242972 2746284 4113834
43007 4113834 3489249 2003000 2162596 3556300 3495266 1816162 1414541 3243778 4351226
42998 4351226 2572344 119704 161086 2130826 3045044 1888975 107796 -1230461 -2273576
42989 -2273576 -2931815 -2812085 -2429637 -2664511 -3126444 -2645514 -1245915 -111398 335009
42980 335009 865928 1937857 3042433 3642731 3662114 3097470 2209860 1907739 2739441
42971 2739441 3673483 3202562 1589608 600648 935864 1450873 1267353 1099758 1708166
42962 1708166 2286036 1461003 -767911 -2964597 -3758633 -2863647 -989987 751989 1627711
42953 1627711 1825171 2070203 2618402 2977225 2697239 1981612 1320804 892476 561028
42944 561028 298780 459802 1547310 3471260 5122416 5324458 4342882 3544669 3230184
42935 3230184 2120539 -142515 -1562964 -562013 1110913 606479 -1646475 -2591110
42927 -2591110 -1424823 -699063 -1846350 -2776117 -1594485 1993 -538124 -2418605 -2741570
42918 -2741570 -869231 1048833 1415912 760830 128347 -91477 313790 1276907 1752583
42909 1752583 659449 -1361462 -2509321 -2150019 -1195757 -286021 744805 1526078 1165473
42900 1165473 90923 61634 1485476 2344964 980780 -1321606 -1887489 26007 2733313
42891 2733313 4370200 4405333 3221664 1430386 -199450 -908417 -443864 726999 1698433
42882 1698433 1677363 626419 -582370 -1116297 -1309998 -2180550 -3722081 -4590746 -3883008
42873 -3883008 -2358034 -1335270 -1170853 -1423998 -1693056 -1565277 -609707 693476 892598
42864 892598 -496304 -1867941 -1682215 -903800 -1533706 -3258230 -3735875 -2290569 -1052130
42855 -1052130 -1669016 -2899334 -2725928 -1265414 -18807 615482 1369292 2326917 2793066
42846 2793066 2682741 2597494 2565158 1941697 599919 -846165 -1965968 -2613554 -2252478
42837 -2252478 -497581 1580772 2121425 861225 -452743 -594422 -437371 -1123311 -1962240
42828 -1962240 -1536796 -73073 822051 474493 -193800 -310576 -163863 -444090 -1293116
42819 -1293116 -2359545 -3091516 -2834966 -1365384 505294 1551622 1576830 1569243 2185664
42810 2185664 2791185 2454341 1373504 761178 1466342 3003390 3919224 3185811 1415783
42801 1415783 431753 1195320 2513477 2530653 1179845 69778 41365 210695 -243938
42792 -243938 -788694 -784413 -720620 -1082401 -1032782 394688 2460554 3499831 3163928 2524485
42782 2524485 2173378 1658924 871997 572099 1089547 1615915 1370970 683155 366193
42773 366193 604423 917977 818827 191430 -643422 -1114775 -1005497 -835524 -1186446 -1802702
42763 -1802702 -2012653 -1869806 -2015897 -2470256 -2530028 -1927307 -1049480 73178 1755700
42754 1755700 3380880 3593554 2404344 1614890 2126031 2251161 216917 -2787474 -4006400
42745 -4006400 -3028455 -2219773 -3114247 -4284648 -3568307 -1018916 1376587 2080471 1143949
42736 1143949 -508630 -1967536 -2600705 -2191056 -1109534 -117129 212234 -89717 -556081
42727 -556081 -914238 -1477038 -2666721 -4134778 -4811652 -4157046 -2983082 -2525131 -2887978
42718 -2887978 -2949799 -1794789 176972 1635756 1614448 468164 -371783 146963 1413721
42709 1413721 1795266 722255 -556742 -680337 209112 1209099 2078001 2831845 2727509
42700 2727509 1144349 -894456 -1634980 -947804 -271573 -191088 251077 1475866 2313137
42691 2313137 1832690 842326 595673 1088701 1568832 1803110 1932404 1852898 1539744 1268107
42681 1268107 939195 92711 -932259 -1107745 -611374 -988683 -2406356 -2656022 -616774
42672 -616774 1168080 -85940 -2806347 -3071439 -587830 902615 -458711 -1906700
42664 -1906700 -654882 1853603 2539634 1246682 54091 -495123 -1636325 -3425079
42656 -3425079 -4207600 -3276550 -1932907 -1301161 -747337 686883 2471127 3189048 2348715
42647 2348715 858150 13508 449884 1770231 2820891 2579652 1135803 -309513 -640582
42638 -640582 55627 721519 586019 -26115 -217254 318689 970810 1152104 1154805 1586799
42628 1586799 2220949 2190958 1398405 842235 1144342 1582977 1286107 663485 651004 979481
42618 979481 417797 -1266522 -2753042 -2896419 -2019508 -1004156 -74232 678096 377378
42609 377378 -1670148 -4258358 -4943644 -2951088 -371799 360250 -610920 -1249030 -634594
42600 -634594 258125 776055 1803255 3955598 6019202 6501323 5740760 5011955 4319090
42591 4319090 2837287 1083510 601066 1388446 1643402 547132 -603795 -783019 -819289
42582 -819289 -1441323 -1551538 -85768 1816771 2358477 1778782 1595951 1908028 1486463
42573 1486463 215660 -552095 -141170 627966 940261 872145 623071 158728 -274407
42564 -274407 -449482 -874837 -1965123 -2812497 -2364267 -1515239 -2027502 -3422304 -3320447
42555 -3320447 -1317613 35729 -810809 -1953966 -1235408 274393 260963 -968433 -1237702
42546 -1237702 -228543 265279 -393684 -799231 -373372 -758825 -3090289 -5524528 -5178271
42537 -5178271 -1867406 1583509 2758194 2207820 2153251 3482325 4991307 5401722 4991000
42528 4991000 4721432 4691849 4417374 3996533 3760213 3162305 1517564 -234048 -158930
42519 -158930 1967203 4189185 5091221 5325746 5730187 5741047 4899936 4332377 5133382
42510 5133382 6408243 6454010 5045065 3281972 2112337 2156945 3783033 6012363 6741831
42501 6741831 5605749 5009143 6349006 7062990 4290308 -33451 -1356008 911697
42493 911697 2877813 2253778 900874 485147 -273849 -2121136 -2701280 -262752 2804650
42484 2804650 3220558 1646128 1105606 1955508 1800430 -74988 -1440308 -711484 794600
42475 794600 1123278 309413 -362785 -445706 -488297 -723578 -618643 269845 1569861 2522257
42465 2522257 2976587 3480459 4123615 3927109 2227514 200440 -315399 592015 1050212
42456 1050212 330448 -183023 380603 715572 -387044 -1738125 -1450182 200391 1383701
42447 1383701 1383062 930249 488542 -53693 -292588 464791 1920944 2990733 3215215 3012798
42437 3012798 2827317 2902658 3353481 3563147 2346026 -211543 -2125052 -2063706 -1275939
42428 -1275939 -1238060 -841873 1553996 4426339 4686285 2620647 1795229 3630145 5442604
42419 5442604 4908771 3262069 2437587 1942479 752040 -42230 975834 2748050 3199647
42410 3199647 2327324 1560767 1045234 -81811 -1333938 -1131868 708814 2640353 3463875
42401 3463875 3149610 1853287 -124644 -1520555 -1076382 503629 1194538 448173 -268470
42392 -268470 -12295 301121 -237060 -913101 -644185 340505 1126412 1511681 1735688 1545409
42382 1545409 661584 -254334 -186072 815548 1681826 1768145 1444802 1154285 666528 -324005
42372 -324005 -1372395 -1607582 -740048 675409 1939688 2728037 2816815 1865163 -9170
42363 -9170 -1773298 -2354519 -1952127 -1690215 -1840598 -1403227 3635 916263 -130046
42354 -130046 -2169490 -2723458 -1089922 765154 964698 -44146 -798979 -1107248 -1703234
42345 -1703234 -2372745 -2049123 -784701 -189209 -1355955 -3325325 -4294925 -3703580 -2432924
42336 -2432924 -1462012 -1110861 -1293776 -1650693 -1485621 -388079 974531 1415535 756348
42327 756348 55490 43091 157038 -341769 -1115182 -1462558 -1686543 -2637849 -4103503 -4762736
42317 -4762736 -3908292 -2307772 -1046294 -253140 603377 1689144 2521522 2451944 1211344
42308 1211344 -762829 -2432636 -2897925 -2147033 -908272 80982 344599 -402440 -1851737
42299 -1851737 -2802678 -2167849 -381225 969108 988167 142502 -916638 -2077292 -3008671
42290 -3008671 -2865933 -1467322 83388 660405 343922 -145134 -452542 -430523 192212
42281 192212 1224894 1831127 1671981 1478543 1724392 1622808 457707 -937429 -1286210
42272 -1286210 -773562 -425876 -97323 1254153 3345832 4322808 3242949 1538227 1240813
42263 1240813 2524637 3722677 3377422 1663267 -170305 -1335399 -2098179 -2767001 -2751161
42254 -2751161 -1533601 -203656 -461866 -1859195 -1892295 258037 2057238 1268059 -609899
42245 -609899 -861861 24055 -513187 -2393875 -2779421 -793774 1018521 835659 83893
42236 83893 420027 959990 436999 -136110 808652 2646177 3708854 3926101 4235776
42227 4235776 4413165 3607066 2305639 1745219 1868698 1737033 1499007 2038014 2984302
42218 2984302 3057931 2325009 2171406 2849923 2934214 1698101 343859 113038 571155
42209 571155 678852 510517 910619 2035515 3045974 3013277 1762067 85137 -763881
42200 -763881 -187160 1140193 2221158 3090498 4418919 5884171 6072510 4388749 2134674
42191 2134674 1070454 1512719 2431701 2947209 3068811 3128895 3049946 2393719 1072463
42182 1072463 -183894 -457706 125482 357913 -406733 -1217493 -956891 -181730 -221970
42173 -221970 -742759 75125 2556101 4442535 3824024 1854561 1124147 2109920 2855671
42164 2855671 1974221 414609 -116858 711054 1959076 2814272 3067150 2688364 1846640
42155 1846640 1264984 1713980 2881583 3378340 2337800 618738 -120680 679293 2055035
42146 2055035 2838870 2751078 2147873 1360538 563143 -147854 -772705 -1216087 -1124620 -399246
42136 -399246 287515 246406 -78585 262862 1000103 927447 144682 305839 1901408 3051797
42126 3051797 2185262 233627 -1293556 -2610510 -4053049 -4042629 -1509011 992859 70428
42117 70428 -3142214 -4116653 -1584038 814829 471889 -514904 447800 2074127 1866055
42108 1866055 519363 457713 1694519 2283985 1794993 1431791 1423593 1005231 534222 1101920
42098 1101920 2322766 2840000 2745441 3172496 3757289 3019771 1259577 487714 1154183
42089 1154183 1455405 482149 -388621 -124069 247320 -253557 -731096 -81759 1166574
42080 1166574 2063089 2842008 3923533 4566142 3984208 2859510 2391636 2597472 2700036
42071 2700036 2444756 1930695 887198 -738847 -2072622 -2219786 -1384592 -290227 819366
42062 819366 1775666 1938026 1143494 571115 1568278 4013960 6621093 8269273 8332012
42053 8332012 6590755 3875605 2020246 2033387 2901234 3149229 2770068 2520028 2296390
42044 2296390 1675173 1239071 1719937 2425762 2213782 1533139 1721417 2648281 2951015
42035 2951015 2408110 2102975 2235906 1816107 774126 355002 927301 1349255 1186702
42026 1186702 1670786 3507561 5387596 5735780 4595218 2895801 1251129 347941 990372
42017 990372 2672360 3597263 3327757 3870945 6591208 9475084 9426762 6349000 2945529
42008 2945529 1047135 144417 -609982 -883500 -31943 1850345 4148164 6131078 7040712
41999 7040712 6567757 5272020 3921453 2633489 1268565 187680 -209830 -232663 -298092
41990 -298092 -100633 673139 1407873 1467425 1450886 2258336 3434123 3856570 3613602 3650063
41980 3650063 3957572 3836349 3652441 4375940 5423727 5081661 3361856 2285614 2701581
41971 2701581 2951740 1690114 30294 -464576 -206311 -374511 -642189 99783 1606906
41962 1606906 2553547 2455116 1933093 1470040 1134897 1174125 1694607 2034513 1531722 700271
41952 700271 651594 1526680 2426972 2777754 2913823 3342318 4081393 4697179 4588778 3500016
41942 3500016 2135553 1840056 3195222 5339843 7004616 7611191 7075579 5504753 3653575
41933 3653575 2615250 2285979 1253266 -876712 -2340871 -1685225 -76471 495277 140191
41924 140191 217344 635798 466799 521529 2371303 4855781 4762220 1814149 -27995
41915 -27995 2125763 5976664 7394482 6055492 5186315 6698297 9222154 10918513 11931835
41906 11931835 13272413 14750836 15167991 14073169 12481190 11687917 11700900 11266085 9617488
41897 9617488 7697263 6960834 7305848 7257511 6218354 5274368 5371366 5956854 6174349
41888 6174349 6249284 6647710 6812600 6047851 5082850 5366033 6924651 8100811 7558194
41879 7558194 5724734 4128529 3956565 5319597 7312681 8643298 8614320 7618322 6531361
41870 6531361 5831496 5530541 5567817 5813341 5974775 5953960 6041161 6390960 6687878 6755122
41860 6755122 7017290 7790379 8571249 8689689 8225779 7564645 6570814 5192625 4444663
41851 4444663 5440136 7436257 8234293 7014627 5607548 6113073 8084805 9160215 8163382
41842 8163382 6481171 6132592 7290515 8334687 8007993 6765992 5852649 5689289 5711588
41833 5711588 5443137 5019985 4694139 4485216 4439596 4651573 4909343 4922859 4996268 5740043
41823 5740043 6975469 7838820 8251964 9165988 10762008 11662914 11003284 10197152 11163147
41814 11163147 13485745 15006839 14937902 14646923 15230712 15977610 15806272 14857338 13843334
41805 13843334 12858683 11770688 11082044 11410554 12402877 12969478 12564919 11709768 11254314
41796 11254314 11562813 12513748 13911086 15512316 16716477 16751680 15582797 14268628 13715524
41787 13715524 13305255 11821302 9783722 9395598 11465831 13839975 14195523 13223357 13294498
41778 13294498 14746050 15554918 14509986 12659283 11318899 10511295 9998418 10222677 11315148
41769 11315148 12414334 12886253 13272905 14246034 15452975 16100043 15928548 15017556 13390454
41760 13390454 11418548 9903998 9196913 8848364 8526556 8547992 9134656 9922792 10544291
41751 10544291 10900604 10674674 9576822 8244178 7672764 7572650 6810960 5765092 6222382
41742 6222382 8149217 8820289 6691431 4059691 3765889 5015633 5111376 4059447 4312480
41733 4312480 6312014 7446564 5986190 3456194 2184514 2610647 4067513 6328827
41725 6328827 8977744 10596060 10078229 8077959 6130849 4950482 4399895 4447421 5157932
41716 5157932 6077355 6445057 5957087 4938873 3969010 3568891 3950222 4871135 6026304
41707 6026304 7545099 9579748 11467784 12126757 11488914 10746880 10828496 11370981 11642752
41698 11642752 11759381 12347376 13463061 14453785 14663592 13891240 12383821 10665667 9173767
41689 9173767 7945975 6929268 6483125 6965858 7818869 7910627 7088784 6543003 7093548
41680 7093548 7893753 7604001 6289976 5234987 5141885 5467243 5574069 5669064 6193506
41671 6193506 6843119 6804432 5877580 4869337 4643373 5035998 5055432 4076341 2458088
41662 2458088 985076 175322 222310 966019 1618419 1247181 71971 -451007 440903
41653 440903 1597961 1691104 1356351 2109462 3641563 4090963 3041697 2283216 3016604
41644 3016604 4100175 4014677 3032767 2282272 1996488 2049434 3066737 5336028 7328243
41635 7328243 7058963 4736794 2581212 2007841 2318072 2329270 2023298 2046139 2441783
41626 2441783 2545384 1819739 464912 -681337 -854890 -145312 623876 1006910 1514060
41617 1514060 2636268 3763990 3830698 2806204 1765889 1526122 1933476 2524293 3132413
41608 3132413 3616721 3614030 2966627 2071757 1470805 1227408 937626 325804 -341099 -583643
41598 -583643 -424691 -416432 -673083 -341746 1200914 2885297 2833339 922499 -715521
41589 -715521 -337347 1350524 2561715 2813977 2860743 3131816 3583434 4473824 5782654
41580 5782654 6188772 4260878 806607 -1421583 -849341 1162906 2197335 1573185 725234
41571 725234 1347057 3584818 5777166 5885058 3544801 675104 -363781 900452 2937043
41562 2937043 4038657 3622127 2139463 658729 385337 1660969 3398258 4176599 3720342
41553 3720342 2652581 1321670 -89958 -824160 -337120 390168 -218990 -2158546 -3953875
41544 -3953875 -4745578 -4664745 -3409295 -583589 2388742 3068076 1405543 81955 540501
41535 540501 1091032 284268 -405930 622097 1878355 1137399 -555478 -320821 1945838
41526 1945838 3486422 2978580 1977231 1777991 1584864 596593 -413747 -685967 -777413
41517 -777413 -1167844 -1112385 -4292 1418852 2306609 3001426 4074257 5078993 5340923
41508 5340923 5128304 4992980 4691951 3803978 2762237 2187665 1704024 551416 -892421
41499 -892421 -1311478 -228058 1258164 1741013 1049172 313603 637585 1764201 2282132
41490 2282132 1504313 759852 1815243 4074089 4836822 2949832 629138 360208 1329072
41481 1329072 898906 -1123803 -2109728 -641507 1395718 1731501 866086 796408 1791366
41472 1791366 2220659 1182560 -306747 -922965 -679974 -539683 -1021534 -1571931 -1120851
41463 -1120851 670467 2546194 2578436 581802 -997211 256213 3491945 5489308
41455 5489308 4852412 3588045 3822858 4704529 4047830 1839292 196778 322114 1288738
41446 1288738 1800043 1547622 679475 -567796 -1353014 -702391 1033402 2336487 2473387
41437 2473387 2102244 1713841 985319 133256 186004 1100869 1347387 425412 -45120 804970
41427 804970 1057023 -1071103 -3873824 -4310206 -2394131 -628271 206114 1559103 3572806
41418 3572806 4356294 3437237 2896424 3943235 5098253 5178023 5468699 7082884 8471758
41409 8471758 7838082 6230669 5818665 6415571 6139618 4552738 2767941 1186920 -450381
41400 -450381 -1269307 -52556 2232001 3116029 2140897 1478004 2547995 4138943 4698957
41391 4698957 4547650 4612885 4524154 3415282 1687841 682784 1090225 2544364 4266503
41382 4266503 5382761 5203209 4022684 3258213 4052016 5959265 7525938 7876117 7281110
41373 7281110 6499229 6059010 5994601 5925844 5598945 5548609 6799282 9511882 12267255
41364 12267255 13202474 11789650 9210731 7098436 6174362 6047915 6055815 6067169 6337414
41355 6337414 6731445 6645912 6004768 5778284 6851349 8716875 10056723 10374598 10173776
41346 10173776 9703660 8687548 7479845 7328542 8862372 11056905 12296454 12002658
41338 12002658 10893090 10194614 10898490 13145694 15914392 17760592 18110883 17388304 15964799
41329 15964799 13924706 11966527 11295822 12028914 12750168 12388036 11607924 11572546 12262365
41320 12262365 12969567 13596034 14351632 14854278 14697344 14363732 14410094 14257265 13086570
41311 13086570 11557853 11196649 12155455 12967684 12661682 11853268 11479084 11645052 12155580
41302 12155580 13091474 14241100 14808450 14393722 13723240 13815453 14789059 15917344 16505559
41293 16505559 16343495 15627411 14838226 14518533 14876671 15688686 16681594 17821754 19104179
41284 19104179 20225491 20664810 20198694 19392915 19369083 20655225 22335857 23020604 22786245
41275 22786245 23249486 25264747 27611356 28887578 29739617 31834939 35262040 38609570
41267 38609570 41422202 44795827 49203927 53343302 55906673 57330170 58916431 61024692
41259 61024692 62924244 63904426 63869218 63146448 62117060 60831006 58961147 56534090 54529346
41250 54529346 54024416 54812316 55672226 55941864 55933710 55969227 56224334 57569651 61198570
41241 61198570 67105374 74159288 81953288 91281185 102599667 115657009 131089018 150649326
41233 150649326 175330441 205276578 242096371 287910155 339168579 383172754 404381634
41226 404381634 395088438 359397010 308492972 254287479 205948459 168039374 139887677
41219 139887677 117986819 99862656 85084225 73295919 63383379 54829622 48108658
41212 48108658 43258380 39449624 36206217 33638584 31325193 28477277 25349426 22882638
41204 22882638 20856404 18238510 15543110 14646839 15667847 16286435 15152683 13769602
41196 13769602 13688048 14014746 13480781 13013033 13976280 15315141 14955217 13179893 12142810
41187 12142810 12446951 12584887 11742063 10902957 10784397 10638638 9837125 9100169 9266416
41178 9266416 9916485 10070021 9596631 9291841 9903562 11404810 13026854 14067348 14890448
41169 14890448 16656659 19540278 21943265 22526387 22452369 24214664 28443521 33271368
41161 33271368 36782669 38588865 38935373 38034725 36838105 36806660 37981472 38594287 37533489
41152 37533489 35909804 35054343 34237701 31916812 28322183 25016985 22359770 19304830
41144 19304830 15764456 13305486 12853652 13195238 12750094 11731244 11299553 11272585 10217532
41135 10217532 7854844 5930036 5951849 6991136 6820113 4861379 2791330 2073730 2104779
41126 2104779 1529006 488121 426580 2043192 4572754 7013102 8934318 9946966 9580217
41117 9580217 8209576 7093270 6773803 6270471 4657947 2673078 1711192 1771670 1617797
41108 1617797 778591 171637 596912 1657901 2499048 2764578 2481375 1788978 1210829
41099 1210829 1429851 2238723 2402571 1259800 -119621 -198796 1037596 2293125 2862136
41090 2862136 3205930 3645985 3740575 3407137 3523461 4569524 5524742 5198373 4119498
41081 4119498 3871764 4737705 5290797 4515935 3143358 2385469 2353902 2413957 2314687 2187821
41071 2187821 2012868 1823431 1926680 2229874 1975795 980786 423920 1238411 2317814
41062 2317814 1859856 243015 -226948 1271001 2659520 1746607 -1021837 -3611924 -4966248
41053 -4966248 -5239946 -4433284 -2376490 219398 2020911 2430256 1873465 962770 233997
41044 233997 386258 1665343 3088556 3403044 2940491 3463217 5843122 8780205 10257317
41035 10257317 9619948 7904169 6769176 7458329 10143697 13712971 16493394 17554032
41027 17554032 17159714 15978908 14340105 12361757 10248697 8222687 6553972 5670209
41019 5670209 5634875 5535123 4283831 2269342 1222908 1938771 3099217 3138856 2383018
41010 2383018 2254205 3001557 3524145 3191069 2520719 1981951 1369361 743867 875684
41001 875684 2041384 3152979 2922505 1486911 122193 -406367 -417663 -275152 351968
40992 351968 1729458 3109445 3283512 2055194 549998 -147357 -131681 -56461 115871
40983 115871 971961 2398998 3321120 2907065 1458145 -50808 -699788 130215 2229419
40974 2229419 3925182 3190819 288375 -1734091 -445291 2856200 4918454 4794475
40966 4794475 4414867 5092955 5743871 5272319 4640849 5131945 6036348 5806472 4627832
40957 4627832 4058737 4472452 4538956 3361598 1756874 1018664 1373796 2076777 2401559
40948 2401559 2261155 2251836 3056821 4358776 4654674 2938300 312307 -1107956 -823627
40939 -823627 -326549 -774719 -1682929 -2385930 -3316985 -4761661 -5474801 -4011123 -951598
40930 -951598 1528971 2183521 1719788 1463231 2137748 3993652 6889965 9796892 11225911
40921 11225911 10826101 9857480 9438374 8991586 7315667 4766350 3208662 3615404 4669253
40912 4669253 4371280 2497287 654166 27134 -27239 -710621 -1780974 -1761166 -123904
40903 -123904 1676273 1900330 667185 -369971 -225166 446531 706826 770234 1443226
40894 1443226 2609473 3126536 2322203 974587 411869 922255 1535297 1388279 808219
40885 808219 664062 975714 891784 178847 -51803 1226197 3229898 3986136 2716924
40876 2716924 821036 205119 1261782 2843567 3658350 3229281 1981602 962185 1106702
40867 1106702 2190245 2815845 2059575 780860 512198 1350729 2030719 2058327 2447713
40858 2447713 3798379 4837244 3962748 1605605 -113291 89196 1447934 2489307
40850 2489307 2702347 2607709 2791011 3233573 3320318 2386282 509967 -1288943 -2013454
40841 -2013454 -1761978 -1396863 -1318888 -1238136 -1052937 -1030361 -933452 35947 1914268 3446329
40831 3446329 3561685 2705807 1988411 1659794 1280075 811725 520699 216089 -309545
40822 -309545 -404707 626707 1977100 1995405 548991 -693376 -761313 -707763 -1609073 -2569663
40812 -2569663 -2030691 -255576 903063 405968 -986511 -1976735 -1905347 -717846 1165788
40803 1165788 2747196 3100777 2433858 1826224 1709195 1350007 192931 -1032073 -1166224
40794 -1166224 -122655 1186149 2267293 3697664 6148695 9202422 11543092 12240898
40786 12240898 11513996 10174698 8718664 7270191 6074321 5406696 5047762 4537734 4075567
40777 4075567 4385657 5352244 5655491 4495477 2997542 2910545 4247326 5216062 4399457
40768 4399457 2114030 -379221 -2152497 -2992289 -3249145 -3455752 -3558687 -2683214 -434426
40759 -434426 1787550 1942715 -27244 -1925386 -2066497 -1164772 -783635 -979515 -551575
40750 -551575 989101 2779176 3710120 3379455 2087501 556668 -398311 -433780 46173
40741 46173 377893 277362 -55013 -128060 529187 1673646 1971641 208852 -2891878
40732 -2891878 -5079589 -5222956 -4417438 -3855760 -3012623 -1119926 867333 1494367 1121229
40723 1121229 1125575 1378311 627448 -824445 -1176940 -222270 -50429 -1712537 -3260031
40714 -3260031 -2587102 -610896 171749 -763820 -1723718 -1547241 -828743 -474535 -534595
40705 -534595 -685040 -777097 -681799 -385319 -252870 -408026 -4514 1832413 4325545 5486654
40695 5486654 4542787 2811060 1665560 760568 -854710 -2757019 -3519669 -2739715 -1571285
40686 -1571285 -1181847 -1542036 -1930691 -1920868 -1551357 -1043150 -687966 -680092 -833360 -805506
40676 -805506 -761337 -1316098 -2493939 -3286738 -2860062 -1824637 -1502752 -2037563 -2131151 -879968
40666 -879968 984459 2191296 2509686 2409150 1704719 -185095 -2538653 -3212292 -1103866
40657 -1103866 2005203 3216640 1930662 349255 384538 1283961 1106473 -424110 -1820888
40648 -1820888 -2089328 -1579791 -643778 875777 2322887 2127320 155358 -1321539 -616733
40639 -616733 589616 -498613 -3518655 -5336964 -4522705 -2837158 -1867216 -892556 765312
40630 765312 1830444 1344522 789029 1738306 2998756 2503646 812860 68450 312666
40621 312666 -242961 -1577544 -1537081 421289 1959466 1335733 -146018 -392610 629473
40612 629473 1558519 1621628 783820 -725879 -1948935 -1558643 239954 1411433 715269
40603 715269 -642883 -993984 -400395 340053 1347789 2728846 3352374 2440296 1340152
40594 1340152 1759034 3046885 3260026 2306082 1902809 2748216 3849352 4531942 4982179
40585 4982179 4719462 2765008 -183089 -1826260 -1309109 -360557 -487098 -807278 48952
40576 48952 1402492 1528430 292635 -789316 -691020 225519 1183163 1716075 1548177
40567 1548177 787632 283009 878126 2142571 2639566 1767285 635134 577257 1305050
40558 1305050 1340187 175704 -913574 -613135 663842 1543878 1663324 1750644 2040573
40549 2040573 2043295 1961803 2631626 3496810 2561602 -375772 -2241218 -427509 3247895
40540 3247895 4674860 2809740 419229 -211026 372493 1011321 1843933 2996816 3495137
40531 3495137 2743551 1577272 847418 354193 -47405 139817 708024 510895 -459897
40522 -459897 -591168 569522 1012879 -622148 -2528040 -2430940 -1232726 -1441835 -3022128
40513 -3022128 -3488994 -1716205 824878 2533959 3168445 2857984 1798943 1109086 1868432
40504 1868432 2943305 1871126 -1437417 -3904388 -3219276 -851908 168553 -796987
40496 -796987 -1708030 -790385 1499393 3245217 3026617 1175272 -604725 -1014386 -452705
40487 -452705 -99788 -125595 165538 679460 527181 -106879 300043 2274176 4124256
40478 4124256 4066757 2490084 1005336 161674 -604196 -1343409 -1343796 -478759 281371 10055
40468 10055 -1071519 -1848449 -1474884 -279430 494158 86413 -769718 -809327 -114152 -96708
40458 -96708 -1370706 -2694352 -2669543 -1589701 -726645 -461650 -157253 450870 747858
40449 747858 201349 -795685 -1231519 -469760 990465 1790780 1102908 -366486 -1348505
40440 -1348505 -1768913 -2489894 -3366960 -3097345 -1480607 -183924 -264573 -492367 436854
40431 436854 1436488 708253 -1097373 -1641645 -427732 680797 592566 518145 1749756
40422 1749756 3650894 4755990 4630214 3791864 2720247 1671044 784247 -131593 -1331600
40413 -1331600 -2436021 -2726513 -2221063 -1558764 -833826 241394 938468 -107419 -2535775
40404 -2535775 -3872425 -2554628 -87971 986997 200664 -1070721 -1979269 -2741279 -3261473
40395 -3261473 -2832139 -1320063 438798 1560108 1680826 742586 -934895 -2384347 -2575519
40386 -2575519 -1383895 456982 2167840 3203118 3147397 2134492 1142905 1088911 1752957
40377 1752957 2244225 2223898 1904376 1230958 114364 -738709 -435936 565510 663447
40368 663447 -826551 -2706055 -3300956 -2083803 253942 2446861 3151792 1824635 -407479
40359 -407479 -1593273 -1185376 -658776 -1436524 -3063869 -4099488 -3998884 -3255837 -2333657
40350 -2333657 -1466087 -1119726 -1586310 -2156144 -1577287 458028 2790765 3895305 3267019
40341 3267019 1838766 1256338 2435018 4466164 5294817 3935458 1655026 430717
40333 430717 678193 1276596 1460980 1572842 1887107 1846572 1022194 72625 21636 905700
40323 905700 1712923 1545352 456865 -764460 -1301178 -805786 486169 1923369 2717680
40314 2717680 2246008 433108 -1929756 -3474725 -3306425 -1847797 -410387 101565 -112529
40305 -112529 -225484 355439 1498094 2326238 1789394 -212641 -2269446 -2676992 -1401929
40296 -1401929 -136923 -41425 -229324 732927 2476899 3176140 2096533 517912 -250052
40287 -250052 -566372 -1306129 -1941504 -1174788 734984 1763808 777647 -680296 -199494
40278 -199494 2429672 4942982 5281873 3656080 1745809 621029 16070 -678001 -1374107
40269 -1374107 -1462755 -750889 174113 694413 988746 1630518 2456319 2591186 1851943 1225941
40259 1225941 1276402 991102 -582235 -2283043 -2180090 -759937 -646432 -2590971 -3931701
40250 -3931701 -2446053 125766 552483 -1071635 -1607141 249480 2023462 1209022 -1178504
40241 -1178504 -2322769 -1595905 -1037134 -2157524 -3811495 -3783229 -1726436 275114 141356
40232 141356 -1757683 -3168205 -2804410 -1700745 -1333156 -1447330 -824645 500298 1231772
40223 1231772 814192 23401 -494220 -890545 -1120394 -708799 53053 59958 -879000 -1617784
40213 -1617784 -1634020 -1892364 -2784189 -2851156 -1138469 544771 -193626 -2666749 -3918115
40204 -3918115 -3019355 -2212404 -3223248 -4574374 -3883726 -1427736 237490 -328645 -1901494
40195 -1901494 -2521656 -1881519 -1242841 -1501188 -2053242 -1750927 -570161 194774 -513984
40186 -513984 -2184905 -3262076 -2791433 -1284743 -117716 -292855 -1617844 -2896361 -3080146
40177 -3080146 -2315632 -1592137 -1392755 -1275002 -914015 -745783 -1074246 -1287864 -740622
40168 -740622 109780 290861 -301792 -933435 -1175894 -1169297 -886103 -23191 1259394 2152722
40158 2152722 1948317 670614 -948570 -1865571 -1432315 -102816 956150 1324531 1761354
40149 1761354 2655729 2957852 1670484 -360092 -1467803 -1482404 -1596179 -2243540 -2667562
40140 -2667562 -2508047 -2204833 -1670396 -205876 1807412 2672947 1575061 -223731 -1145905
40131 -1145905 -1197552 -1324803 -1805936 -2147082 -1961269 -1286346 -494895 -228376 -808917 -1522850
40121 -1522850 -1312193 -376665 -80703 -964947 -1980800 -2179316 -2015269 -2326876 -3079354
40112 -3079354 -3847218 -4578663 -5132905 -4936061 -3827392 -2504066 -1622135 -1288031 -1677713
40103 -1677713 -2864122 -3652852 -2283187 888498 3141760 2953311 2029967 2329644 2896104
40094 2896104 1716204 -751813 -2310946 -2300671 -1735864 -923801 520157 1711127 1206873
40085 1206873 -285681 -434760 1136338 2141478 1100134 -637949 -1136122 -251692 1094953
40076 1094953 2371437 3296255 3704153 4214573 5533544 6583706 5216339 1602100 -1157344
40067 -1157344 -1115541 -206432 -1093287 -3024950 -3229228 -1421300 -256718 -1310055 -2890636
40058 -2890636 -2564733 -317574 1708517 1805946 265490 -1335008 -1916474 -1882279 -2299829
40049 -2299829 -3288544 -3818645 -3293859 -2549513 -2675768 -3467209 -3816657 -3246061 -2289075
40040 -2289075 -1642991 -1623229 -2148365 -2553962 -1765971 431715 2443095 2170669 -478203
40031 -478203 -3126204 -3336140 -1041012 1716361 3051425 2790009 1935962 1254209 891369
40022 891369 1143512 2602461 4923566 6233466 5009474 2315690 727846 850988 545691
40013 545691 -1631236 -3911569 -3805067 -1931865 -1284952 -2999731 -4932517 -4828913 -3135593
40004 -3135593 -1796573 -1606137 -1933777 -2208831 -2348226 -2058909 -1022182 78195 -173278
39995 -173278 -2051987 -3850702 -3725457 -1996959 -677625 -782575 -1206806 -663489 379353
39986 379353 661743 205478 28102 128177 -618969 -2312479 -3341686 -2608925 -1168037
39977 -1168037 -592221 -650964 150335 2257666 4491037 5543573 5058992 3379619 1189245
39968 1189245 -575064 -1261369 -1087564 -708786 -339159 159624 604694 685184 683462 1157117
39958 1157117 1882019 1958433 1188557 602140 1168337 2411447 2767954 1279988 -1236253
39949 -1236253 -2827389 -2391991 -958036 -485313 -1345244 -1849532 -767788 663381 316482
39940 316482 -1854290 -3716320 -3641881 -2074833 -444254 284229 -155468 -1327015 -1966752
39931 -1966752 -953302 1097402 2127605 1039196 -1026331 -2256984 -2098835 -1073852
39923 -1073852 276964 1367201 1360593 152336 -983537 -887871 -284456 -802901 -2386044
39914 -2386044 -3069451 -1658274 613947 1738335 1253585 82775 -1153287 -2523012
39906 -2523012 -3843098 -4554532 -4650664 -4755299 -5010649 -4780824 -3869846 -3123781 -3114553 -3003502
39896 -3003502 -1704122 325372 1564534 1468994 905230 630448 524524 437826 554155
39887 554155 579087 -188636 -1449216 -1807942 -851207 -139510 -1112739 -2991166 -3895771
39878 -3895771 -3222320 -1713972 6788 1532567 1886778 290471 -2355451 -4071206
39870 -4071206 -3918416 -2566262 -1068400 -233766 -802301 -2746254 -4520327 -4508023 -3218852
39861 -3218852 -2554753 -2893995 -2639705 -951795 895694 1555211 1355990 1132412 766652
39852 766652 -54137 -850894 -1197130 -1504976 -1952181 -1664007 -99359 1658366 2206230
39843 2206230 1688387 1184922 902452 234072 -856147 -1780767 -2412396 -3088538 -3685657
39834 -3685657 -3725736 -3349129 -3254518 -3663868 -4150452 -4486801 -4860158 -5145158 -4718460 -3327371
39824 -3327371 -1700197 -946154 -1458921 -2568222 -3284442 -3284539 -2910204 -2192470 -598461 1651950
39814 1651950 2814698 1477101 -1180014 -2571323 -2134363 -1745007 -2392230 -2578367 -1069784
39805 -1069784 740317 821647 -646786 -2130941 -3152765 -3976797 -3985591 -2515480 -700363
39796 -700363 -403486 -1548158 -2279712 -1560415 22176 1712138 3153052 3760389 3203308
39787 3203308 2282525 1771343 904636 -1142695 -2961186 -2512700 -647371 -203583 -1508078
39778 -1508078 -1812116 137811 2075839 2030052 1202882 1184452 926435 -1066697 -3517352
39769 -3517352 -4018422 -2624610 -1326251 -852254 -344753 408992 663408 329855 -7057
39760 -7057 -405355 -1179831 -1625448 -945055 -39585 -362147 -1213321 -373871 2388254 4583122
39750 4583122 4341463 2648089 1518081 1575149 2266503 3014260 3180708 2099298 142885
39741 142885 -1184085 -1070265 -408615 -210196 -45537 896448 2099823 2388114 1833216
39732 1833216 1715660 2623633 3581445 3242559 1374816 -872406 -1775409 -310507 2786461
39723 2786461 5263438 5175254 2610980 -554332 -2468657 -2634211 -1771644 -932040 -771794
39714 -771794 -1285748 -2015628 -2520868 -2632163 -2370491 -1944353 -1828347 -2345662 -2952436 -2458527
39704 -2458527 -433645 1911261 2744179 1440819 -850079 -2292437 -1868647 -184392
39696 -184392 962033 237746 -1670074 -2645658 -1666693 -65711 345803 -380739 -934875
39687 -934875 -1052256 -1675632 -2940609 -3702013 -3524096 -3573846 -4601358 -5294361 -3922582
39678 -3922582 -842803 1922966 3136086 3129755 2464977 1164582 -577263 -2044569 -2730014
39669 -2730014 -2703380 -2104946 -1026714 -18651 161188 -389137 -689104 -293563 12415
39660 12415 -561595 -1532052 -1701993 -612041 1052363 2197248 2136569 1048685 -89778
39651 -89778 -408132 -136738 -141790 -380633 232119 2007697 3617040 3843665 3215360 2832962
39641 2832962 2517410 1563781 616670 921695 1846357 1107970 -1984318 -5079047 -5395647
39632 -5395647 -2689520 1059847 3817802 4592894 3527760 2064429 2255301 4624871
39624 4624871 7033387 6766422 3651458 192926 -1342366 -1112727 -879081 -1776409 -3278908
39615 -3278908 -3997523 -3155751 -1288909 432162 1378739 1665913 1378078 399973 -732889
39606 -732889 -776520 621686 1941598 1473161 -373914 -1603079 -1395171 -1078476 -1971452
39597 -1971452 -3373377 -3516780 -1912462 98138 947173 377324 -611809 -915308 -302218
39588 -302218 580722 1079309 1266770 1568241 1776441 1076266 -614180 -1911050 -1333890
39579 -1333890 762824 2449794 2568457 1997155 2063911 2436399 1635448 -544486 -2326468
39570 -2326468 -2101280 -378642 1124028 1641675 1646167 1446217 790616 -74402 -223943
39561 -223943 535464 1085320 606332 -13028 601606 2128557 2753821 1577976 -209229
39552 -209229 -923717 -371904 345711 508391 461912 666075 782540 163543 -1053801 -1907383
39542 -1907383 -1731172 -856937 17871 685193 1182141 1092514 -106670 -1989237 -3221197
39533 -3221197 -2950738 -1651361 -320554 668172 1567902 2516421 3213543 3192877 2253959
39524 2253959 846537 46725 706672 2447988 3859545 3824737 2366155 343172 -1068974
39515 -1068974 -796261 1191817 3216552 3320637 1778663 1006880 2361605 4296762 4648209
39506 4648209 3487886 2346535 1663353 796038 5430 477988 2254783 3706191 3451019
39497 3451019 1706487 -440770 -2027657 -2327171 -1088523 972687 2701432 3644516
39489 3644516 3952975 3386199 1576086 -726022 -1949398 -1544488 -492624 182540 326543
39480 326543 -3987 -788839 -1349759 -766880 554033 1032556 137564 -878819 -1043566
39471 -1043566 -970461 -1256603 -1076583 374281 2232875 3151820 3237740 3465823 3896852
39462 3896852 3818598 3109279 2211700 1216928 126392 -452038 -26835 796817 1171207
39453 1171207 1355390 2057656 2977784 3331510 3345182 3737477 4078399 3351617 2033398
39444 2033398 1781047 2783113 3219061 2023785 575854 594800 1604976 1775283 556510
39435 556510 -773460 -932273 33781 1286771 2284028 2980924 3312835 2970651 1907998
39426 1907998 826267 599298 1089127 1160378 242185 -798086 -925567 -362277 116069
39417 116069 630474 1788358 3268097 4063876 3895230 3227011 2286744 1399264 1743550
39408 1743550 3888103 5843818 4894276 1643103 -211529 1080933 2991845 2722827
39400 2722827 1103100 528143 1111110 1385448 1313969 1856715 2523642 2145063 1496434
39391 1496434 2327351 4020182 4140734 2471479 1478573 2108817 2161068 122700 -2205038
39382 -2205038 -2755938 -2403520 -2835597 -3298694 -2223428 -662714 -1072731 -3301097 -4666555
39373 -4666555 -3903095 -2351276 -1090889 380449 1965274 2097424 336041 -1279179
39365 -1279179 -978869 294917 708269 253981 -91513 -584408 -1953670 -3225434 -2576970
39356 -2576970 -241380 1414908 945199 -667134 -1819372 -2071647 -1700055 -950001 -429627
39347 -429627 -999550 -2398842 -2934571 -1472755 913031 2147447 1584473 469125 183054
39338 183054 660720 643208 -683738 -2439778 -2817572 -1346719 349180 884648 1291635
39329 1291635 3185905 5349984 4714378 1185476 -1276126 81954 2848537 3004440
39321 3004440 580083 -1071658 -555627 163063 -528475 -1749119 -2271867 -2339427 -2404355
39312 -2404355 -2022707 -983862 56933 881152 2061814 3250340 2838708 387536 -2207859
39303 -2207859 -3182404 -3050130 -3018454 -2830503 -1876641 -1107368 -1768299 -3060759 -3158912 -2106110
39293 -2106110 -1638493 -2262346 -2565170 -1730999 -850338 -975505 -1326619 -440745 1735265
39284 1735265 3763522 4313136 3311908 1756292 655690 84892 -591458 -1448474 -1587295
39275 -1587295 -564227 513749 381835 -453071 -521039 206953 308056 -686526 -1537859
39266 -1537859 -1326856 -653018 -179065 507192 1651797 2280335 1542514 94816 -1018241
39257 -1018241 -1934702 -3107521 -3651530 -2213026 696049 2741760 2415334 571440 -961220
39248 -961220 -1388948 -1162876 -922176 -876197 -1004649 -1352026 -1913127 -2308651 -1915025 -713161
39238 -713161 170925 -489681 -2262955 -3138429 -1816416 812587 3028045 4281215 4955012
39229 4955012 4888555 3483473 1104113 -833877 -1332957 -561097 821892 2170663 2697387
39220 2697387 1894642 465931 -23744 1078131 2612567 2844143 1249674 -1050451 -2290375
39211 -2290375 -1550074 278236 1164281 139943 -1468960 -1783406 -931159 -655246 -1566939
39202 -1566939 -2363041 -2075617 -1503912 -1638961 -1991451 -1467345 96281 2132515 4056139
39193 4056139 4901092 3464579 108932 -2561092 -2343961 -158521 1286064 956285 108494
39184 108494 -88011 231658 756947 1664183 2791248 3437146 3337815 2825367 1902496 266065
39174 266065 -1657234 -2870913 -3109548 -2800632 -1776781 421765 2772654 3114657 979393
39165 979393 -1514692 -2487018 -2515693 -2984364 -3704977 -3648453 -2912791 -2339431 -1891924 -990742
39155 -990742 -41433 -140022 -1324321 -2272790 -1821427 -85797 1771728 2412141 1431931
39146 1431931 72571 63858 1244407 1472075 -267177 -2075676 -1832787 -288054 390488
39137 390488 -19167 -179339 -107780 -1013481 -2460908 -2469599 -770762 606667 601279 495227
39127 495227 1191118 1577692 834078 94063 311132 499398 -220909 -680885 372294
39118 372294 1992126 2644803 2591424 2620143 1930838 -270951 -2337373 -2135938 -642430
39109 -642430 -647307 -2280977 -2912030 -1578145 -315923 -366687 -189455 1320885 2417459
39100 2417459 1367081 -413848 -534137 468261 -12301 -2492358 -4548347 -4264957 -2579142
39091 -2579142 -1586061 -1876160 -2350638 -1922044 -668629 478210 813166 587495 613633
39082 613633 1121015 1341448 505126 -1062809 -2229803 -2262843 -1451228 -713560 -829852
39073 -829852 -1842565 -2994167 -3454344 -3176758 -2696130 -2149048 -1228911 -249799 -232884
39064 -232884 -1319391 -2050895 -1248723 62154 -133911 -2000395 -3548415 -3302462 -2062064
39055 -2062064 -1531332 -2135388 -2930990 -3148087 -3011696 -3080854 -3357316 -3375567 -3061204 -3102571
39045 -3102571 -4067601 -5266047 -5176323 -3305611 -954456 416200 880187 1251119 1289873
39036 1289873 122691 -1762010 -2603344 -1889877 -1281193 -2128458 -3349172 -3066989 -1512530
39027 -1512530 -723742 -1606699 -2784345 -2637052 -1337417 -335142 -579869 -1766613 -2817150
39018 -2817150 -2670414 -1026171 1254947 2778005 2976309 2573927 2418141 2264249 1236312
39009 1236312 -736516 -2551931 -3054970 -2117735 -575091 477562 234608 -1398920 -3475932
39000 -3475932 -4414054 -3362050 -1214405 226109 262449 5815 746837 2127346 2624650
38991 2624650 1658568 361411 56918 756965 1641440 2355440 3058290 3563818 3339285
38982 3339285 2376390 1348894 756278 425032 -75503 -1026483 -2551795 -4374278 -5526875
38973 -5526875 -5058534 -3249970 -1417887 -273278 712659 1971793 2866822 2766120 2234729
38964 2234729 2207497 2580878 2599176 2165904 1796846 1678004 1718168 2051957 2439607 1803001
38954 1803001 -197369 -1662402 -441451 2474409 3675945 1877939 -412892 -674851
38946 -674851 308132 425403 -256145 -53424 1317974 2397427 2203661 1041836 -607507
38937 -607507 -2388765 -3496031 -3372673 -2848672 -3083685 -3575704 -2898574 -1328487 -784545
38928 -784545 -1831894 -2719994 -2163566 -1248377 -1396914 -1978024 -1505569 -244787 44711
38919 44711 -1331133 -3027473 -3344824 -2074095 -526643 -142017 -1097160 -2197145 -2307604
38910 -2307604 -1690277 -1324192 -1192370 -421567 811391 1026056 -296655 -1652475 -1700367
38901 -1700367 -1160878 -1215413 -1229089 151745 2346683 3202674 1869328 -299001 -1720682
38892 -1720682 -2009990 -1385698 -157933 915655 1096787 834020 1235923 2081226 1742639
38883 1742639 -338001 -2455254 -2812675 -1824634 -1262190 -1922238 -3135204 -3942544 -3783202
38874 -3783202 -2519829 -741221 372837 426283 650820 2307020 4514230 4982261 3080137
38865 3080137 910863 673907 1906755 2351512 1090191 -380254 -394449 571904 638952
38856 638952 -862347 -2517203 -2747472 -1731156 -781926 -407346 77365 1131138 2104935
38847 2104935 2032679 726693 -1087442 -2238246 -1736906 293857 2195413 2168928 394436
38838 394436 -1188835 -1580911 -1920764 -3153547 -3937612 -2567428 -70599 800157 -466165
38829 -466165 -1405252 -332531 1254558 1153980 -413191 -1739361 -2385139 -3071188 -3581101
38820 -3581101 -2887694 -1274489 -362047 -639314 -685554 470642 1739574 1710865 799299
38811 799299 448255 994043 1504568 1199188 -53178 -2150175 -4494893 -5689106 -4800382
38802 -4800382 -2867905 -1904664 -2323012 -2600119 -1730088 -640220 -531031 -1037457 -1081072
38793 -1081072 -718332 -909303 -1778218 -2256054 -1575352 -321174 298962 -205016 -1247945
38784 -1247945 -1943788 -2018188 -1852865 -1639609 -888940 681323 2015490 1495611 -813991
38775 -813991 -2646246 -1979416 667474 3158923 4286743 4336376 3640982 2066416 113202
38766 113202 -801336 97255 1809407 2659212 2110324 971022 171734 -42373 131754
38757 131754 440288 539185 51429 -942910 -1682048 -1467034 -617780 -100741 -10068 771665
38747 771665 2710135 4246611 3654930 1852117 1476228 2891604 3228503 535820 -3039417
38738 -3039417 -4127891 -2819073 -2102570 -3339308 -4869468 -5160663 -4838939 -4874007 -4828947
38729 -4828947 -3991182 -2675601 -1386185 -78259 779162 -69365 -2545217 -4198420 -3020714
38720 -3020714 -424435 439790 -1046660 -2223213 -824579 2195273 4147764 3823605
38712 3823605 2360459 1422508 1415605 1689902 1970949 2820167 4369303 5319088 4247902
38703 4247902 1738884 -70170 -292290 -249957 -996131 -1405807 -72313 2064214 2793512
38694 2793512 1793621 827063 805764 527113 -1068607 -2913611 -3184282 -1802977 -411134
38685 -411134 -96941 -135771 743082 2442831 3487169 2914764 1520457 664039 346585
38676 346585 -474742 -1779235 -2145127 -1070400 -207200 -1135234 -2985612 -3698710 -2854908
38667 -2854908 -1680963 -851865 -140584 -4771 -1442659 -3904368 -5242671 -4535031 -3402172
38658 -3402172 -3572887 -4494363 -4508484 -3285952 -1751822 -374635 1013178 2053179 1945342
38649 1945342 804352 -170276 -200582 189210 164501 -210757 -309845 -77081 -94503 -505553
38639 -505553 -603647 32162 516220 -359946 -2237476 -3310360 -2610100 -1130541 -133816
38630 -133816 499686 1235865 1344871 -5119 -1787696 -2110596 -1006615 -424410 -1300398
38621 -1300398 -2407661 -2488821 -1801063 -954725 95040 1101728 1185629 415286 232907
38612 232907 1236619 2047523 1626709 1146079 1919715 2906545 2343400 860366 674109
38603 674109 2141394 3340856 3020728 1909666 915571 -41842 -955040 -1232943 -954872
38594 -954872 -1164022 -2146852 -2620832 -1446620 743446 2299863 2243192 789075 -1044752
38585 -1044752 -2012518 -1610918 -751673 -663610 -1056183 -525848 1024522 1861169 942727
38576 942727 -513792 -1010084 -974315 -1618298 -2654352 -2856299 -2312857 -2301407 -2964418 -2842650
38566 -2842650 -1210845 506528 506144 -1074890 -2516894 -2716488 -2127695 -1629185 -1329946
38557 -1329946 -866011 -320178 -157442 -328410 -160600 531719 835680 -121880 -1796749
38548 -1796749 -2781289 -2574944 -1953251 -1624456 -1526947 -1642413 -2387618 -3634350 -4282728
38539 -4282728 -3564261 -2050382 -629304 787550 2608019 4188160 4231379 2403056 -268869
38530 -268869 -2448682 -3313357 -2702082 -1272861 -221554 -30510 175343 1169931 2031029
38521 2031029 1267921 -733551 -1931485 -1449246 -636523 -777002 -1195303 -652980 428735
38512 428735 418128 -1257218 -3295929 -3945548 -2741022 -965098 -596374 -2385018 -4762827
38503 -4762827 -5271462 -3352309 -949526 38366 -115505 -124143 139176 -59299 -565849
38494 -565849 -518643 -102558 -528344 -1977464 -2951434 -2260035 -590147 579134 754431
38485 754431 392322 -165803 -824060 -1228909 -1015557 -436648 -110661 -227765 -488491 -643775
38475 -643775 -541868 178699 1728020 3466122 4279853 3905152 3279808 3257717 3590881
38466 3590881 3737452 4073166 5275334 6663697 6447710 4208447 2093753 2407771 4519404
38457 4519404 5518037 3945331 1465855 314355 434062 277860 -507315 -802568 -193228
38448 -193228 192961 -483734 -1283087 -693195 1227770 2725935 2288582 259796 -1537291
38439 -1537291 -1677754 -624166 -196867 -1429573 -3353220 -4394272 -4501365 -4882956 -5793341
38430 -5793341 -5933679 -4537307 -2841840 -2503695 -3289231 -3446525 -2062359 -63704 1084328
38421 1084328 882944 -89962 -949141 -1157410 -742415 -40317 787060 1800180 2769787
38412 2769787 3005806 2028962 198446 -1549620 -2366661 -1864619 -337269 1234082 1982554
38403 1982554 2128071 2417250 2495818 1091578 -1590280 -3104882 -1693731 1123581 2480098
38394 2480098 1888255 1233911 1585698 2102121 2087136 2017016 2066393 1536186 508886 358764
38384 358764 1619608 2803749 2464231 1215274 551603 721979 966121 920586 518548
38375 518548 -713203 -2875900 -4721347 -4757262 -3091068 -1179984 -105359 -46065 -939509
38366 -939509 -2413518 -3324296 -2661866 -994477 9138 -396777 -1330839 -1636664 -1129937
38357 -1129937 -423298 -197595 -698659 -1431138 -1479486 -613641 307902 636454 976395 1939522
38347 1939522 2564255 1526498 -378722 -796790 891087 2591568 2481692 1339765 827483
38338 827483 833469 64302 -1509405 -2465633 -2071197 -1215390 -909603 -906375 -395185 561158
38328 561158 1026345 530460 -179141 -43395 887752 1403755 596661 -1053838 -2342206
38319 -2342206 -2682439 -2342699 -1699640 -918917 -216937 242418 689900 1386480 1970189
38310 1970189 1811108 967114 88265 -558459 -1144861 -1439534 -1001917 -377033 -844848
38301 -844848 -2435708 -3368559 -2314390 -248097 955001 916485 525400 -16009 -1340890
38292 -1340890 -3206557 -4176607 -3494753 -2162157 -1501311 -1471144 -1150168 -273860 631497
38283 631497 1380967 2397819 3643308 4095734 2888665 561988 -1462049 -2487530 -2987234
38274 -2987234 -3475135 -3711170 -3302295 -2402680 -1364582 -286409 587987 680770 3356
38265 3356 -368065 319758 1165095 788943 -586592 -1576656 -1863399 -2367581 -3165075 -3076757
38255 -3076757 -1884530 -1173659 -1950682 -2918643 -2385926 -676764 728554 1413435 1863006
38246 1863006 1915299 1066129 -145472 -691543 -747924 -1271217 -2036128 -1767498 -383603
38237 -383603 536243 24986 -942600 -1058510 -398893 257817 751388 1180816 1048517 -31740
38227 -31740 -1129797 -678261 1501264 3683593 4114044 2896204 1588292 1256787 1603340
38218 1603340 2078614 2971348 4550225 5660245 4641565 1923699 180244 905284 2113653
38209 2113653 997130 -1987586 -3630327 -2312608 187610 1534348 1544820 1307338 1326758
38200 1326758 1711897 2813060 4266289 4454017 2471676 -52818 -665665 789056 2268048
38191 2268048 2495371 2189132 2276087 2622388 3075767 4154501 5686519 6035661 4042406
38182 4042406 988097 -744797 -568632 74127 137242 120233 529397 612360 -568685
38173 -568685 -2685094 -4539021 -5298364 -4771170 -3249315 -1850313 -2159385 -4353383 -6234384
38164 -6234384 -5470417 -2549477 -162171 236347 -246028 -160686 418919 877473 1337906
38155 1337906 1897886 1783498 513240 -927405 -1309935 -932774 -931203 -1306005 -1012772
38146 -1012772 101281 770802 60712 -1262817 -1645021 -669154 346564 -180299 -2054778
38137 -2054778 -3203672 -2193110 -346494 -117216 -1558444 -2188153 -706527 1224786
38129 1224786 1880160 1982993 2664044 2892567 1270285 -1042642 -1755368 -851673 -102844
38120 -102844 -71440 -222130 -1114267 -3364320 -4983552 -3304929 363886 1661634 -647107
38111 -647107 -3033955 -2755595 -1315961 -783174 -376248 856093 1258787 -473653 -2172856
38102 -2172856 -1328802 628022 511167 -1645046 -3127028 -3015460 -2825764 -3250783 -3368644
38093 -3368644 -2941269 -2768345 -2755115 -2037079 -1003652 -964607 -1851045 -2315710 -1929095 -1241364
38083 -1241364 -72436 1961702 3586440 3058492 1062617 -117991 -176331 -759344 -1898682
38074 -1898682 -1635565 233055 1202220 -44059 -1630433 -1693217 -919830 -414868 351780
38065 351780 1633792 1840774 60769 -1810284 -1744000 -761524 -1077309 -2376287 -2478440
38056 -2478440 -969869 253873 -115474 -1345332 -2172844 -2209312 -1643296 -672368 518848
38047 518848 1745379 2698566 2704384 1292110 -809116 -2287685 -3092804 -4216189 -5283628
38038 -5283628 -4392956 -1332514 1211436 1261308 351109 739958 1753507 1422153 165790
38029 165790 -116536 445615 245406 -355304 583338 2800965 3693185 2417605 1124375
38020 1124375 1255591 1452555 375478 -933437 -1074565 -607516 -677121 -974791 -692263
38011 -692263 -168332 -50379 102385 996518 2272203 3098145 3196643 2427924 554383
38002 554383 -1649488 -2468018 -1586426 -861694 -1385008 -1504721 257523 1988885 867429
37993 867429 -2128640 -3242548 -1597077 -488095 -2091230 -3941950 -2677933 873819
37985 873819 2853957 1545351 -993853 -2162098 -1574157 -365311 475634 425202 -559740
37976 -559740 -1505676 -952440 1022530 2188269 791788 -1777410 -2463329 -598811 1148116
37967 1148116 418049 -1737656 -2534248 -1216002 315700 219985 -1332207 -2915242 -3376758
37958 -3376758 -2432673 -723195 475285 387388 -271092 -203007 606943 948562 330133
37949 330133 -393704 -603848 -724445 -860308 -74340 1941159 3664244 3494373 1867008
37940 1867008 387995 -391107 -1005077 -1523014 -1479755 -1067233 -980269 -1181045 -1071245 -763628
37930 -763628 -904783 -1337290 -1284778 -805871 -573572 -173823 1588429 4212213 5180917
37921 5180917 3198912 277959 -805418 -117027 -95857 -1995682 -4271293 -4561455 -2296916
37912 -2296916 828696 2447156 1595924 -443999 -1582214 -1319453 -1072218 -1810899 -2447413
37903 -2447413 -1532734 294993 925921 -512131 -2845980 -4594163 -5240621 -4792314 -3396716
37894 -3396716 -1685988 -384050 711783 2252943 3598623 2946790 -112698 -3471223
37886 -3471223 -4935091 -4712389 -4304686 -3953957 -2847258 -1300031 -800894 -1701685 -2531580
37877 -2531580 -2171646 -1297048 -855350 -403008 813550 2038646 1865526 676757 662393
37868 662393 2981159 6046945 7342261 6200817 4065757 2555203 2164986 2603545 3365219
37859 3365219 3739246 3045188 1360753 -390955 -1448965 -1935630 -2224783 -2086598 -1118846
37850 -1118846 251567 1018793 911995 740657 1182921 1834771 1841016 1019066 -51576
37841 -51576 -726005 -730627 -254333 17923 -657900 -2114324 -3054211 -2415632 -794736 105746
37831 105746 -591450 -2095036 -2984430 -2518415 -927625 910954 1904207 1470079 194582
37822 194582 -629041 -385434 294879 560182 481236 790179 1770852 2840381 3209178 2747840
37812 2747840 2147770 2150508 2573567 2445157 1454800 807184 1839810 4058239 5621098
37803 5621098 5793840 5695472 6333519 7297389 8079341 9229389 10977484 11932425 10797784
37794 10797784 8601810 7422423 7309893 6370241 3866323 1319706 162944 64484 203128
37785 203128 516856 767921 -52262 -2046741 -3322473 -2125131 602794 2242977 1718633
37776 1718633 373060 -214614 -27618 -13590 -599087 -1183806 -783923 804052 2282300
37767 2282300 1781166 -949563 -3802842 -4523861 -3167506 -1440724 -151273 1287259
37759 1287259 2919133 3439224 1988875 -311780 -1473443 -763183 837482 1885412
37751 1885412 1758736 1023508 816799 1605012 2549396 2599620 2125133 2580006 4366829
37742 4366829 6065105 6321851 5556641 4992195 4831568 4489272 4066837 4263702 4855556
37733 4855556 4459386 2234431 -842300 -2712215 -1915877 1305465 4905136 6141494
37725 6141494 3828187 -130466 -2240147 -962569 1839773 3412342 3225760 2759780
37717 2759780 2874302 2736200 1407833 -636006 -2058824 -2062971 -853477 718217 1578392
37708 1578392 1065184 -333168 -1274300 -1046598 -296489 196298 738879 1762597 2256800
37699 2256800 718835 -2251869 -3912526 -2658744 -85968 1226143 918580 516599
37691 516599 684813 550437 -356221 -1164678 -1120121 -701539 -665582 -955011 -1191474 -1411192
37681 -1411192 -1651448 -1564867 -1132112 -1008419 -1360772 -1109735 595083 2668924 3132562
37672 3132562 1739340 372784 640659 2045896 2860396 2052341 47832 -1763438 -2024082
37663 -2024082 -562263 1167172 1392817 13944 -1356303 -1511654 -955354 -709997 -843677
37654 -843677 -978732 -1416854 -2633948 -4117527 -4833260 -4613263 -4005402 -2932216 -780289
37645 -780289 2027601 3840636 3713873 2564655 1808141 1700023 1670694 1424269 847603
37636 847603 -396859 -2098891 -2884699 -1650742 600169 1626558 717132 -578523 -689017
37627 -689017 198536 1039431 1466800 1662210 1566345 1111244 665845 465861 114745 -615345
37617 -615345 -1085892 -761217 -236956 -180183 170856 1919740 4146416 4435549 2170770
37608 2170770 -371358 -1034645 -394087 -186565 -464150 -13355 1144183 1599934 866063
37599 866063 129547 283465 555551 -245476 -2065046 -3806397 -4516972 -3958231 -2697240
37590 -2697240 -1937747 -2386540 -2951385 -1731400 1040890 2405913 293260 -3384163 -4971525
37581 -4971525 -3690905 -2012501 -1741757 -2134643 -2329228 -3139782 -5013143 -6182683 -4905886
37572 -4905886 -2366813 -1220679 -1867428 -2279842 -1328266 -138125 168609 113877 488916
37563 488916 937886 883518 648146 706453 851201 976363 1626672 2767678 3080748 1769734
37553 1769734 209030 309260 1783980 2548123 1550826 -234498 -1494408 -1789857 -1074622
37544 -1074622 503469 2005048 2209465 1169917 195881 -20039 -111509 -557172 -811303
37535 -811303 -516458 -351751 -899346 -1745848 -2467361 -3347127 -4205237 -3783308 -1617938
37526 -1617938 502521 500886 -1297839 -3000243 -3977035 -4968167 -5742937 -4917624 -2487383
37517 -2487383 -490313 -267877 -764866 -694124 -861764 -2673554 -5247123 -5919808 -3589191
37508 -3589191 -89098 2017043 1881631 271718 -1855288 -3827023 -4903015 -4488923
37500 -4488923 -2873465 -1225091 -582802 -1037531 -1984548 -2855195 -3335919 -3165875 -2277569
37491 -2277569 -1190130 -743834 -1162082 -1736763 -1752692 -1374218 -1203854 -1286269 -1146171 -689764
37481 -689764 -423602 -659040 -1011344 -936385 -458872 -147661 -508716 -1474888 -2379134 -2478246
37471 -2478246 -1675019 -656312 -168531 -303680 -641442 -803117 -634442 -247717 -246865 -1399285
37461 -1399285 -3495234 -5038481 -4872083 -3683189 -2952060 -2856541 -2489832 -1860621 -1992722
37452 -1992722 -2808316 -2677076 -877660 984741 1141479 70916 -511194 -147907 262337
37443 262337 248917 222001 399739 517615 523380 564131 406039 -223287 -901980 -1032415
37433 -1032415 -849905 -933853 -979273 -206472 1135320 1908698 1771663 1487856 1402418 905904
37423 905904 -185756 -940331 -615376 349396 1284932 2304448 3599562 4503959 4164282
37414 4164282 2755159 1355394 860510 1364297 2197281 2298165 1112964 -562233 -1267170
37405 -1267170 -713000 -172721 -667250 -1683573 -2282020 -2499688 -2781561 -2858722 -2243246
37396 -2243246 -1229659 -399438 305863 1023918 1147050 274971 -579631 -160446 1023797
37387 1023797 1377743 701210 324974 697858 597704 -775883 -2505283 -3418892 -3427756
37378 -3427756 -2684268 -911708 1390089 2474357 1478320 -28575 -108719 789735 787051
37369 787051 -334732 -870995 73671 1403309 1932718 1923753 2082941 2267275 2014292 1499079
37359 1499079 1157034 932609 590760 336650 492118 811120 610683 -508520 -2251842
37350 -2251842 -3736338 -4019148 -2965429 -1602833 -1043296 -1060738 -542019 557599 828147
37341 828147 -479657 -2000663 -1843897 68297 2183481 3269536 3231550 2508345 1725704
37332 1725704 1580594 2016706 1889525 586952 -497042 347569 2243159 2471473 438166
37323 438166 -1194266 -312144 1654215 2166204 1445435 1651324 2982905 3166700 1086824
37314 1086824 -1296552 -1617939 -101706 1315821 1710679 1611369 1394146 798099 7140
37305 7140 -153506 446172 697071 -283303 -1798398 -2461204 -2030675 -1484872 -1411396 -1327123
37295 -1327123 -846745 -572666 -1167264 -2196034 -2673625 -2312638 -1454105 -245266 1093705
37286 1093705 1606650 602789 -755997 -489394 1227710 1866501 196361 -1586739 -927362
37277 -927362 1225780 1672678 -574762 -3226543 -4038173 -3140350 -1641109 162895 2151681
37268 2151681 3333085 2757926 951319 -489234 -554189 278104 517433 -996332 -3700091
37259 -3700091 -5387162 -4514157 -2268364 -1160217 -1643105 -1757015 -411460 958132 941324
37250 941324 381127 477045 386858 -1113550 -2818018 -2549331 -888353 -669890 -2546644
37241 -2546644 -3743771 -2176808 522634 1614256 1081471 942244 1873515 2629466 2425862
37232 2425862 1895380 1403412 133180 -2257736 -4168590 -3475344 -206352 3085505 3821957
37223 3821957 1855275 -678962 -1582602 -475575 1189744 1603925 213006 -1798852
37215 -1798852 -2672305 -1931506 -847468 -690499 -971623 -286419 1355903 2362739 1956963
37206 1956963 1284952 1362891 1352267 201523 -1177626 -1153654 -62198 336184 -246243
37197 -246243 -402669 207826 142226 -1107415 -1778562 -401231 1999995 3603034 4207760
37188 4207760 4461329 4032178 2442927 795505 619757 1450618 1519934 676877 588079
37179 588079 1809140 2673816 1889250 591722 663837 2116856 3357389 3381241 2571902
37170 2571902 1667671 960265 521242 485540 886507 1494775 1912155 1818436 1333747 1147406
37160 1147406 1872746 3148015 3897805 3745072 3551027 4061649 4622387 4048118 2404263
37151 2404263 921428 198829 -376029 -1062996 -801758 1172503 3475224 3789855 1954351
37142 1954351 428665 1118309 2985578 3888713 3745791 4136264 5163994 4900739 2598508
37133 2598508 489684 863269 2648203 2865373 893636 -833257 -521432 623998 564066
37124 564066 -689504 -1672664 -1865285 -1935101 -2078091 -1675403 -697808 -161473 -718349 -1701502
37114 -1701502 -2154962 -2169228 -2528106 -3419791 -4213684 -4422355 -4254030 -4093177 -3948001 -3686835
37104 -3686835 -3417206 -3187878 -2564056 -1146971 385549 450445 -1639607 -4370042 -5291771
37095 -5291771 -3718532 -1526463 -920422 -1937675 -2775972 -2291321 -1317952 -1315407 -2419178
37086 -2419178 -3424145 -3409715 -2753895 -2488030 -3111691 -4238101 -5106341 -5220575 -4689383
37077 -4689383 -4167396 -4343977 -5283606 -6308970 -6618531 -5923690 -4489565 -2859807 -1665233
37068 -1665233 -1290585 -1395343 -1112029 -127893 797653 919630 674269 925862 1350550
37059 1350550 731523 -1035905 -2465597 -2507111 -1940224 -1949496 -2266018 -1851599 -825312
37050 -825312 -426564 -1204825 -2365129 -3006293 -3066102 -2820244 -2276020 -1476140 -863284 -929793
37040 -929793 -1742205 -2948023 -3971147 -4172872 -3248011 -1667895 -455675 -275201 -760910
37031 -760910 -805675 389582 2366973 3618347 3161653 1831946 1294091 1752424 1768504
37022 1768504 779629 365872 1853064 3909007 4282115 3127415 2488738 2764805 2063204
37013 2063204 -479324 -2945086 -3262184 -1868552 -504505 266188 897521 1226966 544860
37004 544860 -1092609 -2735306 -3489359 -2941246 -1176785 933592 2096899 1991671 1702520
36995 1702520 2111291 2635417 2340176 1420748 584247 -209155 -1240523 -2009720 -1958246
36986 -1958246 -1560453 -1418947 -968588 430543 1751198 1451059 24572 -538918 180591
36977 180591 540772 -260244 -871065 -250017 403656 -445249 -2113272 -2602257 -1427084
36968 -1427084 -185476 -471291 -2171729 -3863272 -4352760 -3796036 -3429305 -3994811 -4589832
36959 -4589832 -3776348 -1799864 -606754 -1239002 -2340638 -2105107 -808932 -254317 -1170184
36950 -1170184 -2381553 -2551612 -1766730 -1109991 -1285511 -2020246 -2528570 -2261584 -1226377
36941 -1226377 226191 1647874 2437931 2003181 537479 -630005 -282921 1086140 1775553
36932 1775553 1079031 32244 -289660 -65828 282192 1194521 2937215 4313293 3839753
36923 3839753 1919313 532498 763691 1794883 2507468 2889184 3315065 3435108 2732113
36914 2732113 1715107 1503273 2134774 2209188 801256 -893816 -893444 648294 1205795
36905 1205795 -650729 -2760916 -1942629 1530412 4070450 3603914 2103576 2257059 3532007
36896 3532007 3429573 1493811 -129491 126711 1422728 2097180 1588935 376128 -825240
36887 -825240 -1344057 -941752 -311214 -473730 -1460857 -2327950 -2602101 -2838528 -3474540 -3991547
36877 -3991547 -3648044 -2428435 -961692 -37823 -278139 -1524558 -2446978 -1678816 408927
36868 408927 2031555 2380657 2517914 3308050 3773809 2668996 734820 -97126 634536
36859 634536 1457679 1152294 175384 -380959 -313429 -336376 -1122283 -2607310 -3913480 -3944717
36849 -3944717 -2521223 -864192 -316944 -561285 90551 2335954 4610828 4817216 2849448
36840 2849448 688530 153576 1162706 2201897 2013003 736414 -260079 348764 2398554
36831 2398554 4061798 3582514 1279820 -709984 -923385 -194339 -312726 -1666869 -3066987
36822 -3066987 -3550233 -3261227 -2563666 -1547115 -854758 -1733980 -4266478 -6439887 -6233598
36813 -6233598 -4136366 -2328838 -1713795 -1261763 -326925 82434 -939541 -2492143 -3005282
36804 -3005282 -2320578 -1646445 -1935586 -3170316 -4830935 -6181860 -6360989 -5039312 -2915968
36795 -2915968 -972352 505860 1571665 1805298 893379 -255915 -220148 1018402 2041927
36786 2041927 2143966 2237533 3036383 3623088 2920965 1598567 1056381 1099956 345546 -1099018
36776 -1099018 -1256805 654313 2390540 1362929 -1800077 -4077485 -4069791 -3319354 -3357260
36767 -3357260 -3375506 -2019262 -52777 561773 -381937 -1172854 -923461 -593447 -765417
36758 -765417 -230199 1957095 4331648 4598026 2702650 686025 -237477 -741520 -1444621
36749 -1444621 -1705489 -1054153 -314628 -244500 -253460 252657 264972 -1429105 -3801939 -4452091
36739 -4452091 -2966547 -1540368 -1672466 -2046729 -908040 896823 1025616 -918389 -2904495
36730 -2904495 -3338952 -2688849 -1916269 -932735 483534 1452630 948799 -569194 -1631141
36721 -1631141 -1679221 -1581679 -2212980 -3312936 -3989943 -3845413 -3280668 -2841777 -2445105 -1433074
36711 -1433074 348681 1721173 1172003 -1066275 -2774575 -2211763 -117132 1535522
36703 1535522 2067381 2266582 2592182 2663297 2423007 2346344 2296628 1563265 405770 160558
36693 160558 1191942 2082645 1740680 1074133 1416797 2318199 2310447 1209036 163539
36684 163539 -286022 -775101 -1691268 -2388461 -2102283 -837063 807940 2018798 1998288
36675 1998288 615131 -1103808 -1867520 -1602828 -1371177 -1765227 -2137090 -1599463 -171872
36666 -171872 1247743 1598774 403991 -1619018 -2829866 -2283404 -949664 -466761 -850200
36657 -850200 -628927 655784 1500715 583915 -1340974 -2558491 -2504379 -1860124 -1254075
36648 -1254075 -829293 -625404 -530984 -222950 158261 -214655 -1617273 -2874019 -2711868
36639 -2711868 -1607515 -1126886 -1599587 -1686512 -412195 1492207 2660904 2611623 1748498
36630 1748498 635362 -168268 -157928 572936 1184322 1029838 501326 461181 1067211 1720369
36620 1720369 2093714 2577776 3458680 4119330 3581153 1784478 -140044 -1070947 -1000712
36611 -1000712 -614959 -174229 469028 887263 162360 -1596673 -2733093 -1932462 -118486
36602 -118486 522763 -825766 -2922282 -4295727 -4695973 -4564723 -4135362 -3562544 -3140688
36593 -3140688 -2799902 -1966380 -455863 1021433 1781545 2091761 2581598 3157377 3159237
36584 3159237 2307398 875545 -846016 -2670246 -4285782 -5457747 -6278181 -6742911 -6407391
36575 -6407391 -5080653 -3495962 -2480993 -1785592 -775125 -63949 -1013364 -3302205 -4535820
36566 -4535820 -3264138 -1240051 -1281340 -3508395 -5276112 -4806298 -3343871 -3077146 -4055498
36557 -4055498 -4292418 -2553599 41145 1477160 1236433 609277 769373 1275630 976012
36548 976012 -51801 -438808 399733 1122153 229019 -1617529 -2184451 -502016 1992579
36539 1992579 3395206 3390429 2833948 2225895 1536070 997301 984883 1198256 893428 72322
36529 72322 -320293 348281 1564277 2418173 2665564 2612542 2342226 1600559 344766 -990397
36519 -990397 -1782569 -1606422 -482039 1020941 2086860 2371005 2336112 2613140 3155114
36510 3155114 3361543 2911137 1990577 723410 -991988 -2819644 -3774376 -3251030 -1950918
36501 -1950918 -1180036 -1378328 -1933734 -2315109 -2586720 -2678971 -2071860 -768082 142189
36492 142189 -252652 -1246075 -1291640 -114516 940872 864122 342672 669878 2009496
36483 2009496 3416547 4098844 3926955 2998445 1509875 43569 -730442 -824828 -921282
36474 -921282 -1420245 -1911233 -1756810 -842202 435127 1602932 2360375 2681997 2867027
36465 2867027 3225443 3555278 3243973 2117229 879289 403880 847069 1799565 3021661
36456 3021661 4480866 5772388 6165549 5458920 4329450 3506105 2916294 2017943 741390
36447 741390 -361396 -857206 -896569 -873391 -987741 -1267250 -1661890 -1920027 -1736612 -1341100
36437 -1341100 -1588645 -2959891 -4650689 -5240133 -4274357 -2658114 -1431682 -789371 -519105
36428 -519105 -702290 -1408440 -2149932 -2314176 -1935436 -1441395 -793131 427866 2030951
36419 2030951 3006930 2642754 1434666 539865 531210 954978 974642 212590 -1011448 -2108566
36409 -2108566 -2775960 -3051053 -2886225 -2026778 -576575 629981 761577 49360 -429659
36400 -429659 -135982 304683 137634 -354011 -275398 463013 767062 -354891 -2431531
36391 -2431531 -3847998 -3573618 -2258499 -1335257 -1249143 -1121974 -223655 928379 1418308
36382 1418308 1301496 1296221 1351362 520928 -1496097 -3498331 -3998595 -2883299 -1391995
36373 -1391995 -686822 -857463 -1235868 -1298669 -1108528 -1007726 -1125404 -1378880 -1827505 -2595948
$$ [...]
##END NTUPLES=NMR SPECTRUM
##END=
