##TITLE=31Pdec_PR175-2
 CDCl3, 24 sc
 27.6.2019
##JCAMPDX= 6.0         $$ Bruker NMR JCAMP-DX V2.0
##DATA TYPE= NMR SPECTRUM
##DATA CLASS= NTUPLES
##ORIGIN= UXNMR, Bruker Analytische Messtechnik GmbH
##OWNER= root
$$ XWIN-NMR		Version 3.5
$$ Thu Jun 27 15:25:48 2019 Russian Standard Time (UT+4h)  she@DPX200
##.OBSERVE FREQUENCY= 81.013821
##.OBSERVE NUCLEUS= ^31P
##.ACQUISITION MODE= SIMULTANEOUS
##.ACQUISITION SCHEME= undefined
##.AVERAGES= 24
##.DIGITISER RES= 17
##SPECTROMETER/DATA SYSTEM= spect
##.PULSE SEQUENCE= zgpg30
##.SOLVENT NAME= CDCl3
##.SHIFT REFERENCE= (INTERNAL, CDCl3, 0, 182.463)
##AUDIT TRAIL= $$ (NUMBER, WHEN, WHO, WHERE, WHAT)
$$ ##TITLE= Audit trail, XWIN-NMR		Version 3.5
$$ ##JCAMPDX= 5.01
$$ ##ORIGIN= Bruker BioSpin GmbH
$$ ##OWNER= she
$$ F:/spectra/data/she/nmr/P31/1/pdata/1/auditp.txt
$$ ##AUDIT TRAIL=  $$ (NUMBER, WHEN, WHO, WHERE, WHAT)
(   1,<2019-06-27 15:24:52.48 +0400>,<she>,<DPX200>,
      <created by zg, POWCHK disabled, PULCHK disabled
       configuration hash MD5:
       00 E9 B6 7A A2 85 ED C7 34 08 36 98 17 FE 4E 26
       data hash MD5: 32K
       A8 42 AF 43 2C BD A6 F9 18 D1 C6 BB E1 62 D5 49>)
(   2,<2019-06-27 15:24:56.56 +0400>,<she>,<DPX200>,
      <Start of raw data processing
       efp BC_mod = 2 LB = 1 FT_mod = 6 PKNL = 1 PHC0 = -2595.387 PHC1 = 199.1996 SI = 64K 
       data hash MD5: 64K
       6C D8 48 31 52 BE 5F D6 83 67 1B 03 84 F4 70 6F>)
(   3,<2019-06-27 15:25:12.12 +0400>,<she>,<DPX200>,
      <pk PHC0 = 77.482 PHC1 = -156 
       data hash MD5: 64K
       90 DB 0C F0 0A 30 24 B0 2B B6 B2 29 0F 98 A9 65>)
(   4,<2019-06-27 15:25:15.92 +0400>,<she>,<DPX200>,
      <abs ABSG = 5 
       data hash MD5: 64K
       8B 2E 64 60 3D 06 E4 E5 18 7A A0 9B 24 55 A6 26>)
$$ ##END=
$$ 
$$ hash MD5
$$ 86 5B 6E CD 77 B4 EB A8 28 6E 75 DB 19 52 F6 4C
##$RELAX= 
##$RELAX= 
##$RELAX= 
##$RELAX= 
##$RELAX= 
##$RELAX= 
##$RELAX= 
##$RELAX= 
$$ Bruker specific parameters
$$ --------------------------
##$DU= <F:/spectra>
##$EXPNO= 1
##$NAME= <P31>
##$PROCNO= 1
##$TYPE= <nmr>
##$USER= <she>
##$AMP= (0..31)
100 100 100 100 100 100 100 100 100 100 100 100 100 100 100 100 100 100 
100 100 100 100 100 100 100 100 100 100 100 100 100 100 
##$AQSEQ= 0
##$AQ_mod= 1
##$AUNM= <au_zg>
##$AUTOPOS= <>
##$BF1= 81.014009
##$BF2= 200.13
##$BF3= 200.13
##$BF4= 200.13
##$BF5= 200.13
##$BF6= 200.13
##$BF7= 200.13
##$BF8= 200.13
##$BYTORDA= 1
##$CFDGTYP= 0
##$CFRGTYP= 5
##$CHEMSTR= <none>
##$CNST= (0..31)
1 1 145 1 1 1 1 1 1 1 1 1 1 1 1 1 1 1 1 1 1 1 1 1 1 1 1 1 1 1 1 1 
##$CPDPRG= <waltz16>
##$CPDPRG1= <>
##$CPDPRG2= <waltz16>
##$CPDPRG3= <>
##$CPDPRG4= <mlev>
##$CPDPRG5= <mlev>
##$CPDPRG6= <mlev>
##$CPDPRG7= <mlev>
##$CPDPRG8= <mlev>
##$CPDPRGB= <>
##$CPDPRGT= <>
##$D= (0..31)
0 1 0 0 0 0 0 0 0 0 0 0.03 2e-05 3e-06 0 0 0 0 0 0 0 0 0 0 0 0 0 0 0 0 
0 0 
##$DATE= 1561634691
##$DBL= (0..7)
120 120 120 11 120 120 24 19 
##$DBP= (0..7)
150 150 150 150 150 150 150 150 
##$DBP07= 0
##$DBPNAM0= <>
##$DBPNAM1= <>
##$DBPNAM2= <>
$$ [...]
##$SUBNAM3= <"">
##$SUBNAM4= <"">
##$SUBNAM5= <"">
##$SUBNAM6= <"">
##$SUBNAM7= <"">
##$SUBNAM8= <"">
##$SUBNAM9= <"">
##$SW= 369.568048894756
##$SWIBOX= (0..15)
0 1 3 0 0 0 0 0 0 0 0 0 0 0 0 0 
##$SW_h= 29940.119760479
##$TD= 32768
##$TD0= 1
##$TE= 0
##$TE2= 300
##$TE3= 300
##$TEG= 300
##$TL= (0..7)
0 120 53 12 22 120 120 120 
##$TP= (0..7)
150 150 150 150 150 150 150 150 
##$TP07= 0
##$TPNAME0= <>
##$TPNAME1= <>
##$TPNAME2= <>
##$TPNAME3= <>
##$TPNAME4= <>
##$TPNAME5= <>
##$TPNAME6= <>
##$TPNAME7= <>
##$TPOAL= (0..7)
0.5 0.5 0.5 0.5 0.5 0.5 0.5 0.5 
##$TPOFFS= (0..7)
0 0 0 0 0 0 0 0 
##$TUNHIN= 0
##$TUNHOUT= 0
##$TUNXOUT= 0
##$USERA1= <user>
##$USERA2= <user>
##$USERA3= <user>
##$USERA4= <user>
##$USERA5= <user>
##$V9= 5
##$VALIST= <valist>
##$VCLIST= <CCCCCCCCCCCCCCC>
##$VD= 0
##$VDLIST= <DDDDDDDDDDDDDDD>
##$VPLIST= <PPPPPPPPPPPPPPP>
##$VTLIST= <TTTTTTTTTTTTTTT>
##$WBST= 1024
##$WBSW= 4
##$XGAIN= (0..3)
0 0 0 0 
##$XL= 0
##$YL= 0
##$YMAX_a= 17713
##$YMIN_a= -14099
##$ZGOPTNS= <>
##$ZL1= 120
##$ZL2= 120
##$ZL3= 120
##$ZL4= 120
##$ABSF1= 182.463
##$ABSF2= -187.1042
##$ABSG= 5
##$ABSL= 3
##$ALPHA= 0
##$AQORDER= 0
##$ASSFAC= 0
##$ASSFACI= 0
##$ASSFACX= 0
##$ASSWID= 0
##$AUNMP= <proc_1d>
##$AZFE= 0.1
##$AZFW= 0.5
##$BCFW= 0
##$BC_mod= 2
##$BYTORDP= 0
##$COROFFS= 0
##$CY= -3
##$DATMOD= 1
##$DC= 0
##$DFILT= <>
##$DTYPP= 0
##$F1P= 0
##$F2P= 0
##$FCOR= 1
##$FTSIZE= 65536
##$FT_mod= 6
##$GAMMA= 0
##$GB= 0
##$INTBC= 1
##$INTSCL= 5.30512e-09
##$ISEN= 30
##$LB= 1
##$LEV0= 0
##$LPBIN= 0
##$MAXI= 10000
##$MC2= 0
##$MEAN= 0
##$ME_mod= 0
##$MI= 50
##$NCOEF= 0
##$NC_proc= -6
##$NLEV= 6
##$NOISF1= 182.463
##$NOISF2= 159.3651
##$NSP= 0
##$NTH_PI= 0
##$NZP= 0
##$OFFSET= 182.463
##$PC= 4
##$PHC0= -2517.905
##$PHC1= 43.1996
##$PH_mod= 1
##$PKNL= yes
##$PPARMOD= 0
##$PSCAL= 0
##$PSIGN= 0
##$REVERSE= no
##$SF= 81.0140089999434
##$SI= 65536
##$SIGF1= 159.3651
##$SIGF2= -187.1042
##$SINO= 113.3802
##$SIOLD= 16384
##$SREGLST= <1H.CDCl3>
##$SSB= 0
##$STSI= 65536
##$STSR= 0
##$SW_p= 29940.119760479
##$SYMM= 0
##$S_DEV= 0
##$TDeff= 32768
##$TDoff= 0
##$TI= <>
##$TILT= no
##$TM1= 0
##$TM2= 0
##$TOPLEV= 0
##$USERP1= <user>
##$USERP2= <user>
##$USERP3= <user>
##$USERP4= <user>
##$USERP5= <user>
##$WDW= 1
##$XDIM= 65536
##$YMAX_p= 320061552
##$YMIN_p= -41004925
$$ End of Bruker specific parameters
$$ ---------------------------------
##NTUPLES= NMR SPECTRUM
##VAR_NAME=  FREQUENCY,     SPECTRUM/REAL,   SPECTRUM/IMAG
##SYMBOL=    X,             R,               I
##VAR_TYPE=  INDEPENDENT,   DEPENDENT,       DEPENDENT
##VAR_FORM=  AFFN,          ASDF,            ASDF
##VAR_DIM=   65536,         65536,           65536
##UNITS=     HZ,            ARBITRARY UNITS, ARBITRARY UNITS
##FACTOR=    0.456856943014862, 1,           1
##FIRST=     14782.0589164792, 0,            0
##LAST=      -15158.0608439998, 0,           0
##MIN=       -15158.0608439998, -41004925,   0
##MAX=       14782.0589164792, 320061552,    0
$$ Real data points
##PAGE= N=1
##DATA TABLE= (X++(R..R)), XYDATA
$$ [...]
41120A626343L070809N3122k767327k616991q45660q9610n85019r29631n34544
41111c618508K60761J063791J228667J13411j535852j829012k36031J454233J483633
41102a614907K17710q03396p36762K32005J312016J424746K20745r80151n34059
41093a262053J103779J790860P24680n99636q09928l23105m3137q839j8826k16737
41083C37058m41090j84709M19336O99820N85854M16424o2534r41920j005118N25640
41073C48761J775313N40103j688665j520995O12644P74220j726728k655959J19609
41064c421697K681385J349243j286567q68681J511602J573453q31964j886770
41056a179996l48431J047965P09166K18673O43514P33866j73579p67861l91163
$$ y = [1626343, 4697152, 4750274, 1982947, -634044, -1479704, -1569314, -2154333, -3083964, -3618508, -3357747, -2293956, -1065289, -951878, -2487730, -4316742, -4552773, -3098540, -1614907, -1397197, -2200593, -2937355, -2705350, -1393334, 31412, 252157, -727994, -1262053, -158274, 1632586, 2357266, 1757630, 947702, 624597, 581460, 572621, 553795, 337058, -104032, -288741, 130595, 830415, 1416269, 1832693, 1770159, 828239, -176879, 348761, 2124074, 2664177, 975512, -545483, 67161, 841381, -885347, -3541306, -3421697, -740312, 608931, -677636, -1546317, -34715, 1538738, 706774, -1179996, -1528427, -480462, 228704, 447377, 1090891, 1824757, 1651178, 883317, 492154]
41047D92154k06623p15961p62706k4198Q6209q62990j194543j7988J103832Q76297
41037a226517M54222J158634J970010J306163k28471r34106o97056n58520n16615
41028G27744J46921R03553M69854q26994j158466r922Q52815j2393j508205j502112
41018a917205K07963J651592J311291k6545m71949N15668J593535J375358R0297
41009D330005r47267j020522n70333l00901l88735o36589q53385q50948m53584
41000a692259J83001M77626J18q26447r07596K88672J745190J745462O4719j357300
40990b78814p58678R90389J565552N24160k87953J22095M03222n45164j486372
40981B48437r80725L3437j32550r11851m61751J073311J745807R77544J30569
$$ y = [492154, 285531, -430430, -1193136, -1217334, -1131125, -1994115, -3188658, -3206646, -2102814, -1226517, -772295, 386339, 2356349, 3662512, 3434041, 2499935, 1802879, 1244359, 727744, 874665, 1778218, 2248072, 1421078, 262612, 252690, 1105505, 1093112, -415093, -1917205, -1709242, -57650, 1253641, 1227096, 755147, 1270815, 2864350, 4239708, 4330005, 3382738, 2362216, 1791883, 1490982, 1102247, 465658, -387727, -1238675, -1692259, -1509258, -1031632, -1031514, -1857961, -2765557, -2476885, -731695, 1013767, 1078486, -278814, -1037492, -47103, 1518449, 2042609, 1754656, 1876751, 2279973, 1734809, 248437, -732288, -698851, -831401, -1743252, -2205003, -1131692, 614115, 1591659, 1722228]
40972A722228r4007l84174o66941K14730J908143K088109j29721k384691k226888
40963D6788m01554O52933K01180o15455r24736o99881P1622J175373J636113Q38201
40953A980584k41809k42070N54605P08301j93160j139449j284220p30320R0020
40944d97518O95548M62861n56997j001801K50872K066829K176069L96326j024988
40935B967201p74320k98098j139211k147838j255689R38638J679496J40089j277518
40926a167250o15034O37767l792j816738j615866J370434L931382L242474O83659
40917D647036n60851j66886m07871j926798k662907j399412K37921M65196j07492
40908a882064j00360K20382p1539n33341k56884K02749k02917q76751m82985N50834
$$ y = [1722228, 1628221, 1244047, 577106, 791836, 2699979, 4788088, 4658367, 2273676, 46788, -354766, 298167, 499347, -116108, -1040844, -1740725, -1669103, -493730, 1142383, 1980584, 1738775, 1496705, 2051310, 2759611, 2566451, 1427002, 142782, -587538, -497518, 198030, 660891, 103894, -897907, -647035, 1419794, 3595863, 3992189, 2967201, 2192881, 1894783, 755572, -1392266, -2647955, -1709317, -29821, 110268, -1167250, -1782284, -1144517, -1148309, -2965047, -4580913, -3210479, 720903, 3963377, 4647036, 4086185, 3919299, 3511428, 1584630, -1078277, -2477689, -2239768, -1774572, -1882064, -1982424, -1762042, -1833581, -2366922, -2623806, -2421057, -2623974, -3500725, -3983710, -3432876]
40898c432876O45882j08425j23647O48685L95190j255306k114531p74486J157694
40889d961820J690552J364684J642036J976468Q00803j458224k630843j775545
40881c351889l7089J252011J638115R78946l99084j112641j37521J233409Q40875
40872I05132q76487j219951M99940J691149O67398n71315K05300J547319P35073
40863C583558j465989j824073J84804J641194Q72697l60132l26761k5497q00705
40854A479096j698482j273661k43974j50250o78462n18693R4100k7906n47420
40845c565652n6699J246540J640449P44427J07525N27092Q90139M41058K29655
40836B204534J103235J836140P80694j533906k860262j936549J95082J383279
$$ y = [-3432876, -2786994, -2895419, -3019066, -2370381, -1975191, -3230497, -5345028, -6119514, -4961820, -3271268, -1906584, -264548, 1711920, 2512723, 1054499, -1576344, -3351889, -3388978, -2136967, -498852, 480094, 81010, -1031631, -1169152, 64257, 905132, 28645, -1191306, -691366, 999783, 1667181, 1095866, 1301166, 2848485, 3583558, 2117569, 293496, 478300, 2119494, 2992191, 2632059, 2305298, 2279801, 1479096, -219386, -1493047, -1737021, -1887271, -2565733, -3084426, -2990326, -3018232, -3565652, -3622351, -2375811, -735362, 9065, 116590, 643682, 1533821, 1974879, 2204534, 3307769, 5143909, 5924603, 4390697, 1530435, -406114, -211032, 1172247]
40828A172247M30779j722730k769472j543525M17367Q48724R109J91249J853852
40819a112400K572997Q64947j258113j329471p4596K43823m26318m82796J01397
40810i00530J5694m70711J46090J424142J253666k90317n90166J019518J636054
40801C243440n27805k780993j884558R07844J879180N14383k70725Q66673J802342
40792C749781O45681j407406k153977j396886n04553k16754j93803n0902J81540
40783a347279K85418k0548p97232j439815j133723o3977N91756L42548K49284
40774c333568J357084K863821K849265P49205j707454k334327q95338P05375O91124
40765I45187m93419r39323p4095M14111p83560k181960j409600J038734K167569
$$ y = [1172247, 1603026, -119704, -2889176, -4432701, -4015334, -3166610, -3157501, -2966252, -1112400, 1460597, 2325544, 1067431, -262040, -336636, -92813, -519131, -1001927, -900530, -884836, -1355547, -1209457, 214685, 1468351, 1178034, 587868, 1607386, 3243440, 2715635, -65358, -1949916, -1042072, 837108, 1351491, 1080766, 1947439, 3749781, 4395462, 2988056, 834079, -562807, -1067360, -1284114, -1477917, -1528819, -1347279, -1061861, -1082409, -1879641, -3319456, -4453179, -4517156, -3925400, -3582852, -3333568, -1976484, 887337, 3736602, 4485807, 2778353, 444026, -451312, 254063, 945187, 451768, -487555, -561650, -147539, -931099, -3113059, -4522659, -3483925, -1316356]
40756a316356Q23552o60176j40581J220971J201249M5346m63031j80090l26285
40747B04599p49895j51652J084740R70139p37361j741485o46260J012182J306869
40738E51876N25657r9657m67345q20372m72519Q24857J500721J87133j737709
40729g358j709052M06143K239909K237957J113629j9856j064326k051897k390652
40720a245503j651137j88046J271305J899650R23967j306334k748532j729741
40712d774371N69865J446782M47542k55186M76440J102479L31679o36624k96834
40703a588228O96932J025986R82486J255403R46639q34862k524008j911629J90400
40694a760881Q63266m53929j257949j71719J031431P43970K21140J052772K007404
$$ y = [-1316356, -492804, -1152980, -1293561, -72590, 1128659, 1174005, 710974, 530884, 204599, -545296, -696948, 387792, 1357931, 620570, -1120915, -1767175, -754993, 551876, 1077533, 977876, 510531, -309841, -782360, 42497, 1543218, 1730351, -7358, -1716410, -1310267, 929642, 3167599, 4281228, 4261372, 3197046, 1145149, -1245503, -2896640, -3084686, -1813381, 86269, 1010236, -296098, -3044630, -4774371, -4204506, -2757724, -2310182, -2565368, -2088928, -986449, -654770, -1291394, -1588228, -891296, 134690, 1117176, 2372579, 3319218, 2484356, -39652, -1951281, -1760881, -897615, -1351544, -2609493, -2781212, -1749781, -1005811, -784671, 268101, 2275505]
40685B275505R13725j481400k251575o53570P84304R1687j373697j205940N30629
40676b370332J716467J345026N16627L01621K34227m38151j222960j138327l12087
40667a367889K86782L76573M97345P26114M82980j41958q0385J065510K035380
40658C880452J412065n35964k282739k761851j952960m04423R51475J101032J03057
40649d89856n16360L99290J852281J988354P76217j62637k44577n85371j626816
40640A390525k051063j044417N5582j60199p58750K5779J667127J861166J07475
40631A093225j312791o43302P71463N33100j231296j986269l12224K165439K877066
40622A954411J340633p06969j620208j296622m75801L42194R07210R69021O46303
$$ y = [2275505, 3189230, 1707830, -543745, -1197315, -413011, -321324, -1695021, -2900961, -2370332, -653865, 691161, 1207788, 1509409, 1743636, 1305485, 82525, -1055802, -1367889, -1081107, -704534, -207189, 518925, 1001905, 859947, 779562, 1845072, 3880452, 5292517, 4756553, 2473814, -288037, -2240997, -2645420, -1693945, -592913, -489856, -1006216, -606926, 1245355, 3233709, 4009926, 3847289, 3602712, 3017341, 1390525, -660538, -1704955, -1649373, -1809572, -2568322, -2542543, -875416, 985750, 1093225, -219566, -862868, -91405, 441695, -789601, -2775870, -3088094, -922655, 1954411, 3295044, 2588075, 967867, -328755, -804556, -462362, 444848, 1413869, 2060172]
40613B060172M97914N83169K3157j587008k816439j817934Q73375K485697J556675
40604A858778r9249j10773R92825Q62024p30674j337125K95594J963803J101638
40595D796841j359240k310321r74973K80831j33539p19039K77822J701254J234742
40586B794378q06576j820274p63345O72498J000167P82695P42397J98905j188011
40577A612834j938099r00629M42788l6686j690229j956743k72977J272932J345881
40568b120928J053614J478714J641827L08398j624015k134246p76942R13736J396634
40559A36792N62073o07758j118535p70541k45471k78954p32610q88045n60402
40550d503451k06748K9606M28775P58831L85198l62972k05516J078934J889058
$$ y = [2060172, 2558086, 3141255, 3164412, 1577404, -1239035, -3056969, -2183594, 302103, 1858778, 1759529, 1648756, 2641581, 3503605, 2772931, 1435806, 1731400, 3695203, 4796841, 3437601, 1127280, 152307, 433138, 299599, -419440, -141618, 1559636, 2794378, 1987802, 167528, -595817, 76681, 1076848, 1859543, 2601940, 2800845, 1612834, -325265, -1225894, -783106, -819792, -2510021, -4466764, -4739741, -3466809, -2120928, -1067314, 411400, 2053227, 2361625, 737610, -1396636, -2173578, -1259842, 136792, 698865, 91107, -1027428, -1797969, -2043440, -2322394, -3055004, -3943049, -4503451, -4710199, -4680593, -4251818, -3492987, -3107789, -3470761, -3676277, -2597343, -708285]
40541g08285R73170o75973j189270k75838Q09332J113049O86594o1327o42758
40532B8694n03344K76408O75118L7407p83883o13878J84197K60644n57656r59050
40522a955343r7635J252737J797160J219375L32189J81384R97387J719366R27606
40513F374226j283894k968527k609924j090681l63414p76588j039700m26145N06253
40504c678394J236375J735058J531678L207j981267k322754m15865J689210J820997
40495c81755L70851n98568j59167P24252Q90117L66077n6211K6787K46325J12909
40485A541617k02749q3216M86726O93707J46979l65808j73859j0281p60106j568307
40475b95297r18059O74559J068802j80325j040658k62182O81515J70557q85449
$$ y = [-708285, 264885, -411088, -1600358, -1876196, -1066864, 46185, 732779, 671452, 28694, -474650, -198242, 476876, 514283, -269600, -883478, -699281, -438637, -996293, -1955343, -2052978, -800241, 996919, 2216294, 2548483, 2729867, 3727254, 5446620, 6374226, 5090332, 2121805, -488119, -1578800, -1942214, -2718802, -3758502, -4184647, -3678394, -2442019, -706961, 824717, 827924, -1153343, -3476097, -3891962, -2202752, -381755, -10904, -609472, -768639, -44387, 845730, 1211807, 1155596, 1182383, 1428708, 1541617, 1338868, 1255652, 1742378, 2436085, 2583064, 2217256, 2043397, 2033116, 1273010, -295297, -1213356, -538797, 530005, 349680, -690978, -953160, -271645, -101088, -986537]
40466i86537o64878O26262J310408Q50737R7811m62799r39400r05434J69152J431083
40456E26405J272669l08453j397871o24249J185215K218062J632624n1089j676315
40447B776998k145204j073507P34106J782997J196553n13165j903809j746918
40439h91949r2384J529015J438280k78856j760313j675670p09171j09305J19716
40430b430637M33530K98358p17450j222750L77126K772230K728627l53662l201992
40421a316620k993494q15150O29861R01680J386710K233859K123936Q14306k11084
40412B754004j9308M24170j44504j412603j971944j083178O38800J947642J914973
40403C048052M43033j616999k826055k122616J37937K183198K336430P39405q23642
$$ y = [-986537, -1651415, -1025153, 285255, 1135992, 1233803, 771004, -168396, -1073830, -904678, 526405, 1799074, 1490621, 92750, -531499, 653716, 2871778, 4504402, 4453313, 2776998, 631794, -441713, 292393, 2075390, 3271943, 2758778, 854969, -891949, -984333, 544682, 1982962, 1704106, -56207, -1731877, -2441048, -2550353, -2430637, -1997107, -1698749, -2416199, -3638949, -3261823, -489593, 2239034, 1885372, -1316620, -4310114, -5125264, -4495403, -3593723, -2207013, 26846, 2150782, 2965088, 2754004, 2734696, 3158866, 3014362, 1601759, -370185, -1453363, -814563, 1133079, 3048052, 3491085, 1874086, -951969, -3074585, -2936648, -753450, 1582980, 2322385, 1498743]
40394A498743j071455o06230n99139q34673k40442J009815J459830O15744k83933
40385I48260k90536j03470n47902j010253n66458L74632Q57203R66578J255403
40376A883457J287340K82596j212492j811244j212637k80420M91733J125117J128039
40367A681489J15017p07250K49153K068697J963205n23940k353298j358409N22530
40358A657194M26832r36156p17079J263770K264280J073196k90772r7159M73610
40349E117716l27681j803113j979010o34523O41793Q36938L90536j9641j91269
40340B031746o859M49098M20799o87854j977349j810475j62264J070146O46093
40331b6919l52479k87454O67685J122476P16034L65305N16645N26842m1938o71908
$$ y = [1498743, 427288, -178942, -778081, -1612754, -1853196, -843381, 616449, 1232193, 948260, 657724, 554254, 6352, -1003901, -1570359, -1195727, -338524, 628054, 1883457, 3170797, 3453393, 2240901, 429657, -782980, -1063400, -571667, 553450, 1681489, 1796506, 1089256, 1338409, 3407106, 5370311, 4846371, 2493073, 1134664, 1657194, 2084026, 1147870, 430791, 1694561, 3958841, 5032037, 4741265, 4644106, 5117716, 4790035, 2986922, 1007912, 373389, 1015182, 1852120, 2242656, 2223015, 2031746, 2024887, 2473985, 2894784, 2206930, 229581, -1580894, -1743158, -673012, -26919, -379398, -666852, 833, 1123309, 1839343, 2204648, 2721293, 3248135, 3206197, 2534289]
40321B534289q38512p87759q50911p04907P4652J154297J647805R91253n41767
40312B678440j870045j708110J52216K062930J944888j42102j839717j498864
40304b20364k73742k10872j210388j375127N3086J681617J985417J061655O8090
40295A559372j42727M12468Q97625K57704j436702k472768j459082M08147O07044
40286a368919j067685j987706m88191J690867K022015O55105m42801o45800r35195
40277b568310j546513j400165k4432J536022K095358J507791L17245p48749r00652
40268a732405j1481P24230M8845j321464j271887P23931K588569K348288O43031
40259B739657m60631k18026M02746M90685J34044k60267n98907r20628j183018
$$ y = [2534289, 1695777, 908018, 57107, -647800, -573148, 581149, 2228954, 3220207, 2678440, 808395, -899715, -747499, 1315431, 3260319, 3118217, 1278500, -220364, -494106, -704978, -1915366, -3290493, -3237407, -1555790, 429627, 1491282, 1559372, 1416645, 1829113, 2726738, 2984442, 1547740, -925028, -2384110, -1975963, -1368919, -2436604, -4424310, -4912501, -3221634, -1199619, -544514, -987315, -1633115, -2568310, -4114823, -5514988, -5539420, -4003398, -1908040, -400249, -83004, -831753, -1732405, -1743886, -1019656, -970811, -2292275, -3564162, -2840231, -251662, 2096626, 2739657, 2279026, 2061000, 2463746, 2954431, 3088475, 2828208, 2229301, 1308673, 125655]
40250A25655j338154j306416r78497n08503l24815m92758m16177L39227J250643
40241c649795J459077R24248K78780k56447r24174j384203o95113J116253K360861
40232g70513J559229m12082j215443j57499Q24491p9913j868263k056170j96459
40223d372622J512216J356270L20159K89217J197098J313912j11340j805217k080540
40214b380847n74389J676044L178328L003492J480775j33607j045834j586445
40206C617517k047227j755405l83636O88776P627j426603j244161P00046J950718
40197A07652J112050k82273n07850k33546q92552k036668k047167n43865J383802
40188c940417K634680K635121J284662m75753r42956K93953J463991R50849n01826
$$ y = [125655, -1212499, -2518915, -3497412, -4005915, -4330730, -4823488, -5239665, -4900438, -3649795, -2190718, -1266470, -987690, -1244137, -2168311, -3552514, -4247627, -3131374, -770513, 788716, 376634, -838809, -996308, -171817, -251730, -2119993, -4176163, -4372622, -2860406, -1504136, -1183977, -894760, 302338, 1616250, 1504910, -300307, -2380847, -2955236, -1279192, 1899136, 4902628, 6383403, 6249796, 5203962, 3617517, 1570290, -185115, -568751, 120025, 127652, -1298951, -2543112, -1843066, 107652, 1219702, 937429, 429579, 196033, -696519, -2733187, -4780354, -5324219, -3940417, -1305737, 1329384, 2614046, 2138293, 1195337, 1489290, 2953281, 3904130, 3402304]
40179C402304j206865j002270p40091m22117L16780P87229K57726l93384j5539
40170I83773O32636K01822n65187J3563J333124J247281k23922q98450j89550
40161B535090K16143k45575j88656M84505n2282j771209j901539L68754J727933
40152A173164k13908k776216k221095N42160J746264N02301q13990p82188j15944
40143b959452O95364J711966J943643M62554j217689q76989O00316L60373j564663
40134h44577k071773j40728J432489O27714q16824p10613K65912O19931Q46651
40125g91818J744926K036003L74007j727730j694820K79845J701670J449122N56710
40116C927915l13583j643038l060292k908032o83035J745374K354785J296625
$$ y = [3402304, 2195439, 1193169, 453078, 30961, 347741, 1134970, 1392696, 999312, 983773, 1616409, 1818231, 1253044, 1266607, 2599731, 3847012, 3623090, 2724640, 2535090, 2751233, 2505658, 2317002, 2801507, 2749225, 978016, -923523, -554769, 1173164, 959256, -1816960, -4038055, -3495895, -1749631, -1247330, -2061320, -2843508, -2959452, -2264088, -552122, 1391521, 1854075, 636386, -240603, 359713, 720086, -844577, -2916350, -3057078, -1624589, -996875, -1813699, -2524312, -2258400, -1638469, -791818, 953108, 2989111, 3363118, 1635388, -59432, 220413, 1922083, 3371205, 3927915, 3614332, 1971294, -1088998, -3997030, -4680065, -2934691, -579906, 716719]
40108G16719J37686l27118n17864p90479p04657K41839J613709K210424J389347
40099C969606l8169o95106l47385m1779m40084r50363r52700q44590j019755p75496
40089b135821N16983J836747J593986L873j084903p09347K50189P28108O58857
40080A658672K06267p31518j641397j354426K47185J561105J257240N8522m31776
40071H29874J26611R03577J413511J679416J355273O8048j447859j823404q59713
40062B245334J59173K32699j66920o6692N60140Q63159L17282n39042o12628M29701
40052C422206J428997Q87096r39065k020824j287914k14855m01931p93229N20343
40043F00824K489249K071699p56942k201173j95968K226188J402218j509038k485698
$$ y = [716719, 854405, 527287, 9423, -781056, -1485713, -1243874, 369835, 2580259, 3969606, 3931437, 3236331, 2888946, 2847167, 2407083, 1456720, 504020, -340570, -1360325, -2135821, -1618838, 217909, 1811895, 1815768, 730865, 21518, 271707, 999815, 1658672, 1864939, 1133421, -507976, -1862402, -1615217, -54112, 1203128, 1261650, 829874, 956485, 1860062, 3273573, 4952989, 6308262, 6376310, 4928451, 3105047, 2245334, 2404507, 2637206, 2470286, 2403594, 2963734, 3826893, 4144175, 3605133, 2992505, 3422206, 4851203, 5738299, 4799234, 2778410, 1490496, 1275641, 873710, 80481, 600824, 3090073, 5161772, 4404830, 2203657, 2007689, 4233877, 5636095, 4127057, 1641359]
40034A641359n31772J548571J565649J68373j159201j669733q98349R36224K029214
40025C630335Q32319j246588j482430n6760K98850r93676j451870p2170Q78010
40016C36020O1941n49781L96915Q29719q54815k266324q14659J626635J701618
40007D67269P7615k36128N59395j67301j988793j592363J382520L272025K060563
39998C834802K7466n41315m90384r94291j080003j1537P28362j8052r53191p13029
39988b11172j51459l09741l00971O96294J362365L88280j037485j106992k04732
39979h75613L01333N36504J120633J155420k81546j775836j290882N54860J408701
39970H53574P75514K29571M16878L15659m69037q63761j49915R78173J438310
$$ y = [1641359, 1109587, 2658158, 4223807, 4392180, 3232979, 1563246, 664897, 1601121, 3630335, 4462654, 3216066, 1733636, 1676876, 1975726, 982050, -469820, -541990, 336020, 397961, -151820, 245095, 1074814, 219999, -2046325, -2860984, -1234349, 467269, 544884, 308756, 868151, 700850, -1287943, -2880306, -1497786, 1774239, 3834802, 3862268, 3320953, 2830569, 1836278, 756275, 744738, 1473100, 1455048, 501857, -211172, -362631, -672372, -973343, -277049, 1085316, 1473596, 436111, -670881, -875613, -574280, -37776, 1082857, 2238277, 1956731, 180895, -1109987, -555127, 853574, 1629088, 1858659, 2275537, 2591196, 2122159, 1258398, 1108483, 2086656, 3524966]
39961C524966P27891r11672k266079j787954K77750J431048J90166j426478q63345
39952a103707P95039N48348j395249j749310M38641K070073P93798j536009j858212
39943b996588p819J920373K479440J531548m26250k078213j833501J9089J048253
39934c43668l4397j282959l94942J681291K155662N75894p38644l16823N86018
39925A887432K80789q70123j284388n18769L40311M14307J94235N45999J098850
39916B088643N74170j070922j896142m16379J879005K025712l88438k385565j463449
39907a053365J138171K214450P18881j280104j499285p9311R85575L88899j048311
39898D85600j498061l84650R65261J085261J43013o18688o13074k04632K45392
$$ y = [3524966, 4252857, 3341185, 1075106, -712848, -435098, 995950, 1186116, -240362, -1103707, -308668, 239680, -1155569, -2904879, -2466238, -396165, 397633, -1138376, -2996588, -3004407, -1084034, 1395406, 2926954, 2500704, 422491, -1411010, -1391921, -343668, -378065, -1661024, -2055966, -374675, 1780987, 2356881, 1618237, 1301414, 1887432, 2168221, 1298098, 13710, -505059, -164748, 249559, 443794, 989793, 2088643, 2662813, 1591891, -304251, -720630, 1158375, 3184087, 2795649, 410084, -1053365, 84806, 2299256, 3018137, 1738033, 238748, 159437, 1145012, 1533911, 485600, -1012461, -1397111, -431850, 653411, 796424, 177736, -435338, -639970, -394578]
39889c94578N68332M01591k32416l66786N44063J177827L0224j767260j526741
39880a565744R52844K807619K177460M53854m87846q22739j110528n33916J161686
39871C032690K021833N71040j454298j562949l48169j56007r87214p92611O12415
39862I36730J100749n8656r60956l06559O23366L46153n11807n83556R8810O04456
39852A288730O30412M50077J91719L459J74164M59641R7827r46424j615096j212149
39842d77640l60322J11147L64430Q90793J406878J298931P02432L04318K72289
39833D513256N9747o83650j408141j114474L65263J652919J024169j304013k888959
39824B16117j950642J95977R23314o6658o84214J05552R15496N56315l9989L22658
$$ y = [-394578, 173754, 575345, 342929, -23857, 520206, 1698033, 1728257, -39003, -1565744, -612900, 2194719, 4372179, 4826033, 4338187, 3515448, 2404920, 1871004, 3032690, 5054523, 5625563, 4171265, 2608316, 2260147, 2104140, 1116926, 324315, 936730, 2037479, 1978823, 1017867, 711308, 1334674, 1680827, 1169020, 585464, 684274, 1288730, 1919142, 2369219, 2560938, 2564397, 2738561, 3198202, 3296029, 2349605, 734509, -477640, -837962, -726815, -362385, 528408, 1935286, 3234217, 3936649, 4240967, 4513256, 4573003, 3889353, 2481212, 1366738, 1732001, 3384920, 4409089, 3105076, 216117, -1734525, -1538548, -615234, -681892, -1366106, -1260554, -345058, 211257, 171268, 493926]
39814D93926J004350P91213L3973r4490L34390K74639m21760q44704n08411K17713
39804A280839R62209J533688J458172M49492p55216j057915m39662J83457L81710
39795C996774M70524N03728J89046j70132J16602P58529N49369p69538j843508
39786C801394j501267k34460P82211J222099J363333J159972N40387J9261l058
39777G149872q5735q54579j655323j286526Q2598R68897O49763n074n3066L25890
39767E236717O18207Q42940R55471M30600o64412j113240j91863Q88252N16134
39758G518806q54971j305049l13100O31171N09047K14803P81965J530657J099492
39749I812821m84743j828391j830098n41545J224477K461263K524665J766083
$$ y = [493926, 1498276, 2289489, 2323462, 2228972, 2563362, 2838001, 2416241, 1571537, 1063126, 1280839, 2243048, 3776736, 5234908, 5684400, 4929184, 3871269, 3431607, 3615064, 3996774, 4467298, 4971026, 5160072, 4989940, 5106542, 5865071, 6414440, 5644902, 3801394, 2300127, 2065667, 2847878, 4069977, 5433310, 6593282, 7133669, 7152930, 7149872, 7064137, 6209558, 4554235, 3267709, 3350307, 4319204, 4968967, 4963893, 4910827, 5236717, 5854924, 6697864, 7653335, 8083935, 7419523, 6306283, 6114420, 7002672, 7518806, 6663835, 5358786, 5045686, 5676857, 6185904, 6400707, 7182672, 8713329, 9812821, 9328078, 7499687, 5669589, 5128044, 6352521, 8813784, 11338449, 13104532]
39741A3104532J306354J698966K244348K100285J499347J223632J389044J478595
39733B6045103J203278P08050L29438O57193K198376M344948N479643M997453
39725D5963482M375757N077929O264766O198985N310214N815699Q253612J0435564
39717I7696008J0515898R434195R279780J0393824J1201881J0258339P552050
39710A66331975M139898J091331j390213l979886p065570r756539j0816813j0473071
39702A28081112j0228347j0746425j1080527j0340753q925532p530087o100051
39695F3129390m590844l760897m170333n039949n082572m070679k807420j919849
39687C1686847j402925j075762q50358o86684o60189q84559j209444j358263j415279
$$ y = [13104532, 14410886, 16109852, 18354200, 20454485, 21953832, 23177464, 24566508, 26045103, 27248381, 27956431, 28285869, 28943062, 31141438, 35486386, 40966029, 45963482, 50339239, 55417168, 61681934, 67880919, 73191133, 79006832, 87260444, 97696008, 108211906, 117646101, 126925881, 137319705, 148521586, 158779925, 166331975, 170471873, 171563204, 170172991, 166193105, 159127535, 149370996, 138554183, 128081112, 117852765, 107106340, 96025813, 85685060, 76759528, 69229441, 63129390, 58538546, 54777649, 50607316, 45567367, 40484795, 36414116, 33606696, 31686847, 30283922, 29208160, 28357802, 27671118, 27010929, 26126370, 24916926, 23558663, 22143384]
39678B2143384j630104j765067j426559j029154j361120k065929j859107o16531
39670A0389813K06470j37860n43294j21087K18215l73507p80837K51591J583274
39661A0692778J173876n67648j263827k30331O45131K1508j015309j005314l25329
39652H125535k17573p99944j231379j151329q79031n17004K20973J249568J809224
39643F609040J277421J17989m60104j28453k21851j900736l741545k872412Q17641
39634e03010L488462K028068j540088k649236l44654J890206J394069m58389j140038
39625B165390n36060q7396k12191l65909n06772q22332p24669L93172J828625
39616A131858K231395J319995m062r08477j142275p05454R2100N39614K89595
$$ y = [22143384, 20513280, 18748213, 17321654, 16292500, 14931380, 12865451, 11006344, 10389813, 10596283, 10458423, 9915129, 9794042, 10012257, 9638750, 8857913, 9109504, 10692778, 11866654, 11299006, 10035179, 9804848, 10449979, 10471487, 9456178, 8450864, 8125535, 7907962, 7108018, 5876639, 4725310, 3846279, 3329275, 3550248, 4799816, 6609040, 7886461, 8004450, 7544346, 7415893, 7194042, 5293306, 1551761, -1320651, -503010, 2985452, 5013520, 3473432, 824196, 479542, 2369748, 3763817, 3305428, 2165390, 1629330, 1541934, 1329743, 963834, 457062, -365270, -1089939, -696767, 1131858, 3363253, 4683248, 4679186, 3770709, 2628434, 1922980, 2015080, 2554694, 2844289]
39607B844289p5739P3998L97552K21544k59488l60067j35039k00288m98039l19351
39597A689372L81700P10499J69334n34031m66433K51803O05618o6309j257308
39588A484245j751434r20822M91207J184921R05376O33767R70626J197236O04039
39579D799161j31664l1946L60536k52766j575229j830546n08887O70437K91150
39570A790246p30991p59050J09891N82326L38105J38166K06870L7682l02739j17792
39560A292714N65982R03660O71065M87162L61124m86191j817160j989789l70640
39551c82073J277192J133366j22287o01359n1994L57621L34483M95772N11721
39542B952442n48512j954747j680982M20815J938518J279023k08944o08600j01679
$$ y = [2844289, 2768550, 2842548, 3240100, 3461644, 3202156, 2842089, 2707050, 2506762, 2008723, 1689372, 2071072, 2781571, 2950905, 2416874, 1950441, 2202244, 2807862, 2741553, 1484245, -267189, -1188011, -696804, 488117, 1393493, 2027260, 2997886, 4195122, 4799161, 4667497, 4635551, 4996087, 4743321, 3168092, 1337546, 828659, 1499096, 1790246, 1059255, 300205, 410096, 992422, 1330527, 1468693, 1675563, 1713245, 1410506, 1292714, 1858696, 2762356, 3433421, 3920583, 4281707, 3795516, 1978356, -11433, -382073, 895119, 2028485, 1906198, 1304839, 1252845, 1610466, 1944949, 2440721, 2952442, 2403930, 449183, -1231799, -810984, 1127534, 2406557, 2197613, 1589013, 1487334]
39533A487334J57767J99669N43045O27256k10425j116406q77955L2985K99716
39524A142986m8456r1320l8577p90263j834833j653143j64196J175328J733225
39515e69249K193739K572093J865772J63337r31846p18252l87175p79387r82889
39506B426143k34141M67018n2612j288159k062126k184106j901474r15926O84503
39497e060880J604401R56270j60205j71836O43510R02974N36319O98053J541403
39488A490009J846257J034077M2160k51037k69677p94669j611415j796501r74145
39479a284941K30666R09947P73485K71644q0196k46594l87576m28675m05161p89940
39469a437341j622191j725797j03294K059923K445230Q62010m04641q5794L15269
$$ y = [1487334, 1645101, 1844770, 2387815, 3015071, 2804646, 1688240, 810285, 843270, 1142986, 1094530, 1003210, 964633, 174370, -1660463, -3313606, -3477802, -2302474, -569249, 1624490, 4196583, 6062355, 6225692, 5293846, 4575594, 4188419, 3409032, 2426143, 2192002, 2659020, 2606408, 1318249, -743877, -2927983, -4829457, -5745383, -5060880, -3456479, -2500209, -2660414, -2832250, -2188740, -1285766, -749447, -51394, 1490009, 3336266, 4370343, 4412503, 4161466, 3891789, 3097120, 1485705, -310796, -1284941, -1054275, -144328, 629157, 900801, 820605, 574011, 186435, -242240, -647401, -1437341, -3059532, -4785329, -4888623, -2828700, -383470, 478540, 73899, -11895, 303374]
39460C03374n89063j508770o26404J352094K431345K337960K044304J365999m02689
39451F708150k129442j863828o3430Q40990K48200J10885J359694K258619J403885
39442H873723N2037k4013P60942Q05168k26909j339647j692679j122435m3260
39433F042927M47941n34228k002499j741003M98958K040054Q07960j715472k724755
39424A119883j898348r31661l47559P44735K113929K177140O24270q68953j135286
39415A598150q42445o21303K18987J911239K809997J443203j012943k065927j218116
39406B220842k63065m28066r30747p21616j18808R6312N5621K60214M55619J33168
39396G59474l70015l70808q3587k03761m66905L9559J052156J071874l60879j649829
$$ y = [303374, -285689, -1794459, -2420863, -1068769, 1362576, 3700536, 5744840, 7110839, 6708150, 4578708, 2714880, 2651450, 3492440, 3740640, 3851525, 5211219, 7469838, 8873723, 8925760, 8901747, 9662689, 10467857, 10240948, 8901301, 7208622, 6086187, 6042927, 6490868, 5956640, 3954141, 2213138, 2712096, 4752150, 5560110, 3844638, 1119883, -778465, -1710126, -2057685, -1312950, 800979, 2978119, 3602389, 2733436, 1598150, 755705, 134402, 353389, 2264628, 5074625, 6517828, 5504885, 3438958, 2220842, 1957777, 1529711, 598964, -122652, -241460, -145148, -89527, 170687, 626306, 759474, 389459, 18651, -64936, -268697, -735602, -696043, 356113, 1427987, 1067108, -582721]
39386e82721j239423L25894J393909J368490Q33314K82406q3715J42739J048387
39377C489280J725316J261379Q9706p17020j066180j527321j830308j168815K05371
39368D61408J223557J722104K294504K489389J111329j345963k606823j737612
39360C611893m98477n59062j159205q79095j05282l3065m39866k59824M62050
39351A40067Q77984R04654Q65973K79082j210930k265001j264675R22840J710469
39342I60463M78711o01947M5077J258088J364692P08124M96344N53480P943o47177
39332D623798j28903J244076J612080L70351p36377j78252R69618N51957j383990
39323F944358k426521j111033R91497J342734k80878j745102j488832k66542K68746
$$ y = [-582721, -1822144, -1496250, -102341, 1266149, 2099463, 2381869, 2298154, 2440893, 3489280, 5214596, 6475975, 6565681, 5848661, 4782481, 3255160, 1424852, 256037, 461408, 1684965, 3407069, 5701573, 8190962, 9302291, 7956328, 5349505, 3611893, 3113416, 2554354, 1395149, 516054, 410772, 377707, -62159, -321983, 140067, 1018051, 1922705, 2788678, 3067760, 1856830, -408171, -1672846, -750006, 960463, 1439174, 837227, 882304, 2140392, 3505084, 4213208, 4709552, 5263032, 5270975, 4623798, 4494895, 5738971, 7351051, 7721402, 6985025, 6806773, 7776391, 8328348, 6944358, 4517837, 3406804, 4398301, 5741035, 5460157, 3715055, 2226223, 1959681, 2228427]
39314B228427l14792j137938j361415q80816j724Q75318J289753R58380J00286
39305A755479o82141q73664l81055M00797Q08086N13786K1846J59687R13291J263069
39295C899181N01869p52374j290350o76499N47986J635758K101743J767014R11669
39286H645997J66585k29673p79694j808394k563586j996166k73008J275060J708326
39277D145447J258704N49205j33437n70050m36379J21279L52757r9342n61080
39268D627104l24602J27826k31529j218369j331295K16599K163551K584249J132762
39259G746296q19344j909268j790002p13013P41495J498036Q14304m27397n67778
39250D573329K70882J13524j543109k317027n39951J606355J114502j062893j485721
$$ y = [2228427, 1913635, 775697, -585718, -1466534, -1468258, -592940, 696813, 1655193, 1755479, 1073338, 199674, -181381, 219416, 1027502, 1541288, 1563134, 1722821, 2636112, 3899181, 4401050, 3648676, 2358326, 1681827, 2229813, 3865571, 5967314, 7734328, 8645997, 8812582, 8582909, 7803215, 5994821, 3431235, 1435069, 1162061, 2437121, 4145447, 5404151, 5953356, 5819919, 5249869, 4813490, 4934769, 5287526, 5188184, 4627104, 4302502, 4430328, 4198799, 2980430, 1649135, 1865734, 4029285, 6613534, 7746296, 6926952, 5017684, 3227682, 2514669, 3256164, 4754200, 5568504, 5141107, 4573329, 4844211, 4957735, 3414626, 1097599, 557648, 2164003, 3278505, 2215612, 729891]
39241G29891J97866R01716m42056j097546M73239J675847K11664j854284j547362
39232g51025R1404J12830j160072r56113R40980J914514J000411O508q7893m06278
39222G05266j213005r71339N33419J133031j81497j313254m10521J157228J187614
39213F26942P0315m04137j56088l33623o77141J59229J903027K489138R65308
39204D642970j040368j403376n6076J194215R08804m70793j346547r12981K4171
39195A540019L54377J64961J79588K38478l65835j205752r45318M59093J340802
39186A760413P15602l35293m32899K92909R91014J334208J073138k06031j778010
39177C415051j774908P5721J220854l70859k945507l257241j143815P03393R94127
$$ y = [729891, 927757, 1829473, 1387417, 289871, 763110, 2438957, 2650621, 796337, -751025, -659621, -546791, -1706863, -2662976, -1721996, 192518, 1192929, 1199437, 1111544, 705266, -507739, -1479078, -945659, 187372, 5875, -1307379, -1717900, -560672, 626942, 697257, 293120, 137032, -196591, -873732, -714503, 1188524, 3677662, 4642970, 3602602, 2199226, 2143150, 3337365, 4246169, 3775376, 2428829, 1515848, 1540019, 1894396, 2059357, 2238945, 2477423, 2111588, 905836, -39482, 419611, 1760413, 2476015, 2140722, 1707823, 2000732, 2991746, 4325954, 5399092, 5193061, 3415051, 1640143, 1715864, 2936718, 2565859, -379648, -3636889, -4780704, -4077311, -3083184]
39168c083184J073370J777648J869878N71373o46239k21448J168527J848778J475190
39159E833893P61589p7028j129724j748435j219081j64319R0671n14587o98638
39150A134341J25139R30299O82261j06288k08052N04066R57374M21880o40734
39141C800286j354493j371439p92467J94035J090530J033853k70255j758757j959919
39132a388626p78239M05296N85871L12282N78808J203691J056258l12684j923070
39123b60413k379438j317228L31214J416047J697209J694970J609370J057779
39115C849510J10741l02498K04286M73995n73301j919795j664157l436Q92107
39106A067452J67222n90013j51558M87416K08589j70724M48537J286691J027631
$$ y = [-3083184, -2009814, -232166, 1637712, 2209085, 1562846, 1341398, 2509925, 4358703, 5833893, 6595482, 6518454, 5388730, 3640295, 2421214, 2256895, 2347566, 1832979, 1134341, 1259480, 2189779, 2872040, 2765752, 2557700, 3061766, 4019140, 4441020, 3800286, 2445793, 1074354, 281887, 475922, 1566452, 2600305, 2330050, 571293, -1388626, -2166865, -1761569, -1175698, -863416, -284608, 919083, 1975341, 1662657, -260413, -2639851, -3957079, -3625865, -2209818, -512609, 1182361, 2791731, 3849510, 3960251, 3657753, 3862039, 4336034, 3762733, 1842938, 178781, 175345, 1067452, 1234674, 644661, 493103, 980519, 1189108, 1018384, 1466921, 2753612, 3781243]
39097C781243J21536j70556n6717n42421j259338j054951k06636N6674j48893
39088E19941K95964J133533R81725n9691m36123N160l21236j632870j887397j13747
39078a514741J668923J377002j88939r73347o49741k22652M1151M51107O44451
39069F33214K56283N7778P59882J401921O66353p92274j185947m13543j18986
39060A264681r33508j532958q38236M41152J066130Q09431J39281n67540r13719
39051a065286n25149K30924M21318o4053k05416N12520J174206R43097M90779
39042A912940P50763J060435J32130j449311j540854L51407J901142J071953r19833
39033C270772j336598J38827J136177K79558q75913m48994Q80112J097157l6862
$$ y = [3781243, 3902779, 3732223, 3675506, 3133085, 1873747, 818796, 612160, 668834, 519941, 815905, 1949438, 2931163, 2871472, 2435349, 2440509, 2119273, 486403, -1400994, -1514741, 154182, 1531184, 1342245, 368898, -280843, -503495, -462344, -11237, 633214, 889497, 947275, 1707157, 3109078, 3775431, 2983157, 1797210, 1383667, 1264681, 331173, -1201785, -2040021, -1598869, -532739, 276692, 415973, -151567, -1065286, -1590435, -1359511, -938193, -1002246, -1207662, -695142, 479064, 1422161, 1912940, 2663703, 3724138, 3856268, 2406957, 866103, 1217510, 3118652, 4190605, 3270772, 1934174, 2073001, 3209178, 3488736, 2612823, 2163829, 3043941, 4141098, 4104236]
39024D104236q84093n86542o6431j96240n49911n41686m81735o76816n44499L68156
39014e5561J250484J021131J0640m46347M7645M40943j80800j306822j705794
39005i24481r77432N8390M78875M28484Q09734J734886J872386R1868k488756
38996A083954l258434j279934J347504K011492O10765q70655j090174m30757K82853
38987a593386Q28598J202417J199195P21792m8783q58159j284975p40123O36560
38978F3136J408398L62279j473046j753197n4232J363873P82228n21215l83548
38969b05324Q88443J162592m5833q32392O1497J304669J042426l39335q27994
38960B208749L47971J680708J320435o96568k488813k359440n71797J003863J056817
$$ y = [4104236, 3220143, 2633601, 2567170, 2370930, 1821019, 1279333, 797598, 120782, -423717, -55561, 1194923, 2216054, 2226694, 1780347, 1827992, 2268935, 2088135, 781313, -924481, -1901913, -1843523, -1364648, -936164, -126430, 1608456, 3480842, 3572710, 1083954, -2174480, -3454414, -2106910, -95418, 515347, -355308, -1445482, -1876239, -1593386, -764788, 437629, 1636824, 2358616, 2309833, 1451674, 166699, -573424, 63136, 1471534, 1833813, 360767, -1392430, -1446662, -82789, 699439, 178224, -205324, 683119, 1845711, 1799878, 967486, 1028983, 2333652, 3376078, 3036743, 2208749, 2556720, 4237428, 5557863, 4861295, 2372482, 13042, -558755, 445108, 1501925]
38951A501925L02751K79639J004247R37811m98987j725662j243212N3402K57440
38942H69354n86228p29654K67721Q20330N8853o96926k66443L34503k42377j093798
38932a264665l83843J466293K125792Q41134n56572o09795k10542n86196r96783
38923a75177o0973J613965J952399L47304j483439j810756q15266K77837R29958
38914G75852J351634J507863J061859J77243m33372l75293R0523O46877J199757
38905F002943J387781O51438o58023j022491M54087K502608L038766J769208K14826
38896A4341143p06660j552676k556300k717198j598029n29691p41811j441639
38888B497139j163750q8670N21263M49752M49473N86823L47964j1813L9539j65185
$$ y = [1501925, 1804676, 2084315, 3088562, 4026373, 3527386, 1801724, 558512, 611914, 869354, 283126, -446528, -178807, 641523, 700376, 3450, -262993, 71510, -170867, -1264665, -1648508, -182215, 1943577, 2784711, 2228139, 1618344, 1407802, 821606, -175177, -236150, 1377815, 3330214, 3677518, 2194079, 383323, -431943, -154106, 775852, 2127486, 3635349, 4697208, 4874451, 4441079, 4065786, 4156309, 4803186, 6002943, 7390724, 8042162, 7384139, 6361648, 6815735, 9318343, 12357109, 14126317, 14341143, 13634483, 12081807, 9525507, 6808309, 5210280, 4680589, 3938778, 2497139, 1333389, 1244719, 1765982, 2215734, 2665207, 3252030, 3599994, 3588181, 3627720, 3462535]
38878C462535j511597k831400j900371R59327K598347J251989j032497j435672
38870d39339p5063Q85030N08125k60563m76724j88431J60165K20759j44583n36879
38860c47503k21521P77774J399760R54634Q9629l18320m38988q35263j249497
38851a89295r82285k4717R41661J284794O89164o84653j846156j600401r7339
38842b509227J103103J071420N81161M88379K96285o39502j626205j611688p57424
38833c603698J42614R39682J661407J710255Q23264m7330j01324P885m28366o20693
38823D83696K20826R90502L22182q33672n84825O29609O87871n96376j178428
38814A41385k62323N36751R5012n48595l29863J05984j05473n23750m44131o7401
$$ y = [3462535, 1950938, -880462, -2780833, -1821506, 776841, 2028830, 996333, -439339, -514402, 370628, 878753, 618190, 141466, -46965, 113200, 333959, 189376, -347503, -569024, 208750, 1608510, 2563144, 2652773, 2334453, 1895465, 1060202, -189295, -1171580, -1196297, -254636, 1030158, 1719322, 1034669, -811487, -2411888, -2509227, -1406124, -334704, 246457, 734836, 1031121, 391619, -1234586, -2846274, -3603698, -3461084, -2521402, -859995, 850260, 1673524, 1626194, 1524870, 1532755, 1104389, 483696, 704522, 1695024, 2017206, 1183534, 598709, 1228318, 1916189, 1319813, 141385, -120938, 415813, 510825, -37770, -367633, -261649, -367122, -890872, -1335003, -1402404]
38804a402404K68600P36508J161349Q44768o8085m33244J3509J31213n33556q12529
38794i3871r2435L01766o78371j725273j058657P36882J626916J140085N86681
38785G43723O57230O74787K75280R4072L09007m1797j417975k474044j593814
38776b773531O44083J808975P51905p29766l70415J207469J341123n33032j799735
38767d52924o87088Q67599L73796j044661n44470J483620J879713J3006j114140
38758G74451N8682J075273k10155j896571j261942O72608R12913o58379j398235
38749a931355k52427R78866Q19733N5442q7146K30019K63569J9276l2197J85844
38739B49624L68676L30584K09329K94628N95215N87846j59595j090144j147106
$$ y = [-1402404, -1133804, -397296, 764053, 1608821, 1540736, 1107492, 1121001, 1252214, 718658, -93871, -186306, 115460, -562911, -2288184, -3346841, -2609959, -983043, 157042, 743723, 1400953, 2075740, 2351020, 2445092, 2754099, 2712302, 1294327, -1179717, -2773531, -2129448, -320473, 431432, -298334, -668749, 538720, 1879843, 1346811, -452924, -1140012, -272413, 101383, -943278, -1487748, -4128, 1875585, 1888591, 774451, 833133, 1908406, 1698251, -198320, -1460262, -787654, 125259, -533120, -1931355, -2183782, -1204916, -385183, -329741, -416887, -186868, 76701, 95977, 63780, 249624, 618300, 948884, 1158213, 1452841, 2048056, 2635902, 2476307, 1386163, 239057]
38730B39057l31270K07041m5357k54134J37075L49057l13266j154752j197635
38721b364184n85265L7015N04022O52490Q3389p06469l89804R70770J457457L31081
38711i498m62364L88836R20613q03675k683883j370756K065446L193157Q22646
38702B060522j368732o11980J172929J043483m77079r23152J6806M40437n20887
38693H32347j512670j101621K38753Q40443Q7278p04890j17513J063088O85437
38684C10652j355654k399360q56752J198752J238159K05731M92016J523857Q90532
38675A247933r98933j335025J56151Q05118j7039K06760K109786K674005M89408
38666E338164j363239m20858R58801r1842j750395p10893J925279K457747O91925
$$ y = [239057, -92213, 114828, 69471, -184663, -47588, 301469, -11797, -1166549, -2364184, -2949449, -2912434, -2408412, -1755922, -1672533, -2379002, -2768806, -1798036, -340579, -9498, -471862, -83026, 837587, 33912, -2649971, -4020727, -1955281, 1237876, 2060522, 691790, 79810, 1252739, 2296222, 1819143, 895991, 912797, 1353234, 832347, -680323, -1781944, -1543191, -702748, -615470, -1320360, -1437873, -374785, 310652, -1045002, -3444362, -4301114, -3102362, -1864203, -1658472, -1166456, 357401, 1247933, 249000, -1086025, -929874, -124756, -141795, 64965, 2174751, 4848756, 5338164, 3974925, 3554067, 4512868, 4421026, 2670631, 1959738, 3885017, 6342764, 7034689]
38657G034689k90481L65667M72342o10068q03653O46314J715511J237720P40538
38648A0508579J351736J723340N70951j066363j659136j376317j070906p90557
38640H191327n42275q98142j644819j463635j63198M72430n56374j579892q28863
38631I86559O72046P90378l74303j050387q19377p28228q40173j12173J220377
38622b55281J453739J28713j092500j007672m71584m37848k13534Q85950J649047
38613F39030O46325j110853j254284N08844K023574J836691P95472L4471o90322
38604C428948j611644j636801r2590J399564Q07403j097155j526202K54732J741114
38595A667369Q11015j256862j694415J0102J792755J879050N74065o82572r18336
$$ y = [7034689, 6744208, 7109875, 7582217, 6972149, 6168496, 6814810, 8530321, 9768041, 10508579, 11860315, 13583655, 14154606, 13088243, 11429107, 10052790, 8981884, 8191327, 7649052, 6750910, 5106091, 3642456, 3479258, 3951688, 3395314, 1815422, 986559, 1658605, 2448983, 2074680, 1024293, 204916, -523312, -1363485, -1475658, -255281, 1198458, 1327171, 234671, -773001, -1244585, -1682433, -1895967, -1010017, 639030, 1285355, 174502, -1079782, -570938, 1452636, 3289327, 4084799, 4119270, 3428948, 1817304, 180503, 87913, 1487477, 2294880, 1197725, -328477, -73745, 1667369, 2478384, 1221522, -472893, -462791, 1329964, 3209014, 3783079, 3100507, 2182171]
38586B182171j77808P12330Q05454J9876o27663l47439J65561k98055j435289
38577I99138j624655l66380Q16424O21051j30841j6239N44283O0357j221409j290134
38567a608405M60449J927458J233547n65424j231776o44356m01019p93047m75858
38558b098431P88735J391851O04921o1656N55489J181396K74989j172589j057310
38549D07395N24697J514875J026196J73432j84978n37643j162860j217766j59480
38540C83868J109419J301312K93774q26048q66816L33407J517978J188994l31102
38531D104786r44104J95693J028343l36919k233221j713076O19907J268888p15525
38522A274772k386718j709227l03599K9248L01984J750946K986235K274566N78068
$$ y = [2182171, 2004363, 2716693, 3522147, 3542023, 2914360, 2566921, 2732482, 2434427, 999138, -625517, -991897, -175473, 445578, 314737, 298498, 842781, 903138, -318271, -1608405, -1147956, 779502, 2013049, 1447625, 215849, -428507, -829526, -1622573, -2098431, -1309696, 82155, 687076, 625420, 1180909, 2362305, 2637294, 1464705, 407395, 932092, 2446967, 3473163, 3646595, 3461617, 2923974, 1761114, 543348, 383868, 1493287, 2794599, 3088373, 2262325, 1395509, 1728916, 3246894, 4435888, 4104786, 3160682, 3356375, 4384718, 4047799, 1814578, 101502, 721409, 1990297, 1274772, -1111946, -2821173, -3124772, -3095524, -2793540, -1042594, 1943641, 4218207, 4796275]
38513D796275k39361m78229j280849j804275n61241J471735J912190N66330n69493
38504C813082n37201l22883p05173j217288j193667l56704J179686K225791J006652
38495C892295j994235l286125q46760K296919K084997m18626q51594J273125J947299
38486D097295l79519k123829o05159J606654J160315p50687r27439M66888P72114
38477C316633l72598p27276M75352J351450O28332m40011k78948O42025P27123
38468E322082m08935j499205j300267j37697M72146k75697j358467j213062J73564
38459b25538J326400J323174O99808K15331p7442j49874M08190J440788J837645
38450F798482Q59506p89402j778287j515286l84080P94476J342922J329379J516622
$$ y = [4796275, 4556914, 4078685, 2797836, 993561, 432320, 1904055, 3816245, 4382575, 3813082, 3275881, 2952998, 2247825, 1030537, -163130, -519834, 659852, 2885643, 3892295, 1898060, -1388065, -2234825, 62094, 2147091, 1728465, 876871, 2149996, 4097295, 3717776, 1593947, 988788, 2595442, 3755757, 3005070, 2077631, 2544519, 3316633, 2944035, 2216759, 2692111, 4043561, 4671893, 4231882, 3952934, 4594959, 5322082, 4913147, 3413942, 2113675, 1975978, 2448124, 2172427, 813960, -399102, -225538, 1100862, 2424036, 3123844, 3339175, 3261733, 3111859, 3520049, 4960837, 6798482, 7657988, 6868586, 5090299, 3575013, 3190933, 3985409, 5328331, 6657710, 8174332]
38441H174332K087127J964341N61727n03028O75461L066212L783337K475866J946249
38432B4231624L711813N750284O042775N828920P462545J1063158J5302491J9943425
38424I9337035K5761081L3108720M1414628M7822598M5435765K7181725m663231
38417C15398321l5558345n0348381m7337011l7158459k9072259k3469285j7627525
38410G4827056j2363474r821177q922525p089921m507917l364553l968196m407276
38402B0382017l549538k117198r78984k10095J37668k00914r85380j520999j543469
38393I413108j354796j143451q02428l45619J4741J34921k6583m08271o48608
38384D833014l26826K90175L04838n24628j127318m56990R09794J352290K81808
$$ y = [8174332, 10261459, 12225800, 12787527, 12284499, 12959960, 16026172, 19809509, 22285375, 24231624, 27943437, 33693721, 39736496, 45565416, 53027961, 64091119, 79393610, 99337035, 125098116, 158206836, 199621464, 247444062, 292879827, 320061552, 315398321, 279839976, 229491595, 182154584, 144996125, 115923866, 92454581, 74827056, 62463582, 52642405, 43719880, 36629959, 32122042, 28757489, 24789293, 20382017, 16832479, 14715281, 13736297, 13526202, 13663870, 13462956, 12477576, 10956577, 9413108, 8058312, 6914861, 6112433, 5766814, 5781555, 5916476, 5889893, 5481622, 4833014, 4506188, 4796363, 5101201, 4576573, 3449255, 2992265, 3902059, 5254349, 5536157]
38375E536157j140750j502413p10253K61678P07546O91708L61710m95076j764264
38366A946043k371960j240868J037351K376698J552700k92025j161073o22735
38358A224131J78174M66803N93838Q63924Q30269K19773l37423j72728L50576
38349D217337K98165n09754j181513q37187K66264R01169K36206j093363j635236
38340F62088r12280l1505j17531o97804m31924Q20789J648348J000974l57911
38331A583244q56716j39004N72947J67742q37206r77410M7480P19532k50717j828944
38321a799052j765853K97214K187707K056395N45317o31722r78320r60698n97380
38312a646392J85805N29348l73205j586828j330354M60684J916756J763035P89717
$$ y = [5536157, 4395407, 2892994, 2182741, 2444419, 3151965, 3843673, 4205383, 3710307, 1946043, -425917, -1666785, -629434, 1747264, 3299964, 3007939, 1846866, 1224131, 1402305, 1869108, 2462946, 3326870, 4157139, 4376912, 4039489, 3866761, 4217337, 4515502, 4005748, 2824235, 1987048, 2253312, 3154481, 3390687, 2297324, 662088, -250192, -281697, -399228, -1097032, -1528956, -708167, 940181, 1941155, 1583244, 726528, 587524, 1160471, 1328213, 491007, -486403, -438923, 280609, 29892, -1799052, -3564905, -3267691, -1079984, 976411, 1521728, 890006, -88314, -1049012, -1646392, -1460587, -931239, -1304444, -2891272, -4221626, -3760942, -1844186, -81151, 708566]
38303G08566M57993J075291J766638J550163K02568j425882k015896j240742l12979
38294G65720l73163q38524l85841Q72240J504357Q81582j18986n42710l38320
38285A426355Q9439K71034k27668j053069q38618R25467K332679J190446j587075
38276B528990k859021j601569n4862m1899n54420p6258Q83239J127612R26586
38267B78398J093139J138217R4980j544496k225282j305646L83900J578521J489212
38258I80943K40482j012911j023360Q9487J050352J234293J110178P52347m36907
38249B984904k000445k246165p07680R47877J498070J786842K485493K275856
38241G024752J56515k179534k494925j199828j62990M16621J455134K326478J601896
$$ y = [708566, 1166559, 2241850, 4008488, 5558651, 5761219, 4335337, 2319441, 1078699, 765720, 392557, -445967, -831808, 40432, 1544789, 2426371, 2307385, 1764675, 1426355, 1515794, 1786828, 1559160, 506091, -332527, 592940, 2925619, 4116065, 2528990, -330031, -1931600, -1986462, -2028361, -2582781, -2659039, -1775800, -648188, 278398, 1371537, 2509754, 2604734, 1060238, -1165044, -2470690, -2086790, -508269, 980943, 1221425, 208514, -814846, -725359, 324993, 1559286, 2669464, 3421811, 2984904, 984459, -1261706, -1969386, -1021509, 476561, 2263403, 4748896, 7024752, 7181267, 5001733, 2506808, 1306980, 1143990, 1560611, 3015745, 5342223, 6944119]
38232F944119k1422l82576N55959N46590j109055k228692j213055M28148L99826
38223C919842j157474k244471j785762n04666M74844Q30290Q70600P44768J48711
38214A296682r50951j496508k37449K103882K864860Q17055j690069j694516K13543
38205A226529R15670n34961j815350j153276K91952P51271L89906K40965K43986
38196E56692k05213q42437r69910n83260q3103N00398J181042J497425J038205
38187B089839P1687p68317r89203l55006P55495J116909j13665j793475j749470
38178a735206K60264J946756J519471q0007r10600o81172l93369l54436n9745
38169d88044M35623M36792j45639n06650n6889P81014J017801J39917j200335
$$ y = [6944119, 6922697, 6540121, 7096080, 7642670, 6533615, 4304923, 3091868, 3520016, 3919842, 2762368, 517897, -1267865, -1772531, -1297687, -467397, 403203, 1147971, 1296682, 345731, -1150777, -1388226, 715656, 3580516, 4397571, 2707502, 1012986, 1226529, 2142199, 1607238, -208112, -1361388, -1069436, -318165, 71741, 312706, 556692, 351479, -490958, -1460868, -2044128, -2127231, -1626833, -445791, 1051634, 2089839, 2161526, 1393209, 404006, 49000, 804495, 1921404, 1807739, 14264, -1735206, -1474942, 471814, 1991285, 1911278, 1000678, 319506, -73863, -428299, -488044, -52421, 384371, 238732, -267918, -324807, 456207, 1474008, 1613925, 413590]
38160D13590j616080n65369O62392L91883j065959j697548o59526N92294O87186
38151b857137L29239P49434J450821J047718m15606j532591j529903q50897j2204
38142c621126Q71046J547789J714231J546133J253409M22126j140180k274315
38134C19113j573195M29039J595686R58885j93874m43275j01288j49328m70689
38125C71074l24335J13084n063n96832n27176O62133J840219J626216O6781j537374
38115A688727k075118j403841q8747R82414J012844J30166l27780P01347K217338
38106B837350K006206l91529k791279l085823j605685J29535J580325K644907
38098A324007K318493P4634k219889k248581p85779o32587j946037j702860J254303
$$ y = [413590, -1202490, -1767859, -1105467, -713584, -1779543, -3477091, -4136617, -3544323, -2857137, -2527898, -1778464, -327643, 720075, 304469, -1228122, -2758025, -3608922, -3621126, -2750080, -1202291, 511940, 2058073, 3311482, 3733608, 2593428, 319113, -1254082, -825043, 770643, 1729528, 1535654, 1092379, 991091, 841763, 371074, 46739, 159823, 154760, -442072, -969248, -307115, 1533104, 3159320, 3226101, 1688727, -386391, -1790232, -1878979, -896565, 116279, 246445, -81335, 620012, 2837350, 4843556, 4452027, 1660748, -1425075, -3030760, -2901225, -1320900, 1324007, 3642500, 3717134, 1497245, -751336, -1537115, -2169702, -4115739, -5818599, -4564296]
38089d564296L755772K851127K58893m02443R36896J238633n15541j818040o57401
38080A083600J517258K011473M65161j114824j170418k63736Q2408n44526j143010
38071I23386r88461p29256j058830j135395J45626J745895J492560l18025q27345
38062g49845R36824K145795M92892j959820j810737O01591K100009J480177L25964
38053C562850l53989j151649j958454j580328n8236J112493J436130J729468J775797
38044D514082L39733j952527k557054q45963O36076O5601r95829m94384Q15464
38035d74801J029536L02856J66032P82702R74456L04595n80521j191180j402967
38026h9292r57728M4805O96616L62473l59985o05554m08028j05286M52843J186182
$$ y = [-4564296, -808524, 2042603, 2301496, 1899053, 2835949, 4074582, 3559041, 1741001, 1083600, 2600858, 4612331, 5077492, 3962668, 2792250, 2528514, 2610922, 2066396, 923386, -65075, -794331, -1853161, -2988556, -2842930, -1097035, 395525, 77500, -749845, 186979, 2332774, 2825666, 865846, -944891, -343300, 1756709, 3236886, 3562850, 3208861, 2057212, 98758, -1481570, -1539806, -427313, 1008817, 2738285, 4514082, 4853815, 2901288, 344234, -501729, 134347, 199948, -795881, -1290265, -474801, 554735, 857591, 1023623, 1806325, 2780781, 3085376, 2504855, 1313675, -89292, -1047020, -1002215, -305599, 56874, -303111, -908665, -1316693, -1421979, -969136, 217046]
38016B17046J305236N44524j78008k96107n24390j162091j013327M63535J485401
38007H41819M58005j131637p33722J247371K075795R12464k60146n1273N39436
37998C898112L22523k60115l88805k56697l59393o79087j137221j661744j535264
37989b057691j10238J568396J558490o5523r20079K38860J610832J154566l47418
37980B630195p43237J26256M94838l73737j183350p38570L77832Q41185M01358
37971A832770n7887N2121J86397n07126j788768k293838j143899Q58247K116297
37962g45686J943107Q17528n60114j597262j618107m98392O72211P23982P9228
37953g83505L5242N46504L36386o94356j049287j46225O43399L54688J7428O62685
$$ y = [217046, 1522282, 2066806, 1888798, 1592691, 1068301, -93790, -1107117, -643582, 841819, 1299824, 168187, -565535, 681836, 2757631, 3670095, 3409949, 3358676, 3898112, 4220635, 3960520, 3571715, 3315018, 2955625, 2276538, 1139317, -522427, -2057691, -2167929, -599533, 958957, 893434, -26645, 212215, 1823047, 2977613, 2630195, 1886958, 2013214, 2508052, 2134315, 950965, 212395, 590227, 1431412, 1832770, 1774883, 1827004, 2013401, 1506275, -282493, -2576331, -3720230, -2861983, -745686, 1197421, 2014949, 1454835, -142427, -1760534, -2258926, -1586715, -862733, -783505, -748263, -201759, 134627, -559729, -1609016, -1755241, -1111842, -757154, -739726, -77041]
37943g7041J401165J015402P1477k40182j88072o22364j026790m25059N02084
37934D10620K84385p73039r56222P9345R01712P41320L98852M31105K75110k96638
37924A496550m89852Q2505O57926O09076K30200k23143r51608j580347j154211
37915a322904J53196P39588j63793j241284j055359k3030O24248O90818O44905
37906i53615M42042n765r8736M05707M88586n64076j509232p27854J114503J797814
37896C89374O94471o08457q38118m11657k6468L87224P43557M09027m70344o07348
37886c38739N31994J640747J396379L47457j55343k1936j16680n58310p55102
37877A970467p48772j045053j257283m94646P41928P44359o72175j270322N01591
$$ y = [-77041, 1324124, 2339526, 2411003, 2170821, 1982749, 1360385, 333595, -91464, 410620, 695005, -78034, -1034256, -954911, -53199, 688121, 1086973, 1518078, 1793188, 1496550, 1006698, 1089203, 1747129, 2356205, 2586405, 2363262, 1411654, -168693, -1322904, -1169708, -430120, -593913, -1835197, -2890556, -2913586, -2289338, -1598520, -953615, -511573, -517338, -616074, -210367, 278219, -285857, -1795089, -2522943, -1408440, 389374, 1083845, 475388, -362730, -774387, -800855, -413631, 329926, 738953, 268609, -338739, 193255, 1834002, 3230381, 3577838, 3422495, 3400559, 3283879, 2725569, 1970467, 1221695, 176642, -1080641, -1575287, -833359, -89000, -761175, -2031497, -1529906]
37868a529906K800548K632421J61663j388686l25511J214880O38811j262751j764130
37859A177339m80063J85671j075547k386148j479835J004200K476717J785818
37851A208152J96544o56907m64553J44925N76115N36782O7643l74691l08086J51840
37841A077764M19643J86390l50687q92839j190207r40783j47952N32435M80142
37832h26094M3737O272K40843m4685o51322l17953J127221J862830M44149j842783
37822D2215k404571o96766J278478J817850J433445J410248J616215Q29902j130240
37813D196776k664101k172401j45401J142672K28624j684634k104868l82302J478445
37804b107190J552300N07562L07939J128771J223905j34367j364637r72677K60574
$$ y = [-1529906, 1270642, 3903063, 4064726, 2676040, 2350529, 3565409, 4204220, 2941469, 1177339, 697276, 882947, -192600, -2578748, -4058583, -3054383, -577666, 1208152, 1404696, 747789, 283236, 428161, 1004276, 1541058, 1608701, 1234010, 925924, 1077764, 1497407, 1683797, 1333110, 440271, -749936, -1690719, -1838671, -1306236, -826094, -782357, -776085, -535242, -579927, -1231249, -1549202, -421981, 1440849, 1884998, 42215, -2362356, -3059122, -1780644, 37206, 1470651, 2880899, 4497114, 5327016, 4196776, 1532675, -639726, -785127, 357545, 586169, -1098465, -3203333, -3585635, -2107190, -554890, -47328, 260611, 1389382, 2613287, 2478920, 1114283, 141606, 402180]
37795D02180P25467M60498N34073O86308l36143k080738k195585K03018K752308
37786A151386K805566Q42221p30909j133652j447351j796287q42474J394419K562080
37777B804999J168267r82346j254727J13569P10063l20742j294709p11149Q52314
37768A085539J937687J850248O69557j067820k171464j539398K04913R39950k81519
37759A627693j819401j654983o4774J097291J058518O57221N51573L72896j75133
37750A650901o08968n27509k97455l23968k75564L33351J153552J254700L55007
37741B714047o87463q37631j17502M34047O3466p55479r69414l42810K57731K3968
37731b17040p89458j230110p27205L72775J135741Q51268j96147p83592l0083
$$ y = [402180, 1127647, 1588145, 2122218, 2808526, 2472383, 391645, -1803940, -1600922, 1151386, 3956952, 4799173, 4068264, 2934612, 1487261, -309026, -1151500, 242919, 2804999, 3973266, 2990920, 1736193, 1849762, 2559825, 2239083, 944374, 233225, 1085539, 3023226, 4873474, 5543031, 4475211, 2303747, 764349, 969262, 1909212, 1627693, -191708, -1846691, -1911465, -814174, 244344, 901565, 1453138, 1826034, 1650901, 1041933, 514424, 216969, -106999, -382563, -49212, 1104340, 2359040, 2714047, 2026584, 1188953, 1071451, 1505498, 1568964, 813485, -155929, -498739, -241008, -217040, -1006498, -2236608, -2963813, -2591038, -1455297, -604029, -800176, -1583768, -1613851]
37722a613851J345514J657315L58350j134121j147991K49029J526852J591333
37714B832430P69063J9515k49493l68915o41842p41625k13155M99088K78833r44113
37704A239786j588476n75885P13071K67404j271397j324346N75963J951862J312073
37695A300055K86147M10720L99140j131927k469929j326514J014320J429012l6665
37686a25641m48415R22368J469995j21223j578299p96801R66715J466186P35590
37677B490475N6677m50037j146557j272577j41302J097090R15090r3503j21130
37668A334226R00844J194547l7609j414568j421985l60558M01647L25486R1099
37659A013129K99412M53659k66686j365099j125140R62331K786893K064236l23765
$$ y = [-1613851, -268337, 1388978, 1747328, 613207, -534784, -285755, 1241097, 2832430, 3601493, 3621008, 3371515, 3002600, 2360758, 1619133, 1405978, 1905066, 2183899, 1239786, -348690, -924575, -211504, 55900, -1215497, -2539843, -1963880, -12018, 1300055, 1586202, 1996922, 2396062, 1264135, -1205794, -2532308, -1517988, -88976, -125641, -574056, 348312, 1818307, 1697084, 118785, -678016, 288699, 1754885, 2490475, 2547152, 2097115, 950558, -322019, -463321, 633769, 1548859, 1455356, 1334226, 2235070, 3429617, 3392008, 1977440, 555455, 194897, 596544, 922030, 1013129, 1312541, 1766200, 1499514, 134415, -990725, -28394, 2758499, 4822735, 4498970]
37650D498970j328836n9310J074085J22185j711007k340937j783677j217125o79922
37641c425574L57276J276897J145202M95759M64870P53193K10946j009343j617399
37632a348173j227653o49569l40821o7216M0988m54408j184060j154683r2295
37623f477890J312558K276853K249476R94462o33703q34296Q87337K464459J852330
37614D091586J0867o11466J65626L30241q16357j711070j284387l80127O4101
37605a40986K45450L65129J14855j79668L29652J267684J181500q0937r72868
37596B129811p44110l90726n06084k92467M11768K78627j110968j999355j030030
37587c253534O33072J239213R06028O43357M73341J35067K29881R78929J155044
$$ y = [4498970, 3170134, 3110824, 4184909, 4307094, 2596087, 255150, -1528527, -2745652, -3425574, -3068298, -1791401, -646199, -150440, 314430, 1067623, 1278569, 269226, -1348173, -2575826, -3225395, -3566216, -3633432, -3592444, -4046852, -5230912, -6385595, -6477890, -5165332, -2888479, -639003, 355459, -278244, -1112540, -225203, 2239256, 4091586, 4102453, 3490987, 3656613, 3986854, 3170497, 1459427, 175040, -205087, -140986, 104464, 469593, 584448, 404780, 734432, 2002116, 3183616, 3102679, 2129811, 1385701, 994975, 488891, 196424, 608192, 886819, -224149, -2223504, -3253534, -2620462, -1381249, -475221, 168136, 641477, 776544, 1006425, 1985354, 3140398]
37578C140398m2670j326422j287420p21445j039630j610021r31651N27648J081406
37569b209807P29309Q33099J296829O45172j070312j925702j094392K1148K00688
37560b573968r908J84561M95143N38292O41863Q55549M96393n26993j138907o21823
37550a659798L30751P61366O44029L34496j16567m41984O661J141038J770365
37541B770357J115156j22712q71349j006641q70277m23475K33791L68491l19663
37532H73678q43381k55063P31465O62140m53114j121362n06693N78414J001105
37523F67189O11852r9436p52107j004591m83571N98565J298469J078140O47650
37514B562160Q79485J227118L61824j534493k449200j247025M81952N94205m44127
$$ y = [3140398, 3097728, 1771306, 483886, -237559, -1277189, -2887210, -3818861, -3291213, -2209807, -1480498, -647399, 649430, 1294602, 224290, -1701412, -2795804, -2774656, -2573968, -2583876, -2399315, -1904172, -1365880, -724017, 131532, 627925, 100932, -1037975, -1659798, -1329047, -567681, 76348, 410844, 294277, -147707, -141046, 999992, 2770357, 3885513, 3762801, 2891452, 1884811, 1014534, 591059, 824850, 1193341, 873678, 30297, -224766, 506699, 1168839, 715725, -405637, -912330, -333916, 667189, 1279041, 1179605, 427498, -577093, -1060664, -462099, 836370, 1914510, 2562160, 3441645, 4668763, 5030587, 3496094, 1046894, -200131, 281821, 876026, 431899]
37505D31899m25650Q79023J207283m01901j699664o64396J175880J154221k56941
37496A399754m65252O43554M50728j700434k867028j012609J607416J747686j45819
37487c42004j114647k73924N51009L21477K16260J175469K208805K034422Q78432
37478E655299k60283j008070j423491j283128m31311O54777J258095J037718K9135
37469D228741j360440k157124j486078J34105J033302M85492l64559l98583k64259
37460a49403r82759j719642p38527J654391K989589J856478l44004j561156j582827
37451e77860j351929j015132p4629J168597J743711J392379P14399Q3966n46265
37442A537237q90459m91315K86991M48408k50360r76869j058863o87776k10301
$$ y = [431899, 6249, 885272, 2092555, 1690654, -9010, -673406, 502474, 1656695, 1399754, 934502, 1578056, 2028784, 328350, -2538678, -3551287, -1943871, -196185, -342004, -1456651, -1730575, -1179566, -858089, -641829, 533640, 2742445, 4776867, 5655299, 5395016, 4386946, 2963455, 1680327, 1249016, 1903793, 3161888, 4199606, 4228741, 2868301, 711177, -774901, -640796, 392506, 877998, 513439, 114856, -149403, -1132162, -2851804, -3590331, -1935940, 1053649, 2910127, 2566123, 1004967, -577860, -1929789, -2944921, -3019550, -1850953, -107242, 1285137, 1999536, 2083502, 1537237, 646778, 155463, 442454, 890862, 640502, -336367, -1395230, -2083006, -2293307]
37433b293307L75420R12765R16513L12996k81617k94303L14801J249178J850114
37424C062560J159078q41538k295290j379246Q48033J463282j01231j167420o2862
37415F85366J277678O94769o04706l66394O92600K80726j244930j421483L2702
37406B6328Q63965L30894K65565J393085J777846K48481j403323j331754m46065
37397A725022m86155j221544j474931j312055j260455p20415Q40728K210242J933418
37388B33855O41185J028J31802j8772m24915k13440K74760j66843j242197j239627
37378b023164J97824J308102Q24321l01897o09336j95487q0252m72686p12962
37369b065537m23892J27125N88659Q66424R85268R48674P48782M50679K65666
$$ y = [-2293307, -1917887, -1005122, -88609, 224387, -57230, -351533, -36732, 1212446, 3062560, 4221638, 3380100, 1084810, -294436, 553597, 2016879, 1915648, 748228, 685366, 1963044, 2657813, 2053107, 1686713, 2379313, 2660039, 1415109, -6374, 26328, 890293, 1221187, 1486752, 2879837, 4657683, 4906164, 3502841, 2171087, 1725022, 1238867, 17323, -1457608, -2769663, -4030118, -4750533, -3909805, -1699563, 233855, 875040, 876068, 1007870, 989098, 564183, 350743, 625503, 458660, -783537, -2023164, -1825340, -517238, 307083, 5186, -604150, -799637, -879889, -1352575, -2065537, -2489429, -2362304, -1773645, -907221, 78047, 1026721, 1775503, 2226182, 2491848]
37360B491848L63682N17210K77261k96981n84979m14668m63516j078591j434540
37351f23274p49929L13091N91060K47403L25801Q05290O62488j12437k42295O25833
37341A843031J024351r1346j487680j339836Q057M47292q67459k240637j674274
37332d378501M94414K054205J743982O36584L34810O60245J89528j280045k223773
37323a768551j610216k39478P65913J401291J749165J031594p53906j612273r2757
37314a129218J906131J417906r88554j815363n1826J170466m81406k818752k419321
37305e209937M31146K509108K135945N56920n26730o96437k61319L21807M23665
37296c15832j35704n67467k38141J38737l25625q47197R1356K108259K931613
$$ y = [2491848, 2855530, 3372740, 3650001, 3353020, 2768041, 2353373, 1889857, 811266, -623274, -1373203, -1060112, -469052, -221649, 104152, 909442, 1571930, 1459493, 1217198, 1843031, 2867382, 2776036, 1288356, -51480, -43423, 403869, -463590, -2704227, -4378501, -3884087, -1829882, -85900, 550684, 885494, 1545739, 1735267, 455222, -1768551, -3378767, -3618245, -2852332, -1451041, 298124, 1329718, 575812, -1036461, -1129218, 776913, 2194819, 1206265, -609098, -660924, 509542, 28136, -2790616, -5209937, -4778791, -2269683, -133738, 423182, -103548, -799985, -1061304, -739497, -315832, -451536, -1019003, -1257144, -1118407, -1444032, -2291229, -2199873, -91614, 2839999]
37287B839999J338886j333732l030283l039225j736394L91034K521168L252585
37279A204038J824183o21390j892947j037277O76976J263235K93807o47807N2764
37270A115582J913493K812151J588019o11534j929902j858693j020897J65586
37262B173805J426848J858155O93619j246902k209377j702714q56336n06848k72677
37253f42427J59659K51033k06146l57435L41097J011312O56872j87697k61485
37244G64783M56376P73106J23825o94789p84962l13150q3330m37153q97280p11600
37234a804174L64286J698682K212519J347160l62100j715828j820374p37925N68786
37225b48968R70320J97407q20225r73442k89826K69819L00917M54707J155287
$$ y = [2839999, 4178885, 2845153, -185130, -3224355, -4960749, -4569715, -2048547, 1204038, 3028221, 2406831, 513884, -523393, 153583, 1416818, 1710625, 1062818, 1115582, 3029075, 5841226, 7429245, 6817711, 4887809, 3029116, 2008219, 2173805, 3600653, 5458808, 6152427, 4905525, 2696148, 993434, 137098, -369750, -642427, -482768, -231735, -437881, -795316, -454219, 557093, 1213965, 1026268, 764783, 1221159, 1994265, 2118090, 1423301, 638339, 325189, 241859, -195294, -1092574, -1804174, -1439888, 258794, 2471313, 3818473, 3456373, 1740545, -79829, -817754, -248968, 721352, 918759, 98534, -874908, -1164734, -894915, -593998, -139291, 1015996]
37216A015996J643447R97324m03940j240055r02384j32948k1389q27412j822139
37207a693500j994720r44282P09984J859282J938534J282852M96664j14211m16460
37198A124143l25660p3818j02713m25584n99190n20802n71445p31997m59105J43672
37188b542499J17097o87988r30847J27671J003534K6056j855609k182058m77959
37179g402602J314404J802052J555135J337281R26440L12251K51662P83652P84897
37170A665172r9621o38221j26908K70828m23279j124464m70369P70822R08742
37161G32702J7503n02553l86966n30784r13187n51588M48831P44714M007m17289
37151a354610L78362J453474J487058M57320p47847j441226j334278m89980M70790
$$ y = [1015996, 2659443, 3656767, 3252827, 2012772, 1110388, 977440, 956051, 128639, -1693500, -3688220, -4632502, -3922518, -2063236, -124702, 1158150, 1654814, 1540603, 1124143, 798483, 724665, 621952, 196368, -402822, -923624, -1495069, -2227066, -2686171, -2542499, -2425402, -3113390, -4044237, -3916566, -2913032, -2886976, -4742585, -6924643, -7402602, -6088198, -4286146, -2731011, -1393730, -467290, -155039, 96623, 880275, 1665172, 1565551, 927330, 800422, 1071250, 647971, -476493, -946862, -176040, 732702, 750205, 247652, -139314, -670098, -1583285, -2134873, -1686042, -941328, -937321, -1354610, -976248, 477226, 1964284, 2421604, 1673757, 232531, -1101747, -1591727, -1120937]
37142a120937Q46880P63805Q17691Q33259R8204j105370j558755r52734k65753
37133a643710J5685M45175R26936M00193q90306q60982J192001K740362J404711
37124C730065j328123k119706m40141J295657J549058R63318J59830j006757j824606
37115I78595j058786N46063O76024q81352j613999l95781O15984j05403n07033
37106a745688J435638L534439K305529j297555k884124j043237R44047L39330
37098A588379j529498k226769j692476r43002K40075K047413K878283J335624
37090A698029j100109j733332l25559J037742J217195R20769N93076k27867j211974
37081H67970j141096j15116K04847o04120p01960R97546K641566K028084J4737
$$ y = [-1120937, -274057, 489748, 1307439, 2140698, 2238902, 1133532, -425223, -1377957, -1643710, -1628025, -1182850, -255914, 144279, -746027, -1607009, -415008, 2325354, 3730065, 2401942, 282236, -157905, 1137752, 2686810, 3650128, 3809958, 2803201, 978595, -80191, 465872, 1141896, 260544, -1353455, -1749236, -1133252, -1238655, -1745688, -310050, 3224389, 5529918, 4232363, 1348239, 305002, 1249049, 1588379, 58881, -2167888, -3860364, -4803366, -4563291, -2515878, 362405, 1698029, 597920, -1135412, -1460971, -423229, 793966, 1714735, 2307811, 2079944, 867970, -273126, -388242, -183395, -787515, -1489475, -491929, 2149637, 4177721, 4192458]
37072D192458p08079N06305J663146J173497l85163j705647k272908j996921p77415
37063c10727P91038J331728K15326j409664j879787r56357J39210M05034J06565
37054a567634M3526K99802K29827l72788p47931l07843K27078j58704q40474j06607
37044c301748J966143K875401J081006j444668j795492j93248O79361j57703r21851
37035a212799k92051O97704P56531L10172K33260J62160o23622j659500j789372
37026c417517o14143J198047K433530J958537j62151k020774j678492J77279J023838
37017a101846K12189k47215P16398J359886K76754j004101o30030M44717L81159
37008D07911k29755K85589J369275J187081m5181o27202n55482j121711j851814
$$ y = [4192458, 3484379, 3990684, 5653830, 6827327, 6442164, 4736517, 2463609, 466688, -310727, 480311, 1812039, 2027365, 617701, -1262086, -2218443, -2079233, -1674199, -1567634, -1524108, -1224306, -994479, -1367267, -2115198, -2423041, -2195963, -2354667, -3195141, -3301748, -1335605, 1539796, 2620802, 1176134, -619358, -812606, -133245, -290948, -1212799, -1504850, -807146, -50615, 259557, 492817, 654977, 31355, -1628145, -3417517, -4031660, -2833613, -400083, 1558454, 1396303, -624471, -2302963, -2125684, -1101846, -889657, -1136872, -420474, 939412, 1216166, 212065, -417965, 26752, 407911, 178156, 463745, 1833020, 3020101, 2974920, 2347718, 1792236, 670525, -1181289]
36999a181289j071374O46411R35613k97624o94174K07823J23404j432418j589678
36990d353306R41123K931836J424607j422734j631024N20622J407288m0350j117373
36981a339311n8054J380771J058762k96515n36639O18506J384421O25371n69920
36972B267392n09126O16109R41930k52155j294547p07137K85740k35443j346248
36963b33485n29308J773832K194770k42289k263754j423295K51818O5315r33452
36954a339848m88848M54517k74957j482730k74911K527364L004958K43799k263836
36945A05508k032103o39625j66514l5850P85709J314430M52564p48933q25600
36936a790414k86737l62765p18518k73347P23481J156718Q43543M08692J5268
$$ y = [-1181289, -2252663, -1606252, -670639, -968263, -1662437, -1454614, -1331210, -2763628, -4353306, -3412183, -480347, 944260, -478474, -2109498, -1588876, -181588, -221938, -1339311, -1397365, -16594, 1042168, 745653, 209014, 827520, 2211941, 2837312, 2267392, 1758266, 2374375, 3316305, 3064150, 1769603, 1062466, 1348206, 1112763, -233485, -762793, 1011039, 3205809, 2963520, 699766, -723529, -471711, -406396, -1339848, -1828696, -1374179, -1649136, -3131866, -3406777, -879413, 2125545, 2369344, 105508, -1926595, -2566220, -2732734, -2768584, -1982875, -668445, -215881, -964814, -1790414, -2077151, -2439916, -3158434, -3431781, -2708300, -1551582, -708039, -299347, -284079]
36927b84079m65561n99483N8232R85268J315645J055755Q02302O70806L22985
36918C861870l03134r44723j302964r46199M11682K035257K410972J093284m62501
36909E853544p17700K7451M11488J8383m46943n17500m07252k86148o3155R5073
36899C967241k46278j137663j968335j944428q14957P00283J324218N28763p03510
36890b94666j074031o75987m96104m80967L01062J436299J121917q16807j886675
36881b865959m05845J720583J709073L2512n80571N04269J185967L21842n70160
36872A051711m8323R87535R70162J2074p61348j088179j379250j370498l95304
36863b021420J179674J959222J146408n44128j744192j675835m67860J156023
$$ y = [-284079, -749640, -1349123, -1290891, -305623, 1010022, 2065777, 2868079, 3538885, 3861870, 3558736, 2614013, 1311049, 364850, 776532, 2811789, 5222761, 6316045, 5853544, 5135844, 5163295, 5574783, 5593166, 5146223, 4628723, 4221471, 3935323, 3872168, 3967241, 3720963, 2583300, 614965, -1329463, -2144420, -1444137, -119919, 408844, -294666, -1368697, -2044684, -2540788, -3021755, -2720693, -1284394, -162477, -979284, -2865959, -3271804, -1551221, 157852, 190364, -390207, 114062, 1300029, 1621871, 1051711, 1003388, 1990923, 2961085, 2973159, 2211811, 1123632, -255618, -1626116, -2021420, -841746, 1117476, 2263884, 1719756, -24436, -1700271, -2168131, -1012108]
36855a012108K181817J784268J09726j512056j736183p64628k03784r83056j981260
36846d117264j505779J99865J065708O128j511223j414574K67475J639394J488306
36837c881964N38251Q1136K84102M15087K59564M50730J179163J354111R719j692440
36827a002541j315314J399237L412770K134097r12191k193510j141465l42502
36819C8581q91282p87909R94203K023656K22043k273749j958245Q14136K477925
36810F59359J433218l48616q19888k86015J07561J02955j63624o84675r71707
36801i71432l03394R61610J581676J212331O86328L71898k32395j013399j033436
36792A259787l21077k05526j092050j487830l06900J211568J197269j84296j103858
$$ y = [-1012108, 1169709, 2953977, 3063703, 1551647, -184536, -949164, -1152948, -2136004, -4117264, -5623043, -5423178, -4357470, -4351342, -5862565, -7277139, -7009664, -5370270, -3881964, -3343713, -3262577, -2978475, -2563388, -2303824, -1853094, -673931, 680180, 689899, -1002541, -2317855, -918618, 2494152, 4628249, 3716058, 1522548, 381083, 38581, -852701, -1640610, -646407, 1377249, 1599292, -674457, -2632702, -1818566, 659359, 2092577, 1743961, 924073, 638058, 745619, 848574, 684950, 275, -971432, -1274826, -313216, 1268460, 2480791, 3167119, 3539017, 3306622, 2293223, 1259787, 938710, 733184, -358866, -1846696, -2153596, -942028, 255241, 70945, -1032913]
36783a032913o08314L79913M87746m64039j320163q56387P26538J740014R36602
36774a1003p61570j352187m05351N81615N70256K98159O71855J146500O39104
36765A377378p57701j824273j535629Q6812J926263K412273R74518r94323j494939
36756A70379l14932R59556J290128J139842R45106L35125o07464j001493p94268
36747B121979j033003j709700j260254O26556J737400N56798j104884q33516O06643
36738b91981P36422n00029q72271L07770J276476R14662K62254L21085M39543
36729B593931j86440r85753r89912k87868K95586K66129k79826q77621r62959
36720a414733m66695q7602l34398n68126J26936J398068J987075J453877M99907
$$ y = [-1032913, -1641227, -1261314, -773568, -1237607, -2557770, -3414157, -2687619, -947605, -11003, -772573, -2124760, -2530111, -1948496, -1378240, -1080081, -408226, 738274, 1377378, 619677, -1204596, -2740225, -2653413, -727150, 1685123, 2659641, 1665318, 170379, -144553, 815003, 2105131, 3244973, 4190079, 4525204, 3917740, 2916247, 2121979, 1088976, -620724, -1880978, -1254422, 482978, 1039776, -65108, -898624, -291981, 444441, -55588, -927859, -620089, 656387, 1571049, 1833303, 2154388, 2593931, 2407491, 1421738, 431826, 143958, 439544, 705673, 425847, -451774, -1414733, -1881428, -1969030, -2303428, -2871554, -2744618, -1346550, 640525, 2094402, 2594309]
36711B594309k33092o26713o13914m00263q26545k165218k887266j289003J709437
36702d738268L175363J866347l37206j171174n87977O4023R0184k03574l13066
36693b155348k02N02307N88891J71289J27760Q97143J268690J18402j285812q33591
36683f00471R46982J509044L79425k78657L31830K66973j380725k490577j451396
36674b767572K11286P94655J148511K008700J522870j350204l522574j758747
36666c713075J861826K668213L69960j131120l09191L06424o69769j220884j02290
36657a939906Q30388K52101k26404O51117J239224O4365j288492q89386K58900
36648a048093K83526k30663K34159R40721K19208j184839j103302L78155J145664
$$ y = [2594309, 2361217, 1734504, 1120590, 720327, -106218, -2271436, -5158702, -6447705, -4738268, -1562905, 303442, -33764, -1204938, -1792915, -1728892, -1638708, -1842282, -2155348, -2155550, -1653243, -1064352, -893063, -765303, 131840, 1400530, 1518932, 233120, -600471, 346511, 1855555, 2234980, 1956323, 2288153, 2555126, 1174401, -1316176, -2767572, -2556286, -1761631, -613120, 1395580, 2918450, 1568246, -1954328, -3713075, -1851249, 816964, 1186924, 55804, -253387, 53037, -616732, -1837616, -1939906, -1109518, -857417, -1083821, -432704, 806520, 870885, -417607, -1306993, -1048093, -764567, -995230, -761071, 179650, 398858, -785981, -1889283, -1511128, -365464]
36639c65464O77964N95935J410922J427943l18512k217168k284212p07604Q44073
36630i36123J369842J075430N14026O063l80080o77898p79491m90274o9585k16531
36620e84621r62187j217021k90207P87389O18584m13931p40715j309O87575P42131
36610a374312P61081R93946P62321j16771p23506m49846J47373M54448O44400
36601A099134Q63486O98200J13512j18871L22897N43867k69216j517896j945935
36592b10822j191784K7197Q24032P96417K22372j37397J05081L56018Q632k63563
36582E36183N65555J805779J609113j82147j637960j698377j409252j349633k90329
36573b051068J975254K916410Q44944j759612j526302N98799Q63237j291000k517778
$$ y = [-365464, 312500, 908435, 2319357, 3747300, 3428788, 1211620, -1072592, -1780196, -936123, 433719, 1509149, 2023175, 2029238, 1649158, 971260, 191769, -298505, -368090, -584621, -1546808, -2763829, -3054036, -2266647, -1648063, -2061994, -2802709, -2804018, -2116443, -1374312, -613231, 380715, 1143036, 1026265, 302759, -147087, 286, 454734, 1099134, 1962620, 2660820, 2774332, 2655461, 2978358, 3522225, 3253009, 1735113, -210822, -1402606, -1375409, -551377, 245040, 467412, 330015, 435096, 791114, 799746, 536183, 1101738, 2907517, 4516630, 4334483, 2696523, 998146, -411106, -1760739, -2051068, -75814, 2840596, 3685540, 1925928, 399626, 998425, 1861662, 570662, -1947116]
36564a947116j076035O91602N54087k49251K47855J287477J068626N2181P1467
36555G00893J162739J570770M79441j115616k055826k054752j267383j28285N10239
36546b197780J90549l67796k53780K52440L79922M53457J289702K228562J550602
36537C525878p56666k303976j278980J104578K259669J470814K07754l17455m26065
36528C485551o39904m14731R27383K675594L189989J873007j02360j277994j506828
36519H209707j631317k044323k244855j706091n66413O28576J389988J380203
36511C415475N35389o39105j251868q48657Q1307O40381M87141J16770J79558
36502B716391N91024M90283o58957k039149k171260q54510L70924L03689k08512
$$ y = [-1947116, -3023151, -2331549, -1777462, -2026713, -1778858, -491381, 577245, 629426, 700893, 1863632, 3434402, 3913843, 2798227, 742401, -1312351, -2579734, -2708019, -2197780, -2007231, -2375027, -2628807, -2376367, -1996445, -1542988, -253286, 1975276, 3525878, 2769212, 465236, -813744, 290834, 2550503, 4021317, 4229071, 3911616, 3485551, 2845647, 2430916, 3358299, 6033893, 9223882, 11096889, 10994529, 9716535, 8209707, 6578390, 4534067, 2289212, 583121, 16708, 645284, 2035272, 3415475, 3950864, 3311759, 2059891, 1211234, 1292541, 1932922, 2420063, 2536833, 2716391, 3307415, 3797698, 3138741, 1099592, -1071668, -1926178, -1555254, -1251565, -1460077]
36493a460077K84615J356660J257521k26382j256920o97100L15976L94362n473
36484c6818K66881R67023R73534K03516l75829k69082J88875O62451R14370M35353
36474C930274q70300j926376j637632n90229k73255o90675k89265J415481K675311
36465A743334J809729m38981j884976j568376m35883L19440O23714J080899J753970
36456C002870J798415M04403j927866l395272k670928n93092O00384p8816j191640
36447d051542q29432Q73466K034730J580210M73078J05698M04192L76829K662
36438I69891K92124J306910J467082k22818k205918k077115R0351J699960J071383
36429B391850o28854j456364j191496p73163m98919j52672o9672o02067j023404
$$ y = [-1460077, -1175462, 181198, 1438719, 1212337, -44583, -741683, -425707, -31345, -36818, 230063, 1197086, 2170620, 2374136, 1998307, 1729225, 1918100, 2580551, 3494921, 3930274, 3059974, 1133598, -504034, -1094263, -1367518, -2058193, -2347458, -931977, 1743334, 3553063, 3114082, 1229106, -339270, -775153, -455713, 168001, 1248900, 3002870, 4801285, 5205688, 3277822, -117450, -2788378, -3381470, -2781086, -2859902, -4051542, -4880974, -4007508, -1972778, -392568, 80510, 186208, 590400, 967229, 969891, 1262015, 2568925, 4036007, 3813189, 1607271, -469844, -379493, 1320467, 2391850, 1762996, 306632, -884864, -1658027, -2156946, -2309618, -2379290, -2981357, -4004761]
36420d004761l93805P55447R74803M0347p57156n25820K31367P06241P71645O14517
36410a587175L23235J01764J14602J3312n76351j110925o51984O04762J373192
36401a395568J018571K24588k58696m31322l66936P7296M67843o0303j261959
36392a986486j552938j16146J768193K364798J583323N44384j31475n63281p54193
36383A156179n83008l28792l25208l60447j39703K7644k37204n49816l17587J88540
36373a469402K50528j5549J51411O48261L18040j226560k467515j573203J160857
36364d223132L342538L132753J186755m94170j049275j203028j487137j319074
36356b113770k96084P80293J077128J001562J216010J227200L17800q01312q78020
$$ y = [-4004761, -4398566, -3643119, -2668316, -2627969, -3385125, -3910945, -3679578, -2973337, -2201692, -1587175, -1263940, -1162176, -1047574, -1034262, -1610613, -2721538, -3373522, -2768760, -1395568, -376997, -152409, -411105, -842427, -1209363, -1132067, -664224, -724527, -1986486, -3539424, -3655570, -1887377, 477421, 2060744, 2605128, 2473653, 1910372, 1156179, 573171, 244379, -80829, -441276, -580979, -553335, -790539, -1340355, -1657942, -1469402, -1218874, -1234423, -1083012, -434751, -116711, -1343271, -3810786, -5383989, -4223132, -880594, 2252159, 3438914, 2944744, 1895469, 692441, -794696, -2113770, -2409854, -1629561, -552433, 449129, 1665139, 2892339, 3210139, 2408827, 1530807]
36347A530807j87826K6814j95159J32022N82544k42391j663185j071715J874522
36338G86433L873783K438499n58020j798564j017331k59314k74706l13061m40943
36329B436776j299704k054294j196611P12545J481246N63876l14200o4754L74000
36320F38880P1751m41020n18442n26166p63146o62353L9234N05996Q0967n76074
36310b150373m88489J97701N37155P8140p42846j188083q65696k8994O84042J019129
36300b948314J365184J880293J897353R48201j56228l16956J60196M8502q41797
36291B036434j429385j030324j02478O41950P78688j4902j483372k321491j532231
36282d457111r1541K42444l76879j85249J126339J727490O40703n62306j55465
$$ y = [1530807, 1342981, 1369795, 1174636, 1306658, 1889202, 1646811, -16374, -1088089, 786433, 4660216, 7098715, 6540695, 4742131, 3724800, 3465486, 3190780, 2877719, 2436776, 1137072, -917222, -2113833, -1401288, 79958, 643834, 329634, 264880, 638880, 710631, 269611, -248831, -774997, -1538143, -2200496, -2161262, -1655266, -1574299, -2150373, -2638862, -2441161, -1904006, -1825866, -2568712, -3756795, -4622491, -4651485, -3967443, -2948314, -1583130, 297163, 2194516, 3142717, 2986489, 2669533, 2829729, 2878231, 2036434, 607049, -423275, -525753, 116197, 894885, 879983, -603389, -2924880, -4457111, -4548652, -4306208, -4683087, -4868336, -3741997, -2014507, -1373804, -1936110, -2091575]
36273b091575J205041J627579O16846o08364p68613L12164J653674J812040L09029
36264D067821j458899j664679m48551L70730M8513k48751K51740N81097j54807
36255A344214j176036j325791p47885k69014j21653j06156j22011OK55979o1322
36245b329669j303764j984793l71265K340880K994478J111902l78748J0100J84951
36236B74072j102853j415145R01011K794699R80526k281752k400654L09331J507829
36227d32936R8266n31653J159183K242028N05380j841269j791640J53297J446722
36218A007378J058783k29494j360153j432360j43022J225367Q65474q20709j428913
36209a257649j21475J211168J165572P62067R87507Q83040k88860j215336p60406
$$ y = [-2091575, -886534, 741045, 1357891, 749527, -19086, 293078, 1946752, 3758792, 4067821, 2608922, 944243, 495692, 866422, 914935, 666184, 917924, 1499021, 1344214, 168178, -1157613, -1905498, -2174512, -2296165, -2402321, -2524332, -2524326, -2268347, -2329669, -3633433, -5618226, -5989491, -3648611, -654133, 457769, 79021, 89121, 274072, -828781, -2243926, -1342915, 1451784, 2432310, 150558, -2250096, -1940765, -432936, -334670, -866323, 292860, 2534888, 3040268, 1198999, -592641, -439344, 1007378, 2066161, 1836667, 476514, -955846, -1098868, 126499, 991973, 171264, -1257649, -1379124, -167956, 997616, 1759683, 2747190, 3630230, 3341370, 2126034, 1365628]
36200A365628p2278m91882j126012o10300K74513k801r75783j089292l74868k9216
36190c132291j06099K51496Q93162J006512Q74892J322174J816380J099205n11038
36181C514393j315402o91096K81208N93796K34817n23742j313439j336308k78145
36172h33918P10005M20184l94049r1661J100684J358868J99579r22857j148961
36163C97874j222700j469144q97451P29999J817150J199920K1702j4052Q84000
36154A447298J256073O59115j22411n75579q23333p42388K4940J054825J146257
36145C324797j83941j742994j798219j62328J360383J052716m97097j144872k21432
36136a2987N00481l77614j517177q73436R60360J593027N58302k22524J90403
$$ y = [1365628, 1293350, 801468, -324544, -934844, -660331, -663132, -1638915, -2728207, -3103075, -3132291, -3238390, -2986894, -2093732, -1087220, -212328, 1109846, 2926226, 4025431, 3514393, 2198991, 1507895, 1789103, 2382899, 2617716, 2093974, 780535, -555773, -833918, -123913, 296271, -97778, -189439, 911245, 2270113, 2469692, 1546835, 397874, -824826, -2293970, -3191421, -2461422, -644272, 555648, 577350, 563298, 1447298, 2703371, 3362486, 3240075, 2664496, 1841163, 1098775, 1123715, 2178540, 3324797, 3140856, 1397862, -400357, -562685, 797698, 1850414, 1353317, 208445, -12987, 487494, 109880, -1407297, -2280733, -1320373, 272654, 830956, 608432, 798835]
36127G98835M67470k05083n66209J76803N31353p00666j924808j109687P51270
36118a780722J074461k40163q29539K44120J224222P10687k88806k65097N88334
36109D37497J160796J129768Q17184K82795m70163j063905j280299j399644j427225
36100a813196q02782L97481Q93218q9841j280739q99663O60689J233232J1049
36091a690552j289842r60172M26223J266516J297674J280362J080764r1658j624161
36082c04846j632534K10307J699419J095437l55422m80657M05138K71414j004325
36073i6069j263418L68386J885810J402701j67994q46104m83813k54850l51653
36064A92996p2139M00301J84366m83733l47340P57998J377365M97640j000771
$$ y = [798835, 1266305, 1061222, 495013, 671816, 1203169, 502503, -1422305, -2531992, -1780722, -706261, -946424, -1775963, -1531843, -307621, 403066, 114260, -150837, 437497, 1598293, 2728061, 3545245, 3828040, 3357877, 2293972, 1013673, -385971, -1813196, -2615978, -2218497, -1325279, -1415120, -2695859, -3595522, -2934833, -1701601, -1690552, -2980394, -3940566, -3514343, -2247827, -950153, 330209, 1410973, 1319315, -304846, -1937380, -1727073, -27654, 1067783, 712361, 231704, 636842, 908256, -96069, -1359487, -991101, 894709, 2297410, 2129416, 1283312, 799499, 544649, 192996, 120857, 521158, 705524, 221791, -125549, 632449, 2009814, 2507454, 1506683]
36055A506683j537762p30862L92068O37263j61689r67112o57285M74858R01564
36046a42274K0681p55935q5087J069608Q84695k86339l87881R47897J740335Q47574
36036C853274l61316m42077j318j01537k69199K93017Q42206K23819j001212j238315
36026A797342j49827J126767J578933R47256o32276k368097k831256j556014k9100
36017b116272K24723j92295J77820J012888Q06297l77399r11271l05493K32100
36008a448902J14187J29716M71353J51879q77084j075070J89019J344252J034805
35999C4155J33878l1622J16866l70075q73138k23176J044227J323451L68665n58771
35989I64460o86375l87470j4541N47170J156914J368581J128138P01786J19144
$$ y = [1506683, -31079, -761941, -369873, 267390, 105701, -861411, -1518696, -1043838, -142274, -121593, -877528, -962615, 106993, 991688, 705349, 317468, 1265365, 3005700, 3853274, 3491958, 3049881, 3048563, 2947026, 2677827, 2970844, 3813050, 4036869, 3035657, 1797342, 1647515, 2774282, 4353215, 5300471, 4668195, 2300098, -531158, -2087172, -2116272, -1891549, -2083844, -1906024, -893136, -86839, -464238, -1375509, -1681002, -1448902, -1334715, -1204999, -733646, -581767, -1458851, -2533921, -2344902, -1000650, 34155, 168033, 136411, 253277, -116798, -989936, -1213112, -168885, 1154566, 1523231, 964460, 278085, -109385, -123926, 423244, 1580158, 2948739, 4076877, 4778663, 4897807]
35980D897807n63317r07385q44315j115231j923163j999067m71197J133774O94551
35971a097543j126808j528239L14233K018070J505618k96040j281109r78047k71316
35962b741181L69330J000541J387127J269996R29084O62630K76309k99873o20045
35953B233918n29981n29434p62361o31768m4654J21733m15213o15088K8583L32089
35943h12176m95832j086601j14319J038535K63325j472081j193656J310779K801271
35934B39245J364836q83819j229329j39820K17660n09367r32876m52708K60637
35925b065541P16727Q79647M83412m18756p48038J86127J105050M18505r34932
35916c77799n19181J649318K648018R64837j088247q36988Q18823J083903m11115
$$ y = [4897807, 4334490, 3427105, 2582790, 1467559, -455604, -2454671, -2925868, -1792094, -1097543, -2224351, -3752590, -3438357, -1420287, 85331, -210709, -1491818, -2469865, -2741181, -2371851, -1371310, 15817, 1285813, 2214897, 2877527, 3153836, 2853963, 2233918, 1703937, 1174503, 412142, -219626, -264280, -142547, -557760, -1172848, -1144265, -812176, -1308008, -2394609, -2508928, -1470393, -1207068, -2679149, -3872805, -2562026, 239245, 1604081, 720262, -509067, -648887, -431227, -940594, -1873470, -2326178, -2065541, -1348814, -469167, 14245, -404511, -1152549, -966422, 138628, 557133, -377799, -896980, 752338, 3400356, 4365193, 3276946, 2439958, 3258781, 4342684, 3931569]
35907C931569j484200j078150m65468n35033l20429Q02160J477721M14515j358811
35898A383874j894384j000558Q5882Q66885J568306J513749k50480k589410k812945
35889c129081l95749J809647J348538n31718j038873N0610O03380k53826j123867
35880b660939r95384o38329o89085l51259Q33309J559799O73839o39321l85368
35871c292738J140848J705475N21527o14266j24149J052916J059890j40105j044180
35862B65218j034365r59205j266491j054063L27310J800939J786592M09521o33970
35853c58514l56542M28107N52392O1655k70423k39428j66530j587N65845J229495
35843A444470J233713N18268j51154m22635q80366j876643k590338j961954j68803
$$ y = [3931569, 2447369, 1369219, 903751, 368718, 48289, 850449, 2328170, 2742685, 1383874, -510510, -1511068, -1425186, -558301, 1010005, 2523754, 2273274, -316136, -3129081, -3524830, -1715183, -366645, -898363, -1937236, -1886626, -1283246, -1537072, -2660939, -3656323, -4294652, -4983737, -5334996, -4501687, -2941888, -2268049, -2907370, -3292738, -2151890, -446415, 75112, -539154, -663303, 389613, 1449503, 1309398, 265218, -769147, -1728352, -2994843, -4048906, -3721596, -1920657, -134065, 275456, -358514, -715056, -286949, 265443, 327098, 56675, -182753, -349283, -350870, 214975, 1444470, 2678183, 3196451, 3045297, 2622662, 1742296, -134347, -2724685, -4686639, -4855442]
35834d855442J478032J913257J154180K9279m97533l6396P41618O72436l66423
35825B33008r89958j20483J234738J171403l31406j239437m21722O42705Q3852
35816B62700j500801j844932k56906J476261J691557J013546J047027J773174
35808C661626J576559j72964j855240j666997j74879L75290q46652k147479j759044
35799c009780j99554Q19276R22148J026661J233533N70973r51804j806975j201247
35790b596769l33610l73502n81906J90247J346652J593657J215076J322787J455459
35781C238091K18266j804951k247363n60026R45813O24451j61477L39512J317120
35772A909436J020730k01577p06557l61093k60795l36151L78431J392958J095634
$$ y = [-4855442, -3377410, -1464153, -309973, -280694, -778227, -814623, -73005, 599431, 233008, -756950, -877433, 357305, 1528708, 1197302, -42135, -463857, 178848, 262700, -1238101, -3083033, -3339939, -1863678, -172121, 841425, 1888452, 3661626, 5238185, 5065221, 3209981, 1542984, 1368105, 1743395, 896743, -1250736, -3009780, -3209334, -2390058, -1467910, -441249, 792284, 1363257, 411453, -1395522, -2596769, -2930379, -3303881, -3885787, -3695540, -2348888, -755231, 459845, 1782632, 3238091, 3456357, 1651406, -595957, -1155983, -210170, 414281, 252804, 592316, 1909436, 2930166, 2728589, 2022032, 1660939, 1400144, 1063993, 1442424, 2835382, 3931016]
35763C931016m70349j460957j159241p53193p29288l1675J225499Q86691j670985
35754b32482l470662j842285J391969K403924Q08448m25614Q3854N74638k08997
35745i17207r77231n88453p7550m14560m82035P65531J919858J170114n12763
35736a14296p01669O61176J291042K84281p01477m54265k4651m68948q13941J15413
35726i27335J326172J044542m01684j097623n78834l05731r19873j037590L69336
35717b528620K031250K125812Q36679l11068q94434j646412k377423j785834K15517
35708d334533J694460J202975j97665o14810J7434M48654M95039R96833J620169
35699A328556Q75282j118579j949101k45161J985871K079674M80212l69667m5052
$$ y = [3931016, 3460667, 1999710, 840469, 87276, -642012, -673687, 551812, 1438503, -232482, -3703144, -5545429, -4153460, -1749536, -941088, -1366702, -1282848, -708210, -917207, -1894438, -2482891, -2560441, -2975001, -3457036, -2691505, -771647, 398467, -114296, -815965, -154789, 1136253, 1420534, 719057, 264792, 240141, -228807, -1042748, -927335, 398837, 1443379, 1041695, -55928, -634762, -940493, -1860366, -2897956, -2528620, -497370, 1628442, 2465121, 2154053, 1259619, -386793, -2764216, -4550050, -4334533, -2640073, -1437098, -1634763, -2249573, -2232139, -1783485, -1288446, -291613, 1328556, 2203838, 1085259, -863842, -1109003, 876868, 2956542, 3436754, 3067087, 3022035]
$$ [...]
##END NTUPLES=NMR SPECTRUM
##END=
