##TITLE=31Pdec_PR173_K2
 D2O, 24 sc
 28.6.2019
##JCAMPDX= 6.0         $$ Bruker NMR JCAMP-DX V2.0
##DATA TYPE= NMR SPECTRUM
##DATA CLASS= NTUPLES
##ORIGIN= UXNMR, Bruker Analytische Messtechnik GmbH
##OWNER= root
$$ XWIN-NMR		Version 3.5
$$ Fri Jun 28 14:32:47 2019 Russian Standard Time (UT+4h)  she@DPX200
##.OBSERVE FREQUENCY= 81.013821
##.OBSERVE NUCLEUS= ^31P
##.ACQUISITION MODE= SIMULTANEOUS
##.ACQUISITION SCHEME= undefined
##.AVERAGES= 24
##.DIGITISER RES= 17
##SPECTROMETER/DATA SYSTEM= spect
##.PULSE SEQUENCE= zgpg30
##.SOLVENT NAME= CDCl3
##.SHIFT REFERENCE= (INTERNAL, CDCl3, 0, 182.463)
##AUDIT TRAIL= $$ (NUMBER, WHEN, WHO, WHERE, WHAT)
$$ ##TITLE= Audit trail, XWIN-NMR		Version 3.5
$$ ##JCAMPDX= 5.01
$$ ##ORIGIN= Bruker BioSpin GmbH
$$ ##OWNER= she
$$ F:/spectra/data/she/nmr/P31/1/pdata/1/auditp.txt
$$ ##AUDIT TRAIL=  $$ (NUMBER, WHEN, WHO, WHERE, WHAT)
(   1,<2019-06-28 14:31:53.59 +0400>,<she>,<DPX200>,
      <created by zg, POWCHK disabled, PULCHK disabled
       configuration hash MD5:
       00 E9 B6 7A A2 85 ED C7 34 08 36 98 17 FE 4E 26
       data hash MD5: 32K
       6D B0 44 F9 9E 17 28 F6 99 C0 7B 88 96 7D 47 74>)
(   2,<2019-06-28 14:31:56.25 +0400>,<she>,<DPX200>,
      <Start of raw data processing
       efp BC_mod = 2 LB = 1 FT_mod = 6 PKNL = 1 PHC0 = -2572.916 PHC1 = 159.1996 SI = 64K 
       data hash MD5: 64K
       30 14 60 4E 09 AA 65 13 D1 9A 71 19 AD 93 84 3F>)
(   3,<2019-06-28 14:32:15.50 +0400>,<she>,<DPX200>,
      <pk PHC0 = -15.59697 PHC1 = 0 
       data hash MD5: 64K
       8A 7F BA 34 42 DC 36 AE 7E DE 5F 61 BD 76 C7 44>)
(   4,<2019-06-28 14:32:18.32 +0400>,<she>,<DPX200>,
      <abs ABSG = 5 
       data hash MD5: 64K
       D7 2C 38 F9 79 51 F6 6B 98 8A AB E9 26 E2 EC 8C>)
$$ ##END=
$$ 
$$ hash MD5
$$ 51 E6 00 25 FC 47 08 E1 C6 7E 2F D8 27 83 5C 09
##$RELAX= 
##$RELAX= 
##$RELAX= 
##$RELAX= 
##$RELAX= 
##$RELAX= 
##$RELAX= 
##$RELAX= 
$$ Bruker specific parameters
$$ --------------------------
##$DU= <F:/spectra>
##$EXPNO= 1
##$NAME= <P31>
##$PROCNO= 1
##$TYPE= <nmr>
##$USER= <she>
##$AMP= (0..31)
100 100 100 100 100 100 100 100 100 100 100 100 100 100 100 100 100 100 
100 100 100 100 100 100 100 100 100 100 100 100 100 100 
##$AQSEQ= 0
##$AQ_mod= 1
##$AUNM= <au_zg>
##$AUTOPOS= <>
##$BF1= 81.014009
##$BF2= 200.13
##$BF3= 200.13
##$BF4= 200.13
##$BF5= 200.13
##$BF6= 200.13
##$BF7= 200.13
##$BF8= 200.13
##$BYTORDA= 1
##$CFDGTYP= 0
##$CFRGTYP= 5
##$CHEMSTR= <none>
##$CNST= (0..31)
1 1 145 1 1 1 1 1 1 1 1 1 1 1 1 1 1 1 1 1 1 1 1 1 1 1 1 1 1 1 1 1 
##$CPDPRG= <waltz16>
##$CPDPRG1= <>
##$CPDPRG2= <waltz16>
##$CPDPRG3= <>
##$CPDPRG4= <mlev>
##$CPDPRG5= <mlev>
##$CPDPRG6= <mlev>
##$CPDPRG7= <mlev>
##$CPDPRG8= <mlev>
##$CPDPRGB= <>
##$CPDPRGT= <>
##$D= (0..31)
0 1 0 0 0 0 0 0 0 0 0 0.03 2e-05 3e-06 0 0 0 0 0 0 0 0 0 0 0 0 0 0 0 0 
0 0 
##$DATE= 1561717913
##$DBL= (0..7)
120 120 120 11 120 120 24 19 
##$DBP= (0..7)
150 150 150 150 150 150 150 150 
##$DBP07= 0
##$DBPNAM0= <>
##$DBPNAM1= <>
##$DBPNAM2= <>
$$ [...]
##$SUBNAM3= <"">
##$SUBNAM4= <"">
##$SUBNAM5= <"">
##$SUBNAM6= <"">
##$SUBNAM7= <"">
##$SUBNAM8= <"">
##$SUBNAM9= <"">
##$SW= 369.568048894756
##$SWIBOX= (0..15)
0 1 3 0 0 0 0 0 0 0 0 0 0 0 0 0 
##$SW_h= 29940.119760479
##$TD= 32768
##$TD0= 1
##$TE= 0
##$TE2= 300
##$TE3= 300
##$TEG= 300
##$TL= (0..7)
0 120 53 12 22 120 120 120 
##$TP= (0..7)
150 150 150 150 150 150 150 150 
##$TP07= 0
##$TPNAME0= <>
##$TPNAME1= <>
##$TPNAME2= <>
##$TPNAME3= <>
##$TPNAME4= <>
##$TPNAME5= <>
##$TPNAME6= <>
##$TPNAME7= <>
##$TPOAL= (0..7)
0.5 0.5 0.5 0.5 0.5 0.5 0.5 0.5 
##$TPOFFS= (0..7)
0 0 0 0 0 0 0 0 
##$TUNHIN= 0
##$TUNHOUT= 0
##$TUNXOUT= 0
##$USERA1= <user>
##$USERA2= <user>
##$USERA3= <user>
##$USERA4= <user>
##$USERA5= <user>
##$V9= 5
##$VALIST= <valist>
##$VCLIST= <CCCCCCCCCCCCCCC>
##$VD= 0
##$VDLIST= <DDDDDDDDDDDDDDD>
##$VPLIST= <PPPPPPPPPPPPPPP>
##$VTLIST= <TTTTTTTTTTTTTTT>
##$WBST= 1024
##$WBSW= 4
##$XGAIN= (0..3)
0 0 0 0 
##$XL= 0
##$YL= 0
##$YMAX_a= 24099
##$YMIN_a= -32176
##$ZGOPTNS= <>
##$ZL1= 120
##$ZL2= 120
##$ZL3= 120
##$ZL4= 120
##$ABSF1= 182.463
##$ABSF2= -187.1042
##$ABSG= 5
##$ABSL= 3
##$ALPHA= 0
##$AQORDER= 0
##$ASSFAC= 0
##$ASSFACI= 0
##$ASSFACX= 0
##$ASSWID= 0
##$AUNMP= <proc_1d>
##$AZFE= 0.1
##$AZFW= 0.5
##$BCFW= 0
##$BC_mod= 2
##$BYTORDP= 0
##$COROFFS= 0
##$CY= -3
##$DATMOD= 1
##$DC= 0
##$DFILT= <>
##$DTYPP= 0
##$F1P= 0
##$F2P= 0
##$FCOR= 1
##$FTSIZE= 65536
##$FT_mod= 6
##$GAMMA= 0
##$GB= 0
##$INTBC= 1
##$INTSCL= 5.30512e-09
##$ISEN= 30
##$LB= 1
##$LEV0= 0
##$LPBIN= 0
##$MAXI= 10000
##$MC2= 0
##$MEAN= 0
##$ME_mod= 0
##$MI= 50
##$NCOEF= 0
##$NC_proc= -4
##$NLEV= 6
##$NOISF1= 182.463
##$NOISF2= 159.3651
##$NSP= 0
##$NTH_PI= 0
##$NZP= 0
##$OFFSET= 182.463
##$PC= 4
##$PHC0= -2588.513
##$PHC1= 159.1996
##$PH_mod= 1
##$PKNL= yes
##$PPARMOD= 0
##$PSCAL= 0
##$PSIGN= 0
##$REVERSE= no
##$SF= 81.0140089999434
##$SI= 65536
##$SIGF1= 159.3651
##$SIGF2= -187.1042
##$SINO= 113.3802
##$SIOLD= 16384
##$SREGLST= <1H.CDCl3>
##$SSB= 0
##$STSI= 65536
##$STSR= 0
##$SW_p= 29940.119760479
##$SYMM= 0
##$S_DEV= 0
##$TDeff= 32768
##$TDoff= 0
##$TI= <>
##$TILT= no
##$TM1= 0
##$TM2= 0
##$TOPLEV= 0
##$USERP1= <user>
##$USERP2= <user>
##$USERP3= <user>
##$USERP4= <user>
##$USERP5= <user>
##$WDW= 1
##$XDIM= 65536
##$YMAX_p= 283403379
##$YMIN_p= -10078327
$$ End of Bruker specific parameters
$$ ---------------------------------
##NTUPLES= NMR SPECTRUM
##VAR_NAME=  FREQUENCY,     SPECTRUM/REAL,   SPECTRUM/IMAG
##SYMBOL=    X,             R,               I
##VAR_TYPE=  INDEPENDENT,   DEPENDENT,       DEPENDENT
##VAR_FORM=  AFFN,          ASDF,            ASDF
##VAR_DIM=   65536,         65536,           65536
##UNITS=     HZ,            ARBITRARY UNITS, ARBITRARY UNITS
##FACTOR=    0.456856943014862, 1,           1
##FIRST=     14782.0589164792, 0,            0
##LAST=      -15158.0608439998, 0,           0
##MIN=       -15158.0608439998, -10078327,   0
##MAX=       14782.0589164792, 283403379,    0
$$ Real data points
##PAGE= N=1
##DATA TABLE= (X++(R..R)), XYDATA
$$ [...]
47314 123702 -388811 -949005 -1217830 -1073311 -649165 -226710 -130171 -448120 -773135 -561724
47304 -561724 105981 517847 289287 -113920 -146155 -22952 -278659 -811979 -996586 -619816
47294 -619816 -125451 89498 116487 190440 321115 402422 388973 259819 35515 -126965
47284 -126965 -82967 35988 -64926 -436790 -785672 -797994 -426328 104539 436638 324210
47274 324210 -91964 -376133 -325828 -224906 -373242 -620961 -671361 -591990 -631418 -729785
47264 -729785 -643719 -407227 -242516 -159756 -70873 -111097 -362568 -478875 -179134 83936
47254 83936 -330098 -1144058 -1408449 -867899 -252115 -93423 -122763 -65014 -127651 -309942
47244 -309942 -100003 601265 1037878 705909 193241 209004 427816 133915 -502017 -710775
47234 -710775 -363711 -29849 18183 22441 76294 37154 55188 427227 908230 900587 410104
47223 410104 123151 391484 772838 760727 395846 -47270 -443662 -650324 -426129 218040
47213 218040 935089 1458950 1751240 1678103 1051232 165763 -222827 232201 1004509 1359736
47203 1359736 1119921 536128 -160871 -731530 -834379 -416122 23617 -42473 -524670 -927392
47193 -927392 -1044323 -1073686 -1132000 -1042867 -661491 -126692 320072 604434 803325 935037
47183 935037 868094 484966 -89146 -533263 -672637 -646302 -614798 -485941 -173120 56404
47173 56404 -121235 -520466 -621389 -321690 -41419 4833 115766 470879 707866 496446
47163 496446 123790 72155 304746 411494 253110 21743 -203108 -539313 -998149 -1433879
47153 -1433879 -1744145 -1842673 -1556213 -895642 -332704 -389373 -919697 -1163515 -623133 375777
47143 375777 1094379 1133157 677611 177563 -78938 -135158 -195208 -327635 -411554 -365016
47133 -365016 -250719 -96760 155659 396514 319244 -108618 -409878 -173940 328742 496426
47123 496426 213263 -117888 -269786 -419163 -646570 -702979 -451710 -155091 -94899 -184713
47113 -184713 -165092 27038 249374 338747 194115 -140568 -399813 -316803 10859 216898
47103 216898 188803 192191 368739 466354 282570 48791 75496 267591 318356 192858 81044
47092 81044 15517 -108827 -219278 -127580 105475 192520 39514 -141608 -194420 -226654 -366282
47081 -366282 -538143 -609707 -596560 -608962 -710288 -899766 -1111243 -1169745 -900127 -378535
47071 -378535 50068 122192 -65894 -231775 -263409 -269409 -337284 -404729 -389116 -322528 -295347
47060 -295347 -325726 -350565 -333362 -324352 -380441 -454119 -432563 -308335 -223869 -257595 -234707
47049 -234707 84003 606135 878455 577601 -67917 -488076 -367492 86776 447088 501245
47039 501245 367460 287503 363957 459653 347979 -766 -336976 -438344 -429841 -593760
47029 -593760 -871837 -853698 -394624 57289 39231 -245566 -230367 136674 310862 19579
47019 19579 -297721 -189660 96533 38282 -308735 -409680 -109132 151547 60976 -99390
47009 -99390 55121 427891 645086 597130 464044 356784 241347 139411 116525 91577
46999 91577 -87965 -366486 -498679 -382578 -179000 -60928 -37202 -76335 -195599 -321649
46989 -321649 -250538 94335 481630 594356 351006 -99848 -577030 -896844 -828890 -283880
46979 -283880 440749 827032 647671 184624 -137507 -211401 -232205 -329859 -409612 -392482
46969 -392482 -446265 -792062 -1287973 -1421746 -897181 -113358 216065 -65805 -375452 -200638
46959 -200638 235415 399562 252617 196496 366290 473873 355139 177652 9844 -313854
46949 -313854 -700087 -667135 -39551 643793 810231 590105 445236 401999 191575 -100511
46939 -100511 -147823 -28252 -127450 -410413 -409479 -17067 313090 314932 274893 404389 408437
46928 408437 40575 -377345 -414375 -161707 12813 63831 206861 466390 683548 833673
46918 833673 991281 1094634 1037228 865280 629101 220643 -354861 -755058 -702104 -434416
46908 -434416 -369612 -457457 -305587 117273 372631 209714 -70316 -64390 190587 295649
46898 295649 -25877 -621550 -1040720 -983518 -632639 -402132 -337330 -68522 489838 802916
46888 802916 453760 -119381 -148547 396145 829700 758874 486438 383903 416064 419644
46878 419644 379793 259068 -54248 -469132 -707059 -711470 -700722 -727450 -574206 -212041
46868 -212041 34023 -43334 -240784 -297902 -236269 -202026 -271075 -515801 -933742 -1226008
46858 -1226008 -1039795 -545765 -345401 -645498 -963118 -838370 -387100 67118 418454
46849 418454 563650 283159 -279092 -485596 -5380 640645 774525 429681 66565 -193443
46839 -193443 -492480 -696993 -545445 -173302 48839 76342 106625 89990 -151947 -426998
46829 -426998 -330630 117284 465154 456900 258475 94573 64698 274237 729516 1123560
46819 1123560 1120316 834050 671351 761218 904516 979203 985280 809541 407234 102906
46809 102906 203180 414302 209899 -298408 -490173 -217382 32426 21861 80173 343760
46799 343760 408900 71700 -237277 -171573 -62706 -341125 -837065 -1127042 -1172329 -1146291
46789 -1146291 -992695 -643527 -365629 -394467 -480865 -298932 -80642 -306194 -891976 -1224144
46779 -1224144 -990994 -524465 -264785 -261687 -287159 -152973 163336 502671 603589 367304
46769 367304 29510 -92984 18146 118323 45233 -151775 -361774 -506925 -536840 -488119
46759 -488119 -489197 -568994 -562520 -364710 -155838 -177580 -389089 -555575 -590328 -594472 -634980
46748 -634980 -704529 -837095 -1034835 -1126952 -938042 -583358 -372326 -405435 -470264 -368048
46738 -368048 -157472 -18702 -27353 -137001 -280837 -410043 -470775 -398660 -167152 131067
46728 131067 289849 177718 -83617 -252320 -277356 -311944 -409373 -440988 -391676 -466480 -730910
46717 -730910 -883529 -630746 -130940 178850 101084 -180356 -383433 -368684 -188646 -65136
46707 -65136 -216946 -558147 -706115 -470351 -174606 -247627 -609652 -751054 -395913 161816
46697 161816 425634 235822 -115276 -235823 -61627 111038 58544 -53822 242 38895
46687 38895 -238014 -560147 -292518 539731 1098435 925442 608479 737075 856749 245569
46677 245569 -748397 -1089115 -549942 104987 375817 533741 773786 767488 361030 -34388
46667 -34388 -125757 -195289 -498163 -755909 -666661 -462868 -530959 -823061 -1032556 -1076882 -1074950
46656 -1074950 -1071367 -1038632 -951781 -716576 -286976 67216 -18846 -423810 -626492 -496810
46646 -496810 -480940 -816842 -1152100 -1215170 -1239399 -1337294 -1102661 -369391 223704 75930
46636 75930 -445274 -591221 -314225 -36310 253284 809229 1310005 1151063 467471 -9035
46626 -9035 -100918 -320854 -787269 -912957 -431508 89461 143873 1039 87595 250781
46616 250781 134406 -163486 -296000 -205998 -56070 98226 231774 236539 179799 345906
46606 345906 715661 785412 297007 -218260 -115321 424664 672227 397642 86079 151218
46596 151218 444705 607460 492550 140322 -332363 -703605 -756221 -510977 -190107 44903
46586 44903 139586 5341 -397456 -858588 -1077505 -1034530 -954541 -918909 -803322 -601847
46576 -601847 -483812 -474585 -410848 -302706 -393906 -708515 -870068 -593196 -84362 271983
46566 271983 369509 282598 -8845 -461968 -743306 -543616 -30885 338700 386278 281320
46556 281320 155502 20125 5805 255427 553480 496053 128029 -15828 331057 781553
46546 781553 892262 742464 608395 429962 9255 -525110 -875216 -999677 -981423 -686148
46536 -686148 -41878 501560 381746 -212870 -463582 -14071 584056 693159 357124 -6496
46526 -6496 -225249 -340642 -318871 -175306 -145655 -391180 -715420 -851477 -833486 -820913 -782052
46515 -782052 -648792 -562668 -639022 -692482 -546317 -412141 -563093 -800464 -696602 -269218
46505 -269218 45302 50389 -26090 1437 74719 191310 453989 735311 732340 484362 404087
46494 404087 612334 662293 184940 -552026 -1036308 -1174662 -1236278 -1345738 -1377232 -1251632
46484 -1251632 -1045788 -831880 -614210 -425275 -357044 -480901 -746299 -913243 -670726 -12269
46474 -12269 567862 536694 -20460 -518670 -653011 -654641 -704335 -602469 -255265 10586
46464 10586 -15453 -16321 279968 513558 232621 -290109 -423379 -174326 -128807 -447544 -638192
46453 -638192 -439659 -247358 -380099 -506114 -196317 382530 759812 834885 816597 703410
46443 703410 303403 -270069 -542924 -232309 391255 807996 778460 490934 272658 239035
46433 239035 224154 25957 -326102 -591573 -570088 -255342 219022 662300 880754 815074
46423 815074 639092 551124 450664 51283 -602006 -988987 -698224 13877 493133 433639
46413 433639 123912 -12792 113901 293567 321597 175875 -6981 -47490 128553 402528
46403 402528 561888 522715 421048 452438 644505 817620 766554 468882 111212 -97103
46393 -97103 -140186 -209885 -482207 -884568 -1123101 -979377 -574212 -278140 -317349 -520760
46383 -520760 -544502 -309657 -72056 -40775 -113703 -100061 -30786 -50757 -111916 -17396 248374
46372 248374 456851 432495 230038 -16353 -244452 -425294 -547292 -685161 -909930 -1085264
46362 -1085264 -956425 -521030 -99663 81691 174624 417544 749919 913842 798340 483868
46352 483868 69307 -332013 -529160 -422544 -179148 -29816 44570 205466 414882 487646
46342 487646 462221 594529 914339 1094747 896508 468092 37096 -409718 -873716 -1028245
46332 -1028245 -566187 217368 612298 332846 -189350 -479423 -612107 -858144 -1060272
46323 -1060272 -819628 -199593 233817 157387 -118480 -165561 6908 145429 179433 127210
46313 127210 -167776 -784242 -1346879 -1363854 -927525 -643905 -803762 -1046938 -982821 -730038
46303 -730038 -607730 -637745 -644607 -590807 -521577 -382880 -172461 -89999 -268087 -526427 -651012
46292 -651012 -714217 -825302 -803305 -498825 -241439 -458020 -927547 -969441 -427413 74079
46282 74079 24018 -324403 -472187 -406846 -425461 -529625 -447699 -133843 153695 257353
46272 257353 291795 381266 469796 450227 306630 82097 -150955 -250527 -77302 318610
46262 318610 675855 764637 608952 420872 358809 411466 494435 566413 599674 505375 204765
46251 204765 -218759 -549837 -663182 -609277 -436104 -83986 422442 828466 884430 634132
46241 634132 288143 -79538 -476123 -740780 -679707 -439250 -399440 -621288 -727667 -471694
46231 -471694 -114813 -25136 -148549 -151205 59344 226267 113474 -213279 -477522 -455540
46221 -455540 -156389 214636 493398 714774 927348 949489 580187 42970 -132531 203945
46211 203945 581670 538414 179473 -137263 -367168 -675671 -975783 -963095 -549705 28768
46201 28768 479846 600006 285645 -313006 -745811 -665563 -220388 188518 402701 468686
46191 468686 286365 -265528 -914190 -1168502 -960739 -700761 -621496 -505704 -209530 -21957
46181 -21957 -233799 -680016 -1013364 -1182600 -1319394 -1335418 -997322 -367639 128465 151521
46171 151521 -189677 -478462 -416123 -87385 152958 45456 -323251 -650558 -755076 -702791
46161 -702791 -622464 -515961 -291588 77664 459577 628791 488172 232928 154402 233804
46151 233804 158221 -122794 -159762 364723 1024547 1127745 664749 256691 197087 136787
46141 136787 -162563 -364016 -142512 251005 389407 255388 39023 -309564 -857068 -1251395
46131 -1251395 -1030106 -310340 258280 253033 -138280 -505882 -665895 -638658 -450689 -130881
46121 -130881 195553 332263 165977 -169930 -311983 6866 591073 904790 664997 163290
46111 163290 -116621 -36238 185023 322270 314015 193391 43588 -30799 -9224 24838 14704
46100 14704 -42602 -212659 -546665 -842599 -768543 -328403 99658 308488 475655 661284
46090 661284 548746 7588 -517776 -611095 -498317 -570539 -653748 -356835 123949 232191
46080 232191 -55591 -244413 -173146 -169417 -324750 -294792 42764 338845 349378 216041
46070 216041 35756 -278024 -559643 -449439 -100182 -148892 -666718 -844683 -208418 517655
46060 517655 418820 -258473 -537229 -161862 193951 44919 -352726 -613380 -714996 -710689
46050 -710689 -495626 -112821 96908 -102635 -544901 -926902 -1142670 -1222083 -1171903 -1040447
46040 -1040447 -973120 -1059119 -1229489 -1385473 -1510383 -1597013 -1594077 -1489514 -1334179 -1131506
46030 -1131506 -813731 -374316 76797 420404 588076 514236 186356 -213576 -393979 -286167
46020 -286167 -145812 -187682 -259686 -87554 242570 329671 29216 -302544 -305143 -124971
46010 -124971 -154230 -404949 -509571 -331398 -175005 -264193 -385663 -285423 -92288 -32238
46000 -32238 4696 230620 503694 534875 408094 438805 598346 555618 264006 25624
45990 25624 -33824 -60105 -31051 210659 415600 67399 -728960 -1149732 -767143 -136142
45980 -136142 142842 303811 772053 1210655 993560 303310 -48367 218872 581997 584643
45970 584643 347370 160077 116216 235815 479146 565409 216658 -352095 -609009 -434724
45960 -434724 -251869 -345801 -491890 -405051 -166393 -2852 54109 95741 142921 171105 165281
45949 165281 82058 -95061 -270770 -367108 -446972 -500228 -276412 338810 939788 1020879
45939 1020879 679110 432733 418117 303888 -9789 -198675 -110159 19859 83232 265123
45929 265123 518957 468246 83901 -129291 48471 120399 -318825 -865381 -908051 -534108
45919 -534108 -295474 -378501 -526474 -562757 -521397 -435285 -382479 -534558 -815288 -806885 -389195
45908 -389195 -116517 -445794 -922291 -763760 -15538 573115 685165 697174 811188 707503
45898 707503 265673 -43194 172719 645571 867144 717869 394087 42202 -240999 -305148
45888 -305148 -120891 116314 239009 285996 317862 300274 286404 414100 558173 326344
45878 326344 -332063 -820101 -562990 201607 679980 485638 1784 -202825 -928 319835
45868 319835 463331 369732 171812 16067 -82198 -205123 -347626 -361925 -177896 13460
45858 13460 -45003 -326660 -523529 -416535 -113760 112950 112675 -68363 -279944 -354669 -186456
45847 -186456 167408 489648 594286 501635 355705 209114 12671 -187411 -215133 -23364
45837 -23364 141814 -15332 -484440 -951129 -1097413 -799217 -143685 556437 856026 550921
45827 550921 -49996 -470395 -654937 -893947 -1169258 -1041628 -380232 249335 290795 -45536
45817 -45536 -163150 37423 157830 36740 -67829 -33217 -82783 -315442 -468669 -337990
45807 -337990 -70756 146409 349625 529864 444769 6828 -401388 -360755 -13700 125834
45797 125834 -105844 -333769 -206378 152461 371499 303646 106115 -41496 -124615 -203611
45787 -203611 -275580 -302581 -305191 -317745 -278913 -118078 22633 -145096 -627414 -970977 -761192
45776 -761192 -196332 125727 -32873 -313558 -328309 -140631 -39108 -113950 -281944 -533010
45766 -533010 -889866 -1213219 -1277820 -1034688 -657760 -341993 -142474 22666 272731 613175
45756 613175 853906 789553 502356 322798 395715 463492 235441 -182215 -423377 -319368
45746 -319368 -14560 285608 450070 354070 -61146 -606662 -915757 -778605 -305122 251067
45736 251067 685722 854355 696971 368282 202926 393612 750506 899882 705055 388417
45726 388417 228546 239506 224528 98676 32464 203789 480372 498956 107791 -386063
45716 -386063 -524839 -206709 235229 449267 423468 375093 410461 441034 403718 389845 473313
45705 473313 536463 423374 217200 173991 346404 464330 301191 -2224 -144651 -72522
45695 -72522 20225 15418 -41979 -141140 -326493 -500042 -476428 -323170 -378289 -763870 -1107496
45684 -1107496 -979376 -467021 -71444 -90881 -323006 -373859 -90845 335896 585394 495483
45674 495483 210346 32732 88441 199547 151264 -20230 -131663 -154134 -225810 -381578
45664 -381578 -457712 -326130 -96982 -3266 -138563 -361639 -436619 -257979 25152 105293
45654 105293 -212396 -806314 -1318888 -1455273 -1218738 -878600 -704205 -700001 -622210 -310492
45644 -310492 49811 137860 -37244 -93895 192608 521657 447852 13893 -268867 -70366
45634 -70366 379289 639011 573869 380382 246874 188920 177990 239336 366270 461546 452469
45623 452469 393785 361264 292089 62922 -265637 -428047 -258457 87942 319864 329200
45613 329200 208623 44391 -134316 -253860 -254039 -251336 -432605 -735250 -835398 -548260
45603 -548260 -69238 289400 441572 480308 438008 270188 7190 -229115 -348191 -365677
45593 -365677 -396718 -588112 -945284 -1201938 -1029593 -453821 112028 353309 385429 452833
45583 452833 505353 328750 -12466 -139155 212961 877669 1375233 1280171 575937 -244486
45573 -244486 -558559 -246470 177254 218348 17453 67620 464482 776013 641394 192787
45563 192787 -177250 -238377 -56824 105078 -10439 -388122 -672808 -557008 -209557 -74027
45553 -74027 -240680 -326642 -78486 210036 97833 -382632 -751259 -647042 -167808 333474
45543 333474 627849 745653 818251 855732 727158 390616 76577 104887 489308 847060
45533 847060 789584 339445 -126835 -316485 -301940 -337795 -480606 -510206 -252028 150996
45523 150996 410890 455331 436254 414275 264473 -60306 -394136 -573913 -600007 -512650
45513 -512650 -330626 -184284 -226895 -297471 -5366 661341 1174615 1181762 1002345 1044549
45503 1044549 1109235 786042 244335 22255 195797 369678 396244 476911 592953 498980
45493 498980 320318 476096 884721 934671 468287 121418 354660 762414 756803 402326
45483 402326 112862 -23035 -140244 -217744 -271639 -560318 -1109414 -1375654 -921934 -155341
45473 -155341 153108 -134838 -553051 -852423 -1169732 -1448136 -1319764 -680679 77806 538423
45463 538423 622565 437142 102078 -194425 -261285 -103952 142871 454725 851547 1162258
45453 1162258 1165943 947878 805500 795457 681283 365625 74300 15392 77335 -30629
45443 -30629 -453008 -1022115 -1345970 -1156003 -670460 -442126 -691578 -1020790 -1001838 -750391
45433 -750391 -582026 -425396 -76936 212900 41087 -363205 -334150 194343 497194 83714
45423 83714 -659927 -1101191 -1123879 -959804 -701639 -344596 -2258 239971 459882 664248
45413 664248 668784 404063 72990 -173048 -421404 -694422 -804655 -724385 -733145 -931520
45403 -931520 -972540 -597851 -99058 118104 112223 151567 187992 54351 -64190 107244
45393 107244 346230 161469 -424576 -832348 -706798 -292072 42650 217046 250241 50966
45383 50966 -390803 -856311 -1108077 -1074816 -776465 -301432 95974 159829 -16729 -83889
45373 -83889 28362 -12495 -371319 -692363 -583594 -179824 108508 212193 392190 709849
45363 709849 904043 829231 681489 679665 770879 772416 606802 288521 -125184 -450551 -461206
45352 -461206 -232006 -184186 -526201 -823766 -488058 370647 985193 897677 484218 321315
45342 321315 395589 284782 -120333 -498603 -622367 -597605 -542940 -374590 -39133 286601
45332 286601 377008 189676 -166827 -538881 -730804 -586955 -193978 136315 210088 174940
45322 174940 291659 573119 769381 670889 335831 15020 -119516 -153992 -287579 -501132
45312 -501132 -527598 -274699 -92304 -354938 -889812 -1157746 -982636 -743173 -787215 -1018895
45302 -1018895 -1188636 -1238831 -1170753 -891252 -450542 -186502 -357133 -787349 -1091640 -1090100
45292 -1090100 -829294 -386693 138060 599887 948896 1227146 1323000 1018634 445364 124909
45282 124909 274421 429175 126772 -375936 -532308 -351283 -250909 -272836 -72480 377852
45272 377852 694502 714704 646219 530750 159402 -342420 -465903 -122888 57304 -395660
45262 -395660 -1077299 -1296413 -1024215 -788841 -852723 -963845 -839919 -509467 -162542 69139
45252 69139 154333 139458 79257 -64910 -347862 -620525 -601209 -276406 11339 36675 -6813
45241 -6813 102556 190467 -27526 -430860 -630306 -525503 -387027 -417895 -534218 -578637
45231 -578637 -493709 -280829 -8422 159441 158571 200626 503463 887129 933299 562216 159491
45220 159491 71609 246417 446606 537153 437676 59977 -514196 -986648 -1162829 -1167534
45210 -1167534 -1172981 -1078669 -693729 -138431 195124 98172 -217626 -380446 -244055 17083
45200 17083 124518 -10930 -182788 -110470 201997 419640 271119 -118377 -434435 -613421
45190 -613421 -838846 -1115752 -1143155 -748088 -218683 26189 -15572 47859 465775 1053886
45180 1053886 1459329 1517792 1297376 979165 782488 832276 979421 908990 561512 275208
45170 275208 320883 473644 340804 4818 -46481 336459 684098 550448 116659 -121213
45160 -121213 -38123 85280 96111 161167 389539 587702 549961 387224 362446 484512
45150 484512 464852 112815 -352174 -494494 -163743 293502 400852 78252 -325487 -512788
45140 -512788 -559419 -672516 -825941 -840245 -708140 -591071 -527479 -399222 -218952 -205750
45130 -205750 -477085 -857768 -1099014 -1112416 -892172 -433739 84284 248904 -158676 -763588
45120 -763588 -909410 -370132 463482 1070953 1214033 888712 232538 -390877 -550677 -245980
45110 -245980 -21169 -316807 -879536 -1110338 -860488 -535316 -468734 -564833 -589831 -466320
45100 -466320 -180079 277824 721591 814578 502074 164656 140488 315508 395179 345837
45090 345837 300039 235703 70701 -75850 -49088 28537 -57169 -211623 -168846 51514 204423
45079 204423 269148 402477 467197 117348 -554341 -960230 -791616 -383930 -100363 148814
45069 148814 464541 546150 187703 -201832 -102119 365753 696867 760316 740977 541119
45059 541119 -88191 -877130 -1177471 -861795 -478786 -375612 -270232 69989 314366 111977
45049 111977 -314908 -548662 -594212 -683785 -747873 -551991 -194175 -23115 -136771 -335682
45039 -335682 -515371 -745773 -976001 -995716 -739464 -385843 -125784 -21624 -61705 -140503
45029 -140503 -36005 339402 693540 631868 188928 -182361 -180457 52177 253720 369566
45019 369566 427171 331349 -17678 -517831 -914704 -1006317 -774161 -414287 -228723 -329767
45009 -329767 -460996 -304029 48902 178247 -85682 -460344 -658545 -717369 -737191 -620562
44999 -620562 -305230 13581 157919 232323 345761 312321 -32911 -422265 -457779 -205604
44989 -205604 -86848 -236136 -367597 -270087 -49206 154077 316007 346639 117541 -239773
44979 -239773 -402868 -315884 -239001 -258113 -134201 221719 532957 617800 662199 780288
44969 780288 715731 319540 -58098 -69845 62955 -48750 -285819 -286838 -169280 -364245
44959 -364245 -822145 -1021416 -805070 -598735 -665073 -719667 -511492 -256754 -190116 -144586
44949 -144586 54154 163076 -82039 -434278 -453960 -180235 -40516 -177213 -290200 -161426
44939 -161426 36267 54315 -81474 -175846 -157475 -139268 -243645 -429925 -498102 -301803
44929 -301803 29977 189699 75637 -45823 120826 511804 808887 854026 786879 792230
44919 792230 858794 813754 524419 60398 -329263 -452189 -386051 -353171 -388185 -302680 -9456
44908 -9456 338763 612060 856592 1062482 1061610 855537 754960 906866 946961 490181 -236334
44897 -236334 -667565 -669192 -587542 -618155 -614065 -526208 -531187 -618834 -529601 -274151 -254824 -609641
44885 -609641 -857321 -565693 -56404 1843 -456984 -795166 -519215 127905 532316 435670
44875 435670 130595 14057 112336 138741 -43395 -227998 -245396 -296534 -605379 -896158
44865 -896158 -678579 -66022 211247 -192171 -711746 -699757 -355777 -330361 -676910 -803338
44855 -803338 -416757 54817 123563 -106729 -174508 131004 610999 935662 907961 563263
44845 563263 146202 -73738 -51986 667 -134732 -453113 -735754 -741671 -426747 -32968
44835 -32968 120091 19015 162 254978 459782 187483 -411980 -725621 -501497 -165980
44825 -165980 -174535 -420100 -550357 -560636 -686424 -870602 -761101 -252195 304688 512137
44815 512137 303826 -155630 -684852 -1060890 -1019222 -525592 52699 275188 109961 -81832
44805 -81832 -19360 228614 455065 571430 554800 337744 -63097 -419135 -490827 -314648
44795 -314648 -115188 36761 282354 679313 1044039 1153926 965380 592835 224529 80330
44785 80330 243133 470619 417837 156263 184312 716604 1264477 1271029 927687 874801 1172013
44774 1172013 1129853 319063 -742292 -1243334 -1100550 -918028 -1082691 -1331663 -1273827 -998216
44764 -998216 -937782 -1250837 -1563756 -1398662 -758942 -151377 1811 -164986 -204011 39511
44754 39511 297628 347064 320961 420310 557324 530922 416984 486712 749723 862321 599169
44743 599169 213786 150069 484543 838671 847490 554037 257088 90471 -74328 -327701
44733 -327701 -534495 -563914 -557450 -771329 -1207081 -1596708 -1743204 -1667032 -1395724 -868049
44723 -868049 -178515 306308 300674 -36331 -283833 -234610 -11523 209811 362264 380999
44713 380999 180334 -168851 -403756 -340364 -104089 5168 -162169 -482490 -730738 -806605
44703 -806605 -774875 -717636 -608376 -388853 -144677 -85815 -290403 -562872 -648766 -526434
44693 -526434 -367638 -251216 -57227 338361 866096 1290313 1383862 1092789 594380 173079
44683 173079 -25169 -94261 -190696 -336545 -464852 -544819 -545665 -400624 -163995 -67238 -206776
44672 -206776 -318647 -151825 62598 -97963 -552601 -789364 -676928 -658676 -929148 -971796
44662 -971796 -333023 573008 965222 737566 458795 487202 632581 649183 535838 297582
44652 297582 -122154 -572406 -759404 -677135 -605972 -619550 -505539 -264869 -223949 -475958
44642 -475958 -670612 -601687 -553523 -746794 -869024 -569957 -75146 154076 101471 60562
44632 60562 39453 -181188 -525622 -679242 -626271 -652865 -818562 -889870 -833118 -905904 -1158683
44621 -1158683 -1282485 -1107334 -867273 -790213 -768469 -636882 -475589 -421638 -430432 -424319 -456998
44610 -456998 -548298 -562988 -424337 -255256 -162650 -88195 -8880 -51120 -244973 -397924 -384422
44599 -384422 -326791 -316088 -217425 35864 229771 212885 186483 339938 442730 178772
44589 178772 -292180 -514697 -371324 -137367 27218 220634 431253 441533 196918 -68824
44579 -68824 -202061 -340791 -625306 -942759 -1110066 -1114653 -1022520 -807962 -443913 -69737
44569 -69737 92753 -5827 -152787 -86482 185104 327277 50323 -472291 -742775 -544948
44559 -544948 -171543 64262 230639 451034 511932 212777 -128620 -41305 329273 368581
44549 368581 -70392 -426959 -264406 162931 396473 385053 324327 249969 119047 38578
44539 38578 111421 238744 300571 333591 335870 141070 -276666 -608361 -586499 -355144 -203374
44528 -203374 -123806 84735 442207 792438 1036569 1107005 882325 418088 95552 204722
44518 204722 495425 483000 119068 -185167 -159882 38874 146996 82783 -117030 -384358
44508 -384358 -587526 -612293 -500268 -361205 -211408 -69983 -81159 -288039 -426429 -266486
44498 -266486 -28494 -63536 -226812 -63828 394683 588000 298161 1620 90074 267158
44488 267158 115880 -170605 -135796 149298 199838 -94936 -325553 -225742 -24811 -8845
44478 -8845 -83798 28216 373479 724768 836163 631383 244032 -39414 30621 433813
44468 433813 869594 1027726 842024 469015 84993 -244642 -524111 -717562 -735308 -560368
44458 -560368 -342342 -262231 -297812 -255774 -91841 -40393 -285728 -631310 -708016 -469933
44448 -469933 -262762 -364880 -652596 -808784 -717132 -531545 -448968 -539327 -756357 -996736
44438 -996736 -1135323 -1076981 -816638 -448931 -124021 20583 -56243 -246656 -364357 -316328
44428 -316328 -186840 -118014 -140638 -177880 -188255 -216727 -285738 -318429 -234920 -86389 -22785
44417 -22785 -124402 -306941 -399445 -296991 -53778 144830 131818 -65595 -220803 -148125
44407 -148125 64655 150268 -11901 -267998 -407017 -381767 -260833 -97512 51844 104495
44397 104495 89606 205037 551498 880941 837148 441330 99794 67077 131757 -27697
44387 -27697 -361185 -520853 -323771 49301 285265 210778 -147701 -603233 -868011 -729607
44377 -729607 -283591 76374 16217 -387955 -730763 -723999 -489067 -351210 -408910 -436176
44367 -436176 -235551 44719 65149 -284337 -741868 -953833 -803753 -460368 -203960 -232099
44357 -232099 -528383 -846353 -883939 -559628 -112029 119563 22881 -191346 -230162 -58797
44347 -58797 39173 -181384 -533054 -533610 -30844 501115 515524 124274 -30233 380028 985082
44336 985082 1270036 1189059 1028359 922305 795637 641004 556702 543130 483506 312466
44326 312466 42098 -320926 -702348 -875647 -685173 -337946 -237202 -492541 -800461 -850919
44316 -850919 -649344 -381940 -178577 -109024 -212152 -384121 -401104 -218260 -109819 -316082
44306 -316082 -648366 -683276 -341064 -35881 -158085 -575934 -807930 -613548 -234778 -30989
44296 -30989 -42566 -46747 50427 86361 -65503 -273096 -341136 -284758 -235227 -175240 10609
44285 10609 256046 320896 119169 -161733 -332687 -407704 -458668 -450686 -335878 -160137 24772
44274 24772 201213 258581 51232 -276958 -298813 105359 410719 84488 -593196 -811389
44264 -811389 -317598 262846 328614 67610 46525 390563 738595 805538 624430 340009
44254 340009 97699 82910 349036 605207 474281 14178 -281684 -89083 374830 697311
44244 697311 778907 829478 991758 1158479 1142844 918037 661446 564206 581769 443687
44234 443687 22495 -377997 -314374 206175 666731 662518 359101 186670 284921 458235
44224 458235 521479 435315 184662 -209447 -559132 -618058 -367358 -31880 220583 444090
44214 444090 734061 1017392 1098537 854590 361573 -131178 -390486 -433312 -496453 -666999
44204 -666999 -674113 -274587 250269 332353 -98710 -434903 -189655 334286 491090 189917
44194 189917 -61186 57213 288396 314043 260303 401566 612225 502258 40032 -331268
44184 -331268 -282851 -2835 144741 91499 -47895 -326798 -831424 -1291471 -1257946 -741778
44174 -741778 -287417 -243731 -316004 -100141 252308 273507 -111151 -520266 -690763 -734258
44164 -734258 -810047 -876304 -834202 -669840 -413062 -169531 -162347 -460506 -697416 -423814
44154 -423814 218569 573945 344502 -18594 -2419 285544 437377 409423 444942 537098
44144 537098 431401 122408 -57225 83846 325667 361043 188468 57594 131821 308597
44134 308597 354095 179304 -40520 -56102 180275 517867 825301 1013706 873572 202039
44124 202039 -786436 -1465732 -1427376 -901631 -374632 -34716 167463 182393 -50519 -335490
44114 -335490 -407688 -318030 -327041 -493251 -662407 -771769 -838626 -729914 -315501 170841
44104 170841 289437 -54525 -522327 -797209 -812165 -565759 -116499 214896 76424 -372731
44094 -372731 -560835 -283126 36503 50307 4432 238773 558515 533760 184526 -80580
44084 -80580 -104249 -147421 -404076 -679752 -663302 -336780 -3165 52887 -96955 -62051 401045
44073 401045 994452 1145397 696365 95769 -180060 -129018 -7740 88983 179822 167442
44063 167442 -18365 -187987 -118755 68072 57620 -178299 -349390 -297936 -199636 -252180
44053 -252180 -395244 -443737 -347233 -216990 -168638 -188848 -138507 74922 307720 297024 63807
44042 63807 13187 412401 916138 934588 432895 3785 64086 326777 284467 -49539
44032 -49539 -203835 62052 476031 709501 817663 1028571 1273398 1223323 795272 340329
44022 340329 191071 238682 179958 19941 17986 201577 296933 193212 112691 170405 113632
44011 113632 -238185 -574172 -462559 11058 322217 171794 -217188 -443516 -313318 103274
44001 103274 547719 682919 356680 -181422 -486714 -385092 -113888 -5012 -158764 -415614
43991 -415614 -523040 -362545 -131319 -218076 -733582 -1258038 -1276138 -798632 -305251 -111834
43981 -111834 -69291 109708 512084 1057073 1590160 1862876 1676954 1163711 708202 499387
43971 499387 368462 158238 -8566 15235 117714 114121 44075 59086 132247 101375 -60086
43960 -60086 -207050 -236122 -189760 -156243 -170678 -206926 -201770 -115121 -13063 -43526 -287120
43949 -287120 -678333 -1083338 -1375252 -1439979 -1248493 -959226 -802875 -809285 -791766 -652507
43939 -652507 -522996 -516647 -544412 -514520 -516845 -613627 -619560 -344456 49469 203154 36936
43928 36936 -181263 -245647 -241444 -308727 -404853 -418762 -359202 -300531 -255838 -225990 -277169 -426498
43916 -426498 -514013 -356134 -23545 200581 194209 166653 320809 466147 196318 -538732
43906 -538732 -1254053 -1428342 -1038165 -484171 -121456 -13765 -47670 -103683 -144244 -254951
43896 -254951 -537961 -863504 -872485 -415437 156501 402032 372073 455810 730092 872835
43886 872835 736525 564767 520022 421707 148139 -98064 -170308 -242916 -403722 -368052
43876 -368052 14013 318957 118028 -269361 -160987 468659 931520 787148 314708 -51777
43866 -51777 -224979 -226361 47123 510203 726532 424687 -66127 -230872 -38000 134775
43856 134775 112498 96741 235406 347588 198818 -149609 -420760 -470634 -431634 -516866
43846 -516866 -772300 -1064646 -1251493 -1263744 -1034089 -503113 209615 774147 951146 848126
43836 848126 715294 576914 293185 -67358 -221459 -95103 32699 -50358 -169307 -59843
43826 -59843 198619 299020 169122 66383 192109 402451 396930 108173 -198642 -233236
43816 -233236 -35076 65172 -132551 -423477 -460151 -203660 63625 135645 76795 490
43806 490 -118396 -323422 -552146 -724932 -803314 -702909 -350972 86711 277448 164019
43796 164019 94438 309451 532661 348643 -182108 -603797 -664203 -517922 -378412 -288382
43786 -288382 -260125 -353519 -534390 -678438 -788664 -1009491 -1350723 -1580955 -1484481 -1090664
43776 -1090664 -607166 -273513 -289034 -666779 -1090950 -1146672 -819215 -565956 -729495 -1056865
43766 -1056865 -1023847 -535377 -62497 -83686 -576181 -1108563 -1304160 -1128905 -788285 -457856
43756 -457856 -179634 16559 30610 -170932 -431687 -582054 -690242 -933016 -1221656 -1214113
43746 -1214113 -792394 -287957 -70592 -114562 -174560 -212919 -378474 -653594 -813987 -751088
43736 -751088 -605795 -536713 -527556 -468093 -294265 -28297 203476 206188 -91383 -493775 -729774
43725 -729774 -755090 -702283 -594673 -364757 -144287 -213110 -553642 -750935 -516477 -70996
43715 -70996 200255 253388 295230 372532 361404 265804 214607 196628 89733 -49810 -17788
43704 -17788 181348 293183 205479 100729 95464 16301 -251273 -437332 -223901 214502
43694 214502 342503 -51299 -582409 -773957 -609119 -426595 -417148 -442035 -330083 -146354
43684 -146354 -53615 -21833 140218 449822 626759 436008 42938 -167511 -93642 -15235
43674 -15235 -141584 -298154 -217713 45964 229719 282128 400189 643394 768628 554141
43664 554141 118688 -208760 -246156 -93106 21612 -44412 -228402 -317185 -190694 -32337
43654 -32337 -176180 -680825 -1184717 -1297559 -1031964 -714224 -558817 -505278 -433394 -347189
43644 -347189 -311150 -340330 -399309 -425067 -348613 -189915 -108630 -227103 -420953 -456850 -340019
43633 -340019 -307648 -422874 -423925 -115239 322456 615156 784832 990976 1147807 1042118
43623 1042118 763469 645238 740268 703384 306103 -245148 -661151 -942287 -1175849 -1224277
43613 -1224277 -925584 -449512 -140241 -83677 -118766 -214747 -506094 -930220 -1156499 -996388
43603 -996388 -634743 -318359 -46451 248072 419569 281497 -44014 -229137 -185239 -143919
43593 -143919 -237436 -264614 -46157 199930 125532 -185663 -254031 134124 611177 758037
43583 758037 680706 750374 941698 839701 302643 -280000 -514711 -452831 -327661 -145687
43573 -145687 185902 531286 633924 470579 272181 257082 498793 926630 1272971 1176692
43563 1176692 580171 -92461 -379182 -276841 -82103 61836 150566 55304 -298273 -604300
43553 -604300 -506019 -226611 -381564 -1093198 -1757053 -1830775 -1443008 -1047502 -848650 -772697
43543 -772697 -693670 -496160 -172461 26083 -176503 -618225 -816928 -621568 -338316 -131342
43533 -131342 196495 675582 987935 1050738 1180401 1356739 997679 -39027 -891240 -809214
43523 -809214 -278832 -224186 -543246 -394178 310970 726318 395795 -171531 -409475 -371695
43513 -371695 -276882 -105544 56551 -99069 -554976 -826348 -657093 -372243 -275527 -203268
43503 -203268 6381 80416 -260159 -794304 -1083765 -992468 -656439 -222185 138159 235634
43493 235634 123665 92183 232681 302264 159636 -14736 -80722 -129872 -159591 1900
43483 1900 255713 200569 -221983 -557048 -579434 -642002 -934421 -1015863 -589339 -161266 -301355
43472 -301355 -732108 -840429 -667061 -626442 -601876 -190075 351029 302968 -367048 -873016
43462 -873016 -728449 -296541 -87588 -141941 -280370 -407928 -396076 -146750 105227 19219
43452 19219 -260606 -250151 95093 322485 281022 330519 578989 573980 48376 -615431 -990128
43441 -990128 -1118206 -1089925 -694573 60212 604297 507501 124648 37676 223449 291930
43431 291930 205576 188059 179627 -31974 -316691 -390667 -356714 -519601 -783566 -787699 -564286
43420 -564286 -492949 -618993 -598376 -375362 -333252 -615437 -827880 -651599 -302569 -120293
43410 -120293 -88905 -49533 -43251 -129876 -151106 916 110932 -39977 -283221 -331924 -270820
43399 -270820 -388140 -615486 -566067 -159916 194707 183609 9176 11459 139722 111027
43389 111027 -57549 -37858 275983 544550 435784 77071 -144847 -91420 61338 193299
43379 193299 380333 598923 575816 156501 -328902 -347880 184627 760518 852969 471989
43369 471989 47757 -102690 -36263 25050 -15209 -90461 -111285 -60576 10403 15790 -123017
43358 -123017 -414157 -756134 -986230 -992297 -793309 -530594 -382846 -451341 -684515 -914417
43348 -914417 -991480 -893363 -720295 -628785 -760860 -1128775 -1506447 -1560615 -1240105 -944274
43338 -944274 -1088734 -1539731 -1751214 -1505886 -1202718 -1235773 -1381409 -1113267 -355487 428112
43328 428112 837533 895108 790029 595971 358132 202607 187323 198670 138589 94331
43318 94331 186923 343060 367433 218565 90102 171130 372409 372309 -4305 -501072 -663216
43307 -663216 -373394 23401 201731 233776 321639 402901 321921 212836 332051 587966
43297 587966 623915 355441 54443 -100620 -161590 -83137 271114 684242 640635 54860
43287 54860 -493336 -533802 -300054 -215105 -204549 12304 275395 196185 -135515 -203107 194224
43276 194224 704137 950016 897106 650016 280120 -30696 -11887 351158 710048 738595
43266 738595 487490 275915 353732 704378 1049758 1041078 596961 67392 -86040 210921
43256 210921 594613 699521 498886 222434 96181 179377 324888 287181 -22765 -395100
43246 -395100 -519166 -288750 151849 558724 691130 429361 -35758 -284203 -145810 56770
43236 56770 -19535 -216058 -164146 58911 16887 -372469 -679367 -611825 -409436 -413485 -577372
43225 -577372 -616877 -414195 -93810 130648 78599 -243387 -541524 -501079 -201151 -16022
43215 -16022 -67736 -93660 66338 226668 263296 384815 737271 1063773 1072084 882758 781875
43204 781875 744275 555788 247556 46289 -4076 -25630 8933 213257 430980 311326
43194 311326 -183300 -646387 -726274 -530692 -401223 -456141 -513049 -387679 -145001 -43709
43184 -43709 -253012 -633550 -857438 -787773 -654788 -761955 -1089002 -1309649 -1162622 -687769
43174 -687769 -127174 283428 432450 356106 175697 -25864 -241864 -434270 -477563 -291647
43164 -291647 32905 315732 426970 303534 -35484 -383933 -417988 -64245 301563 245938
43154 245938 -174618 -474542 -338161 66121 403007 564923 628817 609272 466094 301905
43144 301905 345402 659345 969834 907096 410690 -198881 -573198 -654674 -590133 -475348
43134 -475348 -343953 -298822 -420024 -577431 -577609 -487653 -536476 -672862 -558057 -108068 299183
43123 299183 347448 197651 147964 186652 171812 162779 217577 116919 -295900 -696482 -643737
43112 -643737 -223011 118208 247635 369275 459665 243317 -254671 -679369 -934399 -1245535
43102 -1245535 -1535269 -1359719 -719533 -330263 -678360 -1279374 -1326854 -719960 -15456 321648
43092 321648 184224 -355255 -1004590 -1260707 -933784 -481859 -385209 -417482 -62748 551273
43082 551273 783803 476342 152877 171598 321594 411146 617578 979184 1122156 875838
43072 875838 677778 926423 1317285 1291375 837508 369353 66033 -137867 -103652 361945
43062 361945 950018 1035391 516239 -44798 -257811 -366465 -628589 -749737 -370898 241515
43052 241515 533602 511259 676363 1122995 1285134 809251 189930 117212 484141 560387
43042 560387 79037 -382303 -254239 244405 510603 437356 443712 735622 1006286 954674
43032 954674 708284 534128 428003 241723 2486 -166353 -286483 -407450 -378857 -65618
43022 -65618 279751 234119 -168573 -391889 -119986 294066 329885 125 -250349 -203943
43012 -203943 -89307 -130879 -174213 82965 620412 1029960 937837 408922 -136353 -391288
43002 -391288 -448101 -550462 -676996 -565622 -143928 289876 421225 293690 196848 294740
42992 294740 497666 613170 499016 145656 -275415 -524112 -557419 -574861 -676968 -631115
42982 -631115 -191520 457914 856799 842366 697465 683288 692827 504585 183024 31117
42972 31117 214068 578970 846964 900056 847857 833260 827928 699191 468957 355510 484139
42961 484139 719773 917274 1145207 1438442 1528766 1190866 758350 838390 1460778 1972993
42951 1972993 1959533 1811583 2044444 2423077 2278520 1548481 971461 1155771 1857359 2390306
42941 2390306 2492370 2506548 2797122 3259937 3497993 3318641 2876961 2366485 1798569 1198879
42931 1198879 807841 819327 1013621 967492 641252 435843 583758 818713 828565 722858
42921 722858 775049 941598 972476 855642 810609 901938 973900 962167 989860 1123493 1272176
42910 1272176 1371699 1456671 1498365 1368540 1046806 716049 567373 599600 653111 570914
42900 570914 328635 83537 56981 260830 395155 171323 -290452 -554317 -363581 116308
42890 116308 567315 865332 1088346 1298145 1416910 1312078 982206 633850 498053 561965
42880 561965 615861 606846 736475 1074938 1318831 1188643 879567 789625 922776 932255 697639
42869 697639 458869 365800 308089 276439 476108 906637 1202618 1130510 932923 924302 1032280
42858 1032280 1035774 997639 1097061 1213774 1079190 758730 588422 622519 513834 49470
42848 49470 -488330 -656444 -348243 193957 712268 1118582 1440280 1733283 2015258 2184044
42838 2184044 2049274 1562527 992083 732123 907285 1283042 1618340 1965204 2483979
42829 2483979 3075738 3434390 3469348 3433649 3533313 3635344 3559967 3511320 3968457 5175067
42819 5175067 6889347 8560641 9584092 9525372 8442067 7029836 6154053 6072657 6251103
42810 6251103 6006738 5178478 4110411 3185506 2527988 2051339 1650432 1352293 1293772
42801 1293772 1496328 1706646 1608388 1194515 772151 580237 568805 587260 606794 679636
42791 679636 820106 997880 1149703 1188305 1123047 1137573 1362762 1606631 1554780 1238917
42781 1238917 1023775 1087330 1221970 1242771 1267632 1426963 1593017 1620854 1623638 1771181
42771 1771181 1984959 2044259 1871462 1564737 1277404 1151247 1188090 1134485 758351 305542
42761 305542 324470 897366 1452201 1562979 1499191 1648901 1840161 1716742 1438657 1441484
42751 1441484 1716550 1894778 1911176 2040405 2357713 2693300 3053450 3534296 3850115 3549876
42741 3549876 2775546 2228899 2241153 2409590 2329466 2143216 2104694 2101735 1953890 1777544
42731 1777544 1705778 1602319 1412314 1457953 1960697 2530080 2599225 2235658 2070897 2445664
42721 2445664 3006012 3210290 2960507 2636012 2657873 3076210 3516260 3563658 3269041 3176272
42711 3176272 3751800 4899455 6157395 7233424 8170436 9093245 9990522 10686154 10867335
42702 10867335 10238309 8859486 7286532 6157621 5634017 5400097 5170340 4978536 4952296
42693 4952296 5036985 5066137 4976912 4843402 4768177 4824315 5054735 5459995 6012362 6712210
42683 6712210 7568521 8452945 9017212 8879416 7959425 6593350 5271561 4293318 3704148
42674 3704148 3459593 3474710 3524602 3323383 2828727 2323723 2068248 2016097 2031821 2200865
42664 2200865 2648068 3162806 3351989 3171624 2986665 3050489 3242828 3419790 3677562 4057264
42654 4057264 4273723 4032199 3452494 2907924 2552331 2263786 1981595 1820581 1827060 1836636
42644 1836636 1662835 1338848 1135648 1364755 2101402 3033140 3657253 3722155 3410307 3016595
42634 3016595 2581305 1999437 1382289 1063792 1218380 1645716 2004622 2165890 2282366
42625 2282366 2563903 3016226 3400163 3487910 3372361 3421326 3847018 4417641 4712011 4576404
42615 4576404 4184918 3722818 3210768 2637034 2064591 1551425 1118919 855546 889320 1157729
42605 1157729 1349355 1222359 893927 665040 629296 641737 648399 808100 1193689 1570555
42595 1570555 1653958 1479598 1323378 1306558 1288153 1147687 964144 861905 862925 956626
42585 956626 1133705 1279088 1246591 1156229 1380939 2047787 2767270 3105024 3144872 3301273
42575 3301273 3727185 4254616 4850954 5772999 7225997 9104483 11035099 12434834 12652396
42566 12652396 11461893 9445783 7543975 6188420 5181232 4335858 3735487 3317839
42558 3317839 2782507 2127591 1762309 1793562 1688926 1039340 239262 -54546 173220 400676
42548 400676 321380 18058 -404176 -847143 -1007092 -642064 -24809 308742 254518 187512
42538 187512 340240 560932 716377 903027 1151130 1297757 1306983 1409529 1760464 2192786
42528 2192786 2445152 2437288 2222205 1863801 1466725 1166853 1007543 940333 951011 1027841
42518 1027841 1030071 803055 434517 188391 172540 272612 395120 531790 598482 507733
42508 507733 435687 699587 1267675 1676146 1569404 1086955 601865 325896 297763 484260
42498 484260 698506 652719 316988 42588 109501 320967 296389 35469 -99344 72994
42488 72994 297103 236138 -97436 -370335 -308671 38646 408004 625040 727892 785621
42478 785621 723263 455667 116276 -41464 27414 120554 125295 206916 550752 1052179 1403364
42467 1403364 1435680 1273779 1154480 1135882 1004228 513320 -259508 -889984 -1028775 -758371
42457 -758371 -422852 -229107 -183561 -273055 -432191 -422082 -81030 304346 223052 -384559
42447 -384559 -973218 -1019327 -541860 79430 505583 544565 185987 -265365 -357762 -18919
42437 -18919 297408 183366 -228329 -535299 -572235 -395062 -20110 474509 771344 633704
42427 633704 330500 366289 783486 1080126 901480 514236 428995 737516 1012777 816311
42417 816311 182353 -424732 -592359 -343730 -8380 209352 381203 593357 754943 761644
42407 761644 672571 606224 611349 735926 1024826 1312510 1248280 745524 210581 66954
42397 66954 216049 259237 112430 48401 187212 306164 197279 -71034 -294029 -291613
42387 -291613 67832 708119 1178440 992989 274005 -258492 -152712 179209 13729 -710253
42377 -710253 -1307475 -1203453 -567659 -6911 137177 12638 -88520 -71249 -7759 52797
42367 52797 113321 144462 118721 115059 243853 440718 480843 266629 -27369 -181645 -179321
42356 -179321 -123034 -33634 119420 275495 319429 200257 -89718 -524964 -879300 -723998
42346 -723998 101709 1079682 1420574 957622 348766 268972 663894 987111 945847 728751
42336 728751 598147 559853 488720 374897 326148 405448 546232 604919 481454 234422
42326 234422 79572 189693 456769 550899 314227 19135 72091 477928 806451 763733
42316 763733 575591 621620 870807 963745 766736 513274 382578 276778 123317 77217
42306 77217 222929 331450 162426 -170263 -371610 -351904 -204979 44813 386511 615189
42296 615189 497128 134018 -97543 11041 313037 533010 474341 58107 -580241 -1050027
42286 -1050027 -1041809 -729794 -574487 -702771 -780230 -550098 -166634 120726 271506 265840
42276 265840 -27132 -500228 -645501 -158383 484850 524316 -64433 -533584 -423732 -173878
42266 -173878 -400935 -953056 -1121698 -640444 -9108 229107 140908 128990 278663 295609
42256 295609 15182 -327695 -411214 -214729 24756 131373 135309 143404 183236 194829 110385
42245 110385 -90383 -367297 -613924 -668555 -404341 111851 573401 660244 349462 -87508
42235 -87508 -410218 -578817 -559714 -224826 350140 724963 579874 229253 242786 599474
42225 599474 690578 243656 -255177 -294884 -50193 -5089 -212249 -355929 -328516 -301112
42215 -301112 -334199 -323918 -281209 -297340 -262820 21273 448609 673884 620870 594234 786926
42204 786926 969865 830148 419652 111139 204119 646350 1075455 1139210 852489 563904
42194 563904 463391 298173 -174787 -626104 -459722 325222 1003752 983597 443507 -48753
42184 -48753 -220117 -153589 53449 363889 657018 785447 740623 598053 380513 138351
42174 138351 55853 256022 556653 657690 564415 567892 734977 691610 134239 -619938
42164 -619938 -916913 -582574 -124434 -13433 -102597 -10335 233245 355999 464127 915401
42154 915401 1564541 1757481 1302786 886568 1142577 1777523 2097448 2026945 2045735 2371777
42144 2371777 2800514 3198058 3546299 3565493 2918191 1852568 1082989 900237 886380 645680
42134 645680 329694 236828 334304 439828 535538 660459 775380 927789 1263982 1691424
42124 1691424 1823003 1474869 973827 767414 942352 1290695 1613067 1770302 1653621
42115 1653621 1314056 989906 878920 1000155 1295679 1652188 1815747 1583989 1139897
42106 1139897 890291 924718 988333 1040337 1369564 1972451 2294503 1926006 1202464 758969
42096 758969 752784 859517 818095 657924 550542 698780 1209854 1864892 2221304 2157029
42086 2157029 2062617 2242284 2410270 2134852 1552485 1209733 1296523 1453004 1343082 1051293
42076 1051293 810525 630702 406899 261891 523501 1258673 1972964 2033007 1440854 913297
42066 913297 1015569 1506310 1831451 1936449 2094236 2182635 1819918 1182010 980323 1488429
42056 1488429 2203999 2645244 2880908 3072004 3124843 3098003 3356979 3966572 4471696 4644622
42046 4644622 4897708 5525154 6060616 5910278 5231215 4688060 4641505 4983675 5474565 5876912
42036 5876912 6051315 6227183 6883097 8127166 9530032 10704753 11603184 12169064 12347541
42027 12347541 12600007 13677319 15664887 18025349 20702058 24051460 27324414 28593413
42019 28593413 27077065 24450042 22903481 22915407 23852388 25471332 27350492 27860909 25552987
42010 25552987 21204821 17010592 14054383 11912524 10278874 9394822 9050016 8654540
42002 8654540 8300826 8512695 9079757 9371380 9577163 10324816 11300837 11623122 11367940
41993 11367940 11324646 11470424 11159929 10582954 10474223 10615034 10260765 9791165 10166033
41984 10166033 11010269 11169109 10916069 11507922 12785888 13558854 14189970 16192378 19330637
41975 19330637 22032883 24758739 29745100 37206586 45422226 54941766 68519059 86597527
41967 86597527 108591316 139598435 186948747 243812263 283403379 280222444 236385816
41960 236385816 179292247 133770837 104052575 82499300 65114201 52831143 44717803
41953 44717803 37808952 31629162 27613403 25173445 22292184 19062663 17179582 16553830
41945 16553830 15458495 13632799 12526557 12597543 12707621 12225035 11735561 11572786 11315346
41936 11315346 10828583 10416060 9978440 9263108 8750364 9036770 9588117 9404502 8688219
41927 8688219 8495196 8897416 8922448 8336288 8082965 8714189 9607070 10078805 10229574 10300065
41917 10300065 10080346 9366961 8350087 7273541 6272462 5664448 5783568 6412169 6967004
41908 6967004 7324165 7883374 8801686 9811081 10859593 12288689 14243683 16435983 18520555
41899 18520555 20160282 20765077 19860230 17801494 15521663 13540670 11849703 10689141
41891 10689141 10552001 11289402 12147306 12990357 14523205 16757434 18176009 17303682 14569488
41882 14569488 11740973 9850082 8545886 7306097 6300500 5835685 5721162 5659862 5825120
41873 5825120 6535920 7526057 7996361 7465105 6292271 5234650 4653632 4318178 3874221
41864 3874221 3277414 2734196 2402987 2265911 2208223 2144008 2116391 2288007 2730137 3224719
41854 3224719 3448326 3381835 3312661 3350156 3216984 2713215 2132528 1923051 2089502 2240484
41844 2240484 2149607 1973450 1929699 2016860 2076753 1939323 1500612 845273 306263 220789
41834 220789 567856 959795 1035377 798909 568086 634940 964339 1211411 1087241 701379
41824 701379 446471 556307 913571 1270420 1463981 1427347 1241327 1190429 1466476 1774855
41814 1774855 1599981 967322 534111 732698 1234065 1514344 1529261 1485692 1358063 1085907
41804 1085907 930324 1139511 1484068 1582615 1479559 1446197 1432623 1231424 1008553 1117497
41794 1117497 1477964 1658465 1509671 1229850 905456 528779 384528 797358 1479394
41785 1479394 1744198 1458768 1198786 1338973 1585223 1598669 1499741 1477098 1419674 1260646
41775 1260646 1223574 1373488 1338038 870114 345299 274606 566574 692181 442637 152113
41765 152113 208323 597209 922282 760924 98704 -514565 -422236 412442 1317039 1644568
41755 1644568 1385909 961809 696140 677666 868272 1079430 1012738 567596 432 -385589
41745 -385589 -564017 -645108 -600016 -347829 533 204451 165576 19339 2921 273174
41735 273174 740520 1059250 951048 560214 270747 158217 -59347 -441664 -591762 -243065
41725 -243065 253588 367853 88118 -164396 -150752 27430 290589 706091 1207391 1509713
41715 1509713 1444105 1188734 1032437 1009174 897622 570643 230826 194237 462794 684219
41705 684219 628553 509565 625072 862751 893624 733603 687604 768872 666123 367720
41695 367720 295855 611760 883247 748954 462810 402698 455498 355232 276651 529238
41685 529238 886465 822275 351319 88189 421526 1064767 1499720 1505018 1176226 746652
41675 746652 481730 507210 674983 757170 720165 622505 398304 50581 -93888 251050
41665 251050 778337 872945 476851 188165 388584 753539 837452 694727 606142 556844
41655 556844 376085 154228 127940 289557 464792 682785 1111156 1651474 1953123 1893295
41645 1893295 1744090 1752066 1821163 1784755 1750904 1903298 2112095 2113823 2092169 2680294 4146940
41634 4146940 5839342 6759706 6569067 5706942 4649839 3520278 2460108 1833928 1738494
41625 1738494 1691224 1220975 542931 236708 410263 630116 629403 623819 832189 1068792
41615 1068792 1011389 645204 263215 149432 357839 697780 883655 791628 579791 475066
41605 475066 507470 583922 706551 889763 955308 716787 351281 265360 542846 830847
41595 830847 858656 772778 833688 1060279 1335168 1607893 1798470 1715617 1300640 816093
41585 816093 591834 669843 836049 896062 793933 574141 357914 265330 265724 213300 98095
41574 98095 101513 310429 564334 723535 900743 1238305 1608880 1758171 1658933 1530422
41564 1530422 1559444 1745894 1951771 1971207 1651859 1107615 728815 812766 1231514 1593067
41554 1593067 1661188 1494117 1265911 1105173 1042446 987238 830231 656024 703241 986065
41544 986065 1159401 969416 632000 479583 429532 191181 -130395 -120866 245199 486812
41534 486812 340788 157797 334981 736462 996606 1090147 1215336 1325865 1215240 976020
41524 976020 937964 1120277 1146783 836367 530790 608329 928360 1056831 905695 825952
41514 825952 1081289 1538074 1979558 2469219 3186054 4031151 4632194 4710698 4267802 3456007
41504 3456007 2507971 1790264 1599971 1747524 1623860 947055 225865 140368 616195 952115
41494 952115 829534 677049 880268 1141290 988103 536937 249679 152115 -132248 -599542
41484 -599542 -710102 -210697 374009 416800 21096 -228925 -139391 -54062 -176254 -229488
41474 -229488 48856 453061 618590 542903 494034 551545 574146 561849 679529 860195
41464 860195 750253 243380 -228157 -219645 118592 295422 203064 190025 439730 703985
41454 703985 762106 756369 867026 979449 934790 848112 896267 1024771 1170484 1528927 2195762
41443 2195762 2732143 2592186 1933640 1492480 1592623 1773728 1552290 1080090 785536
41434 785536 745773 733485 612753 394584 123018 -38420 162402 692618 1130330 1205602
41424 1205602 1190605 1432409 1752369 1704709 1239957 697626 293501 42877 56663 431342
41414 431342 907456 1113579 1117075 1250150 1425116 1199891 594304 229183 441476 814500
41404 814500 869267 704043 596078 464824 200326 122650 551223 1158654 1317322 985494
41394 985494 735426 912126 1228283 1273599 1036002 752593 508052 186016 -271241 -685491
41384 -685491 -758101 -389070 146040 456195 467135 415596 423728 378429 296804 412251 687672
41373 687672 658523 121494 -373017 -176729 573715 1239637 1634483 2089532 2645331 2838360
41363 2838360 2428414 1789447 1346518 1056373 707890 386377 330833 536993 757264 789046
41353 789046 623340 410891 343830 443634 466399 207154 -123731 -94524 355604 809343
41343 809343 917406 757683 567387 433875 387102 488695 636015 549330 183362 -70541
41333 -70541 152783 674974 954724 701220 126554 -345362 -466314 -294920 -56264 103252
41323 103252 202483 249907 123215 -206438 -468259 -397990 -175107 -207221 -496064 -610497
41313 -610497 -344241 8486 154420 180003 259547 358212 418715 493035 508173 279511 -57300
41302 -57300 -69072 280221 451683 179782 -34345 254884 653250 615072 485859 1040463
41292 1040463 2188137 2981134 2911531 2434330 2099263 1885472 1620438 1421396 1397094 1391547
41282 1391547 1312528 1297234 1313493 1048673 482663 125045 320653 707145 762581 549909
41272 549909 468133 544126 479438 234905 63411 30088 -25126 -50654 224956 765350 1088342
41261 1088342 833041 190243 -383870 -654654 -679237 -610840 -589223 -665529 -715936 -574448
41251 -574448 -313105 -172133 -124446 194346 916028 1578714 1646865 1193308 713300 419060
41241 419060 144843 -124348 -130778 166841 437874 486560 514939 668917 713143 442265
41231 442265 63083 -168918 -368436 -680155 -817197 -435037 212371 499362 243425 -142001
41221 -142001 -240270 36260 601645 1218369 1449600 1089218 575836 464878 592914 389606
41211 389606 -75088 -150688 245623 437224 170579 65319 475967 814771 595639 295856
41201 295856 424272 511452 -37320 -720127 -658091 -112140 -111259 -744227 -990270 -331588
41191 -331588 516412 744662 449313 152970 23926 -63909 -194676 -403619 -625557 -562591
41181 -562591 -27966 592378 740084 501819 428704 609982 651578 539744 656346 858118
41171 858118 520347 -251943 -478434 189451 809600 610375 168598 327265 770109 672609
41161 672609 167788 75980 512724 795520 578843 160054 -259761 -742938 -1049259 -745307
41151 -745307 9572 517322 518399 451395 598957 650147 351163 -13195 -95381 47134
41141 47134 248367 548882 914423 1064347 934975 951780 1439932 2059425 2307283 2428455
41131 2428455 3284350 5191836 7271313 8217478 7573417 6018884 4492872 3358591 2524390
41122 2524390 1999518 1889853 1964286 1749190 1181401 735566 710434 818057 753030 714641
41112 714641 947224 1172462 1035188 811605 1025241 1523179 1622782 1151781 661170 516865
41102 516865 453977 252225 214194 586994 1007746 1001533 709837 642138 872519 938117 532734
41091 532734 -40636 -217995 185531 781410 1027047 798540 479923 445651 591000 548787
41081 548787 268284 106432 328682 753409 958603 699882 124879 -299479 -159072 426495
41071 426495 830607 676802 381736 557242 1041003 1079264 461472 -142484 -140745 249712
41061 249712 501913 510663 471857 431594 341702 270554 223957 31180 -290773 -372561 -28825
41050 -28825 360913 393951 249874 294035 366007 36805 -590160 -949732 -862257 -728095
41040 -728095 -799924 -808001 -494529 -53662 215934 327010 400774 364734 169190 64131
41030 64131 298474 668541 724123 405793 148454 271476 547611 554682 253067 -41731
41020 -41731 -159021 -224164 -273548 -70277 465748 913107 807710 327679 98901 311027
41010 311027 477523 222354 -138542 -115250 195370 290591 29042 -219132 -165692 28137
41000 28137 60569 -102331 -249542 -203880 15980 239099 311183 246382 172477 112317 -48446
40989 -48446 -309146 -449068 -318002 -66003 93911 187769 333338 457988 434767 372801
40979 372801 471348 666549 725017 624663 526435 416190 128200 -267057 -451532 -294008
40969 -294008 18305 323492 613407 760293 532274 58484 -114800 288302 840490 983810
40959 983810 784435 748382 1042987 1297962 1157743 697652 234802 -26216 -76516 -11128
40949 -11128 53440 70873 126881 334306 642218 828186 723299 408484 155872 168319
40939 168319 370720 488038 371450 188334 175559 261386 148867 -192781 -383010 -137223
40929 -137223 293387 429680 178365 -131610 -255992 -279671 -337016 -385480 -378802 -425443 -583065
40918 -583065 -655724 -424076 -2995 263829 261788 221782 311735 362468 196062 23456 173393
40907 173393 481066 371171 -288352 -797166 -443231 509820 1091373 819130 195140 -41044
40897 -41044 268596 784908 1177713 1266579 956023 384300 -25497 14325 278383 338492
40887 338492 143097 -4685 47010 159795 255130 454862 801278 1125804 1289989 1310080
40877 1310080 1166528 772021 264871 53955 338901 768020 816002 398076 -97110 -297560
40867 -297560 -159795 146546 422544 475381 177871 -374262 -839788 -888915 -517904 -73684
40857 -73684 80604 -74129 -249636 -261439 -257841 -405865 -506297 -221095 344224 648513
40847 648513 429806 84669 110967 445384 647004 530425 278105 60106 -102112 -164148
40837 -164148 -99430 -82772 -298687 -581186 -591551 -353652 -222451 -276458 -182145 197519
40827 197519 503944 431867 178165 42565 -50230 -260152 -395950 -228678 -1364 -120053
40817 -120053 -475186 -587945 -378650 -265845 -460785 -668815 -625871 -482564 -463459 -532092
40807 -532092 -612583 -799929 -1105465 -1287529 -1186913 -981790 -883872 -839862 -762003 -754561 -811344
40796 -811344 -590516 100028 814142 934578 512854 161378 144291 87783 -313860 -800780
40786 -800780 -995581 -958597 -967104 -995619 -780414 -295788 162178 377161 449852 560876
40776 560876 665254 545928 120174 -401777 -690035 -598183 -260579 97643 373032 571548
40766 571548 677170 645602 496915 305810 110275 -73612 -166907 -81453 129524 283621
40756 283621 255814 70277 -187062 -437201 -582278 -527384 -260145 161800 673650 1144526
40746 1144526 1318356 1019292 429631 -47625 -257552 -412608 -660599 -776102 -470379
40737 -470379 156153 686886 836721 664495 415537 311289 436146 685602 862248 914184
40727 914184 981298 1099848 1030249 597976 77196 -68911 190204 390351 190546 -216006
40717 -216006 -423696 -315143 -72751 139220 302670 432687 504079 479022 329035 71990
40707 71990 -169344 -246310 -191173 -212849 -370195 -400905 -80430 357216 444039 123420 -138177
40696 -138177 -8049 230517 119328 -228928 -204923 442659 1168896 1260173 698748 125977
40686 125977 18445 202867 253493 92583 -16374 79408 239598 277911 160762 -85101
40676 -85101 -448386 -800791 -873042 -567565 -210742 -265671 -772234 -1261233 -1307287 -1021987
40666 -1021987 -866460 -1060469 -1350146 -1376936 -1123986 -881015 -829808 -828499 -672659 -439826
40656 -439826 -392380 -555723 -625575 -423188 -237951 -443737 -864858 -890309 -311694 300181
40646 300181 309091 -143997 -365545 -57496 364899 437951 243514 154850 279536 420557
40636 420557 428504 330474 187923 54406 27268 125598 143970 -141578 -597137 -781407 -450251
40625 -450251 170609 707058 1049930 1311518 1532714 1643851 1643754 1599088 1460220 1075259
40615 1075259 462377 -71976 -194872 130923 636004 974733 925499 503791 14820 -109181
40605 -109181 269299 749849 780387 325672 -61305 68687 512581 735323 558305 272268
40595 272268 164718 232782 366738 534902 699902 769647 738138 710196 706721 613498 397331
40584 397331 189585 74071 -2500 -15442 186740 552088 711008 446993 68896 15893
40574 15893 258751 420574 352815 207971 20512 -340284 -760943 -867434 -584435 -350909
40564 -350909 -539146 -922837 -992564 -635636 -237686 -171895 -394796 -555184 -388991 14261
40554 14261 314368 303511 145098 154488 416232 763440 1048411 1205296 1112624 713967
40544 713967 289058 249379 566498 750848 537711 223402 113564 38265 -245739 -516410
40534 -516410 -399663 -799 245849 229132 193919 187331 -31955 -480286 -802005 -778444
40524 -778444 -606375 -494504 -320119 75172 499462 592508 277793 -160698 -387545 -293954
40514 -293954 -51238 40661 -150210 -414247 -450824 -281478 -192812 -240252 -113591 351789
40504 351789 822541 889127 629849 440892 435486 364339 104624 -133441 -186751 -225853 -462637
40493 -462637 -759697 -774869 -437090 -56355 85674 88052 248054 603262 829865 655399
40483 655399 246780 39879 208548 461640 427772 116463 -123699 -45528 237715 445343
40473 445343 463452 410376 421289 468222 431911 301834 225142 329781 544958 647185 478223
40462 478223 98631 -246433 -292008 56041 622053 1078627 1229582 1151021 1005273 809239
40452 809239 525351 300122 362555 644807 764876 544714 330172 539174 1016493 1166368
40442 1166368 750916 238881 183881 474783 487271 -61992 -685430 -674800 50432 807868
40432 807868 861721 160814 -666508 -970913 -655133 -133312 147657 77741 -137991 -228740
40422 -228740 -63127 276369 528870 420765 -80951 -658887 -877440 -582580 -38457 353361
40412 353361 416705 262716 86272 1499 41046 197555 418173 594105 584969 286634
40402 286634 -243040 -699281 -704482 -204004 389593 611873 454927 274871 250262 223408
40392 223408 123603 196901 586099 942734 798015 218116 -240943 -233885 9995 90081
40382 90081 -61956 -233671 -300378 -329102 -373562 -362367 -253681 -199372 -437124 -986943 -1518592
40371 -1518592 -1618466 -1214110 -664673 -385827 -441746 -557879 -476600 -220645 -19416 -23703
40361 -23703 -104888 23635 419197 711630 480310 -161556 -610817 -522735 -263408 -381527
40351 -381527 -824454 -1009833 -612997 42557 422298 348852 47467 -181326 -226196 -214263
40341 -214263 -368702 -758247 -1185427 -1385153 -1286194 -995911 -624977 -261438 -5581 153338
40331 153338 386188 732798 887084 569672 28732 -189681 44496 340472 431267 503306
40321 503306 741919 955968 912961 733508 652834 619923 445540 195716 127930 296440
40311 296440 475953 475135 345102 251015 234560 139596 -199184 -650273 -785252 -382941 167886
40300 167886 299607 68432 91641 598486 1049592 958051 601065 500738 604221 518417
40290 518417 282812 295134 574143 691713 469908 225281 217532 305209 282263 149710
40280 149710 -103173 -594600 -1210547 -1512585 -1256609 -748797 -417589 -247824 60769 525459
40270 525459 811550 714509 430482 272651 304684 362551 331141 267846 262825 285213 237046
40259 237046 108972 -19822 -122258 -221302 -215168 97458 666597 1030811 761405 20059
40249 20059 -565760 -595187 -249601 65653 186620 181008 87132 -113108 -328825 -380992 -243394
40238 -243394 -131170 -237247 -434412 -389159 -4417 416903 573121 559352 629148 705180
40228 705180 501332 97005 -79490 45957 14403 -370572 -574570 -116021 595186 792817
40218 792817 452813 208172 328780 486967 505918 611190 819779 778042 446983 310092
40208 310092 576860 763650 461325 -10094 -171706 -129881 -211053 -254528 104170 698707
40198 698707 1005590 915539 760846 675682 509635 333359 422570 676653 636873 236756
40188 236756 -7834 211042 504642 394151 -17540 -344585 -534260 -756449 -931503 -839049
40178 -839049 -578308 -477744 -573474 -576373 -386738 -265186 -393319 -593960 -634574 -532903
40168 -532903 -400838 -243927 -107443 -166497 -411218 -458718 -8572 650477 947555 779604
40158 779604 580464 637789 737224 591223 256918 -48532 -233603 -231761 79292 594731
40148 594731 876440 630706 102213 -280000 -439439 -529407 -500714 -200630 229471 477261
40138 477261 520366 575618 646191 537129 303907 247078 416345 536538 493529 475334 529741
40127 529741 401541 -31596 -522049 -794080 -793440 -520874 -20561 379193 292247 -110275
40117 -110275 -218498 102019 298001 94944 -3103 355951 612830 166370 -514639 -493372
40107 -493372 224825 760759 716873 591428 778760 971387 800280 419271 148118 28152
40097 28152 -3179 71958 129879 -80558 -466870 -553136 -182647 140656 -53251 -506633
40087 -506633 -615720 -253492 179314 359917 324572 227757 157368 181159 315605 432112
40077 432112 391536 281221 343557 638041 911040 858442 456562 5056 -138881 115748
40067 115748 513844 712927 611717 381989 215775 146797 119392 108479 116635 129179 129795
40056 129795 140615 236267 505863 928061 1273142 1279757 1012649 862447 1033859 1234428
40046 1234428 1115158 822069 749171 872096 786339 417429 213277 465342 838654 829222
40036 829222 404943 -59396 -272766 -225877 -73807 -33488 -265625 -685631 -1005733 -1076548
40026 -1076548 -1026665 -966591 -789962 -440247 -136801 -83235 -119715 64086 471744 801361
40016 801361 837538 630088 344059 135449 123822 284691 396993 286884 108984 197053
40006 197053 615749 1032723 1104661 874828 691132 765420 910241 784760 376676 88142
39996 88142 236034 611881 756182 573543 373734 332551 293427 186973 229487 477643
39986 477643 566427 240507 -141903 -61318 382394 596795 342340 -5868 -97836 -77613
39976 -77613 -209898 -358472 -151153 447324 1003963 1103962 810626 537473 530143 625548
39966 625548 566686 386346 291981 267700 73201 -333224 -652053 -638443 -406314 -199925
39956 -199925 -82593 -11411 -9530 -78531 -119317 -101057 -107905 -76061 224140 716518 859644
39945 859644 326359 -412602 -621090 -247572 111426 85910 -129725 -304120 -518467 -835365
39935 -835365 -1015755 -805107 -305047 87357 18557 -523495 -1111814 -1192466 -707232 -240325
39925 -240325 -251106 -393853 -77088 489885 492090 -218161 -767278 -441482 397986 953494
39915 953494 1016094 898667 782135 662285 659725 857345 1003566 839107 568189 554488
39905 554488 689424 564086 205279 105838 456831 840595 854785 625034 463014 365277
39895 365277 170346 -19069 57925 357546 501935 278315 -64652 -149394 52679 251036
39885 251036 268606 219264 217032 146711 -105416 -369129 -391179 -220396 -105279 -60486 118455
39874 118455 388946 416212 138746 -27828 175206 370506 89887 -459740 -648210 -326634
39864 -326634 3318 -43704 -231205 -115123 346671 795197 901222 643376 269374 80212
39854 80212 171051 332808 277495 -35328 -369680 -467447 -232355 256518 752681 935704
39844 935704 699633 305440 43945 -179911 -642366 -1211125 -1328250 -705453 257630 923492
39834 923492 1062629 886421 651262 448207 259953 38518 -210992 -340461 -187120 127632
39824 127632 227957 -45262 -398076 -508905 -483274 -619623 -887067 -968914 -755881 -460102
39814 -460102 -233888 2339 278732 415538 287537 31943 -165619 -327246 -557615 -779952
39804 -779952 -776637 -464623 -18236 278072 265731 52423 -66343 87719 340934 372728
39794 372728 174589 96620 338481 636247 670833 571890 675209 895678 776428 219683
39784 219683 -257074 -209641 133197 275861 206329 326054 741006 1072581 1029137 767386
39774 767386 526249 245024 -196128 -606051 -673511 -405598 -86209 126458 273071 314271
39764 314271 121939 -186896 -231416 142813 587350 673896 434517 261077 369244 589607
39754 589607 658294 515324 295281 161848 173053 222744 139047 -76743 -189801 -47064
39744 -47064 146047 87135 -137938 -120347 282189 725027 880455 878956 1014289 1222074
39734 1222074 1163477 746967 273446 40226 13859 -49878 -296341 -620822 -759656 -567372
39724 -567372 -256652 -228750 -541781 -740498 -459496 -10996 6304 -416015 -688027 -525468
39714 -525468 -335571 -490475 -714106 -583091 -272837 -317001 -812332 -1323430 -1485205 -1279946
39704 -1279946 -783499 -97115 432655 382338 -185642 -659769 -573281 -117024 206664 204617
39694 204617 56281 -64063 -168423 -289208 -314318 -59857 501559 1110404 1416793 1376716
39684 1376716 1312909 1435273 1494929 1206765 840952 930228 1416394 1622028 1206872 625920
39674 625920 372481 277070 -21486 -340456 -261295 74493 90409 -353676 -746341 -636150
39664 -636150 -133818 365821 588484 433038 -15765 -407012 -366334 50348 395533 401493
39654 401493 241867 154897 128965 91964 90327 89927 -107695 -511708 -747446 -487710 82103
39643 82103 470394 427045 90831 -265277 -430032 -330835 -126559 -111228 -348072 -548676
39633 -548676 -495393 -362605 -349496 -241273 241040 806596 841125 311157 -102333 52264
39623 52264 388995 322899 -52803 -140939 297502 859947 1044160 766407 324640 77577
39613 77577 188663 511792 704646 577550 307530 186695 236465 258638 200278 205143 289510
39602 289510 243695 -35623 -334028 -382005 -166664 146604 436059 604253 495452 73785
39592 73785 -370096 -425512 -25708 434043 499193 103475 -410233 -655058 -556646 -361369
39582 -361369 -298614 -285416 -65185 374566 693947 587286 129037 -369463 -695281 -793622
39572 -793622 -663962 -400271 -210194 -176112 -99205 199619 543484 630194 486794 370647
39562 370647 299803 73000 -250281 -318693 -35190 257972 291597 216633 273179 447499
39552 447499 634609 804841 824217 481796 -73759 -325842 -116565 32700 -289736 -699423
39542 -699423 -633394 -286903 -279442 -609177 -664244 -233313 190223 205123 -11212 -162465
39532 -162465 -214573 -119665 307415 963999 1358499 1220456 839425 563627 370580 193344
39522 193344 210945 431226 399168 -179124 -800891 -691455 155772 934984 991201 441735
39512 441735 -156005 -411176 -328966 -188563 -246977 -447075 -501829 -376840 -443228 -881967
39502 -881967 -1207694 -852472 -89925 186706 -327948 -904517 -768500 -90724 365857 280184
39492 280184 16126 -47818 2860 -106383 -386590 -585815 -504108 -163713 252934 500668
39482 500668 371783 -111530 -579255 -582130 -99426 368149 375611 74049 -49926 128470
39472 128470 252389 62411 -247548 -368322 -270295 -86660 147558 437861 712011 945511
39462 945511 1211848 1440826 1371737 969012 622927 635862 739736 486039 -70100 -491547
39452 -491547 -643837 -795689 -1048781 -1127418 -848439 -426121 -134627 67576 398791 897608
39442 897608 1326008 1355604 862904 141423 -281057 -213617 -58558 -261693 -678190 -825355
39432 -825355 -605224 -326871 -113482 172700 431725 374242 189339 510857 1424191 2107130
39422 2107130 1890622 1171664 751397 686687 432489 -136930 -545133 -512520 -324446 -286738
39412 -286738 -290851 -106499 234377 543281 744005 878759 987579 1085125 1166744 1201333
39402 1201333 1193557 1219567 1293317 1265324 1014873 695721 608771 834625 1141263 1252200
39392 1252200 1083596 739793 395809 166766 12632 -171341 -321168 -216092 164479
39383 164479 493766 501665 338773 289473 306425 157618 -98548 -168745 2825 203286
39373 203286 372502 643851 931426 925401 631664 476942 643224 696196 217353 -490134
39363 -490134 -730096 -295050 348577 679633 585596 227067 -221246 -598532 -768524 -740232
39353 -740232 -654314 -574147 -413370 -142547 69658 54327 -98402 -134051 26479 200755
39343 200755 245120 278100 463494 688527 684665 452194 318555 504817 865119 1169244
39333 1169244 1389577 1513523 1337472 780605 229466 159340 462717 570871 282825 50178
39323 50178 285447 770712 1017310 937451 845583 936428 1046054 897461 404707 -244410
39313 -244410 -711813 -779638 -568048 -395083 -388391 -391678 -292564 -204140 -202629 -139172 85277
39302 85277 278137 244501 149063 300569 678308 957677 953321 772836 556293 313765
39292 313765 27518 -298405 -692047 -1119434 -1356530 -1183353 -715998 -318524 -159947 -100741
39282 -100741 -70221 -267052 -804207 -1365565 -1479389 -1081561 -594057 -409930 -449513 -320598
39272 -320598 150026 669929 797263 410620 -219780 -747415 -980490 -846872 -382530 151721
39262 151721 363129 117769 -283205 -453007 -312430 -22209 264540 382016 105602 -561230
39252 -561230 -1181140 -1285644 -917455 -493891 -243941 -122820 -167003 -467769 -789608 -707798
39242 -707798 -245197 82278 25834 -43742 213830 556525 612466 492719 504053 548491
39232 548491 327512 -32443 -105955 129304 249117 99291 38727 276997 430276 80775
39222 80775 -522205 -729885 -357937 71818 -24704 -667572 -1391906 -1739701 -1563616 -1013690
39212 -1013690 -408089 -59622 -58571 -204604 -252336 -208100 -252924 -395575 -421755 -253767
39202 -253767 -113567 -158311 -179452 77995 471849 651465 562703 414564 252488 2100
39192 2100 -113462 254622 897963 1121645 754524 528755 1029946 1748376 1750704 986578
39182 986578 295838 250022 588368 797159 701766 385920 -29518 -382554 -562898 -681049
39172 -681049 -861125 -894687 -490686 130413 369821 90153 -153572 66534 440374 431745
39162 431745 43840 -284689 -300196 -101650 143874 339006 422797 456246 628606 952443
39152 952443 1093609 765072 173841 -202358 -206309 -90840 -64576 -45265 99490 319911
39142 319911 483416 529976 438214 172828 -223076 -546422 -545507 -142970 454312 888428
39132 888428 939943 694436 390318 145067 -70576 -243015 -302675 -329156 -536766 -925205
39122 -925205 -1133497 -831197 -150672 434501 589790 350790 -33025 -329090 -437272 -397833
39112 -397833 -287300 -101817 161951 328020 155923 -302153 -699447 -864527 -998998 -1222306
39102 -1222306 -1231900 -745517 -45698 329191 308569 268437 331250 165970 -385985 -884531
39092 -884531 -757599 -8143 754752 924097 440845 -207359 -492052 -376695 -283950 -485058
39082 -485058 -719148 -623186 -328111 -253103 -413622 -399090 -73632 185079 121462 33588
39072 33588 273360 663045 778208 580724 388478 353466 347470 313212 369520 526455 583361
39061 583361 394539 33906 -356326 -680871 -802419 -567652 -57327 364014 422817 256393
39051 256393 190027 274279 249993 -31637 -361553 -425967 -164755 213880 460345 436928
39041 436928 181160 -50830 60973 516204 876293 755573 332459 99913 203889 395828
39031 395828 587075 955309 1410561 1505501 1139911 835808 927526 978186 538451 44854
39021 44854 238977 944779 1227520 729920 78836 -141123 -90327 -121527 -179508 -98888
39011 -98888 1628 -36965 -175947 -435165 -943633 -1479131 -1463292 -769347 -53747 130857
39001 130857 83293 319436 643334 504162 -15043 -285715 -123401 -30294 -380194 -889881
38991 -889881 -1051152 -722749 -172190 207472 164402 -212503 -549898 -599064 -489376 -413398
38981 -413398 -292189 -47462 46471 -280616 -746891 -809009 -428249 -75976 -7303 -8063 116383
38970 116383 274439 381758 485954 515587 324266 71848 136529 541350 892945 1000816
38960 1000816 1093389 1259560 1178364 681913 146521 -17478 90029 161934 204081 383487
38950 383487 627747 760308 828829 932587 907484 572157 160073 104266 425811 687637
38940 687637 579463 264839 102127 245039 573773 861042 964316 945311 977182 1063545
38930 1063545 959281 511618 -31528 -258727 -92856 147741 179941 62493 31238 174763
38920 174763 360129 416401 310459 129636 -60567 -258024 -405578 -365228 -134924 24545
38910 24545 -124905 -468109 -723567 -874575 -1092083 -1268469 -1051033 -435228 97774 237820
38900 237820 266433 565863 1046539 1367773 1431818 1319215 991795 439165 -71820 -270773
38890 -270773 -266598 -319930 -389522 -266510 -24284 45718 -146191 -474856 -874649 -1247800
38880 -1247800 -1251879 -657907 146858 509494 357829 203506 289101 301386 67227 -50176
38870 -50176 245645 655652 741469 563930 458192 410870 97302 -530099 -1045088 -999970
38860 -999970 -405635 276499 564166 394216 124427 37679 -35252 -384380 -840091 -916887
38850 -916887 -547435 -232307 -328736 -622220 -801262 -903568 -992040 -840175 -375521 -64385
38840 -64385 -327792 -838459 -966978 -745225 -755962 -1125106 -1305440 -1001324 -691321 -915531
38830 -915531 -1484256 -1759716 -1449842 -808823 -248335 -24273 -155601 -396602 -376572 36632
38820 36632 567696 835901 723872 369693 -37211 -335007 -443050 -473788 -613318 -766035
38810 -766035 -565296 63666 625491 648626 330315 199879 305977 217693 -204802 -543290
38800 -543290 -428569 11606 456674 748755 770811 390242 -194954 -424569 -53493 424747
38790 424747 416374 42035 -124323 62150 208783 88752 -70618 -62294 -3981 -46064 -160174
38779 -160174 -332586 -584754 -677614 -227325 660424 1274811 1128196 577893 293783 395666
38769 395666 496454 368738 138269 -61882 -220016 -265335 -97258 212888 507765 771669
38759 771669 1018221 1061502 724733 209238 -84033 -69562 5699 9034 25507 46201 -42454
38748 -42454 -128985 57948 483177 795297 861095 891680 935791 732545 272903 12958
38738 12958 197037 394469 115428 -457564 -789351 -749217 -567676 -268405 312232 1041128
38728 1041128 1554077 1807955 2096601 2466539 2561482 2165752 1522970 974917 613270 421830
38718 421830 426105 514296 412541 74742 -136850 97927 611100 989706 1106863 1143795
38708 1143795 1182081 1064224 671964 120823 -380104 -707371 -799892 -587451 -63422 591787
38698 591787 1050681 1071065 704222 232534 -126616 -391818 -633676 -732570 -511000 -78172
38688 -78172 205730 192082 141814 308443 538122 534618 376506 440182 820684 1152768 1107084
38677 1107084 796384 529660 392148 297813 283043 431211 553325 285424 -389251 -983194
38667 -983194 -1062757 -783866 -635254 -759730 -829534 -606774 -307640 -226775 -230221 58124
38657 58124 604701 837724 343562 -507140 -898731 -507751 150887 397156 177910 -19779
38647 -19779 96661 288713 215392 -90576 -343069 -410174 -387185 -363903 -336645 -316268 -330600
38636 -330600 -327786 -252857 -212583 -364664 -614611 -638250 -305045 93693 175058 -85039 -351723
38625 -351723 -307309 66070 509873 706461 527536 143740 -136559 -154939 16443 236771
38615 236771 394547 362761 83372 -229123 -202991 216497 607149 581806 287180 150022
38605 150022 270214 375032 313811 250683 304556 309683 107043 -135728 -121177 140341 294987
38594 294987 83008 -312961 -457222 -178597 210504 291824 59325 -106446 29409 280640
38584 280640 392128 420910 542275 666053 573885 373094 459264 952758 1457363 1521739
38574 1521739 1141996 657880 303456 32982 -278322 -607044 -768175 -599454 -183744
38565 -183744 143169 110188 -173440 -354582 -292348 -201750 -292156 -465073 -503479 -390690
38555 -390690 -245072 -44459 344862 863540 1195581 1105421 728135 427201 410732 557076
38545 557076 590422 366612 -1604 -244733 -166052 162020 420309 341188 15480 -199088
38535 -199088 -137375 -50750 -217328 -468548 -385459 71455 464117 480727 298058 175945
38525 175945 27566 -324161 -729996 -903857 -851532 -766624 -657122 -453932 -350783 -574747
38515 -574747 -864148 -669446 52800 698613 803142 558178 375957 332781 280855 178600
38505 178600 47945 -138657 -312915 -309771 -192097 -259897 -521835 -537363 -115359 198967
38495 198967 -196586 -1045333 -1512858 -1254181 -688848 -265198 8717 214531 210227 -82294
38485 -82294 -407776 -468464 -303422 -172324 -190672 -258394 -272470 -250109 -238455 -194513 -18884
38474 -18884 265650 424073 234782 -170851 -374753 -171891 187827 391709 465599 562911
38464 562911 596388 420994 211503 248989 413777 321192 -46920 -285026 -194692 -27446
38454 -27446 39865 235459 751403 1324224 1557418 1420776 1159096 913221 701970 604210
38444 604210 671344 761292 703538 558856 522475 648595 840413 1020142 1143858 1146703 1035943
38433 1035943 937485 903848 814138 633957 599184 890832 1263794 1301339 977438 671032
38423 671032 641092 780533 912168 1028305 1137750 1130823 956855 769249 732711 780124
38413 780124 697813 417531 132881 117880 447261 897422 1155554 1136041 1010732 908952
38403 908952 760826 550424 503488 751929 957565 649094 -66422 -513091 -293791 194806
38393 194806 295852 -105490 -551042 -616427 -312326 33417 102326 -161114 -501492 -619594
38383 -619594 -545374 -592017 -853414 -983470 -680851 -180930 34276 -114205 -269693 -192044
38373 -192044 -4034 113449 140138 78883 -80690 -168941 75534 576709 882690 767197
38363 767197 608577 911972 1661951 2422173 2882733 2981771 2658849 1940876 1258705 1205936
38353 1205936 1809226 2388938 2370666 1951779 1689910 1677973 1522844 1053375 618115 570981
38343 570981 798883 978811 1068653 1243457 1454772 1410424 1071634 879499 1272786 2132959
38333 2132959 2942432 3427271 3808736 4436358 5441264 6830391 8669194 11010148 13842649
38324 13842649 17280993 21516638 26189064 29934801 31111707 29224919 25393020 21246207
38316 21246207 17618426 14482368 11759771 9650531 8209104 7112253 6069801 5179635
38308 5179635 4658416 4444666 4330605 4328524 4578350 4927678 4943062 4439641 3729508 3182089
38298 3182089 2768298 2271002 1759393 1521227 1576962 1599920 1376903 1058824 858490 783174
38288 783174 810210 1029999 1372721 1450113 1004053 357144 65892 215048 415002 447552
38278 447552 499499 697178 822622 683268 454566 427602 630896 901935 1145890 1322351
38268 1322351 1331273 1120220 816115 606059 567528 683726 874173 947798 749360 455212
38258 455212 456080 793076 1020728 866903 697285 962866 1465284 1636556 1378834 1122825
38248 1122825 1120637 1190363 1181093 1183379 1162905 858780 250636 -263364 -381594 -262472 -161483
38237 -161483 -40272 206318 449452 567587 732289 1110019 1473103 1463357 1116544 796369
38227 796369 715347 847561 1206682 1816607 2423639 2628861 2382358 2034707 1841664 1746171
38217 1746171 1721460 1928630 2328873 2507606 2206028 1753134 1592368 1588115 1270608 689778
38207 689778 489161 991695 1666701 1795723 1362606 947676 925502 1108934 1103990 715284
38197 715284 39708 -564181 -623172 38049 985219 1519777 1386726 932035 568920 386290
38187 386290 328300 405279 559795 612699 533750 521491 647266 694851 544379 404042 409500
38176 409500 328439 8394 -203960 53069 501035 582346 325093 263694 527934 616875
38166 616875 207787 -341988 -535592 -373163 -190194 -152264 -145661 11788 380517 764130
38156 764130 771691 266771 -300395 -379496 -105622 -119999 -566066 -838290 -520012 9420
38146 9420 234821 253637 434965 750135 914204 875903 725732 417898 31651 -1238
38136 -1238 545697 1155322 1153579 668145 419855 653206 879946 704150 328006 115499
38126 115499 134571 284498 468378 489617 152522 -374379 -636245 -493125 -318910 -426115
38116 -426115 -615701 -537945 -232830 -15919 13093 47172 197412 296634 164356 -59989
38106 -59989 -2403 479742 1029042 1159919 866920 597951 564142 440725 -9193 -386521
38096 -386521 -180389 388255 595203 237093 -109855 52281 497054 676255 407574 -60729
38086 -60729 -418896 -529773 -447818 -316467 -146140 257559 939605 1480625 1398427 833651
38076 833651 419079 435127 555294 524896 562123 834496 1035823 882852 658924 797166
38066 797166 1154916 1172546 659481 19888 -282883 -153878 250283 756745 1192377 1365086
38056 1365086 1183047 772620 427759 397581 664257 948162 1005443 870942 703311 511364
38046 511364 262148 148557 380376 701275 531576 -257045 -1063958 -1259006 -866611 -353647
38036 -353647 -26296 123092 217174 393946 718116 1002632 929539 507925 137652 28149
38026 28149 -118060 -566723 -1016539 -969180 -409385 239585 655272 781289 649442 393304
38016 393304 274632 349896 282092 -157895 -607448 -575010 -225202 -170051 -516159 -670123
38006 -670123 -205559 542884 951058 823923 433831 104329 -26194 9686 67006 -4197
37996 -4197 -210979 -407063 -444658 -299657 -87062 -1292 -154709 -407420 -472745 -264889
37986 -264889 8749 168292 251673 285016 156728 -101893 -231830 -187028 -314897 -768465
37976 -768465 -1088183 -800476 -133984 346746 558618 808754 1105613 1166164 983785 796945
37966 796945 588620 211951 -87412 63424 430013 412143 30237 -82105 246562 459874
37956 459874 278983 158232 407607 635403 507540 356679 511443 651909 428904 180960
37946 180960 381246 798897 872684 594616 389345 379427 385889 444594 708881 977028 886868
37935 886868 494994 161606 -42626 -326089 -669630 -829425 -795646 -784418 -809492 -699608
37925 -699608 -502245 -433307 -450938 -311585 -45006 44591 -137239 -382493 -573154 -761418
37915 -761418 -832897 -505019 231546 983670 1352339 1233499 758205 208522 -71187 10822
37905 10822 136666 29981 -105858 4496 88344 -294474 -869609 -865323 -176518 414154
37895 414154 390010 172691 291733 534109 432534 95856 -45219 1696 -131295 -512974
37885 -512974 -845931 -957065 -905970 -674907 -185781 371590 609507 404661 16782 -276764
37875 -276764 -404295 -348997 -71545 321347 564437 525237 365204 306950 360134 386965
37865 386965 349408 354428 468095 609202 689629 778867 999910 1268462 1304860 999496 617044
37854 617044 474626 533541 521025 369336 265284 285416 274360 145705 48401 137975 383759
37843 383759 670756 889532 883079 555478 106092 -106862 -24806 66850 39561 110982 356405
37832 356405 417786 22979 -507876 -673696 -515563 -508914 -822424 -1091491 -952350 -471986
37822 -471986 30163 342992 449696 412720 270375 18552 -284931 -406473 -104302 489370
37812 489370 864476 709586 314361 157482 262902 278691 90551 -4953 242293 698941
37802 698941 1034322 1039097 723174 273476 -59221 -160625 -117196 15070 365872 990009
37792 990009 1629371 2038547 2424115 3185446 4249187 5033734 5110722 4578810 3771313 2960663
37782 2960663 2393892 2203769 2146432 1801852 1191828 819941 913412 1051346 841673 554866
37772 554866 651379 989857 1030661 667927 323004 241032 214660 95395 93723 351109 605987
37761 605987 593621 497937 646758 930760 931546 596808 379460 576644 869773 773307 312046
37750 312046 -64067 -112918 7276 141957 334257 519642 431060 50575 -177233 88997
37740 88997 566837 769668 723449 802188 1002798 955852 661715 610735 989053 1312758
37730 1312758 1159974 799477 690534 739759 549278 155462 -22495 108971 163235 -118625
37720 -118625 -510712 -672990 -567455 -360847 -155281 17759 103505 102537 166443 462271
37710 462271 933429 1285974 1278032 1015494 874920 1059837 1318121 1253403 851030 450494
37700 450494 206260 -86282 -510379 -731749 -451332 106400 469064 498383 404838 363285
37690 363285 439727 733249 1210074 1510019 1327716 933670 898214 1291091 1564893 1293536
37680 1293536 646607 48549 -263025 -232732 86661 441810 529937 399856 405444 626078
37670 626078 684197 343452 -59996 -78066 225488 434717 377630 241777 199194 198300 100320
37659 100320 -155381 -480484 -636713 -424727 31971 355569 366564 262148 230927 169230
37649 169230 -17983 -126678 24544 202727 49129 -370737 -645889 -563254 -258646 90136
37639 90136 379220 432194 111698 -358182 -490120 -82119 527813 856131 792547 665753
37629 665753 876523 1473172 2048461 2146659 1833446 1671639 1979618 2353718 2211561 1609699
37619 1609699 1134024 1080294 1171364 1094856 908156 798539 765227 678054 429648 -34757
37609 -34757 -616565 -980973 -851636 -415437 -135445 -127363 -62457 239555 507742 477154
37599 477154 299953 265131 372861 420202 304157 43237 -311673 -616891 -670088 -443302
37589 -443302 -95111 318389 853758 1312878 1277324 742322 305876 377169 570621 341906
37579 341906 -87990 -25824 629485 1224580 1266985 947179 629459 339654 13440 -156651
37569 -156651 11791 294481 279339 -81417 -402317 -361229 -71347 116086 58271 -62782
37559 -62782 -54648 12044 -37056 -155789 -132922 42735 134818 48401 -8155 102500 181991
37548 181991 25571 -225770 -325978 -296877 -268414 -176063 19336 28807 -382356 -853449
37538 -853449 -800928 -279539 98278 130311 273147 742829 1025495 684873 127297 36112
37528 36112 408248 708115 727886 704966 711026 532318 184029 -11829 7418 -103656 -474725
37517 -474725 -701286 -458377 -56434 11906 -191225 -217803 28763 232890 300433 498825
37507 498825 833169 828321 268879 -274636 -130326 541904 1024108 1074810 1094362 1292411
37497 1292411 1352429 1099334 880435 941163 955969 639061 368243 610064 1040738 934968
37487 934968 319559 34774 540802 1263507 1379989 819512 184819 -43888 55242 82344
37477 82344 -181494 -489321 -393655 105923 382352 -53437 -799781 -1039325 -658199 -311454
37467 -311454 -354126 -371589 12019 491494 620098 468152 304548 68694 -334947 -572363
37457 -572363 -274702 307831 559862 286165 -188770 -576514 -852072 -1024626 -1088431 -1138218
37447 -1138218 -1194414 -1035067 -553528 -109145 -88343 -272858 -151455 244650 393601 161026
37437 161026 12239 209626 366756 74200 -462965 -717336 -473756 67151 572692 775315
37427 775315 610524 306575 141124 63484 -159431 -413874 -289105 222435 556913 373249
37417 373249 77501 197132 597944 744347 467170 41864 -294184 -475494 -415946 -111584
37407 -111584 158777 128570 -46767 -56538 4584 -192554 -540110 -539339 -102922 221491 40174
37396 40174 -343618 -463217 -341580 -229121 -47577 401437 885565 966294 737455 774005
37386 774005 1210263 1397780 808663 -116178 -486691 -133785 244013 93671 -319694 -428645
37376 -428645 -157329 125021 219308 290007 486345 686987 701358 534774 372829 410625
37366 410625 716649 1143535 1364867 1145174 610080 126484 -100525 -162329 -165396 -36855
37356 -36855 263606 520082 461833 127192 -164667 -218801 -193513 -356888 -700655 -908416
37346 -908416 -733636 -332787 -112245 -236203 -428617 -361774 -105217 2964 -147893 -324227
37336 -324227 -327470 -219768 -89583 141910 506913 789142 757053 472361 162794 -93641
37326 -93641 -318612 -363824 -19259 556258 814659 428098 -244905 -533781 -245145 149632
37316 149632 155755 -148443 -336530 -290665 -307408 -529192 -631538 -306030 204844 398958
37306 398958 213001 62188 226505 589198 1013816 1534903 2000034 1949260 1194019 250390
37296 250390 -164789 75617 517223 770192 810954 730636 552553 345475 249082 302429
37286 302429 399182 433501 370828 214795 38258 -22524 49418 76377 -37785 -95317 103491
37275 103491 401142 504579 431113 377698 260489 -152507 -656745 -674710 -52304 659440
37265 659440 929372 838738 692997 461407 -10897 -544530 -816916 -823989 -762878 -634636
37255 -634636 -385023 -281820 -635956 -1178474 -1249592 -709727 -160820 -54420 -55408 347607
37245 347607 965923 1137348 681528 153284 114045 525270 965974 1138314 987782 572897
37235 572897 71072 -198702 -9550 501704 943981 1071408 969850 849594 782026 691010
37225 691010 515331 311174 217544 325307 537676 593881 340417 -25552 -128153 135577
37215 135577 485261 681368 847836 1162396 1390558 1068489 164568 -749256 -1113906 -950210
37205 -950210 -667890 -521288 -481795 -511070 -660156 -878093 -962818 -811340 -580022 -483795
37195 -483795 -517789 -486665 -272534 26716 231427 275847 232228 182124 127798 48133 -9545
37184 -9545 33311 150180 190318 60394 -126039 -180705 -113582 -153852 -444816 -817725 -968858
37173 -968858 -802733 -481897 -167306 138860 454801 665936 620129 316604 -83866 -396704
37163 -396704 -506332 -395410 -172815 -14214 27749 104688 357742 684396 864017 863316
37153 863316 825654 770097 534467 85747 -331307 -489938 -461421 -447924 -466322 -371210 -112969
37142 -112969 191570 409530 489027 443751 347896 309807 363164 429001 445816 446185 431676
37131 431676 313686 118237 107785 479056 1003972 1199789 869213 304980 -51461 -13927
37121 -13927 275588 524793 525953 330295 190832 248687 339345 235713 -3896 -121587
37111 -121587 -40880 60243 56822 39985 126425 285024 416826 474996 461358 409152 380941
37100 380941 389156 347133 199719 30201 -86874 -215541 -355824 -268609 204753 756035
37090 756035 893312 568448 172125 -54924 -192664 -228264 27238 476566 669278 424178
37080 424178 105886 40300 73351 7330 45535 385098 715759 622130 270671 200774 533536
37069 533536 834520 740392 352697 -2070 -112329 32648 285977 484552 652100 915443
37059 915443 1130030 918631 320007 3531 418116 1070442 1183729 789166 518881 520340
37049 520340 352914 -64754 -229734 44961 264498 104411 -44476 201021 542600 562501
37039 562501 467999 670671 965369 782645 108541 -451697 -525319 -388946 -456851 -745767
37029 -745767 -980255 -967252 -747434 -522109 -463760 -495277 -330535 109332 445027 266651
37019 266651 -253139 -490108 -158114 316181 338458 -139468 -625705 -700658 -447120 -270457
37009 -270457 -412649 -721834 -873960 -720942 -358690 55745 400667 536017 360244 -11323
36999 -11323 -288109 -311958 -193495 -90058 -28309 -28550 -184886 -464712 -621966 -506739 -307000
36988 -307000 -281563 -395371 -435062 -353473 -259261 -172397 -45225 50298 11597 -72133 -32557
36977 -32557 88146 105636 9309 -47277 -40053 -82207 -143522 -50162 198634 383984 390695
36966 390695 318862 214846 -33303 -424644 -716674 -709280 -480424 -239420 -107835 -98891
36956 -98891 -124941 1508 340252 586512 378340 -109280 -271839 82653 435355 358749
36946 358749 175099 404918 923811 1193832 1096119 958269 876789 621396 223134 56877
36936 56877 198979 247178 1933 -177529 -9741 173466 -38528 -398213 -309701 278000
36926 278000 772790 723628 309239 -8469 -3340 224792 431007 402488 131152 -126373
36916 -126373 -97100 185286 444428 521811 494804 467745 469574 548493 710091 744092 413204
36905 413204 -110912 -324575 -51877 297050 343723 282124 461904 711478 555412 -3388
36895 -3388 -415964 -338707 -669 301136 624447 1031611 1189381 746775 -42352 -503297
36885 -503297 -376853 -136150 -338702 -905520 -1253662 -1030644 -491484 -139188 -185528 -468989
36875 -468989 -753259 -898019 -780297 -319464 301770 657797 531318 213382 127841 266666
36865 266666 281406 67531 -105759 -87367 -71451 -163022 -84060 385738 943557 1105796
36855 1105796 854247 559942 357046 22856 -483605 -786453 -585294 -85078 291404
36846 291404 408409 398702 304008 25188 -402907 -737012 -780252 -556740 -198108 182719
36836 182719 431805 337171 -140115 -661808 -740732 -263032 322672 451360 38500 -461299
36826 -461299 -562169 -205930 276433 528588 444235 181433 -20736 -81096 -150996 -385223
36816 -385223 -661929 -691532 -441312 -240901 -325259 -465192 -288591 147549 398451 243129
36806 243129 -18627 20866 357613 599928 413277 -148721 -685688 -763361 -264225 492414
36796 492414 998548 961572 482384 -92267 -423372 -364729 -41798 254876 353773 354606 409837
36785 409837 453753 333541 135926 125382 352315 578396 628220 548189 358152 -37375
36775 -37375 -547852 -824737 -722826 -566024 -677825 -885662 -823823 -530121 -338818 -294775
36765 -294775 -118144 251614 509959 478610 362160 367266 402696 346798 315663 434667 580921
36754 580921 585873 489478 370449 146638 -185451 -334381 -95459 203636 54440 -486046
36744 -486046 -821542 -616598 -148730 241196 608526 1071986 1396002 1272841 816985 437906
36734 437906 339558 430190 602414 787295 814376 549862 152737 -99826 -208421 -359480
36724 -359480 -484758 -321471 43460 142109 -188072 -501732 -382851 -7720 242617 369648
36714 369648 539871 584268 244158 -253966 -436159 -340289 -453848 -833743 -900573 -353612
36704 -353612 253036 252554 -205990 -446181 -243678 -9301 -61132 -195618 -97758 171039
36694 171039 303995 188294 11550 -27831 24987 -25712 -210549 -265305 81542 710979
36684 710979 1147805 1050081 549391 44881 -208044 -218484 -118782 -47272 -76951 -126044 -8957
36673 -8957 322639 679049 859933 852445 703638 387281 -21560 -238825 -120926 8627
36663 8627 -284316 -900171 -1246087 -957229 -296952 218880 340118 160200 -73334 -135027
36653 -135027 -16172 3398 -298414 -662358 -604940 -162162 63118 -182074 -306529 255581
36643 255581 1033174 1015238 74449 -758971 -612877 177664 664389 526639 251694 251400
36633 251400 298592 -52674 -804822 -1479536 -1625966 -1222651 -612705 -138146 141864 392427
36623 392427 693540 869633 714394 335219 103124 204710 410247 428368 353114 511903
36613 511903 898017 1050907 635116 -80347 -527418 -488448 -213179 24427 208684 407889
36603 407889 579935 658377 655628 580308 402043 188797 115965 215895 265489 65850 -294879
$$ [...]
##END NTUPLES=NMR SPECTRUM
##END=
