##TITLE=31Pdec_PR172_WF
 D2O, 24 sc
 7.6.2019
##JCAMPDX= 6.0         $$ Bruker NMR JCAMP-DX V2.0
##DATA TYPE= NMR SPECTRUM
##DATA CLASS= NTUPLES
##ORIGIN= UXNMR, Bruker Analytische Messtechnik GmbH
##OWNER= root
$$ XWIN-NMR		Version 3.5
$$ Fri Jun  7 14:44:58 2019 Russian Standard Time (UT+4h)  she@DPX200
##.OBSERVE FREQUENCY= 81.013821
##.OBSERVE NUCLEUS= ^31P
##.ACQUISITION MODE= SIMULTANEOUS
##.ACQUISITION SCHEME= undefined
##.AVERAGES= 24
##.DIGITISER RES= 17
##SPECTROMETER/DATA SYSTEM= spect
##.PULSE SEQUENCE= zgpg30
##.SOLVENT NAME= D2O
##.SHIFT REFERENCE= (INTERNAL, D2O, 0, 182.463)
##AUDIT TRAIL= $$ (NUMBER, WHEN, WHO, WHERE, WHAT)
$$ ##TITLE= Audit trail, XWIN-NMR		Version 3.5
$$ ##JCAMPDX= 5.01
$$ ##ORIGIN= Bruker BioSpin GmbH
$$ ##OWNER= she
$$ F:/spectra/data/she/nmr/P31/1/pdata/1/auditp.txt
$$ ##AUDIT TRAIL=  $$ (NUMBER, WHEN, WHO, WHERE, WHAT)
(   1,<2019-06-07 14:43:41.07 +0400>,<she>,<DPX200>,
      <created by zg, POWCHK disabled, PULCHK disabled
       configuration hash MD5:
       00 E9 B6 7A A2 85 ED C7 34 08 36 98 17 FE 4E 26
       data hash MD5: 32K
       26 A5 A7 52 7A 10 3E 02 60 C2 45 F3 2E D6 C1 21>)
(   2,<2019-06-07 14:43:45.60 +0400>,<she>,<DPX200>,
      <Start of raw data processing
       efp BC_mod = 2 LB = 1 FT_mod = 6 PKNL = 1 PHC0 = -2534.228 PHC1 = 78.19916 SI = 64K 
       data hash MD5: 64K
       C2 37 FF F5 9A B9 EE C2 DA 80 45 6A 3A B3 C7 50>)
(   3,<2019-06-07 14:44:08.60 +0400>,<she>,<DPX200>,
      <pk PHC0 = -22.88663 PHC1 = -15 
       data hash MD5: 64K
       1B B0 B4 62 13 BB AF 3D 60 EE 60 46 94 26 67 9D>)
(   4,<2019-06-07 14:44:11.92 +0400>,<she>,<DPX200>,
      <abs ABSG = 5 
       data hash MD5: 64K
       DD 56 02 47 71 C8 36 8E 51 37 55 C7 85 39 75 54>)
$$ ##END=
$$ 
$$ hash MD5
$$ 14 B9 B1 A6 8A E9 52 79 41 61 18 0F 52 20 C7 DA
##$RELAX= 
##$RELAX= 
##$RELAX= 
##$RELAX= 
##$RELAX= 
##$RELAX= 
##$RELAX= 
##$RELAX= 
$$ Bruker specific parameters
$$ --------------------------
##$DU= <F:/spectra>
##$EXPNO= 1
##$NAME= <P31>
##$PROCNO= 1
##$TYPE= <nmr>
##$USER= <she>
##$AMP= (0..31)
100 100 100 100 100 100 100 100 100 100 100 100 100 100 100 100 100 100 
100 100 100 100 100 100 100 100 100 100 100 100 100 100 
##$AQSEQ= 0
##$AQ_mod= 1
##$AUNM= <au_zg>
##$AUTOPOS= <>
##$BF1= 81.014009
##$BF2= 200.13
##$BF3= 200.13
##$BF4= 200.13
##$BF5= 200.13
##$BF6= 200.13
##$BF7= 200.13
##$BF8= 200.13
##$BYTORDA= 1
##$CFDGTYP= 0
##$CFRGTYP= 5
##$CHEMSTR= <none>
##$CNST= (0..31)
1 1 145 1 1 1 1 1 1 1 1 1 1 1 1 1 1 1 1 1 1 1 1 1 1 1 1 1 1 1 1 1 
##$CPDPRG= <waltz16>
##$CPDPRG1= <>
##$CPDPRG2= <waltz16>
##$CPDPRG3= <>
##$CPDPRG4= <mlev>
##$CPDPRG5= <mlev>
##$CPDPRG6= <mlev>
##$CPDPRG7= <mlev>
##$CPDPRG8= <mlev>
##$CPDPRGB= <>
##$CPDPRGT= <>
##$D= (0..31)
0 1 0 0 0 0 0 0 0 0 0 0.03 2e-05 3e-06 0 0 0 0 0 0 0 0 0 0 0 0 0 0 0 0 
0 0 
##$DATE= 1559904220
##$DBL= (0..7)
120 120 120 11 120 120 24 19 
##$DBP= (0..7)
150 150 150 150 150 150 150 150 
##$DBP07= 0
##$DBPNAM0= <>
##$DBPNAM1= <>
##$DBPNAM2= <>
$$ [...]
##$SUBNAM3= <"">
##$SUBNAM4= <"">
##$SUBNAM5= <"">
##$SUBNAM6= <"">
##$SUBNAM7= <"">
##$SUBNAM8= <"">
##$SUBNAM9= <"">
##$SW= 369.568048894756
##$SWIBOX= (0..15)
0 1 3 0 0 0 0 0 0 0 0 0 0 0 0 0 
##$SW_h= 29940.119760479
##$TD= 32768
##$TD0= 1
##$TE= 0
##$TE2= 300
##$TE3= 300
##$TEG= 300
##$TL= (0..7)
0 120 53 12 22 120 120 120 
##$TP= (0..7)
150 150 150 150 150 150 150 150 
##$TP07= 0
##$TPNAME0= <>
##$TPNAME1= <>
##$TPNAME2= <>
##$TPNAME3= <>
##$TPNAME4= <>
##$TPNAME5= <>
##$TPNAME6= <>
##$TPNAME7= <>
##$TPOAL= (0..7)
0.5 0.5 0.5 0.5 0.5 0.5 0.5 0.5 
##$TPOFFS= (0..7)
0 0 0 0 0 0 0 0 
##$TUNHIN= 0
##$TUNHOUT= 0
##$TUNXOUT= 0
##$USERA1= <user>
##$USERA2= <user>
##$USERA3= <user>
##$USERA4= <user>
##$USERA5= <user>
##$V9= 5
##$VALIST= <valist>
##$VCLIST= <CCCCCCCCCCCCCCC>
##$VD= 0
##$VDLIST= <DDDDDDDDDDDDDDD>
##$VPLIST= <PPPPPPPPPPPPPPP>
##$VTLIST= <TTTTTTTTTTTTTTT>
##$WBST= 1024
##$WBSW= 4
##$XGAIN= (0..3)
0 0 0 0 
##$XL= 0
##$YL= 0
##$YMAX_a= 45232
##$YMIN_a= -47729
##$ZGOPTNS= <>
##$ZL1= 120
##$ZL2= 120
##$ZL3= 120
##$ZL4= 120
##$ABSF1= 182.463
##$ABSF2= -187.1042
##$ABSG= 5
##$ABSL= 3
##$ALPHA= 0
##$AQORDER= 0
##$ASSFAC= 0
##$ASSFACI= 0
##$ASSFACX= 0
##$ASSWID= 0
##$AUNMP= <proc_1d>
##$AZFE= 0.1
##$AZFW= 0.5
##$BCFW= 0
##$BC_mod= 2
##$BYTORDP= 0
##$COROFFS= 0
##$CY= -3
##$DATMOD= 1
##$DC= 0
##$DFILT= <>
##$DTYPP= 0
##$F1P= 0
##$F2P= 0
##$FCOR= 1
##$FTSIZE= 65536
##$FT_mod= 6
##$GAMMA= 0
##$GB= 0
##$INTBC= 1
##$INTSCL= 5.30512e-09
##$ISEN= 30
##$LB= 1
##$LEV0= 0
##$LPBIN= 0
##$MAXI= 10000
##$MC2= 0
##$MEAN= 0
##$ME_mod= 0
##$MI= 50
##$NCOEF= 0
##$NC_proc= -3
##$NLEV= 6
##$NOISF1= 182.463
##$NOISF2= 159.3651
##$NSP= 0
##$NTH_PI= 0
##$NZP= 0
##$OFFSET= 182.463
##$PC= 4
##$PHC0= -2557.115
##$PHC1= 63.19916
##$PH_mod= 1
##$PKNL= yes
##$PPARMOD= 0
##$PSCAL= 0
##$PSIGN= 0
##$REVERSE= no
##$SF= 81.0140089999434
##$SI= 65536
##$SIGF1= 159.3651
##$SIGF2= -187.1042
##$SINO= 113.3802
##$SIOLD= 16384
##$SREGLST= <1H.CDCl3>
##$SSB= 0
##$STSI= 65536
##$STSR= 0
##$SW_p= 29940.119760479
##$SYMM= 0
##$S_DEV= 0
##$TDeff= 32768
##$TDoff= 0
##$TI= <>
##$TILT= no
##$TM1= 0
##$TM2= 0
##$TOPLEV= 0
##$USERP1= <user>
##$USERP2= <user>
##$USERP3= <user>
##$USERP4= <user>
##$USERP5= <user>
##$WDW= 1
##$XDIM= 65536
##$YMAX_p= 457971504
##$YMIN_p= -11399674
$$ End of Bruker specific parameters
$$ ---------------------------------
##NTUPLES= NMR SPECTRUM
##VAR_NAME=  FREQUENCY,     SPECTRUM/REAL,   SPECTRUM/IMAG
##SYMBOL=    X,             R,               I
##VAR_TYPE=  INDEPENDENT,   DEPENDENT,       DEPENDENT
##VAR_FORM=  AFFN,          ASDF,            ASDF
##VAR_DIM=   65536,         65536,           65536
##UNITS=     HZ,            ARBITRARY UNITS, ARBITRARY UNITS
##FACTOR=    0.456856943014862, 1,           1
##FIRST=     14782.0589164792, 0,            0
##LAST=      -15158.0608439998, 0,           0
##MIN=       -15158.0608439998, -11399674,   0
##MAX=       14782.0589164792, 457971504,    0
$$ Real data points
##PAGE= N=1
##DATA TABLE= (X++(R..R)), XYDATA
$$ [...]
41033A8783j79560q6669J5488J4445L0660J12082J04916l5832j03293K9091J82112
41022A02223J50248l11p8621m4563R095J3763m4228j30541j47868m9929L0868
41011a89864m0752j32197j9101J88010J50165j25023k26981R780K28844J36453
41001b0666n5842o2792k003p2181j14249O2579K11430J2794k99274k27552J73626
40990c94130L38185N5263k43410j83359M7154J02699kl9325J1624K2040k8267
40979c11528n6202n1947o3675p0807j2597R8823J87488J97862J19108j5722j14967
40968i4164q3571O1981J90882J99310J02307k1993j13080j45644j32646j16977
40958a53595j09668n9245N5563J46477J18162R712o5805p9436p0158k0979J02182
$$ plain form
41033 18783 -160777 -247446 -231958 -217513 -186853 -74771 30145 -5687 -108980 -79889 102223
41022 102223 252471 252160 173539 128976 138071 151834 107606 -22935 -170803 -220732 -189864
41011 -189864 -230616 -362813 -381914 -193904 -43739 -168762 -395743 -385963 -157119 -20666
41001 -20666 -76508 -139300 -141303 -213484 -327733 -265154 -53724 -40930 -340204 -567756 -394130
40990 -394130 -55945 -682 -244092 -427451 -380297 -277598 -277600 -316925 -305301 -283261 -311528
40979 -311528 -367730 -419677 -483352 -554159 -566756 -467933 -280445 -82583 36525 20803 -94164
40968 -94164 -177735 -115754 75128 274438 376745 354752 241672 96028 -36618 -153595
40958 -153595 -263263 -322508 -266945 -120468 -2306 7406 -58399 -137835 -207993 -228972 -126790
40947a26790K15717J85367L3485p1748n1194L777L445l3071p2705j24079j55506
40936a93302r9745N230J8978r0887j72973j07908K1506P0282L4013M559J0995
40925d99252K2060M5224J01959J36544O7016o9025j16646J2047K10200K76954
40915A87081J35410p9101j65708q3034J3043k3019j34107j40319J7672K00371
40905g1711K39664J12023p6164k07004k23720j41928l2205L2735L4612Q82m5426
40894c78242q6820q2892r719P4054P7226O006l4268Q716O5547O9583N6517O4869
40882a69423K6268j21369k60758j94032O5465K50772J68697m8977j33366k6080
40872d42803J03548J25796N9768n9199k13313k75830q3423K63303L98455J59658
$$ plain form
40947 -126790 88927 274294 307779 236031 184837 188614 192059 158988 86283 -37796 -193302
40936 -193302 -293047 -287817 -268839 -359726 -532699 -640607 -619101 -548819 -514806 -510247 -499252
40925 -499252 -477192 -431968 -330009 -193465 -126449 -195474 -312120 -300073 -89873 187081
40915 187081 322491 243390 77682 -5352 7691 -15328 -149435 -289754 -272082 -71711
40905 -71711 167953 279976 203812 -3192 -226912 -368840 -401045 -368310 -333698 -332816 -378242
40894 -378242 -465062 -547954 -557673 -483619 -406393 -400387 -434655 -425939 -360392 -290809 -234292 -169423
40882 -169423 -143155 -264524 -525282 -719314 -653849 -403077 -234380 -283357 -416723 -442803
40872 -442803 -339255 -213459 -153691 -212890 -426203 -702033 -785456 -522153 -123698 35960
40862C5960j41752j39359P7747J52065J4186r0812o3153n4292r9198k6748J70103
40851a65253K33692N7191j22823j15326m2204l0850K8599J75151J59054j41074
40841C6157l71380j68135K42648L39013O0693j65508r6035O7174R9908M4067j716
40830H6886m5348o5579L642P9254j0619k05696k29113r233J86313J50173J3491
40819d5829j1793O0302R9357Q6341O5854J2046j02302j97634j71906l5183J05449
40808a35298J40518K8963j41279j85518l1446J46575J50915N2650N6560J40765
40798B23405J04186n0006r6425R650M3791p6355j21150N0932K23205J57105m8768
40787D19570j54503j29140r2705q3810q4403j18594j50988n4525J52503K31738
$$ plain form
40862 35960 -105792 -245151 -167404 -15339 -1153 -91965 -155118 -209410 -308608 -335356 -165253
40851 -165253 68439 125630 2807 -112519 -154723 -185573 -156974 18177 177231 36157
40841 36157 -335223 -503358 -260710 78303 138996 -26512 -122547 -55373 44535 88602 86886
40830 86886 41538 -24041 -20399 58855 48236 -157460 -386573 -395806 -209493 -59320 -45829
40819 -45829 -57622 2680 102037 188378 254232 266278 163976 -33658 -205564 -240747 -135298
40808 -135298 5220 34183 -107096 -292614 -324060 -177485 -26570 26080 82640 223405
40798 223405 327591 277585 181160 190810 234601 158246 37096 88028 311233 468338 419570
40787 419570 265067 135927 43222 -40588 -124991 -243585 -394573 -449098 -296595 -64857
40777f4857P5807p8761k0275P3730o0317k80848k16629J42827L92884K70051l7167
40766A96445j99631j33678R932P1649J4549o8135m1702J03911K05061J29026l6610
40755B50817j20767j19006j45158j94162j49981j5074O3892K7140j0733M5230
40745c67802J27654J24973M6280L527P6015K22542L06264K20769J5079j50644
40735F24657j99548k07704k36493k14405q0641O8446J08421P0872N8125N7963
40725D9693k46p4484o4230R471L7943J236l8675p3072j18827j12238o393Q0890
40713c08932J5534j04282p5546O4936Q8065k7243m0053J28699K24320P4011r8308
40702e8799j4500K04883K24797J7130j19311m1672M4521m3105j67359j15518M8941
$$ plain form
40777 -64857 10950 -67811 -88086 -14356 -74673 -355521 -572150 -429323 -36439 233612 196445
40766 196445 -3186 -136864 -126932 -55283 -40734 -108869 -150571 -46660 158401 287427 250817
40755 250817 130050 11044 -134114 -328276 -478257 -493331 -429439 -402299 -413032 -367802
40745 -367802 -240148 -115175 -68895 -65368 10647 233189 539453 760222 775301 624657
40735 624657 425109 217405 -19088 -233493 -314134 -245688 -137267 -66395 -8270 49693
40725 49693 49447 -25037 -89267 -79796 -41853 -40617 -79292 -152364 -271191 -383429 -389822 -308932
40713 -308932 -293398 -397680 -473226 -408290 -320225 -347468 -387521 -258822 -34502 39509 -58799
40702 -58799 -73299 131584 356381 373511 254200 212528 257049 213944 46585 -68933 -19992
40691a9992R7950J96o5978l3570l4328j14884j08197P4593K30528J49060m3209
40680A32169p3079M7368P1855m3291q3388J3233L1140j23211k25712j15781K4114
40669c44583k874o9284J4288J34938R2022j5582L6153J77612J64550J6107l9413
40658A63934R202k7899j30971q7879O1431L1147j78563k00641Q4509K84106R5355
40647A03731k07642k14553K191Q4829j7120n7057L0864O1708k3699o3200J7945
40636b82003R5868R5367R5415J27599R9724l549n3771l801J1589r1451j87894
40625i6907j51017o3951o4878j02518l3739J06813J35721R374j00693n9391N6715
40614c64471J01457N5868J796j1223J1230N2665P9356M9504q739j911P8741J07325
$$ plain form
40691 -19992 77958 78154 12176 -21394 -55722 -170606 -278803 -204210 26318 175378 132169
40680 132169 59090 106458 178313 135022 51634 64867 96007 -27204 -252916 -368697 -344583
40669 -344583 -347457 -416741 -402453 -267515 -175493 -191075 -154922 22690 187240 203347 163934
40658 163934 173136 145237 14266 -73613 -12182 18965 -159598 -360239 -275730 8376 103731
40647 103731 -103911 -318464 -316273 -231444 -248564 -305621 -274757 -213049 -236748 -299948 -282003
40636 -282003 -186135 -90768 4647 132246 231970 228421 174650 170849 182438 90987 -96907
40625 -96907 -247924 -311875 -376753 -479271 -513010 -406197 -270476 -261102 -361795 -421186 -364471
40614 -364471 -263014 -207146 -205350 -216573 -205343 -152678 -73322 -23818 -32557 -34468 44273 151598
40602A51598J6841o8461l1090K2420o4248j94509j38579Q1062K01328J32118O4278
40591A72758R6353O4440j16591k40837j44784O120J602p2005l5265N3047O1422
40580a53740Q4646K38181L19775O8003l40915m63538k19644M6131J23919J41788
40570a55394J68839N5047k00778l22108j80242r925r961m8771K8215J10959P6835
40559d87284L3384N6430j8172k45560l07421K9683M29384L95956K0439j48909
40549b42070P2351K85783J68286q6178j42889lJ20329J05091k5175k30569l98666
40538c73710l37427j9994K77212K71227L0394j38287r7103J3275N0189O0521J43407
40527a20296K63404K93067J79435J141j16243j13182m6294k8596r0410j23915
$$ plain form
40602 151598 168439 99978 68888 91308 27060 -167449 -306028 -224966 -23638 108480 172758
40591 172758 269111 333551 216960 -23877 -168661 -162541 -160939 -232944 -268209 -215162 -153740
40580 -153740 -69094 169087 488862 556865 215950 -247588 -467232 -421101 -297182 -155394
40570 -155394 13445 68492 -132286 -454394 -634636 -644561 -654522 -703293 -675078 -564119 -487284
40559 -487284 -453900 -397470 -415642 -661202 -968623 -938940 -509556 -113600 -93161 -242070
40549 -242070 -169719 116064 284350 198172 55283 55280 175609 280700 255525 24956 -373710
40538 -373710 -711137 -731131 -453919 -182692 -152298 -290585 -387688 -374413 -324224 -263703 -120296
40527 -120296 143108 436175 615610 616751 500508 387326 341032 312436 222026 98111
40517I8111l0892J04031J03602l5826j20128n2988J6859l9850j00349j7897P5589
40506B62k3011j78074p0458K42699L23398J7471k73062j97245L1331L7235j14075
40495b03529j09914M0843P3836k9067m9837J9560j5898j17033l1598K03844K36141
40484A7348j8296j92729m7500J72083J75305O1395N4189J13431R5155M2359L5711
40473E08451j9648j86483k88454j83939l8789m3232p1862N2119J61869N287k52673
40462c57354k22670P5741K17054L2758j53756o8769J14422J12668k8719p2530
40452c51155L0036J27266J24352O0198j1821p1524r8520r7483j15966j56542j35414
40441f96573k1380N9695p256j06760j6937K40582L73020K25008K5250N2028K03704
$$ plain form
40517 98111 67219 171250 274852 239026 118898 65910 82769 42919 -57430 -75327 262
40506 262 -22749 -200823 -271281 -28582 294816 312287 39225 -158020 -126689 -89454 -203529
40495 -203529 -313443 -272600 -198764 -227831 -277668 -258108 -274006 -391039 -422637 -218793 17348
40484 17348 -948 -193677 -241177 -69094 106211 167606 221795 335226 430381 472740 508451
40473 508451 488803 302320 13866 -170073 -208862 -252094 -323956 -271837 -109968 -104681 -357354
40462 -357354 -580024 -504283 -287229 -254471 -408227 -476996 -362574 -249906 -278625 -351155
40452 -351155 -321119 -193853 -69501 -9303 -21124 -92648 -191168 -288651 -404617 -561159 -696573
40441 -696573 -717953 -658258 -665514 -772274 -789211 -548629 -175609 49399 74649 126677 330381
40430C30381J64220p3757j76402m371J53453L7837j86277k24169r2373Q025M7968
40419a5465R7146Q2712m3025o7990J66206L73099J84034k13884k99024k1619J44159
40408C86349k5778k25330k02947r4617l3521O4149J65455P2678j30907j00004
40398a24473J52007K10796J1570Q43L12569M64990K03432m9602K5372J23647J4735
40387A345886K4517L28939N42432N28215P34177J176166J252784J342631L010302
40378A0286049O097528P142051L179827l556999p469493o215794k929720j337876
40370E195573j402339j142519l24951j23719n70493o38411k22393j19851l67835
40361B83062k49334K15786K73566j19597k12388J31649K05489j99582l98197m2945
$$ plain form
40430 330381 494601 420844 244442 240071 393524 431361 245084 20915 -71458 -63433 -15465
40419 -15465 81681 164393 121368 53378 219584 592683 776717 562833 263809 242190 386349
40408 386349 360571 135241 -67706 -162323 -195844 -131695 33760 106438 -24469 -124473
40398 -124473 27534 238330 249900 250743 563312 1028302 1231734 1182132 1207504 1331151 1345886
40387 1345886 1370403 1699342 2241774 2769989 3504166 4680332 5933116 7275747 10286049
40378 10286049 16383577 23525628 26705455 23148456 15678963 9463169 6533449 5195573
40370 5195573 3793234 2650715 2325764 2202045 1631552 993141 770748 650897 283062
40361 283062 33728 249514 523080 403483 191095 322744 528233 328651 -69546 -112491
40351a12491K92204J42725j23500n1389J65355J45725n1951j74356k03119k13097
40341a83894j61035m9937J2750M8033J62697K34597M5216k57952l00691j05350
40331e55566n0302j66616p3703K69943L93879J15261j11007M6856K59888J40621
40321B69254j25898j79811q3269p4483q5647M7641J89755J41917K5412L4886M8927
40310B08684j19748l06245k30555K4506J61287J41939J40400J57267O1263q5703
40300A53095j06271l6161m4966j05079o2394L8266K7464n0475m278J41529J78320
40289A29050Q1727K3284K4988o6812k41092k77347r8675J12217K05471K10935
40279A03746J53724J46j56159j33974L0395Q3771n2034j54886o9644O6822R4998
$$ plain form
40351 -112491 179713 322438 198938 147549 312904 458629 406678 232322 29203 -183894
40341 -183894 -344929 -394866 -382116 -334083 -171386 63211 108427 -149525 -450216 -555566
40331 -555566 -605868 -772484 -846187 -576244 -182365 -67104 -178111 -131255 128633 269254
40321 269254 143356 -36455 -119724 -194207 -279854 -232213 -42458 99459 124871 159757 208684
40310 208684 88936 -217309 -447864 -423358 -262071 -120132 20268 177535 238798 153095
40300 153095 46824 10663 -34303 -139382 -201776 -163510 -136046 -186521 -190799 -49270 129050
40289 129050 210777 234061 259049 192237 -48855 -326202 -424877 -312660 -107189 103746
40279 103746 257470 257616 101457 -32517 -2122 81649 29615 -125271 -194915 -128093 -33095
40268c3095P0452Q2002P0248o449m1300J7892M1768l7823p3977K1601P6229m8368
40256A39180j72152p3640J30375J71142M6894m4151o4825j18310j70635j27921
40246b84043j07319k68368m28870k50573J91834M47496L47724J92824J78739J10382
40236A29826j09196j79507P6189K97929J16183k26079k49736n561N3395j58018
40226b54575k48079j4809K63683L03577J77466P0031Q559j9759L3745J24973J03703
40215E48515l3923j10455o8762n5550j18634j03494L1658R0893j5649r2183p696
40204F4720O0227l9086j23833N848J79800J14543j05686j52626K7543J52816N0040
40193B34306j21536j28207N8925K76848L31672J59743p3330j05808Q6442K16699
$$ plain form
40268 -33095 37357 119359 189607 183158 141858 159750 201518 163695 89718 111319 187548 139180
40256 139180 -32972 -106612 23763 194905 241799 197648 132823 14513 -156122 -284043
40246 -284043 -391362 -659730 -1088600 -1339173 -1147339 -699843 -352119 -159295 19444 129826
40236 129826 20630 -158877 -82688 215241 331424 105345 -144391 -149952 -96557 -254575
40226 -254575 -502654 -517463 -253780 49797 227263 297294 305853 286094 319839 444812 548515
40215 548515 514592 404137 335375 279825 161191 57697 89355 180248 164599 72416 64720
40204 64720 124947 85861 -37972 -32124 147676 262219 156533 3907 31450 184266 234306
40193 234306 112770 -15437 43488 320336 652008 811751 738421 632613 719055 935754
40183I35754Q4900j20419j24161m07k2755j93046k45530q7864P6994R6288N7056
40172D56810O9452R3736N9323k2910j20912k05050j97946n6846R9147J10733R684
40161B95221m8906m9892j00678j77215j33678K3265J15047P7714K9626J7371n1914
40150d039j64033j46253L4819J64721R8401k5256k2332P1618J18675R5156M6790
40139B68267l3201j40951j86771j06153L3790J17957R6167j6746j42839j39228
40129b49708N0117K39605J96955J739l9765J22134J85848K17j65466o6564R6043
40118C71155O317k26326k18489Q8020L35435K77479R1259M9897J04661j5832l62084
40107E01492o08514m30232M8434L51934K37902j4050m7925M7000l8055k33348
$$ plain form
40183 935754 1020654 900235 776074 775667 752912 559866 314336 226472 303466 399754 456810
40172 456810 526262 619998 679321 656411 535499 330449 132503 75657 174804 285537 295221
40161 295221 246315 196423 95745 -81470 -215148 -191883 -76836 878 30504 47875 -4039
40150 -4039 -168072 -314325 -279506 -114785 -16384 -41640 -63972 7646 126321 221477 268267
40139 268267 235066 94115 -92656 -198809 -165019 -47062 49105 32359 -110480 -249708
40129 -249708 -199591 40014 236969 238708 198943 321077 506925 507142 341676 275112 371155
40118 371155 377472 151146 -67343 20677 356112 633591 724850 774747 879408 863576 501492
40107 501492 -107022 -537254 -488820 -136886 101016 86966 39041 86041 47986 -185362
40097a85362j58515K06706L97470J63691j48661j69212n1050j00885k07254p7787
40087c30859J81959J99510n7817k41429j61069J4760J10659J52766J73714J04167
40077A46361n8358j88692k00655j15768K6381J63370J70843K5063o8382O0511
40067c9326K35115J66347p1000j33291L7308J26358k4546j77000j26014l2750
40057c8799j11614k50997k03634J6320J76384J73287J23511J39905J81903J43208
40047C49474J225j44869j75200r2687k1349j8633J8648J55887K44341J29062o0941
40036C84958p5015O1682R3258m4817j63484j98016k89841m04989k59820J81228
40026g14856M95185L65950O2006K0756J96657K05209l8797k36511k09901j09434
$$ plain form
40097 -185362 -343877 -137171 260299 423990 275329 106117 55067 -45818 -253072 -330859
40087 -330859 -148900 50610 -7207 -248636 -409705 -394945 -284286 -131520 42194 146361
40077 146361 88003 -100689 -301344 -417112 -390731 -227361 -56518 -31455 -99837 -39326
40067 -39326 195789 362136 291136 157845 195153 321511 296965 119965 -6049 -38799
40057 -38799 -150413 -401410 -605044 -588724 -412340 -239053 -115542 24363 206266 349474
40047 349474 350699 205830 30630 -62057 -83406 -102039 -83391 72496 316837 445899 384958
40036 384958 309943 371625 464883 420066 256582 58566 -231275 -636264 -896084 -714856
40026 -714856 -219671 146279 208285 229041 425698 630907 592110 355599 145698 36264
40016C6264q1578n6742L9977J27454J29943J00893Q4891K7589p7862j11103m531
40005B15195J25907J49966J15201J33551J62415Q2828j1680J86214P69938J300389
39995C229924J145969K11570q40371j252609r59108n22615l65128l49030j75535
39986A23067J12786K47345J60055L2680k414J2689L130n6776j77849l07649k86224
39975a39160l2229K53781K74401L2002j59051r3838Q1068J16435j5443j39681
39965A78285j05391P8835K46423J89310j04980l35912j96238J77418L00371j5933
39955D12188l74743l36320j1082J67733Q8602K1576R6709J09898p2153k46876
39945a44468j91352k822Q2890M5134L2230P3638O8704J7166M1047J59569K24233
$$ plain form
40016 36264 -45314 -102056 -62079 65375 195318 296211 381102 408691 330829 219726 215195
40005 215195 341102 491068 606269 739820 902235 985063 973383 1159597 1929535 3229924
39995 3229924 4375893 4587463 3747092 2494483 1535375 1012760 647632 298602 123067
39986 123067 235853 483198 643253 675933 673519 686208 689338 632562 454713 147064 -139160
39975 -139160 -171389 82392 356793 388795 229744 135906 216974 333409 317966 178285
39965 178285 72894 151729 398152 587462 482482 146570 -49668 127750 428121 412188
39955 412188 37445 -298875 -309957 -142224 -53622 -32046 64663 174561 102408 -144468
39945 -144468 -335820 -338642 -255752 -210618 -178388 -104750 -36046 -18880 22167 181736 405969
39934D05969J30122m6452j75861k19526j86302o4291J11126K10701J43401j0835
39924B98052r3407n9108O023K2066k0773j03422j77438j46414K3118J73296R5079
39913A7072j56475k57371l7256K46768K37379l0662j98658j04344L5993J8914
39903b28640m5291J8445J23400Q3460l7488j7073J37901J81318L0257r5648l2386
39892A18255P4499L0489q9664q7427K5127N6644n6069j71123j61479n3632N3718
39881b60662Q3173L621j19176j25930M9332K29071J86315l0881j47709m0687J24404
39870d9129J69763J21764O9461o673j37745k36585k02391o8151O1111J37684J56417
39859A5526J03593O291n4926n5268n0393l8015O0824K01649J79464o2755k59995
$$ plain form
39934 405969 536091 489639 313778 94252 -92050 -156341 -45215 165486 308887 298052
39924 298052 204645 145537 151560 173626 152853 49431 -128007 -274421 -251303 -78007 17072
39913 17072 -139403 -396774 -434030 -187262 50117 19455 -179203 -283547 -247554 -228640
39903 -228640 -273931 -255486 -132086 -48626 -86114 -103187 34714 216032 246289 150641 118255
39892 118255 192754 223243 133579 46152 71279 127923 71854 -99269 -260748 -314380 -260662
39881 -260662 -177489 -173868 -293044 -418974 -369642 -140571 45744 14863 -132846 -173533 -49129
39870 -49129 120634 242398 311859 305186 167441 -69144 -271535 -339686 -278575 -140891 15526
39859 15526 119119 125410 70484 15216 -35177 -73192 -12368 189281 368745 305990 45995
39848D5995j60856R6019J72857Q979j42088j06146K9010J20102J25997M0766j12301
39837A18334j90766n7593J56682J46997j24420l08739j35520K00675L10090J24259
39827B39999p7692r2519j7426k6666j04887j05504Q316R7767L9250q9972r2124
39816b21458Q6637K58724K20212P646j59343j49819l1088P1070J05932Q6273M8757
39805C23543M6241R7403J37450R6003Q767m0381n7730r8969j24814n9670J9452
39794C47295m8172k19394k44248l3820J76690J62926K4822m599Q5512J20032L2938
39783C99982p6705j34531j51729j20300j9747P3970M7769n8222o3510J04674K92641
39772B94292L07518J38148o8347j87839k15518k10686j99965j52621m7809N7374
$$ plain form
39848 45995 -114861 -18842 154015 162994 20906 -85240 -56230 63872 189869 230635 118334
39837 118334 -72432 -130025 26657 173654 49234 -259505 -395025 -194350 115740 239999
39827 239999 162307 69788 52362 25696 -79191 -184695 -176379 -78612 -39362 -129334 -221458
39816 -221458 -134821 123903 344115 351761 192418 42599 11511 82581 188513 274786 323543
39805 323543 369784 467187 604637 700640 709407 669026 611296 512327 387513 327843 347295
39794 347295 299123 79729 -164519 -198339 -21649 141277 166099 161500 247012 367044 399982
39783 399982 323277 188746 37017 -83283 -103030 -29060 18709 -39513 -103023 1651 294292
39772 294292 601810 739958 671611 483772 268254 57568 -142397 -295018 -342827 -285453
39762b85453P4861R564k8631K4790R6780J01220Q3704J32635J89543R4859j54758
39751C39114l29870k30593N4720K43037J63379j17387m36590o74110p27231m96870
39741b212401l0941L88239M71069K55451O9956J13429K24283J68338M72m5977
39731e98082O0571J07257k6834j95989k06954n9275J03628J70496J28668M1893
39721d74621K388L5720N4864o980o0464P205J16287J08400M1349J10076K61155
39710A95379K02144j07016l04610j59353O0010K0009j42779p6464J84131K72863
39700A44314P2125j51402j92772j37675r3167j0559J22638J80949J07568R307
39690E1326m5128j10699j68680q0420J38811K26872K3802k67770l46674j87952
$$ plain form
39762 -285453 -210592 -201028 -229659 -204869 -108089 -6869 76835 209470 399013 493872 339114
39751 339114 9244 -221349 -166629 76408 239787 122400 -314190 -988300 -1715531 -2212401
39741 -2212401 -2243342 -1855103 -1384034 -1128583 -1058627 -945198 -720915 -552577 -552105 -598082
39731 -598082 -537511 -430254 -457088 -653077 -860031 -919306 -815678 -645182 -516514 -474621
39721 -474621 -472233 -436513 -381649 -388629 -449093 -441888 -325601 -217201 -175852 -65776 195379
39710 195379 397523 290507 -14103 -173456 -113446 -93437 -236216 -312680 -128549 144314
39700 144314 216439 65037 -127735 -265410 -358577 -369136 -246498 -65549 42019 51326
39690 51326 6198 -104501 -273181 -353601 -214790 12082 35884 -231886 -578560 -766512
39680g66512J6843J51187K14765J90947Q1925K682M3879R5944J141j65503j77199
39669c09901m159J36752J12467M1939N5909Q2606O015j06977j04799J631N5159
39658c3358q386q6136r1177q0571j35644j96116j09321J56566M11686M08849J20744
39647C57136j86163k16415J7178K04767J22150j02440j96295j15222m2612o6154
39637b24070o9977J8801Q8635M6232k4026l5068o0085j49217j42900R8335L83868
39626f9472L83782R7176j36140j12381P06k5006j55099j95838o4294J46748K68010
39615A38192J73470q0469k30521q4205J79955K03141m7292k28300j43307r503
39605a28839n5773j51083o5500J35490K23012J55755M3168q9689k41546k73124
$$ plain form
39680 -766512 -749669 -598482 -383717 -192770 -110845 -108163 -64284 31660 32801 -132702 -309901
39669 -309901 -314060 -177308 -64841 -22902 33007 115613 121628 14651 -90148 -88517 -33358
39658 -33358 -41744 -127880 -219057 -299628 -435272 -631388 -740709 -584143 -172457 236392 357136
39647 357136 170973 -45442 -28264 176503 298653 196213 -82 -115304 -157916 -224070
39637 -224070 -294047 -275246 -186611 -140379 -164405 -199473 -259558 -408775 -551675 -453340 -69472
39626 -69472 314310 411486 275346 162965 163671 138665 -16434 -212272 -276566 -129818 138192
39615 138192 311662 231193 672 -83533 96422 299563 252271 23971 -119336 -128839
39605 -128839 -184612 -335695 -401195 -265705 -42693 113062 156230 66541 -175005 -448129
39595d48129p7105J86238K72079J76230M6527r8075k79445l22148n4591L11910
39585b86509L69867Q6893j52539j12423K8237N4461K9216Q0220J42563R3699l8025
39574B95660j43501j70990j05424M1802J59482J17741k4049o7126K6424Q7461
39564B17480M0778J2184N2844J8098j39360k04796k7302J88970J45331j32833
39554A71394l50446l26546j36615O3000J81866J99328J55708J26131J25732Q1366
39544B90918m4857j69026j82382p5753O7871J35584L9365j76088k83163r1440
39534d88971K58269M05199K22468m0524j38679j27962j61582k11021j66666m9237
39524d98706N4425J31646J71109R6023p7450j67556p8099K8979j1271r4286l1310
$$ plain form
39595 -448129 -525234 -338996 -66917 109313 155840 57765 -221680 -543828 -598419 -286509
39585 -286509 83358 170251 17712 -94711 -66474 -12013 17203 97423 239986 333685 295660
39574 295660 152159 -18831 -124255 -82453 77029 194770 170721 103595 130019 217480
39564 217480 258258 270442 323286 341384 202024 -2772 -30074 158896 304227 171394
39554 171394 -179052 -505598 -642213 -579213 -397347 -198019 -42311 83820 209552 290918
39544 290918 246061 77035 -105347 -181100 -113229 22355 61720 -114368 -397531 -488971
39534 -488971 -230702 174497 396965 356441 217762 89800 -71782 -282803 -449469 -498706
39524 -498706 -444281 -312635 -141526 -45503 -122953 -290509 -368608 -339629 -350900 -445186 -476496
39513d76496J33793K17637J92459J57885J12680o988j27576j09735J7221R7352
39503B08232Q6488N8461K4269n5211j21372q6290j2915k8756r7865q2578M422
39492a03115K4802l4506n3907p288K5730N5963J52395K19549P9616j82845k40047
39481f3653J3472K67208K13431m6167j84902r0068O6671J13415O5835M2707R2965
39470D90914J30290L7790j50748k37049j08145P5977Q8656l6213q3047k0065k8882
39459A59478j46271j61852J9270J76058J05143o4095r4642n756K3157j6965R863
39448C388R2539O6455r0364j78001n4579J65948K68998J79066j6225j85328k30987
39437B0910j23993O5277J98637J85201O0445o0284q8343k5233M2331Q243j43469
$$ plain form
39513 -476496 -342703 -125066 67393 225278 337958 330970 203394 93659 110880 208232
39503 208232 294720 353181 377450 322239 200867 114577 101662 72906 -24959 -107537 -103115
39492 -103115 -78313 -112819 -166726 -174014 -148284 -92321 60074 279623 359239 176394 -63653
39481 -63653 -50181 217027 430458 384291 199389 109321 175992 289407 355242 397949 490914
39470 490914 621204 658994 508246 271197 163052 239029 327685 291472 208425 188360 159478
39459 159478 13207 -148645 -129375 46683 151826 87731 -6911 -12667 10490 -6475 3388
39448 3388 95927 162382 72018 -105983 -160562 5386 274384 453450 437225 251897 20910
39437 20910 -103083 -37806 160831 346032 406477 346193 257850 232617 274948 283191 139722
39426A39722k80491k31422M978K09325J73594l6078j41211Q93K07954K10710P967
39415B65941j45057q8382N0533O9769l0357r4357n8341j1037j7781j1349Q5485
39404A5067K02005J74927l0574k28533k16299m5124L6518n4704r7926P4304K53092
39393H2753J47285j16087j50083N1551P7048j82609k67258R8665M45958K35200
39383D22423k54780l24617N0301K15506p7932l02623p0602K36835J40571j54305
39373a19223j48417J30425K39620P0220m9366L7851P8614j28666l90926l94604
39363f74472j01947K54827M30571L33208N3464j92446k24144n2825J54572K52802
39353B33610K13788R1692k7460p3006n6049n4019q4442p1860J024K3284o2421
$$ plain form
39426 139722 -140769 -372191 -367213 -157888 15706 -20372 -161583 -160690 47264 257974 265941
39415 265941 120884 32502 83035 152804 122447 28090 -30251 -41288 -59069 -70418 15067
39404 15067 217072 391999 361425 132892 -83407 -128531 -92013 -146717 -244643 -170339 82753
39393 82753 230038 113951 -36132 15419 92467 -90142 -357400 -258735 187223 422423
39383 422423 167643 -156974 -106673 108833 30901 -271722 -342324 -105489 35082 -119223
39373 -119223 -267640 -137215 102405 172625 123259 161110 239724 111058 -279868 -674472
39363 -674472 -776419 -521592 -91021 242187 295651 103205 -120939 -173764 -19192 233610
39353 233610 447398 539090 511630 438624 382575 328556 244114 172254 173278 196562 134141
39342A34141j26411m0194J03494J20301K866j07737j46630j44460r0201L1276
39332b63555J19340P9352J4836P6165J65252N7849j92857k78250j06042O3386
39322b64524N6053M0314J63409K33546L9271k36204k45171L353J75713J18358
39312H4118J9802M6575J02580M9699m7767l6578R5195K18820K24435J06342n1544
39301H11677j27491n8292P9740J39446P0119m2944j07620j13641q6837m8744l8805
39290D76608q0142j03690j4014J42032J95759R4638q228K6026J37844J92752J62831
39279A222416P8029p0190k33662k44736l9158J54649P3284j88399k85521j14111
39269C52601O7355N3267l7865k5597L3096j2820j30746j66123q1734L3357J14649
$$ plain form
39342 134141 7730 -32464 71030 191331 194197 86460 -60170 -204630 -294831 -263555
39332 -263555 -144215 -64863 -50027 26138 191390 249239 56382 -221868 -327910 -264524
39322 -264524 -208471 -168157 -4748 228798 268069 31865 -213306 -209953 -34240 84118
39312 84118 103920 150495 253075 302774 255007 218429 313624 532444 756879 863221 811677
39301 811677 684186 625894 705634 845080 915199 872255 764635 650994 564157 515413 476608
39290 476608 396466 292776 278762 420794 616553 711191 702963 728989 866833 1059585 1222416
39279 1222416 1300445 1230255 996593 751857 712699 867348 940632 752233 466712 352601
39269 352601 419956 473223 435358 409761 442857 430037 299291 133168 51434 84791 199440
39258A99440J32530L6718j47919k45189j24632P9402J29941K8387j1158Q2596
39248A60116J34852K4463j27800j70856j42760j44389j35747k0985J49874K26806
39238d6426J69254P1640J423n6763j00066q4364k9552k7795r3822j09516Q188
39227b97799J66522K15017J44914O8760M1755J8371l0824q3851j50502k53113
39217a60750l02070j55805J23986K53454R6457j05096n7182J59924K28015O8899
39207A49832r1272j11856r3005r7044j6811J58008K14704L5299j77416j88745
39197b18306o7147k0793n1574p056J20979J81818J08211j2682q3477o9047K9510
39186h9564J44919J47844K736j49110j68202q1788K8860J57825K58051J79260
$$ plain form
39258 199440 331970 368688 220769 -24420 -149052 -69650 60291 88678 77520 160116
39248 160116 294968 319431 191631 20775 -121985 -266374 -402121 -423106 -273232 -46426
39238 -46426 122828 194468 195891 139128 39062 -45302 -74854 -102649 -196471 -305987 -297799
39227 -297799 -131277 83740 228654 297414 339169 357540 326716 242865 92363 -160750
39217 -160750 -462820 -618625 -494639 -241185 -144728 -249824 -307006 -147082 80933 149832
39207 149832 58560 -53296 -146301 -243345 -260156 -102148 112556 147855 -29561 -218306
39197 -218306 -285453 -306246 -357820 -364876 -243897 -62079 46132 33450 -50027 -119074 -89564
39186 -89564 55355 203199 205935 56825 -111377 -193165 -164305 -6480 251571 430831
39176D30831q1456k44956j10455J09039R1387j01674j64315o4041l9790j32111
39166c07541j16632O2129J69486Q0454l5940m1623k9575p1800n5388P6166J64826
39155a05438Q0443q0416j71690j86491j54957m1259J41640K75981K85948J96525
39145B40286K2543k08046l21601j51636J45827K20326K4111j30097p4776L618
39135b29445k8362k2052R8096J34392M823l8078J41291K47754L0170k56037k49686
39124a67134o4185l2973j07005O346K44182K39470m9107k25696m8997K44857L25821
39113C65579J80696J3232n1705m4169n4274j25733j83490j01163R2151J80536
39103B71660M7610j42684j93486j44070j19719r4102j7192K379j04006j60156
$$ plain form
39176 430831 349375 104419 -6036 103003 194390 92716 -71599 -135640 -175430 -307541
39166 -307541 -424173 -362044 -192558 -112104 -148044 -189667 -219242 -291042 -346430 -270264 -105438
39155 -105438 -24995 -105411 -277101 -463592 -618549 -659808 -518168 -242187 43761 240286
39145 240286 262829 54783 -266818 -418454 -272627 -52301 -28190 -158287 -233063 -229445
39135 -229445 -257807 -279859 -181763 -47371 -42548 -80626 60665 308419 338589 82552 -167134
39124 -167134 -231319 -264292 -371297 -364951 -120769 118701 69594 -156102 -205099 39758 365579
39113 365579 546275 559507 507802 463633 409359 283626 100136 -1027 91124 271660
39103 271660 319270 176586 -16900 -160970 -280689 -374791 -391983 -389604 -493610 -653766
39093f53766j8688J37426Q1410m6494J9722J79953J42291k5455N293K13605K19175
39082B54472o4571k50898r0883J61427J81027J4334j07388j04125j8595R4611
39072F9411J10253q3355l22900k72828P7896L16428J69183j23483j93014l3055
39062b85464J25179J91119K11458J68284L4115r2482j13778q7512q8643n2514
39052I762O8458J35849K0311j47558j41031J7366Q6014m2907k04698j98806l5523
39041d32763J00882P9921k3750k8330R9105J67988L7125j36268j01896R5543J78715
39030C6272P2745p902M8117P7333k4233r6841k2271M1191n0127j40231l6773J40339
39018C7619J55678M9149L4415J16432J14596J0296k5519N4838J05798N7942J3379
$$ plain form
39093 -653766 -672454 -535028 -453618 -500112 -480390 -300437 -158146 -183601 -178308 35297 254472
39082 254472 189901 -60997 -151880 9547 190574 204908 97520 -6605 -25200 69411
39072 69411 179664 96309 -226591 -499419 -421523 -105095 64088 -59395 -252409 -285464
39062 -285464 -160285 30834 242292 410576 444691 352209 238431 150919 62276 9762
39052 9762 78220 214069 234380 86822 -54209 -36843 49171 6264 -198434 -397240 -432763
39041 -432763 -331881 -251960 -275710 -304040 -204935 -36947 178 -136090 -237986 -142443 36272
39030 36272 109017 101115 149232 226565 202332 105491 83220 124411 74284 -65947 -102720 37619
39018 37619 193297 242446 276861 393293 507889 518185 492666 547504 653302 711244 724623
39007G24623J9976k7197j75768k95896k76059j90191j52781j23008J1202K17741
38997b67358L26915K50920Q9345j8079o2009j17906j81279j58984l6103O5861
38987a08677O4990M8606J15583J77198P6761j33512k19293q2392J15749J89154
38977B44167J31154K7208q4554j77280j79730n9114J07510K08584J90630O0762
38967D69337j12228j89624p8490J13567J65157K1997j36510j52126o7873K380
38957C5587L3686L5165k3855j21736j29351L0065K32369K67381P0202k19460l93781
38946a83728l45396j46740K4995P8797R3201J53929J95786J30260L7923M6468
38936H5495Q5754n597j65291j60279L7497J94082J70016O9396j8586j42366k62460
$$ plain form
39007 724623 744599 717402 541634 245738 -30321 -220512 -373293 -496301 -485099 -267358
38997 -267358 59557 310477 399822 381743 319734 201828 20549 -138435 -174538 -108677
38987 -108677 -43687 4919 120502 297700 374461 240949 21656 -60736 55013 244167
38977 244167 375321 402529 317975 140695 -39035 -98149 9361 217945 408575 469337
38967 469337 357109 167485 88995 202562 367719 389716 253206 101080 33207 35587
38957 35587 69273 104438 80583 -41153 -170504 -140439 91930 359311 429513 210053 -183728
38946 -183728 -529124 -675864 -650869 -572072 -478871 -324942 -129156 1104 39027 85495
38936 85495 171249 165652 361 -159918 -122421 71661 241677 311073 292487 150121 -112339
38925a12339j92841Q8472L18887K96618J32612K1717j8128l6340j8Q6581J08377
38914F93598L1763j6506J4924l684j30611k21026j79503j09897q4371k1928O6195
38903C8954O868j85672k08502N9452L00390K33349L7987J40L4371p9150k38938
38892g51k04007m1680K00p4485p6427m479M680j2196O7293J56287R4127k2964
38880a14402J0712J27105R7892n0700r0001N853N3404J2723J3447O4843N5766
38869A86642P125K7579P1148K7744k6444K9463P7501m5621j88664r8961J06381
38858A73893R7866j08304j84907m8975O0478N0287P3225J43852R5877m1863o0288
38847B51141M144r4207l04700k85504Q958K27224K10490J89998K64063J96229
$$ plain form
38925 -112339 -305180 -216708 102179 398797 531409 553126 534998 498658 498640 585221 693598
38914 693598 725361 708855 723779 720095 589484 368458 188955 79058 -5313 -27241 38954
38903 38954 45822 -139850 -348352 -288900 11490 244839 282826 282966 317337 238187 -751
38892 -751 -204758 -246438 -246238 -320723 -397150 -401629 -396949 -409145 -341852 -185565 -91438 -114402
38880 -114402 -103690 23415 121307 70607 -19394 -13541 39863 52586 66033 130876 186642
38869 186642 193767 221346 292494 320238 293794 323257 400758 355137 166473 67512 173893
38858 173893 271759 163455 -21452 -70427 -9949 40338 113563 257415 353292 311429 251141
38847 251141 255285 161078 -143622 -429126 -420168 -192944 17546 207544 471607 667836
38837F67836p0288k05899n3797P9236k9595j37527j6203J22856L9601r1798l1623
38826B72799Q8104O4848L4040J65774K57091P0490j75896j18116J53345K60784
38816A073263J46101N0225R387j49550l64243l57736j29359m021j16710k13874
38806e6517p4634J80911L25887L13747K12880P0913l8043j2206J14260J49901
38796A187099m172j98631k31932j10957p913q243j5715P4256J93519J80623K3896
38785A081830r9258q7442q0783k12286l19164j48190K07066L69373J98888m8815
38775H61219j48102j63652j66154l2394K56281M18538K49391m3677j53208j04302
38765I73940r1260r7011p966O7861l4296j73489q4392J47436J71432q3693l17556
$$ plain form
38837 667836 597548 391649 337852 417088 387493 249966 233763 356619 396220 304422 272799
38826 272799 360903 425751 459791 625565 882656 953146 777250 659134 812479 1073263
38816 1073263 1219364 1269589 1278976 1129426 765183 407447 278088 274067 157357 -56517
38806 -56517 -131151 49760 375647 689394 902274 973187 935144 922938 1037198 1187099
38796 1187099 1182927 984296 752364 641407 633494 625251 609536 683792 877311 1057934 1081830
38785 1081830 982572 895130 814347 602061 282897 134707 341773 711146 910034 861219
38775 861219 713117 549465 383311 350917 607198 1025736 1275127 1231450 1078242 973940
38765 973940 882680 785669 777703 845564 811268 637779 553387 700823 872255 788562 471006
38754D71006l33055k51722j93677q3702J06902K21630J71213Q8957R5283J16070
38744D08905O5827Q769l375n9048j89777k24582l8970J84744J62487r7886l05684
38733h8590k59729m1455J52353K12696J41388R548p0828l8984K1534j8735j21041
38722a01843q9603J37412L36229K64968J776j45061m2467J18776J13600l3599
38712E60188j39191j18004l8978R595N634k2953k6072K4832P3810K3210j06786
38701B45285j48061N63K07902K62872J28467n8001j74793j97346j46318o6428
38691E4142k0679k1060j0368L2212N4080M8752Q0126J20717M2833j29185j72946
38680G8624j9189R4305J6455m2440R7276K01317M018k68358k11586Q8571J96853
$$ plain form
38754 471006 137951 -113771 -307448 -391150 -284248 -62618 108595 197552 292835 408905
38744 408905 474732 483501 480126 421078 231301 6719 -32251 152493 314980 217094 -88590
38733 -88590 -348319 -389774 -237421 -24725 116663 126211 55383 16399 37933 19198 -101843
38722 -101843 -191446 -54034 282195 547163 548939 403878 361411 480187 593787 560188
38712 560188 420997 302993 264015 273610 279244 256291 230219 255051 328861 352071 245285
38701 245285 97224 97787 305689 568561 697028 639027 464234 266888 120570 54142
38691 54142 33463 12403 2035 34247 88327 137079 217205 337922 380755 251570 78624
38680 78624 59435 153740 170195 127755 225031 426348 430366 162008 -49578 38993 235846
38669B35846L5365o3632L0125J03661Q5901J51626K75692J94466q1946k10185
38659G56919r0991k2619j38991j88853m6441N2843p334O504J96087K90453J36893
38648I44470k2031r812O913n4987J0109K08583J91975j00135k17034J1409Q1510
38637A050970l01085n75863k01959L76266L91575m9886k47994p6097j9210k08638
38627A38079k55589l5039J13854M2345J930J02796J29894N331o6411j2061o00
38616A64529o7924m6771P5187J16759M8072K916l5269j71863k71412j15142J51622
38605a49296J80400K395k1987J67146K46283J00622O965J22918K39028J67560
38595A062034m756j57124k80206l13258j73753J0607K9778n1788j0851J11391
$$ plain form
38669 235846 271211 207579 237704 341365 427266 578892 854584 1049050 967104 756919
38659 756919 665928 643309 504318 315465 269024 321867 314533 321037 517124 807577 944470
38648 944470 922439 912627 919540 864553 874662 1083245 1275220 1175085 958051 969460 1050970
38637 1050970 749885 174022 -27937 348329 739904 690018 442024 365927 346717 138079
38627 138079 -117510 -152549 -38695 3650 5580 108376 238270 243601 177190 165129 164529
38616 164529 96605 49834 125021 241780 289852 292768 257499 85636 -185776 -300918 -149296
38605 -149296 31104 33499 11512 178658 424941 525563 532528 655446 894474 1062034
38595 1062034 1057278 900154 619948 306690 132937 143544 173322 121534 110683 222074
38585B22074R6167q874J8308J02850j000j65258m4902K29784J61459k38112l62178
38574A0318J5946L56469K31932l9425k3084J27080N5815j44640j62355k7198R539
38563D10397o3413o6293K0645O9204M0169j7958p3539o8070N3710J72133R2133
38552E69118j04437j14242Q2117J36982r4163k94406k07888l3497l3851j08264
38542b02531n3327O3824R8067J14848J90484J84101L275j46518p1782P5670O3943
38531C20054l6703l0774M1596K3651m0695m434Q9956Q4383j8352q0455n9930l2127
38519B56170m2896p1674p9379k9848M4528O274j88975k97393n7427L57447M90240
38508C87067K38374k6916m6913K0362l277l8054l3687j17663k52645j62573J60912
$$ plain form
38585 222074 318241 309367 327675 430525 429525 264267 219365 449149 610608 372496 10318
38574 10318 26264 382733 614665 575240 552156 679236 735051 590411 428056 400858 410397
38563 410397 346984 280691 301336 370540 410709 392751 319212 251142 304852 476985 569118
38552 569118 464681 350439 432556 569538 475375 180969 -26919 -60416 -94267 -202531
38542 -202531 -255858 -192034 -93967 20881 211365 395466 398741 252223 180441 256111 320054
38531 320054 283351 252577 294173 317824 277129 272695 362651 447034 428682 348227 288297 256170
38519 256170 213274 141600 62221 32373 76901 83175 -105800 -403193 -460620 -103173 387067
38508 387067 625441 598525 551612 571974 568697 530643 496956 379293 126648 -35925 124987
38497A24987K96688K3188k90146k43651R444R0683k5078j21488j38639j05622
38487c79634N3816L04137L48319L8905l07672l39170j60890o9214n3364O8296
38477d96471K40014K74345J92678J26306M7629r5930j66179n2019Q3681N7752
38467B11806l1990k6801K536l6547j5309J45707K22859M0013j76437j45317J427
38456A91947l2691j99609k19244l8581J52056K12356R9845j71098l82398k09228
38446e96645K68415M91604J82414j99080j51820J08695Q8610j44892j56559P0688
38436c8570J55484r757j60983j52830o5553Q0241K69134K80734j4497k92968j77215
38425a26780J52207K31048M7880k1180J00052J20767m1987j50927j12904q1465
$$ plain form
38497 124987 421675 444863 154717 -88934 -79490 11193 -13885 -135373 -274012 -379634
38487 -379634 -325818 -21681 326638 365543 57871 -281299 -442189 -511403 -564767 -496471
38477 -496471 -256457 17888 210566 336872 384501 288571 122392 70373 154054 211806
38467 211806 179816 153015 155551 119004 103695 249402 472261 512274 335837 190520 191947
38456 191947 159256 -40353 -259597 -298178 -146122 66234 166079 -5019 -387417 -596645
38446 -596645 -328230 163374 345788 146708 -5112 103583 192193 47301 -109258 -38570
38436 -38570 116914 107157 -53826 -206656 -272209 -191968 77166 357900 343403 50435 -126780
38425 -126780 25427 256475 304355 283175 383227 503994 462007 311080 198176 116711
38415A16711q9855j5896R1719N7746o9714q9910j4001N583P071R7357J35980l9054
38403A93737k19365j14570J19459J25392l5305k9526J22331J29807K5260Q3141
38393D00361K29808J42901j08280j40085M7442P5972j00393j28389N6765J21338
38383E97440n460l368J78201J66135j51428l88154l17481j99261k20076j56900
38373e00352J28459L57645K96504J26346Q0891Q8358K2779l2298M443M2288L5726
38362F50789P8757J58243J21288j5627m9295M2278N3859o2819j23885p8516q3412
38351F91660j57560j30238J3206Q7205L8524j4790n6402j35554j38105K1204J15440
38340C34590m0716j51859R2935L44784Q3536m06891l90582P9384K12770j72942
$$ plain form
38415 116711 26856 10960 102679 160425 90711 801 -13200 -7617 -546 96811 232791 193737
38403 193737 -25628 -140198 -20739 104653 69348 39822 162153 291960 317220 400361
38393 400361 630169 773070 664790 524705 572147 648119 547726 419337 476102 597440
38383 597440 591980 588612 766813 932948 781520 393366 75885 -123376 -343452 -500352
38373 -500352 -371893 -14248 282256 408602 489493 577851 600630 568332 572775 615063 650789
38362 650789 729546 887789 1009077 993450 944155 986433 1040292 977473 853588 775072 691660
38351 691660 534100 403862 417068 504273 542797 528007 471605 336051 197946 219150 334590
38340 334590 293874 142015 234950 579734 663270 256379 -134203 -54819 157951 -14991
38330a4991l58502M465L15012J05209k00874j09745J40303J41967J5686J1918
38320E0448M780j20718j22785R8979K00839J8402p5765J25417K06581j27063m39207
38309a80092k55271J62225L04752K03016J48457Q4662j32561k71685j06815R1982
38299D8670k700j90983j28353N1194K8795j04362p3305N5690P9244R5455K52419
38288A11764L49023J64903r4206j38160q4124j59909k33440j01967O4324L6210
38278h5582l1421O5736J37239k6590j76836k3322J95504J04640j43135j51070
38268a34837M0133J07202L7755K9554L0465q8835j33472J09907L86363L20591
38258G04826L5734r5567q5603j74926k76736j59921J2840p2267k62572j63362
$$ plain form
38330 -14991 -373493 -369028 -54016 51193 -149681 -259426 -119123 22844 38530 50448
38320 50448 55228 -65490 -188275 -89296 111543 129945 54180 179597 386178 259115 -180092
38309 -180092 -435363 -273138 31614 234630 383087 467749 335188 63503 -43312 48670
38299 48670 45970 -145013 -273366 -222172 -193377 -297739 -371044 -315354 -236110 -140655 111764
38288 111764 460787 625690 531484 393324 309200 149291 -84149 -186116 -121792 -85582
38278 -85582 -117003 -51267 85972 59382 -117454 -140776 54728 159368 16233 -134837
38268 -134837 -94704 12498 50253 79807 110272 21437 -112035 -2128 384235 704826
38258 704826 740560 644993 559390 384464 107728 -52193 -39353 -111620 -374192 -537554
38248e37554J51378K54662R7674K2828R6802L2458k01901k61679j4844K20948
38238a39228J64674o2519j72311n2791J79867K92938J26999j86298l10826j35940
38228b95435Q0454J29511J20244J56235J04875o3067q5629J35267K70675Q7362
38218F40492j51135j54290p1369j12760j26408L2266J27059k1995j42009P372
38208B7223J81266J33321Q2310K06408J78765k27107n64498l69010O9333K19786
38198f2203J42625J60332J65531m8490k14846o2570Q6164r5599k41120M6846L48264
38187B24934J10188l08796k27573J61090J90404o5735l5191K07531J26482j79221
38177B04113j47483J53979J68129p2135o0186J36932K2716k68626j61509K14413
$$ plain form
38248 -537554 -386176 -131514 -33840 -11012 85790 118248 -83653 -345332 -360176 -139228
38238 -139228 25446 -37073 -209384 -262175 -82308 210630 337629 151331 -159495 -295435
38228 -295435 -214981 -85470 34774 191009 295884 232817 147188 282455 553130 640492
38218 640492 489357 335067 263698 150938 24530 56796 183855 161860 19851 27223
38208 27223 208489 341810 424120 630528 809293 582186 17688 -351322 -281989 -62203
38198 -62203 80422 240754 406285 357795 142949 80379 166543 70944 -170176 -123330 224934
38187 224934 335122 26326 -201247 -40157 150247 84512 49321 256852 383334 204113
38177 204113 56630 210609 378738 306603 246417 383349 406065 137439 -24070 190343
38167A90343K01421j34368j01478K91945L26353p0105j88654J06193J32997k76677
38157D77970m22681j7601L25816K30489Q7456J14681l6309l75759l50778Q6385
38147A19669K36829j17802l02186J1522K24973k8800k15347L6052K15347p1329
38137A08928l25887p1310K96646K57164J3296n0747n5470j63041j10810K07524
38127A06293L45593L9083k90538k59017r9032o6331L2808K60861K36313j06128
38117A99905k00939J75333L92592J7077l92288k02741K75495L95044J81163L6388
38107H77029k5674j73995k48935p2290J36380J59706J70446K90012K54743n5693
38097A311729k86306k17686j49788k67805k33995J36258M04285K08176j33642
$$ plain form
38167 190343 391764 257396 155918 447863 774216 704111 515457 621650 754647 477970
38157 477970 55289 37688 363504 593993 681449 796130 759821 384062 33284 119669
38147 119669 356498 238696 -63490 -51968 173005 144205 -71142 -35090 180257 108928
38137 108928 -216959 -288269 8377 265541 278837 228090 172620 9579 -101231 106293
38127 106293 451886 490969 200431 -58586 -157618 -223949 -191141 69720 306033 199905
38117 199905 -1034 174299 566891 583968 191680 -11061 264434 659478 840641 877029
38107 877029 851355 677360 428425 356135 492515 652221 822667 1112679 1367422 1311729
38097 1311729 1025423 807737 657949 390144 156149 292407 696692 904868 771226
38088G71226j96754q6845n9297m6353K2061l0304j89280j39300J00864Q4189k25880
38077D327k71142J07659L11828L3067j89055M6902L01902J42945j07942o5575
38067C14916L3399o9077r8537J20062J95154r1526k88951p6287J60088Q4326M33
38056B84000J50186J92843o7742k14284j5757R5413j27845k45785j730J66972
38046B16271R606m7475J88424K32241p8990j61448J80248K79663j23465k94993
38036D00082J32656M06331K6884l24835p4862K25347M9134j29667P9648J38747
38026I29465k41748l28221K42258N78325R2609l69412o0650L68818K80545L25851
38016A817840R91021J293081M12617p00311q78629o01635p50697q36409j68146
$$ plain form
38088 771226 574472 487627 428330 381977 404038 373734 184454 45154 146018 230207 4327
38077 4327 -266815 -159156 152672 185739 -3316 43586 345488 488433 380491 314916
38067 314916 348315 279238 180701 300763 495917 404391 115440 39153 199241 283567 284000
38056 284000 434186 627029 559287 345003 329246 424659 296814 51029 49299 216271
38046 216271 225877 178402 366826 599067 520077 358629 538877 818540 695075 400082
38036 400082 532738 939069 965953 641118 566256 791603 840737 711070 790718 929465
38026 929465 687717 359496 601754 1180079 1272688 903276 842626 1211444 1491989 1817840
38016 1817840 2808861 4101942 4514559 3814248 2935619 2333984 1583287 746878 578732
38007E78732M72202J32206m72088k16831M09533L28712j51295j63428j4317l07974
37997E95452m45916J80994O55122O1218o44450k47698M86338K60756l37249q8216
37987D76351M30830K9064o45891k85419N27554M24303j38929J00235O28801K00312
37977A747211n67457l10018L77629Q3742n96667k05397O43516M00248l76303j33554
37967A062950N60077J57660o71822k74757O29081K45153p20491l67027O24651
37958A245475K89687o71354k21242Q75497M59287o34291q0199J202464O30267
37949C095591q74526m52098J062096O23542r42939l47361J600611J285886o19464
37940D431338k84884J690145J304317p00822J13217K912915K568432l19070p4148
$$ plain form
38007 578732 1050934 1183140 711052 494221 903754 1232466 1081171 917743 903426 595452
37997 595452 149536 330530 985652 1046870 402420 154722 641060 901816 564567 476351
37987 476351 907181 936245 290354 4935 532489 956792 817863 918098 1546899 1747211
37977 1747211 1179754 869736 1247365 1331107 734440 529043 1172559 1572807 1196504 1062950
37967 1062950 1623027 1780687 1108865 834108 1463189 1708342 987851 620824 1245475
37958 1245475 1535162 863808 642566 1518063 1977350 1343059 1262860 2465324 3095591
37949 3095591 2221065 1768967 2831063 3454605 2511666 2164305 3764916 5050802 4431338
37940 4431338 4146454 5836599 7140916 6440094 6553311 9466226 12034658 11715588 11641440
37931A1641440L007136L031380O40456K597958P969437Q727492O330881J1208772
37923E5154952K2205789K7192251L1273719N7629301J01990879J12830746M9693867
37916D57971504n2621322j14297092j02151444n7646775l1581027k7158748k1333986
37909E1181110r838880n038726p667263p075702j978101m36959l148308l233144
37901A2764027j76037N4658k772150l004471k00727M54455j706590k033287K63633
37892C643511J009933o83877j155400M16231P43000q48695j213859L47728Q51451
37883C110023n21622j072736N2868M83945n05786p23660M21822P71061k87209
37874A728706p03588J52228L98792n05936p29750K50411O43493j23723m05853
$$ plain form
37931 11641440 14648576 17679956 18320412 20918370 28887807 37615299 43946180 55154952
37923 55154952 77360741 104552992 135826711 193456012 295446891 408277637 457971504
37916 457971504 405350182 291053090 188901646 131254871 99673844 72515096 51181110
37909 51181110 41342230 36303504 28636241 21560539 19582438 19145479 15997171 12764027
37901 12764027 12587990 12642648 9870498 6866027 6665300 7119755 5413165 3379878 3643511
37892 3643511 4653444 3969567 2814167 3230398 3973398 3124703 1910844 2258572 3110023
37883 3110023 2588401 1515665 1568533 2052478 1546692 823032 1244854 2015915 1728706
37874 1728706 1025118 1177346 1576138 1070202 340452 590863 1234356 1110633 704780
37865G04780L10318M62619l68697n92173K31031N26600j86737m11462L08438M95437
37855A480154l06722o22655N6183L23061l16729m78712L07653N86120k28250o82518
37845A17585p230N14686M2214l43196J67165O49467L49559q610J02202j537n51965
37834A030340n91736J37102M68968r4160m55976J2106L84577O6274j43667J94362
37824A008190K54801k31604j81115P48153J166140K43611q01380p55978k54535
37815A196283k84982m66315j67290J19968j24341k93659J31802M64317J04470
37806F80253k72684j1824K60539j22328n35802k22334K91479J81499k31209k16579
37796a98990N9569P7891j0891P8396K9383l31334m06830J39541O02512L76748
$$ plain form
37865 704780 1015098 1477717 1109020 516847 747878 1274478 1087741 676279 984717 1480154
37855 1480154 1173432 550777 606960 930021 613292 134580 442233 1028353 800103 117585
37845 117585 110355 625041 667255 324059 491224 1140691 1490250 1481640 1583842 1582305 1030340
37834 1030340 438604 575706 1044674 950514 494538 506644 891221 957495 813828 1008190
37824 1008190 1262991 1031387 850272 1598425 2764565 3008176 2206796 1450818 1196283
37815 1196283 911301 444986 277696 397664 273323 -20336 111466 575783 680253
37806 680253 407569 395745 656284 533956 -1846 -224180 67299 248798 17589 -198990
37796 -198990 -139421 -61530 -72421 5975 35358 -295976 -702806 -563265 39247 415995
37786D15995k6934K648R8846j99284m34075j09460K95071J94427n5278M6155J45692
37775C73803j71579m30605j27116K57564J26574j23139J01695M34689K53849j53174
37765E42561j82558k1221j29415k56462o308K32389l5947l89325j81363K87131
37755a40518L15668O086q9455j9350j33639k22420N2941L32412J35869j93937
37745D3657q9661J84336O8986j79195L1515M60075M20820m945j90500r0650j29694
37734E24744k49972q2523J82328P7828k15377j74088Q1300M7343j68897q3779
37724f1093J69217O9518k56519k20184J54672L02330J36414O4391J09667m0404
37714D28009k30706l9789L11396K17400k16441l13892k0220M9072k29881k91830
$$ plain form
37786 415995 389061 391709 490555 291271 -142804 -252264 42807 237234 181956 228111 373803
37775 373803 202224 -228381 -355497 -97933 28641 -94498 7197 441886 695735 542561
37765 542561 360003 338782 209367 -47095 -53403 178986 143039 -246286 -427649 -140518
37755 -140518 175150 181236 91781 72431 -61208 -283628 -230687 101725 237594 43657
37745 43657 -46004 138332 207318 28123 59638 519713 940533 935588 745088 654438 524744
37734 524744 274772 192249 374577 452405 237028 62940 144240 191583 22686 -61093
37724 -61093 108124 177642 -78877 -299061 -144389 157941 294355 358746 468413 428009
37714 428009 197303 157514 468910 686310 469869 155977 135757 184829 -45052 -336882
37704c36882M7973K95748K11479J29755J75177M1530k47243k21586J49600K87585
37694E33136j7182k50424r4813O2962j01815k82571j37897J37015K22927J65672
37684B37010J24337O9859j630L4241J26595O0197j00785m8289J76701J55401j86869
37673F46768l75753j24380K35410L10962J76598P9261K8962m3094n4668N5332
37663I35398J83016K38328K27158J07522j42444l13774j80541Q1321Q2114j85202
37653A032896l61845l17666k55039k24583o2140J52009J19525j04741j17346J39888
37643I58K43773N025k26233j65385J8107J26133K29310L09514J27952k69177m09828
37632i851q3512K78592K43295k4994j50822j30966j42595j19903N5244K05574
$$ plain form
37704 -336882 -288909 6839 218318 348073 523250 564780 317537 95951 245551 533136
37694 533136 515954 265530 170717 233679 131864 -150707 -288604 -151589 71338 237010
37684 237010 361347 431206 429576 463817 590412 650609 549824 501535 678236 833637 646768
37673 646768 271015 146635 382045 693007 869605 948866 977828 934734 880066 935398
37663 935398 1118414 1356742 1583900 1691422 1548978 1235204 1054663 1135984 1218098 1032896
37653 1032896 671051 353385 98346 -126237 -188377 -36368 83157 -21584 -138930 958
37643 958 244731 249756 23523 -141862 -123755 2378 231688 541202 669154 399977 -9851
37632 -9851 -93363 185229 428524 403530 252708 121742 -20853 -140756 -85512 120062
37622A20062J09880r1581j09242L4030Q9921J2372j5946Q3237J89139J93904J14152
37611G29928O099r4505j54792j40826l1368J47094K62512J53790j21908k57254
37601D98770r5440J01676M5792j04057k2765J93066J86983o225j1248J95099K18755
37590A200406m0964k01902q9292l3107k18492l02531l8127K21692Q5463k15247
37580C67899k11383N5096J63670O678j22349m5766R3722J29504O7613j4941n3637
37569D36106M11J08672J40947O1428M887N2858R3304M1816J6649J10895J69600
37558A237573K0264k11666k59932j06062J8716j8967j11734j24282q3888j01005
37548B59017j83753k03571o2194J37842J80084L0165q4848k366J18966N3057j24307
$$ plain form
37622 120062 229942 138361 29119 63149 153070 165442 149496 232733 421872 615776 729928
37611 729928 736027 641522 486730 345904 314536 461630 724142 877932 756024 498770
37601 498770 403330 505006 550798 446741 423976 617042 804025 797800 786552 981651 1200406
37590 1200406 1159442 957540 868248 835141 616649 314118 275991 497683 583146 367899
37580 367899 156516 211612 375282 381960 259611 213845 307567 437071 504684 489743 436106
37569 436106 436517 545189 686136 747564 752451 805309 898613 940429 957078 1067973 1237573
37558 1237573 1257837 1046171 786239 680177 698893 679926 568192 443910 360022 259017
37548 259017 75264 -128307 -190501 -52659 127425 157590 72742 70376 189342 242399 118092
37537A18092j71155p3624j1776j3777L3271Q6733J3389q8477j0906J41970P2166
37526I5906j64344j88399O6009K33229J44824O9758J56709J60476k8040r6327
37516D49801J18726K58215L4135k38077j47589J40184K00092L3217n7095l4242
37506G57367p6513j34941k7108J48922J42534n98l1370M9452L3917p4030p9397
37495G08235J9533M3880j9784m3560o2271j87278k89146j57474P8864R9392p5020
37484A15371j15352O2755K06904J96914J70541J54146J9024j44340p9912J30805
37474G16856J19988j03348r3906K39794L77893L1578l32731k41967L0609m522
37464G40244k09382j32722J51454J97680l710m5788J45250K17862N0304r5641
$$ plain form
37537 118092 -53063 -126687 -138463 -152240 -118969 -32236 -18847 -107324 -118230 23740 95906
37526 95906 -68438 -256837 -190828 42401 187225 256983 413692 574168 546128 449801
37516 449801 568527 826742 860877 622800 475211 615395 815487 848704 791609 757367
37506 757367 680854 545913 518805 667727 810261 809663 778293 827745 861662 787632 708235
37495 708235 727768 771648 751864 708304 646033 458755 169609 12135 90999 190391 115371
37484 115371 19 62774 269678 466592 637133 791279 810303 665963 586051 716856
37474 716856 836844 733496 639590 879384 1257277 1288855 956124 714157 744766 740244
37464 740244 530862 398140 549594 747274 743564 697776 843026 1060888 1111192 1015551
37454A015551j07911j43006j68195L3765L27465K91153o2077k35348o2005P1552
37444I60944p397K7639K66621K93112L234q0523K44328M10287J13999o2833K67444
37433B436855N19172K64108J65149P42402J236447J003922R60691J988875L104426
37424A2422047L481713N087692R809251J4191012J1431211L93795j1033351j4463471
37416C1319899j0302528n402203l705512l352055k062393p28927o94801j079131
37408C992349o52156l1757k42851p48576n32354Q3920J62322k19138l38219j43036
37398A330504q5639j76029j35236m4712q2781n7311J61331K28305p3129l42454
37388G22849k36041p1176j84145k67411K5911L64451K89094N098k4258J44205
$$ plain form
37454 1015551 907640 764634 596439 630204 957669 1248822 1186745 951397 889392 960944
37444 960944 953547 981186 1247807 1540919 1544153 1463630 1707958 2118245 2232244 2169411 2436855
37433 2436855 2956027 3220135 3385284 4127686 5364133 6368055 7328746 9317621 12422047
37424 12422047 15903760 20991452 30800703 44991715 56422926 56816721 45783370 31319899
37416 31319899 21017371 15615168 11909656 8557601 6495208 5766281 5071480 3992349
37408 3992349 3340193 3308436 3065585 2317009 1784655 1868575 2030897 1811759 1473540 1330504
37398 1330504 1244865 1068836 933600 888888 806107 748796 910127 1138432 1065303 722849
37388 722849 486808 415632 231487 -35924 -10013 354438 643532 648630 624372 768577
37378G68577J70060N4271k9943j40868k89443j81186K54482N25059K83062q3376
37368A330695q0776J56714K90210L95925N73856M83370o3317n42600m42100o7773
37358B034204N6119P5566L24904M72541N3002n43954n65075j02515J11297q8224
37348A827865k06925p2265q386q5997l2618J19535O1696j32253j01084Q6038L1585
37337A487191k12833k13640J7072J5269k81684m09893j84800N3541R2169J02948
37327D65340J63187J20005J383k180J6232j77586m01716k61584J23069K49953
37317B96103O9469K638J34353J16522q9020j17368O4564O6705j63078k11223K6741
37306A96406J55922K4944m2162P5680Q4772p8987r2935P7392N1500k15168k68866
$$ plain form
37378 768577 938637 992908 962965 822097 532654 351468 605950 1131009 1414071 1330695
37368 1330695 1249919 1406633 1696843 2092768 2666624 3149994 3086677 2544077 2101977 2034204
37358 2034204 2090323 2165889 2490793 2963334 3016336 2472382 1907307 1804792 1916089 1827865
37348 1827865 1620940 1548675 1540289 1454292 1421674 1541209 1602905 1470652 1369568 1455606 1487191
37337 1487191 1274358 1060718 1077790 1093059 811375 401482 216682 270223 362392 465340
37327 465340 628527 748532 749915 747735 763967 586381 184665 -76919 46150 296103
37317 296103 365572 368210 502563 619085 530065 412697 477261 543966 380888 169665 196406
37306 196406 352328 377272 335110 410790 495562 416575 323640 401032 452532 237364 -31502
37295c1502K6218K24204R7936j2221Q4868Q9551j15750j69405O7169K02449L4795
37284D98312j04669l5056l8702j86550j09163K28417L20803M7452m1106K54366
37274H34104L97514J95866K35074O83146Q22492N40225R96917K622436L612935
37265A0940709K059816j126929l148712k856260j691142j161127j089151p55066
37257A172138k79819j10686j32943m3260N1249j6014n6595O6705R2441j60298
37247E82918l77073k05896J95510M07281K89842K3200j78200k02266p8220J6770
37237D73866l5190q6601L9509J92640J17000o0278q483J84468R4358k91523m68045
37226A51721k01585J14328J23745K4999J14570K55533J79111j7998o7873J0051
$$ plain form
37295 -31502 -5284 218920 316856 304635 389503 479054 363304 193899 261068 463517 498312
37284 498312 393643 358587 319885 133335 24172 252589 573392 620844 579738 834104
37274 834104 1231618 1427484 1662558 2345704 3168196 3708421 4705338 7327774 10940709
37265 10940709 13000525 11873596 8724884 5868624 4177482 3016355 1927204 1172138
37257 1172138 892319 781633 648690 605430 656679 640665 584070 650775 743216 582918
37247 582918 205845 -51 195459 602740 892582 915782 737582 535316 457096 473866
37237 473866 438676 352075 391584 584224 701224 640946 632463 816931 911289 619766 151721
37226 151721 -49864 64464 188209 213208 327778 583311 762422 744424 676551 686602
37216F86602k031j40709k74022l52345l79227k65607K5906K98633L30232J84544
37206A11976R7682J29637J46885R2944M9110L7547k5116j40295j65121j3377J92964
37195E14836K58014J40452k3020r3097n6816J6703P1782P5742K218j12852j51354
37184F42608o3097R347q1812k04310q2445K39385L53549O0219k91600k83064k0357
37173B78423P7188o9057j46985j6266Q8466L612p8118M1309K05305J48267o7120
37162D65024j36034K1750J46758M3388j22318q4317R6082R7564j67806l77910
37152a7819k49560M2300J25907k5590j15383k7614L8709j9269k1175J34117K40125
37141A04748J21339o6366j05354o0034j02101j83604j48727k6754L7959L1758
$$ plain form
37216 686602 684571 543862 269840 -82505 -461732 -727339 -701433 -402800 -72568 111976
37206 111976 209658 339295 486180 579124 628234 665781 640665 500370 335249 321872 514836
37195 514836 772850 913302 890282 797185 740369 757072 828854 904596 906814 793962 642608
37184 642608 579511 588858 507046 302736 220291 459676 813225 873444 581844 298780 278423
37173 278423 355611 286554 139569 123303 211769 215381 137263 178572 383877 532144 465024
37162 465024 328990 350740 497498 540886 418568 334251 430333 527897 360091 -17819
37152 -17819 -267379 -225079 -99172 -124762 -240145 -267759 -229050 -248319 -269494 -135377 104748
37141 104748 226087 159721 54367 -5667 -107768 -291372 -440099 -466853 -428894 -397136
37131c97136K3530p488p7579o2740J11257K63936J83073n3221k03277j96388j13221
37120e29254L3957K36955L27152J70669m9643l8575J76669K95854J88133K932
37110H14849j37634k65686l64955l11209q7433J39226K19880J64494N9580k8419
37100B02693o3793n7771n8650o7258l8390q668o7474j35031L31K97422L93136
37089C96547J27182j50482q3600J49081J52516n7696j62342j02289r0198j55766
37079B2953j15298M3144J39725J43481J67919J64668o067k29792k39963n2897
37069C7873O2633L3487L6236J23287J65001J47472J59226J16377j04569l03763
37059D73260j68003J76829K91666J06417k0960M1575K8676j43476j85627j003
$$ plain form
37131 -397136 -373606 -381094 -458673 -521413 -410156 -146220 36853 -16368 -219645 -416033 -529254
37120 -529254 -495297 -258342 68810 239479 189836 151261 327930 623784 811917 814849
37110 814849 677215 411529 46574 -264635 -352068 -212842 7038 171532 231112 202693
37100 202693 138900 81129 22479 -44779 -83169 -91837 -159311 -294342 -294011 3411 396547
37089 396547 523729 373247 289647 438728 591244 533548 371206 268917 178719 22953
37079 22953 -92345 -49201 90524 234005 401924 566592 560525 330733 90770 37873
37069 37873 100506 133993 170229 293516 458517 605989 765215 881592 777023 473260
37059 473260 305257 482086 773752 880169 859209 900784 929460 785984 600357 599354
37049E99354R0837o8575j74701j4754J41181K7957j53287j22010j1551r4256k89350
37038f9155l13596j25590Q9385K13716K30670J32429j450j2844Q7558R6543k5604
37027C02062n4582Q7459J48638j3002j44453k6846J25544K2320k09295k38345
37017e00m0167J43273K00235J97489J54800M9871m6042n9446l7189j2441Q6002
37006F35885K25178J91768o4464k50531j51933K493r1054k88864k18461J09415
36996I9432K93719J20116j83953l01502j83067m556N9076j8933j02571m1788J18922
36985a45105J73495M3370j13984j52055j08086m3481P4002K11328K20318Q9262
36975B49064J6615Q5295J13680k47o6577M4626J18538o1599l28461l84936k40252
$$ plain form
37049 599354 690191 621616 446915 432161 573342 601299 448012 326002 314451 220195 -69155
37038 -69155 -382751 -508341 -418956 -205240 25430 157859 156409 143565 231123 327666 302062
37027 302062 247480 334939 483577 470575 326122 299276 424820 447140 237845 -500
37017 -500 -40667 102606 302841 500330 655130 705001 658959 599513 562324 549883 635885
37006 635885 861063 1052831 988367 737836 585903 588396 497342 208478 -9983 99432
36996 99432 393151 513267 329314 27812 -155255 -159811 -100735 -119668 -222239 -264027 -145105
36985 -145105 28390 71760 -42224 -194279 -302365 -345846 -271844 -60516 159802 249064
36975 249064 265679 350974 464654 464407 397830 442456 560994 499395 170934 -214002 -454254
36964d54254r6598J0128J50466K47555J91409P6385M7365M3638m2398j06330r774
36953E7592J32443J26688K0809k5968m0533j16457j56326m2980P9828K0250j05240
36942d9894o1418Q6246R2695k8002m5619P0100J24378N2098k1075m5636q8180
36931H5693j37764j33677j30097j83569j67240L6005K61935K74252J36591P5598
36921A17727Q8828J3788j18834j40489o2899j1481N3293K07030K81690R9316j32338
36910C95631p9188J57996J87439l8384j99520j77010j52078j45856K1227K61603
36900B31860K34798n8684j92801K1940K53946K04461R436j09633j82512k54877
36890A57934j96963J0256J30765M6598l2474N1546J24197J2010j29273p4978J11568
$$ plain form
36964 -454254 -550852 -540724 -390258 -142703 48706 125091 172456 216094 173696 67366 57592
36953 57592 190035 316723 337532 311564 271031 154574 -1752 -44732 35096 55346 -49894
36942 -49894 -111312 -25066 67629 39627 -5992 64108 188486 240584 219509 173873 85693
36931 85693 -52071 -185748 -315845 -499414 -666654 -630649 -368714 -94462 42129 117727
36921 117727 206555 220343 101509 -38980 -101879 -113360 -60067 146963 428653 527969 395631
36910 395631 316443 474439 661878 623494 423974 246964 94886 -50970 -29743 231860
36900 231860 466658 407974 215173 237113 491059 695520 704956 595323 412811 157934
36890 157934 -39029 -28773 101992 148590 116116 167662 291859 303869 174596 99618 211186
36879B11186K17566J84383P8254o0253j72008j61267n7692k1989r3750j29194
36869d764n6772L5351J17441K50666L49560K30768k5272j10816Q777J1014k24171
36858E81782l73599j97216Q0158J64855J16152R8975N3126q8883j59580m6601
36848B29169M7981n5478j81579j11513L2967L6568k9022j14M6222q625l4993Q2801
36836E4384J43743k0033j38767R4380M25531L60611l9279k27838j7219J80600
36826H16113L7910k37574l00338j43773R667K7423p8407k11762k12786p388K15093
36815h5822J86001m7708j57941j7689J21006L7835j26398j22888K1041P7105l5655
36804a51113j68613j71234n4485Q0949J80461K52596K83897K02721j8813k54853
$$ plain form
36879 211186 428752 613135 691389 631136 459128 297861 240169 218180 124430 -4764
36869 -4764 -61536 -26185 91256 341922 691482 922250 896978 786162 794939 805953 581782
36858 581782 208183 10967 91125 255980 372132 471107 524233 435350 275770 229169
36848 229169 277150 221672 40093 -71420 -38453 -1885 -30907 -31021 15201 6576 -28417 54384
36836 54384 198127 178094 39327 133707 559238 919849 880570 652732 635513 816113
36826 816113 854023 616449 316111 172338 182005 209428 131021 -80741 -293527 -300915 -85822
36815 -85822 100179 52471 -105470 -123159 -2153 35682 -90716 -213604 -192563 -115458 -151113
36804 -151113 -319726 -490960 -545445 -464496 -284035 -31439 252458 455179 436366 181513
36794A81513l18296j84561j6496O8182J16602J64058J13765o7676j91547p8911
36784b13367J53688K44796J52018N7939N9696O7308N048q2261j44844j85717j80051
36773f5747q2244O0411J25629P1774k3484q1128q1894k7208N3633P4630j7936
36762F436j41351j65548q6502o208L2120O9818J11402J01098K5984n7240j01673
36751b11664r7950m2997L3980M5022n5379j60840j09235J09096L23262L68488
36741B01783K38363N1922p6088j22206j33868j32583p8218K2623M2078j06028
36731i2222k71644k17167M2523K50020K70359K12183J48712M168j85026k06742
36721d4836l5639M5495j02312k10105n6878J22960L9003j28204l3234K10566K05091
$$ plain form
36794 181513 -136783 -321344 -337840 -269658 -153056 11002 124767 57091 -134456 -213367
36784 -213367 -59679 185117 337135 395074 454770 522078 527126 444865 300021 114304 -65747
36773 -65747 -147991 -87580 38049 109823 86339 5211 -76683 -103891 -50258 24372 6436
36762 6436 -134915 -300463 -386965 -393173 -361053 -291235 -179833 -78735 -52751 -109991 -211664
36751 -211664 -309614 -352611 -318631 -273609 -328988 -489828 -599063 -489967 -166705 201783
36741 201783 440146 492068 415980 293774 159906 27323 -50895 -28272 13806 -92222
36731 -92222 -363866 -581033 -538510 -288490 -18131 194052 342764 346932 161906 -44836
36721 -44836 -80475 -34980 -137292 -347397 -404275 -281315 -242312 -370516 -403750 -193184 11907
36710A1907m7667j45049M4836K00197J03147o2658r5582o7709p5628l5880R3495
36699g6591J63973Q0064l4993n4315j6368K9472J20918K16028J59487n8272k23775
36688C05628k05804j26212j05495o5440O3709J57708J04431J5316L8815J07622
36678B90278O2778p9119j61224j16331j4958O3446R5339R1300Q0377P3781K8115
36667D13782p5720j37188o0669M5506n390j49698j22299J11072K55085J40361
36657D14842j3494J4561P2011p6760l01671k90889o4818N1895m8519j04104P5993
36646b70953L07799L22590J55869M7824O1751J8282j81836l56223k78545j8626
36636a92068J26933M2129n6521L7622K03340J91194J2873j03699q3743o6275j01353
$$ plain form
36710 11907 -35760 -180809 -135973 64224 167371 104713 9131 -58578 -134206 -170086 -76591
36699 -76591 87382 167446 132453 78138 61770 91242 212160 428188 587675 529403 305628
36688 305628 99824 -26388 -131883 -197323 -133614 24094 128525 143841 182656 290278
36678 290278 353056 273937 112713 -3618 -18576 44870 140209 231509 311886 385667 413782
36667 413782 338062 200874 140205 185711 180321 30623 -91676 19396 274481 414842
36657 414842 401348 415909 487920 411160 109489 -181400 -246218 -194323 -242842 -346946 -270953
36646 -270953 36846 359436 515305 563129 624880 643162 461326 105103 -173442 -192068
36636 -192068 -65135 -23006 -79527 -41905 161435 352629 365502 261803 178060 111785 10432
36625A0432o9144L6168J9773j82543l24478j81691J14578K67653K06755R9782
36615b715P0235Q5228P8213L3155l6079r4619j00671o4040l5793j0273O6935J64010
36603A53586J67563O7903j3527l9896j17648k51940k57453o0235J19083Q2001
36593a50563l2873Q002J31392Q8033j07125j80301l4189J18330J10475N0832Q8039
36582I0052J55109J00238n7343j56469j21569l6027J085l127J4655N9228P4637
36571A20469N2733O8306J55821K23076J84101J14049J27010J50814L2312j41822
36561A086869j02522J45287K22641p8048m14451l43968M0189K59262J31214n5544
36551H90929m0928P9411J09259N0491O559j2771m6396p3263o1281k6818K6037
$$ plain form
36625 10432 -58712 -22544 -2771 -185314 -509792 -691483 -576905 -309252 -102497 -2715
36615 -2715 67520 152748 230961 264116 228037 133418 32747 -31293 -67086 -77359 -10424 153586
36603 153586 321149 389052 375525 335629 217981 -33959 -291412 -351647 -232564 -150563
36593 -150563 -183436 -175434 -44042 43991 -63134 -243435 -277624 -159294 -48819 2013 90052
36582 90052 245161 345399 288056 131587 10018 -26009 -24924 -28051 -13396 45832 120469
36571 120469 173202 241508 397329 620405 804506 918555 1045565 1196379 1228691 1086869
36561 1086869 984347 1129634 1352275 1274227 859776 515808 555997 815259 946473 890929
36551 890929 850001 929412 1038671 1089162 1095721 1082950 1036554 963291 902010 875192 901229
36540I01229J19165J96317J33801o4913k10224j66232m2816k5328r8928r5216
36530F46855K4728J00666J8728j13575j29403n2040n2487j76572k55363j44988
36520a33451N7583J47038Q5549J1212Q178K3833J7252K5395L8792l0420j82296
36509F8665k73116k16040j08611o2468l5697M6089J20922Q5461k4425p8718j8542
36498d96480J15094K34898K20842J6348k01175j32997K13164M19873K03205j49725
36488D43047j87786L5788R5971r3164j62639O2283K46568P2888k70969l95126
36478a53139k46460o5945K0656Q3155J42591J12064j2636r3067k0513J58030L06926
36467B31662L27174K14704M6681q8622j66528k14186k37395k17505j70564j25666
$$ plain form
36540 901229 1020394 1216711 1350512 1285599 1075375 909143 866327 840999 742071 646855
36530 646855 671583 772249 790977 677402 547999 495959 443472 266900 11537 -133451
36520 -133451 -75868 71170 156719 167931 176109 199942 217194 242589 281381 250961 68665
36509 68665 -204451 -420491 -529102 -591570 -627267 -581178 -460256 -374795 -399220 -477938 -496480
36498 -496480 -381386 -146488 74354 90702 -110473 -243470 -30306 389567 592772 443047
36488 443047 255261 291049 387020 293856 131217 193500 440068 512956 241987 -153139
36478 -153139 -399599 -465544 -444888 -361733 -219142 -107078 -119714 -212781 -233294 -75264 231662
36467 231662 558836 773540 820221 731599 565071 350885 113490 -104015 -274579 -400245
36457d00245n0834R2727K22438J98290M4860l9250M3616J46905R4992q6531k46493
36446B0475k91006j97022K1708K44502K76540J00107l5073N1413J70995L8673
36436D01312k45135k87939J2186K92997K52111O4186O5274K31685K61142P3702
36426A121521q4850o1800k6549j53320l06422k47270j3834J39312J15827N9098
36416E41713O8601P2766L4144M9137J35036J31097k7369j25238K5058K36402J73578
36405A314925j45658l59091k67209n7048L4303J6532n535m4643j23024j33175
36395B30377o509J04943K8454j26385r4907J27935K37574N8053j71932j13603
36385B74000J83163L14753N5115l37893m54180k36355K0243J06829J10908J50989
$$ plain form
36457 -400245 -451079 -358352 -135914 62376 107236 67986 111602 258507 353499 266968 20475
36446 20475 -270531 -467553 -445845 -201343 75197 175304 140231 191644 362639 401312
36436 401312 156177 -131762 -119576 173421 425532 489718 554992 786677 1047819 1121521
36426 1121521 1036671 974871 948322 795002 488580 241310 227476 366788 482615 541713
36416 541713 610314 683080 717224 766361 901397 1032494 1005125 879887 904945 1141347 1314925
36405 1314925 1169267 810176 542967 485919 520222 536754 531219 486576 363552 230377
36395 230377 223868 328811 357265 230880 135973 263908 501482 559535 387603 274000
36385 274000 457163 771916 827031 489138 34958 -201397 -181154 -74325 36583 187572
36375A87572J43952q031j77895j76034m7424J5882p998K2494J22217J52351R7152
36364C24238J06677K02573J95713K960j86451j95734j02090m4922J542Q3670R0076
36353D78252n9772k02566j47841J0862M9449k1716k0528M4744j5764j98264k48025
36342c31169n8468J43051J38079J6649l0295k4480r2815j73399p8123J74147L13276
36331c547J71794p9213j59395m2861N2933Q762l9634M6653J55961R1326r2641
36320A10138j44234j2640O0456n4113j31822L6166K46908J63805j32730k33340
36310i1406k4564J48059L7327j36135p5110J14656J18454q4672k11507j00566
36300c05464J09045K15685J65952J9060j27511j63762o5303L0015j9591j38153
$$ plain form
36375 187572 331524 323493 145598 -30436 -77860 -61978 -69976 -47482 74735 227086 324238
36364 324238 430915 633488 829201 832161 645710 449976 347886 302964 304506 388176 478252
36353 478252 418480 215914 68073 78935 128384 106668 86140 130884 115120 -83144 -331169
36342 -331169 -389637 -246586 -108507 -91858 -122153 -146633 -239448 -412847 -490970 -316823 -3547
36331 -3547 168247 89034 -70361 -113222 -60289 -51527 -91161 -44508 111453 202779 110138
36320 110138 -34096 -46736 13720 -40393 -172215 -136049 110859 274664 141934 -91406
36310 -91406 -115970 32089 69416 -66719 -141829 -27173 91281 6609 -204898 -305464
36300 -305464 -196419 19266 185218 204278 76767 -86995 -152298 -122283 -141874 -280027
36290b80027j27113K5660J20806O0876r475M6389J48715J57445Q5237K0037m1976
36279B06574j37330k02371j55451n1310n881j1103K9869J13535J34288O7989J1811
36268F20J9115K4556k6088q3049q5068n9683o7824r8828p6623M0015J82771K11376
36256a8710O5695j15468j17586O1338J67775M1586j28253p4293J37928K14532
36246B34544Q8307j6940K0560O2943O471o6540j26146k72414m30201l03325J32901
36235f69840M14493J89739k26035k85253M068J74507O2752k9852N0713N1026j77984
36224d41666l42460j43859K45399M25580K95073Q4310J235O1104J74295K17167
36214E76178Q3924j78409l42714k36942L8426K22294J71720l8116k20780k22529
$$ plain form
36290 -280027 -407140 -381480 -260674 -199798 -209273 -162884 -14169 143276 228513 248550 206574
36279 206574 69244 -133127 -288578 -339888 -345769 -356872 -327003 -213468 -79180 -11191 620
36268 620 19735 44291 18203 -64846 -149914 -209597 -277421 -376249 -452872 -412857 -230086 -18710
36256 -18710 46985 -68483 -186069 -124731 43044 84630 -43623 -117916 20012 234544
36246 234544 322851 305911 326471 389414 395885 329345 203199 -69215 -499416 -802741 -669840
36235 -669840 -255347 -65608 -291643 -576896 -572828 -398321 -335569 -365421 -314708 -263682 -441666
36224 -441666 -784126 -927985 -682586 -257006 38067 122377 123612 184716 359011 576178
36214 576178 660102 481693 138979 -97963 -59537 162757 334477 296361 75581 -146948
36204a46948l8912J55761J75653N1152j9927L2753O6833j4739j10143j15515q4438
36193d8470o7464J3533J67498J98089j9244k67144k33218O0205K98294K85532
36183C87611J06066p5329j61682j05058N6757J56169O7480r6343j27992k5595
36173A82084M3963L4858M2311N2614n9720k48099k74804o7672J44424J72205J16037
36162A38201J22417J07812n4125k25910j53097J36729L27218K26828p735j23414
36152D94924q7107m4033o2394o2851P938O0660r892j48238j91823r1748L1152
36141a03412Q1406J16554J95882K21637Q0608j30984k06010j24900o6897j11558
36131d7674j26928j5619J12959J19378L4914k7098l6743j6512L4920P7404J5627
$$ plain form
36204 -146948 -185860 -30099 145554 196706 176779 209532 276365 261626 151483 35968 -48470
36193 -48470 -115934 -102401 65097 263186 243942 -23202 -256420 -196215 102079 387611
36183 387611 493677 418348 256666 151608 208365 364534 432014 335671 207679 182084
36173 182084 226047 260905 303216 355830 296110 48011 -226793 -294465 -150041 22164 138201
36162 138201 260618 368430 314305 88395 -64702 72027 399245 626073 618338 494924
36152 494924 407817 363784 301390 238539 246477 307137 297245 149007 -42816 -134564 -103412
36141 -103412 -22006 94548 290430 512067 592675 461691 255681 130781 63884 -47674
36131 -47674 -174602 -190221 -77262 42116 77030 49932 13189 -3323 31597 109001 124628
36120A24628j24439j47043K4699J58792L1731j90198j73603M4524Q5852j65382
36110c30439l43367j47060J93461K50758J054j98070j33844L7742Q3835k1653
36100f07583j49290j88734j31044p9916j70775l71337m15822j01680L83233O26614
36090a206334M83734K00706L6108l370M128O7180J60568J60948N9570L8500J69683
36079A71421K43573R6962r1345p9194M4677L6105p6449o5890P8734J47328P7415
36068E83337J040n0445j48730j89399O797K78513K27737j48435l55740j29295
36058G5380J49991N6522k27470k46035R727J54843M8578n1436M0707J78218J57472
36047C46497m414j48926j66590o2831N2495M5068q1012j52101n3690J01433J50675
$$ plain form
36120 124628 189 -146854 -122155 36637 68368 -121830 -295433 -250909 -165057 -330439
36110 -330439 -673806 -820866 -627405 -376647 -375593 -573663 -707507 -669765 -585930 -607583
36100 -607583 -756873 -945607 -1076651 -1156567 -1327342 -1698679 -2114501 -2216181 -1832948 -1206334
36090 -1206334 -722600 -521894 -485786 -489156 -485028 -417848 -257280 -96332 -36762 1738 171421
36079 171421 414994 511956 420611 341417 386094 422199 345750 279860 358594 505922 583337
36068 583337 584377 533932 385202 195803 202600 481113 708850 560415 204675 75380
36058 75380 225371 281893 54423 -191612 -181885 -27042 21536 -29900 10807 189025 346497
36047 346497 342083 193157 26567 -36264 16231 61299 -19713 -171814 -225504 -124071 26604
36036B6604J06558N6051k5141j62488k18763p7906J07293J05904k7446m6005Q2491
36025g2848J43440L9776q0560q3125K252J05117J69846R6909j31964k86432j22146
36014b19735K11818L04652O2991j66785j39312k8404m7354q5015L0680J67126
36004I0662Q6755j41724k20160m3734J81696K19005L3495k22335l33971j83294
35994e33605J09863K64037J50027m8810q6887L3005J26478J10565N6394J0453
35984A91520o3565j56840j70738n0366J16535J84143J02869l7655j13254r3925
35974i1276m1267J5220J17523K44475K45007L6907k06100k44492j07966l3045
35964f5014p9927o1775R6861K00303J07920j9150J7909J33619J15509l0949j19856
$$ plain form
36036 26604 133162 189213 164072 1584 -217179 -295085 -187792 -81888 -109334 -155339 -72848
36025 -72848 70592 110368 29808 -53317 -51065 54052 223898 320807 188843 -97589 -219735
36014 -219735 -7917 296735 359726 192941 53629 25225 -22129 -107144 -76464 90662
36004 90662 177417 35693 -184467 -228201 -46505 172500 205995 -16340 -350311 -533605
35994 -533605 -423742 -159705 -9678 -58488 -145375 -112370 14108 124673 181067 191520
35984 191520 127955 -28885 -199623 -249989 -133454 50689 153558 115903 2649 -91276
35974 -91276 -132543 -117323 200 244675 489682 526589 320489 75997 -31969 -65014
35964 -65014 -144941 -206716 -109855 90448 198368 179218 197127 330746 446255 415306 295450
35953B95450q7031l9009l4027o989Q0819J66919J83647J26071J9301r7990j64111
35942D43050j44437q6158o8327j11704j72999j93472j28058J3200J25210R3172
35932b30523l9828q6634M2403K09191K32336J07500l6126j04947p9889J8317J05655
35921A37455O8869p3317j36889j6732J32672J05139n1078j12746k6044K6504p0464
35910a6631j77575j17819L6452M3779j52078k88687r9600L03424N13453L21524
35900C66242k8704j78971r7952j1562j9277l0786k5040q2030j41914k7085K20175
35889e6904L05080J09615j04617q0586Q0650J32695M2443o3960j35237j67934
35879F1245r6725Q1392J97929J19130m9264j28458j11717q3265l9186L2352M0056
$$ plain form
35953 295450 208419 169410 135383 128394 209213 376132 559779 685850 705151 607161 443050
35942 443050 298613 212455 144128 32424 -140575 -334047 -462105 -448905 -323695 -230523
35932 -230523 -270351 -356985 -314582 -105391 126945 234445 198319 93372 13483 31800 137455
35921 137455 206324 133007 -3882 -20614 112058 217197 166119 53373 27329 53833 -16631
35910 -16631 -194206 -312025 -275573 -231794 -383872 -672559 -772159 -468735 44718 366242
35900 366242 337538 158567 60615 49053 29776 -1010 -26050 -108080 -249994 -277079 -56904
35889 -56904 248176 357791 253174 172588 253238 385933 428376 364416 229179 61245
35879 61245 -35480 45912 243841 362971 313707 185249 73532 -9733 -48919 -16567 23489
35868B3489m9401q3087M7171J90453J61805L6137k235M3379O9658J06600K00234
35857G44203K01855l0009l16483l43943j00927J35729J87892J02451k6254j09686
35847D44828l8272J42388J53222j33624l79814k00295K33074M11584K21123R624
35837H63838l0486o2101j55056j31635K0053K8945j90584l48098k40217m4115
35827b89456M0667R3346J98163J97073k5641k68801k74527p1760J30655K11151
35817e9130J53209J182q3582M5215K31297J44796j87669l24222n5427K50813K05186
35806C21668m2362j16695k591M7658k3307p3677p2317q0964m5899R1931J90977
35795A94422R7598o9430r5862j6775n098l4238M2622J65075J29445o6257k22647
$$ plain form
35868 23489 -25912 -108999 -61828 128625 290430 326567 324332 367711 437369 543969 744203
35857 744203 946058 916049 599566 255623 154696 290425 478317 580768 554514 444828
35847 444828 406556 548944 702166 568542 188728 -11567 221507 633091 854214 863838
35837 863838 833352 771251 616195 484560 504613 533558 342974 -5124 -245341 -289456
35827 -289456 -248789 -155443 42720 239793 214152 -54649 -329176 -400936 -270281 -59130
35817 -59130 94079 95261 11679 56894 288191 432987 245318 -78904 -134331 116482 321668
35806 321668 279306 162611 160020 207678 184371 110694 38377 -42587 -88486 3445 194422
35795 194422 292020 222590 126728 109953 104855 70617 113239 278314 407759 341502 118855
35784A18855k45501j96659r6743N6122J27767p024j96543j73161M0448J70901
35774d01538J22740O2107O2892j498j40956j41454Q1796K79133J90219j03367
35764A0074l06672k63022m8347J74751K74094J97785J5036j27419j44224p5073
35754b93017k347L0756J5810k9438n2150j4193M3820M7364j1453p3415q7402l0609
35742d56274J00150K46868K92909J88922K6364q6856j52060k00364j86991q4198
35732c11530J0082l100o1083l9193N5249J25474J48326J51001J01836k1910j30859
35721B4293j40985j11483j12316o6527Q8350K05893J31275j3882j5000O0961j6859
35710C3720k09665k36735l7586J36924J40642J02401J01049J1255j88710k69374
$$ plain form
35784 118855 -126646 -323305 -420048 -363926 -236159 -243183 -439726 -612887 -572439 -401538
35774 -401538 -278798 -216691 -153799 -155297 -296253 -437707 -355911 -76778 113441 10074
35764 10074 -296598 -559620 -607967 -433216 -159122 38663 53699 -73720 -217944 -293017
35754 -293017 -295364 -264608 -248798 -278236 -330386 -344579 -300759 -253395 -264848 -338263 -425665 -456274
35742 -456274 -356124 -109256 183653 372575 398939 312083 160023 -40341 -227332 -311530
35732 -311530 -301448 -304548 -365631 -404824 -349575 -224101 -75775 75226 177062 155152 24293
35721 24293 -116692 -228175 -340491 -407018 -318668 -112775 18500 4618 -10382 50579 33720
35710 33720 -175945 -412680 -450266 -313342 -172700 -70299 30750 42005 -146705 -416079
35700d16079r9380J13975J33325K8036L390P3110J04936N9994O752q479K2118
35689B1698Q1041P5662p8855k54935j91341J11050K96275J26793j59805j86657
35679a59074M1115K00522J19516o8424j72921j27443L7890K11581K25916L9627
35669C48305j46833j21093N3790J54652J31608J14391J30204O1589r5109j66071
35659D65433o9422M8421M6032p430J8075Q8723P8719j1159n9414k5385o088o6462
35647E00043j28623r9353k6244k0096n9799j3421J25050J77271N3361o6785L553
35636D44957J29847L7338k26775l08621p4330J80188J82464O2223N7059Q5806
35626E70156p3820l35068l83706j69245J8269j540p2365j7859P8373N9280l8751
$$ plain form
35700 -416079 -515459 -401484 -268159 -240123 -236733 -163623 -58687 1307 8059 -420 21698
35689 21698 102739 178401 99546 -155389 -346730 -235680 60595 187388 27583 -159074
35679 -159074 -117959 82563 202079 133655 -39266 -166709 -128819 82762 308678 348305
35669 348305 201472 80379 134169 288821 420429 534820 665024 726613 631504 465433
35659 465433 396011 444432 490464 483034 501109 589832 668551 657392 597978 572593 566505 500043
35647 500043 371420 272067 245823 225727 165928 152507 277557 454828 508189 441404 444957
35636 444957 574804 612142 385367 76746 2416 182604 365068 427291 484350 570156
35626 570156 496336 161268 -222438 -391683 -373414 -374954 -447319 -465178 -386805 -327525 -366276
35615c66276p8193m3293p289K1968O5645O2638l8476j23600k7480J93672K76732
35604f3952R8299j35518j54181J5308R4490o0898k69468k73899p1572J12845J35037
35593e73509Q1942R9802J86756K27387J65584N6760k7131o9091q3631q1175o9878
35582h6184n5823l2517J280J3805l0868j07131j33216p1167R250J0781n6659p4808
35570f13257K8264J67140J90691O3117j03915j94943j99704j63781j05387k9957
35560i61732K9565N2015P4332J36518K00545J81810N5448j05955j91100j31087
35550f59641M0942J91769K03594J10734N1738O7109N6991j5584l3199N9445J08123
35539A82021j4017j59782j13902N7705J11611J0725o7552p0411j14788j82551
$$ plain form
35615 -366276 -444469 -487762 -495051 -473083 -407438 -344800 -383276 -506876 -534356 -340684 -63952
35604 -63952 34347 -101171 -255352 -240044 -145554 -206452 -475920 -749819 -821391 -708546 -573509
35593 -573509 -491567 -391765 -205009 22378 187962 244722 217591 148500 64869 -16306 -86184
35582 -86184 -142007 -174524 -173244 -159439 -190307 -297438 -430654 -501821 -492571 -481790 -538449 -613257
35570 -613257 -584993 -417853 -227162 -164045 -267960 -462903 -662607 -826388 -931775 -961732
35560 -961732 -932167 -880152 -805820 -669302 -468757 -286947 -231499 -337454 -528554 -659641
35550 -659641 -618699 -426930 -223336 -112602 -60864 6245 63236 47652 14453 73898 182021
35539 182021 168004 8222 -105680 -47975 63636 74361 6809 -63602 -178390 -360941
35529c60941r5891J24111J93082k141j93800j38433K9684O5285j907l178L7198
35518c46931o998o9176J7663J93082K08753m533k33624k71808j39743L674L7428
35507f12213m3103j19323l8840J94914L68701K98280O4583r9241r2076L293Q2171
35496G146R5232J9914j10646j91024j61727q2496k382J23644K69519K51034k064
35485B16150k31482j57380J02130J93064L9479j04232r1183n1935q3658p7641
35475b46688L4436J21232P7065j283l221P342o1080j37526r8196L3358J29413
35464a45148J32649Q0207R368o3925j01369n3545P4907J91292J69389r560j69494
35453A14771j07605J02376J40887j03055l05928j59246J39229J67200p0661j72947
$$ plain form
35529 -360941 -456832 -332721 -139639 -141780 -335580 -474013 -444329 -379044 -380951 -384129 -346931
35518 -346931 -353929 -423105 -405442 -212360 -3607 -8140 -241764 -513572 -653315 -649641 -612213
35507 -612213 -655316 -774639 -813479 -618565 -249864 48416 112999 13758 -78318 -75025 7146
35496 7146 102378 122292 11646 -179378 -341105 -423601 -425983 -302339 -32820 218214 216150
35485 216150 -15332 -172712 -70582 122482 161961 57729 -33454 -85389 -169047 -246688
35475 -246688 -212252 -91020 -13955 -15238 -18459 -11117 -72197 -209723 -307919 -274561 -145148
35464 -145148 -12499 67708 77076 13151 -88218 -141763 -66856 124436 293825 284265 114771
35453 114771 7166 109542 250429 147374 -158554 -317800 -178571 -11371 -82032 -254979
35443b54979J943J45633N2565o1178J8752J31354N2950j00414p2978J23513K67183
35432C04344K49038J21580m0078j38151o3792J10650J22017j07238k74705j15907
35422A67758J68362J87064q0567l03794k82809j10059Q2810K32134K29800J1751
35412C02450k27493j90947J09905L50770L40357K19815J58279J08229j6291j32109
35402A022965j19745l2983k8671j50333k80021k77629j25987M2169P0035m2046
35392G7754j33140j03289l6719k0550J5897J28828J78206M0355j25906r9237K1179
35381e6622k0116j56140p8021J96935K77610L8164j31179O0441L28716K70251
35371G30039k1469j71851j25463j16355j74785r5390J22371J98119J1836j92993
$$ plain form
35443 -254979 -253036 -107403 -54838 -116016 -97264 34090 87040 -13374 -86352 37161 304344
35432 304344 553382 674962 634884 496733 432941 543591 665608 558370 283665 167758
35422 167758 336120 523184 442617 138823 -143986 -254045 -171235 60899 290699 302450
35412 302450 74957 -115990 -6085 344685 685042 904857 1063136 1171365 1155074 1022965
35402 1022965 903220 870237 841566 691233 411212 133583 7596 49765 119800 77754
35392 77754 -55386 -158675 -195394 -215944 -200047 -71219 106987 147342 21436 -77801 -56622
35381 -56622 -76738 -232878 -310899 -113964 163646 201810 70631 131072 459788 730039
35371 730039 708570 536719 411256 294901 120116 24726 147097 345216 357052 164059
35361A64059j67667J4979J19783O1870o2734j41141j35595q0910m7396n7233l6427
35350c68412P6846K00060J92688O2032m0668l0413K8953N6474L9897k0069j17901
35339G9487j78600j21976j4592j1612j12198j31309K2417J96581K13535J01886
35329D3619L360l3039m5920m7206l4619m5263q6245p8322K4866J26370J07042
35318f5357K818n2924k2414J3312j948l2627j4118Q5711K31609K94263J41524
35307E79849j56335l13152j52785J36998K37947J15552M976L0674P2827K3878
35297E80429n5507r8539j39251j71578j01483M8888Q1729q4686k35647j51931
35287c27576N6553J16413o424r5110k8799Q6020J43260J85351K53156K54054R6501
$$ plain form
35361 164059 -3608 11371 131154 193024 130290 -10851 -146446 -227356 -274752 -331985 -368412
35350 -368412 -291566 -91506 101182 163214 122546 92133 121086 177560 217457 197388 79487
35339 79487 -99113 -221089 -235681 -247293 -359491 -490800 -468383 -271802 -58267 43619
35329 43619 46979 13940 -31980 -79186 -113805 -159068 -245313 -323635 -298769 -172399 -65357
35318 -65357 -62539 -115463 -137877 -124565 -126513 -159140 -173258 -87547 144062 438325 579849
35307 579849 423514 110362 -42423 94575 332522 448074 453050 483724 556551 580429
35297 580429 524922 426383 287132 115554 14071 62959 144688 60002 -175645 -327576
35287 -327576 -271023 -154610 -161034 -256144 -284943 -198923 -55663 129688 382844 636898 733399
35276G33399j30811k25889j03686J03401J84126O4939j28878k31351k17525j73833
35266a26108j25492j4722J36549J94479J15562L5373M9683N3987n4573j60371
35256A04367j07788K3975N2811M989L2705Q8445j2183k15921k52490q0305K5447
35245c35948o0784j02315O3463K03778P6621j28576o9813K07216L57839K63037
35235D74518J19964N5765o874q5021o2819M1024K0057j86478l44423k50074j4565
35224b38926J22920J10049O0860M5764N1995O3627M7951o1615k45881l35912k00583
35213e79751N2405J90112J34873J3158m5630l0223K5456J03462J58130J19061
35203A41053q994j21735j37359q4202k7084K6732Q5337R1713j8133j81503k24730
$$ plain form
35276 733399 602588 376699 273013 376414 560540 625479 496601 265250 47725 -126108
35266 -126108 -251600 -266322 -129773 64706 180268 215641 265324 319311 264738 104367
35256 104367 -3421 20554 73365 78354 111059 199504 187321 -28600 -281090 -361395 -335948
35245 -335948 -396732 -499047 -435584 -231806 -155185 -283761 -353574 -146358 211481 474518
35235 474518 594482 650247 643373 558352 495533 536557 556614 370136 25713 -224361 -238926
35224 -238926 -116006 -5957 54903 100667 152662 216289 264240 202625 -43256 -379168 -579751
35213 -579751 -527346 -337234 -202361 -189203 -234833 -265056 -239600 -136138 21992 141053
35203 141053 132059 10324 -127035 -211237 -238321 -211589 -126252 -34539 -52672 -234175 -458905
35192d58905n6529K02363L31692K35274J7859j41953j53821o1040K5937K7635
35182c1488m0014q5488m5318L6640O6607K8727J545M0942J08401J35502R5842
35171C11898j2896j79205l19396k93680p0970J76718K45036J33213J6007N757
35161A2482M8995N4898J5669k6838m6754l4836Q91J8668q485k6682L4842J33198
35149A76048J49321P2219K5411O7680R5155J4709j09107j81304k31958l06439
35139b28265l01058r4142K02508L21662J85680k378n2363J212N0629R9209J62646
35128C45340J34216o4217k78099k71652o6105O8997q524j32860j03024L0830Q5147
35117b59951K8716j1239K6640O4988L5399k8147o2306m6215J3344Q6890J09571
$$ plain form
35192 -458905 -515434 -313071 18621 253895 271754 129801 -24020 -85060 -59123 -31488
35182 -31488 -71502 -156990 -202308 -165668 -99061 -70334 -68789 -27847 80554 216056 311898
35171 311898 299002 119797 -199599 -493279 -564249 -387531 -142495 -9282 6725 12482
35161 12482 61477 116375 132044 105206 58452 23616 24507 43175 34690 8008 42850 176048
35149 176048 325369 397588 422999 490679 585834 600543 491436 310132 78174 -228265
35139 -228265 -529323 -623465 -420957 -99295 86385 84007 31644 32856 83485 182694 345340
35128 345340 479556 415339 137240 -134412 -200517 -131520 -140044 -272904 -375928 -345098 -259951
35117 -259951 -231235 -242474 -215834 -150846 -115447 -143594 -205900 -252115 -238771 -151881 -42310
35106d2310M9320j5303J4887R5381R0663N759N106J34587J94123K4523k11786
35095C44950k27195j8929J26782M4696r4963n5353J41153K76490K29644P0546
35085H37821r4255k26312k89194k10813R22J81962J70576K3358m8167K8083R1707
35074D65688J4151r6971r4443n4625j29934k27692j17882J46006K29940K8514
35064A62752j45406m9531J12382O1097q1055l4941J06766K1031k54087l17174
35054d18166l3581K48220K34818O9307q982m6686j61442k19072m3554K18861K63571
35043A03294P5576o8023j2584J07955J29235O2469n705n1384q6019j01895r6865
35032E6054q4277n8395o558M6953O1849L0520l4338j14997j49070n7480J13254
$$ plain form
35106 -42310 7010 -8293 6594 101975 192638 198397 203503 338090 532213 556736 344950
35095 344950 117755 98826 225608 270304 175341 119988 261141 537631 767275 837821
35085 837821 743566 517254 228060 17247 18169 200131 370707 394065 345898 373981 465688
35074 465688 479839 382868 288425 233800 103866 -123826 -241708 -95702 134238 162752
35064 162752 17346 -32185 80197 141294 60239 25298 132064 153095 -100992 -418166
35054 -418166 -451747 -203527 31291 100598 91616 44930 -116512 -335584 -379138 -160277 103294
35043 103294 178870 110847 98263 206218 335453 397922 392217 340833 254814 152919 56054
35032 56054 -28223 -86618 -93176 -46223 15626 46146 11808 -103189 -252259 -309739 -196485
35021a96485J75995M6110r5362l8817J26646J20119j17849l27210k83831p1610
35011f62294P9254Q3082K8787J6919O5770J30543J49251R9465L7645M1755J06210
35000A76387J50013J29862P3103j041j00117j82956j65242l9138R3691J43855
34990B78417J16343N0673l2430r7619j02354p2031p5586j00868o5578K0000M4101
34979c6932K3L0842J66911K00530r054k61351k69282p9589K2318l0103k2737J19786
34967a68638J67380l0548k56163k24842O959J64206J59606J29780J30472O2024
34957A40236q1374j33324k0871Q1050l594j80957k17520o8666P8873P5469j9293
34946c49971o0922r328O5958J06863J23293J43789J60483J36674N4432n1041j04742
$$ plain form
35021 -196485 -20490 25620 -69742 -108559 18087 138206 20357 -306853 -590684 -662294
35011 -662294 -583040 -499958 -471171 -454252 -388482 -257939 -108688 -9223 28422 70177 176387
35000 176387 326400 456262 529365 528324 428207 245251 80009 40871 134562 278417
34990 278417 394760 445433 413003 315384 213030 140999 65413 -35455 -101033 -81033 -36932
34979 -36932 -36909 -6067 160844 361374 352320 90969 -178313 -257902 -235584 -265687 -288424 -168638
34967 -168638 -1258 -31806 -287969 -512811 -505852 -341646 -182040 -52260 78212 140236
34957 140236 58862 -74462 -95333 -14283 -17877 -198834 -416354 -485020 -406147 -330678 -349971
34946 -349971 -410893 -420221 -354263 -247400 -124107 19682 180165 316839 371271 320230 215488
34935B15488n3621O8812J48755R3824n7775j57062j04646K9307R5230O1191L5922
34924C75425P2574O1637q3308k22248j38412J21583K43775N6441k09329k02148
34914G5990R6809L59141L29826J29497R7962M03189Q40230J002071O60112m884
34904C989943n71286p76873o92837n09961l06178j16322o4989k17144l72318k55484
34894A06551P6342K56750J06444j23472j34114P663M4798l5006j2431J62231K59782
34883G15538J25128q8159j60522j12632j04380j44098j00661L4190J03974M1231
34873C09609k3156J2643N3504K71l8487P3203K04422R8580k03470l52959j81230
34862d7070N4301O0300p4031o4739J10908K04113Q4766r7362j57321r4049j7407
$$ plain form
34935 215488 161867 230679 379434 473258 415483 258421 153775 183082 278312 339503 375425
34924 375425 447999 509636 426328 204080 65668 187251 431026 487467 278138 75990
34914 75990 172799 531940 861766 991263 1089225 1492414 2332644 3334715 3994827 3989943
34904 3989943 3418657 2641784 1948947 1438986 1132808 1016486 951497 734353 362035 106551
34894 106551 182893 439643 546087 422615 288501 296164 340962 305956 293525 455756 715538
34883 715538 840666 752507 591985 479353 374973 230875 130214 164404 268378 309609
34873 309609 286453 299096 352600 352871 314384 387587 592009 690589 487119 134160 -47070
34862 -47070 7231 67531 -6500 -71239 39669 243782 328548 231186 73865 -20184 -37591
34851c7591J2934K0140M7654Q7796O0433q2822k17442j39184J32201L06305K05648
34840C96072K1385Q456J04809R4370q372k8334L0370K4119l5573l9606n0209j77498
34828C39989k72362j18022J46480K11348J32302J95804L00308O6106l91864m63251
34818A46838K709L95453K82700K2037O2223K36177K13857J26533K31575M13828
34808B133930N06663O64393R69831J182964J319375J841914K817033L783742N101129
$$ plain form
34851 -37591 -24657 -4517 43137 130933 191366 108544 -108898 -248082 -115881 190424 396072
34840 396072 417457 425913 530722 625092 616720 588386 618756 642875 607302 567696 517487 339989
34828 339989 67627 -50395 96085 307433 439735 635539 935847 1001953 610089 146838
34818 146838 149547 545000 827700 849737 911960 1148137 1361994 1488527 1720102 2133930
34808 2133930 2640593 3304986 4274817 5457781 6777156 8619070 11436103 15219845 20320974
$$ [...]
##END NTUPLES=NMR SPECTRUM
##END=
