##TITLE=31Pdec_PR169_YKW
 D2O, 24 sc
 7.2.2020
##JCAMPDX= 6.0         $$ Bruker NMR JCAMP-DX V2.0
##DATA TYPE= NMR SPECTRUM
##DATA CLASS= NTUPLES
##ORIGIN= UXNMR, Bruker Analytische Messtechnik GmbH
##OWNER= root
$$ XWIN-NMR		Version 3.5
$$ Fri Feb  7 14:10:06 2020 Russian Standard Time (UT+4h)  she@DPX200
##.OBSERVE FREQUENCY= 81.013821
##.OBSERVE NUCLEUS= ^31P
##.ACQUISITION MODE= SIMULTANEOUS
##.ACQUISITION SCHEME= undefined
##.AVERAGES= 24
##.DIGITISER RES= 17
##SPECTROMETER/DATA SYSTEM= spect
##.PULSE SEQUENCE= zgpg30
##.SOLVENT NAME= CDCl3
##.SHIFT REFERENCE= (INTERNAL, CDCl3, 0, 182.463)
##AUDIT TRAIL= $$ (NUMBER, WHEN, WHO, WHERE, WHAT)
$$ ##TITLE= Audit trail, XWIN-NMR		Version 3.5
$$ ##JCAMPDX= 5.01
$$ ##ORIGIN= Bruker BioSpin GmbH
$$ ##OWNER= she
$$ F:/spectra/data/she/nmr/P31/1/pdata/1/auditp.txt
$$ ##AUDIT TRAIL=  $$ (NUMBER, WHEN, WHO, WHERE, WHAT)
(   1,<2020-02-07 14:09:11.18 +0400>,<she>,<DPX200>,
      <created by zg, POWCHK disabled, PULCHK disabled
       configuration hash MD5:
       00 E9 B6 7A A2 85 ED C7 34 08 36 98 17 FE 4E 26
       data hash MD5: 32K
       0A FC 6D C1 66 18 45 AC 8B F0 9F EB D2 3E E4 23>)
(   2,<2020-02-07 14:09:13.37 +0400>,<she>,<DPX200>,
      <Start of raw data processing
       efp BC_mod = 2 LB = 1 FT_mod = 6 PKNL = 1 PHC0 = -1380.176 PHC1 = 190.4013 SI = 64K 
       data hash MD5: 64K
       8A C1 2A 75 61 F6 A3 B7 3B 2B B8 33 28 38 5C 68>)
(   3,<2020-02-07 14:09:28.20 +0400>,<she>,<DPX200>,
      <pk PHC0 = 10.70084 PHC1 = 0 
       data hash MD5: 64K
       E5 F1 D8 21 9F CA D0 4E BC 94 A1 D5 B9 0B 51 B3>)
$$ ##END=
$$ 
$$ hash MD5
$$ E7 B5 E7 57 D7 1B 2B 38 A9 35 E9 2A 25 8B B6 0E
##$RELAX= 
##$RELAX= 
##$RELAX= 
##$RELAX= 
##$RELAX= 
##$RELAX= 
##$RELAX= 
##$RELAX= 
$$ Bruker specific parameters
$$ --------------------------
##$DU= <F:/spectra>
##$EXPNO= 1
##$NAME= <P31>
##$PROCNO= 1
##$TYPE= <nmr>
##$USER= <she>
##$AMP= (0..31)
100 100 100 100 100 100 100 100 100 100 100 100 100 100 100 100 100 100 
100 100 100 100 100 100 100 100 100 100 100 100 100 100 
##$AQSEQ= 0
##$AQ_mod= 1
##$AUNM= <au_zg>
##$AUTOPOS= <>
##$BF1= 81.014009
##$BF2= 200.13
##$BF3= 200.13
##$BF4= 200.13
##$BF5= 200.13
##$BF6= 200.13
##$BF7= 200.13
##$BF8= 200.13
##$BYTORDA= 1
##$CFDGTYP= 0
##$CFRGTYP= 5
##$CHEMSTR= <none>
##$CNST= (0..31)
1 1 145 1 1 1 1 1 1 1 1 1 1 1 1 1 1 1 1 1 1 1 1 1 1 1 1 1 1 1 1 1 
##$CPDPRG= <waltz16>
##$CPDPRG1= <>
##$CPDPRG2= <waltz16>
##$CPDPRG3= <>
##$CPDPRG4= <mlev>
##$CPDPRG5= <mlev>
##$CPDPRG6= <mlev>
##$CPDPRG7= <mlev>
##$CPDPRG8= <mlev>
##$CPDPRGB= <>
##$CPDPRGT= <>
##$D= (0..31)
0 1 0 0 0 0 0 0 0 0 0 0.03 2e-05 3e-06 0 0 0 0 0 0 0 0 0 0 0 0 0 0 0 0 
0 0 
##$DATE= 1581070150
##$DBL= (0..7)
120 120 120 11 120 120 24 19 
##$DBP= (0..7)
150 150 150 150 150 150 150 150 
##$DBP07= 0
##$DBPNAM0= <>
##$DBPNAM1= <>
##$DBPNAM2= <>
##$DBPNAM3= <>
##$DBPNAM4= <>
##$DBPNAM5= <>
##$DBPNAM6= <>
##$DBPNAM7= <>
##$DBPOAL= (0..7)
0.5 0.5 0.5 0.5 0.5 0.5 0.5 0.5 
##$DBPOFFS= (0..7)
0 0 0 0 0 0 0 0 
$$ [...]
##$SUBNAM2= <"">
##$SUBNAM3= <"">
##$SUBNAM4= <"">
##$SUBNAM5= <"">
##$SUBNAM6= <"">
##$SUBNAM7= <"">
##$SUBNAM8= <"">
##$SUBNAM9= <"">
##$SW= 369.568048894756
##$SWIBOX= (0..15)
0 1 3 0 0 0 0 0 0 0 0 0 0 0 0 0 
##$SW_h= 29940.119760479
##$TD= 32768
##$TD0= 1
##$TE= 0
##$TE2= 300
##$TE3= 300
##$TEG= 300
##$TL= (0..7)
0 120 53 12 22 120 120 120 
##$TP= (0..7)
150 150 150 150 150 150 150 150 
##$TP07= 0
##$TPNAME0= <>
##$TPNAME1= <>
##$TPNAME2= <>
##$TPNAME3= <>
##$TPNAME4= <>
##$TPNAME5= <>
##$TPNAME6= <>
##$TPNAME7= <>
##$TPOAL= (0..7)
0.5 0.5 0.5 0.5 0.5 0.5 0.5 0.5 
##$TPOFFS= (0..7)
0 0 0 0 0 0 0 0 
##$TUNHIN= 0
##$TUNHOUT= 0
##$TUNXOUT= 0
##$USERA1= <user>
##$USERA2= <user>
##$USERA3= <user>
##$USERA4= <user>
##$USERA5= <user>
##$V9= 5
##$VALIST= <valist>
##$VCLIST= <CCCCCCCCCCCCCCC>
##$VD= 0
##$VDLIST= <DDDDDDDDDDDDDDD>
##$VPLIST= <PPPPPPPPPPPPPPP>
##$VTLIST= <TTTTTTTTTTTTTTT>
##$WBST= 1024
##$WBSW= 4
##$XGAIN= (0..3)
0 0 0 0 
##$XL= 0
##$YL= 0
##$YMAX_a= 6763
##$YMIN_a= -7063
##$ZGOPTNS= <>
##$ZL1= 120
##$ZL2= 120
##$ZL3= 120
##$ZL4= 120
##$ABSF1= 0
##$ABSF2= 0
##$ABSG= 0
##$ABSL= 0
##$ALPHA= 0
##$AQORDER= 0
##$ASSFAC= 0
##$ASSFACI= 0
##$ASSFACX= 0
##$ASSWID= 0
##$AUNMP= <proc_1d>
##$AZFE= 0.1
##$AZFW= 0.5
##$BCFW= 0
##$BC_mod= 2
##$BYTORDP= 0
##$COROFFS= 0
##$CY= -3
##$DATMOD= 1
##$DC= 0
##$DFILT= <>
##$DTYPP= 0
##$F1P= 0
##$F2P= 0
##$FCOR= 1
##$FTSIZE= 65536
##$FT_mod= 6
##$GAMMA= 0
##$GB= 0
##$INTBC= 1
##$INTSCL= 5.30512e-09
##$ISEN= 30
##$LB= 1
##$LEV0= 0
##$LPBIN= 0
##$MAXI= 10000
##$MC2= 0
##$MEAN= 0
##$ME_mod= 0
##$MI= 50
##$NCOEF= 0
##$NC_proc= -6
##$NLEV= 6
##$NOISF1= 182.463
##$NOISF2= 159.3651
##$NSP= 0
##$NTH_PI= 0
##$NZP= 0
##$OFFSET= 182.463
##$PC= 4
##$PHC0= -1369.475
##$PHC1= 190.4013
##$PH_mod= 1
##$PKNL= yes
##$PPARMOD= 0
##$PSCAL= 0
##$PSIGN= 0
##$REVERSE= no
##$SF= 81.0140089999434
##$SI= 65536
##$SIGF1= 159.3651
##$SIGF2= -187.1042
##$SINO= 113.3802
##$SIOLD= 16384
##$SREGLST= <1H.CDCl3>
##$SSB= 0
##$STSI= 65536
##$STSR= 0
##$SW_p= 29940.119760479
##$SYMM= 0
##$S_DEV= 0
##$TDeff= 32768
##$TDoff= 0
##$TI= <>
##$TILT= no
##$TM1= 0
##$TM2= 0
##$TOPLEV= 0
##$USERP1= <user>
##$USERP2= <user>
##$USERP3= <user>
##$USERP4= <user>
##$USERP5= <user>
##$WDW= 1
##$XDIM= 65536
##$YMAX_p= 514483339
##$YMIN_p= -18851090
$$ End of Bruker specific parameters
$$ ---------------------------------
##NTUPLES= NMR SPECTRUM
##VAR_NAME=  FREQUENCY,     SPECTRUM/REAL,   SPECTRUM/IMAG
##SYMBOL=    X,             R,               I
##VAR_TYPE=  INDEPENDENT,   DEPENDENT,       DEPENDENT
##VAR_FORM=  AFFN,          ASDF,            ASDF
##VAR_DIM=   65536,         65536,           65536
##UNITS=     HZ,            ARBITRARY UNITS, ARBITRARY UNITS
##FACTOR=    0.456856943014862, 1,           1
##FIRST=     14782.0589164792, 0,            0
##LAST=      -15158.0608439998, 0,           0
##MIN=       -15158.0608439998, -18851090,   0
##MAX=       14782.0589164792, 514483339,    0
$$ Real data points
##PAGE= N=1
##DATA TABLE= (X++(R..R)), XYDATA
$$ [...]
45711 -3066686 -2325543 99277 2429852 3054935 1808278 -60662 -1218379 -1668809 -2488278
45702 -2488278 -3939372 -4612422 -3237341 -775862 452340 -386267 -1771402 -1942190 -875558
45693 -875558 207913 524856 421321 803165 2154403 3862880 4589692 3738100 2329438
45684 2329438 1746241 1856277 1344346 -197655 -1705006 -2364690 -2676897 -3267466 -3714421
45675 -3714421 -3297406 -2132901 -886950 -3868 273400 -117231 -545209 -75418 979769
45666 979769 945225 -823854 -2442263 -1702531 924251 2938388 3014810 2030660 1081977
45657 1081977 133025 -1018748 -1834113 -1811398 -1347998 -1233369 -1769926 -2644033 -3135445
45648 -3135445 -2386102 -213710 2135835 2810325 1292940 -1023726 -2430718 -2502307 -1960049
45639 -1960049 -1667919 -2083673 -3060555 -3797157 -3486584 -2318916 -1349600 -1167188 -1293298
45630 -1293298 -1125975 -744192 -399456 41567 600391 791868 381318 18789 429708
45621 429708 1355260 1959449 1997569 1946534 2178082 2586270 2927345 3063825 2945198 2661651
45611 2661651 2395016 2152702 1834336 1657619 1995932 2605053 2701147 2147033 1766503 1981102
45601 1981102 2037220 1322344 494181 261366 -56582 -1373164 -2917601 -3083471 -1825678
45592 -1825678 -544957 216467 1129653 2089949 1936191 722123 298288 1634389 3275814
45583 3275814 3666845 3405241 3671886 3853690 2692064 886379 431054 1658505 2837072
45574 2837072 2711700 1751085 720195 -341423 -1273518 -1354340 -385365 780455 1338668
45565 1338668 1354466 1144817 703255 78632 -489246 -1062757 -1809900 -2255036 -1818674 -1145296
45555 -1145296 -1402541 -1982456 -822084 2077921 3493941 1080929 -2976562 -4701723
45547 -4701723 -3674834 -2976252 -4098050 -4813518 -2878344 587546 2893389 3294100 3049069
45538 3049069 2995115 2774891 2128793 1516335 1327970 1407010 1559531 1981590 3012005 4675022
45528 4675022 6386216 7048579 5899068 3567978 1812878 1746475 2732571 3449754 3485377
45519 3485377 3239163 2812805 1982663 1088353 966254 1850459 3037023 3772032 3880978
45510 3880978 3451138 2553779 1473341 624068 -5764 -835626 -1925923 -2754236 -3001985
45501 -3001985 -3042068 -3331552 -3810065 -4247155 -4666334 -4957646 -4582743 -3336394 -2039372
45492 -2039372 -1645767 -1774748 -1028533 1026473 3030285 3507821 2786130 2493577 3397279
45483 3397279 4547993 4696706 3849193 2959150 2532195 2208841 1667755 1260421 1407990
45474 1407990 1810019 1845387 1685662 2339836 4187390 5884905 5488620 2803650 -30552
45465 -30552 -799908 321310 1215668 530877 -908743 -1538111 -983495 3348 816331
45456 816331 1340212 1417899 920699 301041 268489 802371 1088548 497353 -883069 -2569917
45446 -2569917 -3906093 -4163356 -3305260 -2532475 -3010792 -4060321 -3872008 -2201198 -837224
45437 -837224 -843712 -966683 159522 1752706 2352502 2312058 2914757 3776511 3253695 1274897
45427 1274897 -223998 33955 1211881 1932818 1804725 918027 -715593 -2500355 -3222033
45418 -3222033 -2491746 -1366031 -881692 -772123 -237875 761164 1595236 1737795 970696
45409 970696 -593119 -2284113 -3216073 -3137059 -2453530 -1455274 -324931 214125 -512643
45400 -512643 -1788483 -2153659 -1683655 -2003067 -3424381 -3865929 -1782133 1399516 3264428
45391 3264428 3548423 3588896 3661292 2840389 1066740 -507135 -1226774 -1524222 -1731143
45382 -1731143 -1539132 -769034 281484 1287741 1949729 1823223 874270 -163323 -790864
45373 -790864 -1570523 -3010249 -4302599 -4395955 -3694927 -3253253 -2800642 -1254849 1070395
45364 1070395 2556883 2625646 2300308 2222153 1742266 416271 -1054842 -1916021 -2207859
45355 -2207859 -2125325 -1630650 -984115 -573880 -101344 856062 1481336 426767 -1971382
45346 -1971382 -3815879 -4249304 -4208626 -4261415 -3699038 -2473762 -1961428 -2699493 -3284459
45337 -3284459 -2821724 -2592374 -3643691 -4438402 -2947501 136295 2346655 2737584 2244110
45328 2244110 1441587 38731 -1624335 -2458214 -2158266 -1529237 -1253747 -1337194 -1480536
45319 -1480536 -1040275 769172 3455491 4803654 3384161 869740 136419 1563401
45311 1563401 3067836 3341249 2843995 1772677 -373775 -2703115 -2928050 -607202 1687196
45302 1687196 1857026 1154225 1870801 3626754 4088748 2611510 953646 408502 203619
45293 203619 -672150 -1617633 -1467189 -471502 31995 -323658 -411931 527635 1499913 1077666
45283 1077666 -427522 -1250092 -601685 315850 87914 -1138205 -2245299 -2603044 -2178698
45274 -2178698 -1013067 495885 1434420 1413611 1185045 1394018 1515495 1044430 776465
45265 776465 1456792 2002195 912023 -1035198 -1496999 118651 1964236 2438899 1677778
45256 1677778 231671 -1680866 -3172967 -2998204 -1583670 -877167 -1411403 -1469953 -98137
45247 -98137 1149882 824303 -8487 325927 1434826 1967379 1990238 2207373 1956410 239796
45237 239796 -1937272 -2470725 -1103189 465246 1151536 1250583 786931 -771472 -2788773
45228 -2788773 -3350377 -1711999 409241 797127 -773732 -2490837 -2386970 -130129 2500915
45219 2500915 3038316 890330 -1797644 -2647255 -1918937 -1708562 -2729770 -3521452 -2891628
45210 -2891628 -1514899 -646920 -597534 -1035601 -1676226 -2113964 -1957051 -1600253 -1931845
45201 -1931845 -2889666 -3299269 -2519609 -1181434 105991 1560853 3153855 3985211 3582333
45192 3582333 2730335 2123800 1291991 -95531 -996480 -492930 342372 -263455 -2092010
45183 -2092010 -3237961 -2977630 -2596432 -3058822 -3506981 -2875109 -1710041 -1277397 -1661118
45174 -1661118 -1924033 -1740134 -1679431 -1890859 -1617175 -430751 869039 1235681 742169
45165 742169 243424 -8131 -512431 -1290561 -1508613 -801477 -148391 -599626 -1596390 -1541907
45155 -1541907 -1318 1557932 1519005 39298 -1152392 -645409 1160412 2351896 1335117
45146 1335117 -1467752 -3900314 -4232934 -2747015 -915237 426160 1398298 2009042 1793850
45137 1793850 608022 -978826 -2242858 -2797773 -2659982 -2376413 -2767804 -3760827 -3863958
45128 -3863958 -1899631 1035484 2703073 2695055 2641488 3266838 3133913 1131025 -1476405
45119 -1476405 -2691776 -2223546 -1100292 -29455 590989 167770 -1059295 -1402515 215741
45110 215741 2293131 2561370 1239555 569706 1296531 1646544 219456 -1853820 -2488877
45101 -2488877 -1251578 419080 930382 -25786 -1288261 -1300739 169985 1514040 1133023
45092 1133023 -450948 -1272684 -504042 773059 1320761 1045998 426828 -119540 -14952
45083 -14952 1142521 2623441 3030139 2111813 1097568 910490 1174364 1297797 1220893
45074 1220893 630228 -1068031 -3225012 -3901604 -2421211 -607416 -214233 -451909 322563
45065 322563 1609743 1531257 22126 -900420 -146221 1028294 1069409 108149 -756982
45056 -756982 -1051397 -1085299 -1208034 -1431573 -1406779 -657387 650817 1284309 144801 -2023257
45046 -2023257 -3107276 -2182114 -751757 -909666 -2913010 -5187335 -6264363 -6028961 -5226073
45037 -5226073 -4394541 -3547801 -2666336 -2098995 -2175240 -2556970 -2527562 -2089925 -2136729 -3098522
45027 -3098522 -4079967 -4027099 -3157084 -2332174 -1552515 -265033 1117245 1388531 354996
45018 354996 -790625 -1194100 -1284913 -1583943 -1673329 -995496 141169 955116 991414 194217
45008 194217 -1113965 -2074945 -1966095 -1295955 -1275715 -1945105 -2013508 -965095 97943
44999 97943 413296 797879 1782109 2014454 218539 -2334484 -3238487 -2245691 -1251054
44990 -1251054 -1254262 -1220970 -122248 1522920 2567666 2530427 1684756 791049 747022 1542780
44980 1542780 1776252 375197 -1516374 -1865848 -749332 -216323 -1086433 -1879570 -1413742
44971 -1413742 -459191 46614 533808 1381816 1654394 648707 -673206 -1175638 -1177141
44962 -1177141 -1218570 -623961 1020757 2278707 1779592 681074 1001842 2309442 2522674
44953 2522674 1539575 1386041 2702184 3741600 3377749 2609093 2281047 1740250 854067
44944 854067 957199 2248909 2544628 685837 -828052 747377 3835108 4465974 2056022
44935 2056022 -27433 218205 842260 -275655 -1970740 -2027992 -736691 89950 254039
44926 254039 858968 1583263 850853 -1195551 -2239705 -1032274 812700 1321235 905922
44917 905922 1219396 2384352 2997791 2333734 965304 -603366 -2396226 -3924760 -4114667
44908 -4114667 -2762860 -986591 256118 1092190 1730164 1716990 995150 604564 1215382
44899 1215382 1832508 1286452 356574 801874 2487814 3170895 1493658 -1210481 -2724929
44890 -2724929 -2471935 -1519119 -949065 -1058437 -1631943 -2246049 -2559352 -2752446 -3341734
44881 -3341734 -4231068 -4484212 -3543403 -2204165 -1776010 -2575200 -3775110 -4480954 -4443493
44872 -4443493 -3924396 -3337551 -2917644 -2473474 -1705603 -909972 -803967 -1327542 -1392807 -526936
44862 -526936 -6072 -1240561 -3514184 -4707031 -4165225 -3349533 -3314092 -3103480 -1568356
44853 -1568356 522935 1590071 1657928 2004826 2660357 2105559 -53374 -1814055 -1376486
44844 -1376486 174287 409114 -827123 -1256911 231527 1762335 1216288 -698312 -1614656
44835 -1614656 -869325 -10334 -237911 -976978 -1205918 -824341 -217377 471505 1115685
44826 1115685 1521842 1985073 3040919 4264708 4339293 2908350 1338303 855301 910021
44817 910021 404955 -320251 -22233 1402902 2658121 2652361 1382328 -557881 -2348717
44808 -2348717 -3011089 -2134413 -536829 609786 1158275 1664292 2027266 1626575 725343
44799 725343 473145 1280424 2258967 2546382 2192753 1466898 340563 -884665 -1374885
44790 -1374885 -751767 410999 1471820 2362035 2982895 2825846 1766910 536586 -199159
44781 -199159 -664340 -1368833 -2227257 -2788070 -2867665 -2522105 -1836973 -1088645 -644181 -469387
44771 -469387 -310258 -483180 -1615991 -3313154 -4094358 -3211625 -1585036 -327667 617662
44762 617662 1561516 1884105 961291 -501335 -1300117 -1321442 -1112727 -478023 1067738
44753 1067738 2803646 3318922 2564181 2007734 2492491 3114948 2621660 994418 -732688
44744 -732688 -1539088 -1089135 15806 561789 -76212 -1099685 -1309894 -709006 -154406
44735 -154406 280540 1264162 2518607 2703267 1461812 226877 257820 1021059 1349562
44726 1349562 1205962 1330637 1899958 2477435 2740509 2490122 1524665 200825 -565404
44717 -565404 -568425 -730784 -1371709 -1118297 1029949 3378733 3181532 407114 -2021241
44708 -2021241 -2007706 -552585 318605 198026 -130011 -331164 -391010 155884 1403679
44699 1403679 2140775 1246803 -371167 -813640 11512 386603 -220156 -169836 1388885
44690 1388885 2479512 1034461 -1591057 -2216204 -556408 235457 -1667391 -3894006
44682 -3894006 -3355462 -832985 184397 -1489666 -3262400 -2520909 130625 2254433
44674 2254433 2754558 2455985 2319883 2372630 2294911 2132186 2134423 2275013 2177102 1525941
44664 1525941 538790 -151171 -270184 -272051 -499785 -369247 748020 2024144 1789789
44655 1789789 -68192 -1586736 -1299686 -195494 -83068 -949604 -1302802 -592683 204738
44646 204738 338346 250230 528314 962575 1058029 748318 267148 -162579 -391594 -590579
44636 -590579 -1294118 -2486762 -2890567 -1272013 1506032 2981689 2000560 -25537 -1236910
44627 -1236910 -1499518 -1748919 -2342548 -3092511 -3980666 -4664679 -4064078 -1787049 568438
44618 568438 965234 -483020 -1825017 -1994694 -1762373 -1942753 -2237829 -2291311 -2433766
44609 -2433766 -2652657 -2092533 -540179 637085 202237 -1008686 -1065843 534899 2492520
44600 2492520 3641949 4094975 4315498 4117608 3103861 1535772 312760 299009 1758582
44591 1758582 4071127 5878004 5957776 4299130 2143943 795881 551691 912042 1544334
44582 1544334 2638354 4258496 5663254 5674125 3890300 1327563 -443188 -719025 34320
44573 34320 1100267 2154555 2974303 3202662 2731867 1830122 660867 -709350 -1596482
44564 -1596482 -937509 1105363 2681926 2372305 1031538 367798 386482 -188473 -1328333
44555 -1328333 -1434338 61785 1561548 1503284 389229 -208882 348014 1488192 2259615
44546 2259615 1852386 252373 -1103372 -493944 1597598 2498030 782883 -1690506 -2432907
44537 -2432907 -1597028 -941806 -818882 -398068 -86632 -1169514 -3111489 -3652970 -2078207
44528 -2078207 -316096 -87439 -789235 -1058734 -758285 -361738 175521 744603 460137
44519 460137 -1062920 -2679537 -3022893 -2084098 -646996 870974 2024155 1885344 369298
44510 369298 -810887 -43362 1837552 2612868 1724545 655529 369247 92412 -922843
44501 -922843 -1900909 -1663347 -342316 879805 1277370 1160041 1144350 1316662 1185506
44492 1185506 397115 -573059 -769230 22326 902076 1150967 1281832 2006894 2741774
44483 2741774 2361577 1188970 779677 1579055 2288873 2094341 2021601 3045690 4089376
44474 4089376 3379574 1093543 -897721 -1620969 -1756052 -1744838 -820010 1357316 3403136
44465 3403136 3717364 2591751 1696557 1853074 2410841 2642748 2559045 2211679 1415397
44456 1415397 647601 1059308 2693368 3642907 2257107 -378101 -1640529 -891419 -170811
44447 -170811 -1022389 -2251396 -1858325 26371 1576898 1993315 2228158 3031737 3697323
44438 3697323 3302826 2277272 1941900 2812208 3964913 4123933 3057551 1731651 1152646
44429 1152646 1296589 1368126 888063 53775 -885119 -1882811 -2531744 -2087339 -668413
44420 -668413 253721 -520391 -2131280 -2442691 -621055 1821231 2732799 1573007 -211289
44411 -211289 -776586 231069 1351283 1080271 -155347 -558370 341427 743937 -840301
44402 -840301 -3213294 -4095467 -3294416 -2523852 -2505817 -2302550 -1643810 -1771845 -3169808
44393 -3169808 -4272176 -3662491 -2184039 -1487406 -1527045 -1072194 -115126 -108830 -1717357
44384 -1717357 -3593456 -3900141 -2433693 -787356 -562278 -1642943 -2392322 -1601396 143656
44375 143656 1479289 2149698 2875820 3598207 3297442 1863891 670382 563133 629953
44366 629953 -61634 -787310 -518996 150508 37092 -443160 114275 1630815 2414734
44357 2414734 1536903 -168042 -1621722 -2592219 -2973991 -2397038 -1187339 -602862 -1315284
44348 -1315284 -2357836 -2273784 -890319 520799 554651 -1085894 -3340806 -4681362 -4545582
44339 -4545582 -3803062 -3474547 -3405668 -2882917 -2069236 -1717749 -1722009 -1287216 -534172 -436820
44329 -436820 -881055 -429823 1229287 2179743 873215 -1380973 -2091478 -1022638 -273833
44320 -273833 -1118600 -2361947 -2220794 -681266 674728 617137 -509866 -1365113 -1171601
44311 -1171601 -617157 -974443 -2303541 -3131543 -2345549 -776755 -122757 -761676 -1658981
44302 -1658981 -2184324 -2709357 -3178916 -2463455 -49241 2485986 2874713 816813 -1735979
44293 -1735979 -2945993 -2800317 -2212572 -1426426 -180819 1068659 1273366 293229 -690521
44284 -690521 -749111 -402603 -532937 -826863 -430621 255066 -71879 -1301091 -1521217 242881
44274 242881 2231559 2203935 597354 -193041 678372 1492591 693880 -1015054 -2067815
44265 -2067815 -2197022 -2086273 -1813964 -1033652 -240135 -353830 -957594 -335954 2138079
44256 2138079 4710152 5241047 3857310 2592667 2694919 3432433 3701350 3637539 3887171
44247 3887171 4073469 3140989 1081291 -769015 -1458583 -1586752 -2180063 -3094260 -3393680
44238 -3393680 -2968419 -2739752 -3155977 -3451640 -2881320 -1916406 -1443308 -1274778 -477947
44229 -477947 897913 1511629 561656 -947948 -1515385 -1131658 -1004425 -1541178 -1741779
44220 -1741779 -882292 190577 190097 -736568 -1134630 -132473 1524572 2483752 2311368
44211 2311368 1742693 1710579 2399762 3139105 3029566 1738107 -121494 -1310711 -852486
44202 -852486 1035908 2755535 2497329 145911 -2168131 -2140573 14488 1729394 1171928
44193 1171928 -763531 -2080882 -2244954 -2068281 -1870567 -1243911 -343496 120883 240815
44184 240815 813972 1667649 1573515 335144 -525165 37221 1076457 1325307 1017436
44175 1017436 740654 -221453 -2575361 -4918753 -5083247 -3288790 -1862492 -1726326 -1319053
44166 -1319053 401224 1986890 1767445 468266 4459 711002 1340096 1152726 529608
44157 529608 -67374 -329220 363155 2110879 3330539 2086653 -1116612 -3463103 -3338562
44148 -3338562 -2192735 -1981616 -2305342 -1681794 -545319 -788667 -2520588 -3478281 -2310533
44139 -2310533 -622881 -535828 -1523753 -1316745 673476 2543575 2574691 1261962 158603
44130 158603 -186926 -294351 -410734 -109995 787444 1579322 1297120 -171200 -1746510
44121 -1746510 -2094423 -1000541 361905 806148 556780 765321 1710468 2340353 1950508
44112 1950508 1459622 2152818 3584673 3794209 1756159 -1190677 -2815249 -2463678 -1565814
44103 -1565814 -1799119 -3178007 -4154906 -3455760 -1513677 70509 281456 -444081 -1017485
44094 -1017485 -823377 149779 1709441 3401294 4363713 3981633 2744862 1860735 1824543
44085 1824543 1905635 1392074 861347 1535116 3412137 4737069 3811164 1077341 -1202184
44076 -1202184 -1504210 -783019 -1209942 -3488269 -6095638 -7190446 -6496732 -4918705 -2992686
44067 -2992686 -586914 2045136 3856719 4079334 3220054 2446049 2115026 1466656 -52661
44058 -52661 -1643555 -1886458 -497218 1301058 2331475 2709671 3086531 3326850 2800563
44049 2800563 1617552 590419 83969 -164105 -190087 126196 166313 -878148 -2276314
44040 -2276314 -2105294 -46365 1639286 1049220 -706370 -1187255 25112 1226679 1169995
44031 1169995 159647 -995326 -1611154 -1060446 421927 1180354 -30451 -1917094 -2073848
44022 -2073848 -390002 867943 445343 -474861 -596420 -148191 483464 1621841 2718389
44013 2718389 1962974 -942596 -3263068 -2291876 1203598 4239498 5267128 4880773 3862281
44004 3862281 2493436 1314754 735916 111537 -1255941 -2504732 -2172606 -476795 1018811
43995 1018811 1811620 2731714 3786385 3680028 1990497 129196 -620834 -637084 -753812
43986 -753812 -802493 -311105 333707 453459 181495 144616 471650 769216 738217 361449
43976 361449 -179746 -521021 -495329 -606432 -1466482 -2675664 -3176413 -2958214 -3282207 -4641056
43966 -4641056 -5639558 -4863948 -2976713 -1793655 -1857828 -2155955 -1970402 -1780474 -2180851
43957 -2180851 -2843096 -2928918 -2070973 -725720 230920 294516 -106976 -76883 523053 745412
43947 745412 -159068 -1619293 -2475379 -2408193 -1970482 -1569655 -1214176 -1018542 -1098985 -1070886
43937 -1070886 -493006 207207 92168 -936589 -1967034 -2370467 -2418663 -2403961 -2048711
43928 -2048711 -1209517 -362466 166213 774133 1759602 2487834 2088581 624786 -1048759
43919 -1048759 -2252325 -2717431 -2275666 -1123046 -181546 -316038 -1124522 -1228367 82256
43910 82256 2067338 3482152 3700108 2827205 1464080 639738 1202335 2709825 3513355
43901 3513355 2632662 1146014 957466 2407723 3937870 4167912 3532234 3508625 4712952
43892 4712952 6188200 6453370 5075452 3260568 2797685 4144206 5662195 5219728 2597850
43883 2597850 -211487 -1286806 -813778 -472724 -1270592 -2594889 -3245267 -2764156 -1581302
43874 -1581302 -257969 1038139 2292461 3099109 2710101 935392 -1135842 -1854973 -736590
43865 -736590 860534 1123330 -299875 -2054528 -2639296 -1940164 -1195958 -1563462 -2809872
43856 -2809872 -3618385 -3268429 -2516637 -2259869 -1893102 -250251 1927931 2179497 -320381
43847 -320381 -3199952 -3989683 -3390373 -3618483 -4569764 -4107080 -1893766 -270791 -716222
43838 -716222 -1806094 -1801242 -1141500 -822377 -172293 1623026 3071327 1939535 -1190625
43829 -1190625 -3276802 -2817827 -1402775 -839354 -751233 -3105 1114259 1492975 982347
43820 982347 191684 -851702 -2496485 -4176370 -4612122 -3474625 -1891969 -1011587 -810627
43811 -810627 -668779 -422570 -318913 -415088 -631492 -1066534 -1608183 -1505256 -191287 1495148
43801 1495148 1941026 937997 167707 818316 1801126 1539650 576141 536390 945099
43792 945099 -499887 -3964484 -6274729 -5199345 -2898338 -2819493 -4517585 -4398919 -1218421
43783 -1218421 2127371 2866522 1768988 1006218 767074 -70781 -1296582 -1584027 -844160
43774 -844160 -447752 -1069821 -1812746 -1704449 -858038 158254 1035655 1399253 723256
43765 723256 -814204 -2044806 -1995211 -962546 24362 371764 84636 -734710 -1827213
43756 -1827213 -2472591 -2060376 -1015734 -444310 -667236 -806688 -185970 599972 730031
43747 730031 685795 1615973 3304206 4059550 3077484 1779123 1921427 3176524 3687739
43738 3687739 2559871 635482 -948978 -1726240 -1455909 -112658 1315793 1321966 -125573
43729 -125573 -1145526 -347646 1249459 1702645 758984 -233623 -523369 -697583 -1313618
43720 -1313618 -2030008 -2333942 -2188040 -1704231 -1013634 -743992 -1786639 -4050890 -5982335
43711 -5982335 -5892227 -3633817 -751712 882485 593765 -619574 -1104952 -274009 866645
43702 866645 1166667 831987 817164 1213893 1327581 1142202 1412453 2185044 2556973 2246359
43692 2246359 2045162 2168879 1613637 47426 -1069843 -505835 802771 1260284 965628
43683 965628 861627 535037 -958370 -2624258 -2377569 -485595 269973 -1424837 -3424421
43674 -3424421 -3174803 -924408 1350981 2603668 2861873 2131287 784365 -4757 218970
43665 218970 198395 -929571 -1607078 56110 2961544 4148226 2966096 1691092 1793881
43656 1793881 2099310 1472805 1025600 2159690 4056450 4768647 3808767 2215045 796562
43647 796562 -360157 -1170803 -1534693 -1713625 -1852372 -1546201 -631781 214230 489378
43638 489378 721306 1313735 1403809 253350 -928786 -320570 1601147 2344816 876409
43629 876409 -856527 -501230 1933408 4624192 6122252 6127098 4957652 3265891 1872723
43620 1872723 1123572 569364 -350133 -1607320 -2766866 -3363251 -2885762 -1057598 1437214
43611 1437214 3060959 2767190 952107 -1106195 -2270546 -1963587 -435932 1031113
43603 1031113 1056796 -202025 -1152948 -961898 -582463 -875249 -957856 264208 1918519
43594 1918519 2235945 1287725 823542 1469256 1950220 1466652 1067842 1801785 2895624
43585 2895624 2907923 1757518 489585 -322133 -821543 -906444 -134541 1377464 2749239
43576 2749239 3217594 2829655 2247767 2152783 2734238 3485122 3604699 2787582 1433288
43567 1433288 18183 -1290139 -2222300 -2264552 -1405311 -464038 -81007 94367 511801
43558 511801 619698 -280860 -1430227 -1170721 748395 2599007 2820895 1781897 888684
43549 888684 799179 1172683 1524076 1611725 1431136 1398022 2055436 3053558 3041469 1341916
43539 1341916 -805741 -1585530 -761663 492739 1491544 2447018 3141797 2765815 1480649
43530 1480649 702395 1038063 1159484 -203936 -2122833 -2634713 -1457411 -129249 325548
43521 325548 438850 841241 1096238 623304 -116256 -174829 502205 878693 664 -1838424
43511 -1838424 -3099387 -2331498 192284 2406277 2563638 1229742 432604 972868 1645891
43502 1645891 1315179 502953 213743 261237 -116854 -673453 -480118 412368 894370 492298
43492 492298 65868 431111 1105184 963329 -336464 -2075779 -3360528 -3884970 -3891538
43483 -3891538 -3629905 -2968924 -1639681 114777 1409761 1500263 492772 -980256 -2484477
43474 -2484477 -3780949 -4478467 -4365264 -3892530 -3585353 -3095569 -1738383 -5965 565172
43465 565172 -477912 -1494068 -737375 1243761 2207340 1051533 -863999 -1432581 -233978
43456 -233978 1108195 777449 -1302818 -3433574 -3980095 -3070773 -2224268 -2412746 -3037342
43447 -3037342 -3035790 -2440894 -2224373 -2761267 -3077760 -1875505 911961 3798161 5039787
43438 5039787 4261951 2690493 1673659 1227639 431692 -961979 -2055190 -2073225 -1343629
43429 -1343629 -584246 121510 986980 1626944 1309312 9382 -1395978 -2012688 -1639810
43420 -1639810 -709425 101219 306233 -12776 -396740 -758444 -1529920 -2707299 -3320413
43411 -3320413 -2571747 -1119648 -364192 -615213 -819157 -74754 1415297 2983129 4259817
43402 4259817 5041880 5068143 4321491 3228933 2385832 2239465 2839007 3566761 3514083 2648984
43392 2648984 2048041 2182792 1742032 -480961 -3129388 -3614887 -1835307 -478578 -1221816
43383 -1221816 -2773720 -3502632 -3750171 -4108137 -3514781 -1154229 1323245 1848412 1164456
43374 1164456 1638017 3568317 5124168 5515804 5656650 5726136 4706644 2765385 1631130
43365 1631130 1859054 1975209 1223659 910881 1814158 2435314 1498645 355532 920000
43356 920000 2536313 2949538 1549661 -238396 -1247921 -1573304 -1663893 -1850882 -2412623
43347 -2412623 -2911678 -2088148 268987 2103628 1369104 -1076480 -2602397 -2335996 -1635663
43338 -1635663 -1405089 -1182562 -986025 -1724501 -3156203 -3575299 -2508019 -1838033 -2995052
43329 -2995052 -4618498 -4532470 -2880811 -1682308 -1933967 -2643484 -2508550 -1408529 -211117
43320 -211117 220903 -149182 -440773 87257 837853 526386 -771438 -1349808 -224748
43311 -224748 1428613 2117711 2223241 3093589 4756128 5957685 6039432 5389069 4250449
43302 4250449 2462550 498210 -393527 540960 2774715 5058943 6228897 5671180 3811848
43293 3811848 2126830 1912075 2929844 3768698 3445654 2137167 567364 -646818 -1203638
43284 -1203638 -1349474 -1781802 -2722793 -3312913 -2581475 -789652 838529 1422667 826223
43275 826223 -729175 -2541519 -3417740 -2923953 -2312963 -3013043 -4496014 -5002460 -4181967
43266 -4181967 -3441390 -3586587 -3748143 -3074844 -2034580 -1431353 -1354134 -1670810 -2430460
43257 -2430460 -3227986 -3233777 -2345925 -1339426 -654438 -241733 -648846 -2512247 -4654994
43248 -4654994 -4799727 -2938650 -1720333 -2288405 -2224322 439579 3551663 3941387 2357660
43239 2357660 2008669 3272550 3474808 1682976 118513 236503 677427 217365 -182675
43230 -182675 190977 -98020 -2118158 -4129552 -3844712 -1784417 -297032 -156316 -91969
43221 -91969 871243 2393877 3850846 4862757 4936250 3819044 2131721 729288 -253243
43212 -253243 -894168 -703339 461850 1338433 656878 -702049 -574222 1428473 3284592
43203 3284592 3305008 2105657 1309417 1457176 1886801 1834977 1062501 7012 -365658
43194 -365658 424907 1334969 762674 -1119750 -2178194 -1130230 613032 973702 151624
43185 151624 153506 1808374 3676847 4016249 2674687 692863 -1062682 -2287774 -2784773
43176 -2784773 -2292534 -849338 879032 1820557 1304881 -210348 -1450170 -1565414 -850493
43167 -850493 -76255 461604 857603 998972 663768 7225 -612001 -1144748 -1687833 -2022025
43157 -2022025 -1903239 -1620311 -1596351 -1594829 -1076969 -251361 80694 -263704 -693323 -997983
43147 -997983 -1656925 -2679710 -3127908 -2343929 -881764 315203 950212 1120887 860619
43138 860619 527591 814257 1655553 1946874 1139416 239682 275665 724536 710031 804324
43128 804324 1905531 2942421 1818108 -1288038 -3539705 -2898190 -364158 1792300
43120 1792300 2512565 1976598 670225 -579628 -822110 -161851 343672 672888 2268665
43111 2268665 5422022 7867016 7679202 6199055 5902408 6354261 4932182 1303179 -1649138
43102 -1649138 -1953036 -1053842 -1007196 -1396775 -860868 -44721 -728798 -2731467 -3909157
43093 -3909157 -3249186 -2072824 -1753155 -1868679 -1403248 -452368 370006 1281208 2741739
43084 2741739 4008091 3762843 2249608 1347004 1936948 2416014 864254 -2125331 -4107354
43075 -4107354 -3932451 -2830640 -2249526 -2028350 -1367007 -462253 -97530 -192832 109337
43066 109337 989835 1475752 679452 -940267 -1858563 -1012987 969794 2234877 1660865
43057 1660865 179925 -368082 518344 1747370 2477865 2899683 2898230 1560760 -1026907
43048 -1026907 -2957681 -2900978 -2120470 -2378161 -2881001 -1557652 1172715 2499898 1319870
43039 1319870 -218845 -55997 1076308 1492287 1218511 1242026 1489625 1287434 922056
43030 922056 1072481 1272032 519431 -907498 -1730764 -1644052 -1633591 -2263574 -2905549 -2932145
43020 -2932145 -2548837 -2001894 -947420 692111 1900440 1468854 -376494 -1880120 -1506459
43011 -1506459 487910 2462181 3213457 2988234 2607786 2211788 1507127 870884 1158722
43002 1158722 2261725 2830548 1946117 350002 -570680 -475209 -179172 -537027 -1753249
42993 -1753249 -3378442 -4462273 -4121106 -2507837 -911458 -477198 -1176737 -2283885 -3187471
42984 -3187471 -3320559 -2169476 -129335 1411274 1751619 1941833 3130120 4563444 4580222
42975 4580222 3110726 1671677 1079312 749542 292401 104344 -16276 -1161653 -3394177
42966 -3394177 -4946590 -4436997 -2788130 -1729066 -1289800 -258623 1373677 2078698 1046568
42957 1046568 -583451 -1285098 -983102 -675480 -897029 -1318445 -1506151 -1327878 -722649
42948 -722649 254677 1131936 1384059 1207975 1300447 1690187 1583721 796461 412894 1128850
42938 1128850 1718731 503506 -2009381 -3474148 -2756286 -1157152 -320355 -462356 -1219968
42929 -1219968 -2601654 -4112270 -4428769 -3224999 -2038514 -1950294 -1726951 4252 1992015
42920 1992015 2048914 724897 707804 2664029 4208157 3465761 1417897 -40009 -377608
42911 -377608 138135 1448439 2980186 3424351 2448877 1446753 1570252 2245517 2613381
42902 2613381 3022298 3802030 3946199 2718800 1526087 2245954 4241859 4945589 3283697
42893 3283697 826277 -563628 -644856 -25471 1073434 2526155 3709277 4040775 3751683
42884 3751683 3588953 3865605 4051420 3329842 1631776 67794 -98669 952514 1689695
42875 1689695 1321924 980817 1984785 3661537 4174393 3188895 2274743 2527022 3200871
42866 3200871 3276775 3129222 3584303 4113946 3352385 1343942 -21899 571188 1906235
42857 1906235 1787520 250787 -195639 1923632 4603508 4767222 2382457 343775 284554
42848 284554 552795 -824936 -2999320 -3682793 -2508244 -1193378 -881203 -1038383 -905087
42839 -905087 -506846 -17136 630868 1165009 997134 149480 -599493 -656577 -23089 1150351
42829 1150351 2532138 3246474 2669663 1641841 1638902 2509599 2401527 442091 -1896215
42820 -1896215 -2910901 -2808722 -2588726 -2019289 -386899 1451032 1671971 150863 -1146433
42811 -1146433 -820862 311757 830593 683415 599226 535480 2248 -563478 -131269 1155784
42801 1155784 1706201 394476 -2009788 -3743533 -3815694 -2557182 -1012945 -179947 -316324
42792 -316324 -651264 -337322 100066 -773494 -2916876 -4213262 -3360649 -2048496 -2463668
42783 -2463668 -3656899 -2871416 -145294 1290154 -216548 -2340709 -2467302 -1315433
42775 -1315433 -1024042 -1676166 -2017801 -2084499 -2577497 -2675922 -1121324 1057176 1483192
42766 1483192 -39418 -1332864 -1245250 -934252 -1474688 -2395426 -3061655 -3431261 -2941796
42757 -2941796 -828960 1726992 2022828 -503394 -3113334 -3588554 -3172958 -3981419 -5299383
42748 -5299383 -4731316 -1945589 983512 2481475 2780818 2569072 2104035 1760570 2038387
42739 2038387 2783644 3353799 3554066 3561164 3110374 1750172 -145338 -1509230 -1757401
42730 -1757401 -1187514 -364274 248763 315423 8212 99959 957633 1759723 1491903 395560
42720 395560 -427769 -562809 -508915 -574160 -511648 -228830 -31719 -145042 -593274 -1345961
42710 -1345961 -1943148 -1417368 466976 2241278 2116173 201662 -1723112 -2531541 -2675767
42701 -2675767 -2831787 -2929649 -2798826 -2612763 -2312722 -1597621 -800104 -718720 -1227631 -1190127
42691 -1190127 -246273 494964 237308 -206521 137842 717593 471410 -226142 -100424
42682 -100424 900032 1513224 1251949 1169115 2050205 2985592 2586065 960269 -399814
42673 -399814 -430859 553208 1605780 2080412 1702480 472203 -1006854 -1591362 -667423
42664 -667423 984394 1945996 1677610 719443 -419300 -1664526 -2597572 -2400522 -1153919
42655 -1153919 -218021 -463418 -913086 -197386 1279606 1911872 1268347 507128 487331
42646 487331 884695 1381434 2302484 3512084 3918547 2882411 1220661 80793 -368144
42637 -368144 -422934 64632 1112422 1816380 1245804 -222220 -1387093 -1698779 -1355552
42628 -1355552 -378145 1206963 2428935 1978822 41890 -1644193 -2042084 -2021280 -2560448
42619 -2560448 -2809027 -1293737 1411141 2832249 1758445 -101044 -507380 262493 129935
42610 129935 -1481361 -2763431 -2298457 -1107062 -866746 -1302390 -906428 398480 1085078
42601 1085078 399901 -829340 -2020202 -3669301 -5630171 -6304834 -4882254 -3053741
42593 -3053741 -2865943 -3778806 -3645373 -2039680 -622339 -296018 -55770 863774 1604544
42584 1604544 1435351 1335292 2442836 3939789 4017090 2500266 1110244 1169789 2223530
42575 2223530 3093648 3301935 3054445 2555193 1898842 1336512 1221594 1691123 2464715
42566 2464715 2923686 2569330 1643169 1078727 1422260 1939293 1330535 -626598 -2649497
42557 -2649497 -3307196 -2428897 -1062046 -416494 -966386 -2208903 -3120154 -3068628 -2278115
42548 -2278115 -1172277 376274 2448345 4034306 3798811 2112402 1052216 1729479
42540 1729479 2772730 2394771 894679 -118885 -64884 551840 1655002 3310139 4322367
42531 4322367 3256066 1018148 314926 1928814 3525083 3084792 1563606 772750 460721
42522 460721 -515383 -1440036 -551452 1899173 3646110 3550480 2869014 3053295 3909348
42513 3909348 4512970 4619836 4422231 3834687 2728027 1321853 -73869 -1273508 -2059130
42504 -2059130 -2365899 -2602238 -3057853 -3034884 -1519706 1110799 3027196 2997140 1742018
42495 1742018 851623 978412 1460322 1206242 -278865 -2253722 -3068078 -1764367 629484
42486 629484 2123122 1997696 1097896 46003 -1426013 -3064774 -3565309 -2346605 -691248
42477 -691248 -62535 -171497 175539 991633 1094547 -98642 -1773448 -2681114 -2255000
42468 -2255000 -880428 457670 958283 770499 720734 1132025 1479300 1420149 1329372 1340517
42458 1340517 767860 -733580 -2166965 -2275074 -1163597 -70607 73646 -759654 -1977508
42449 -1977508 -2583142 -1793413 -220399 272650 -1200938 -3191401 -3815818 -3248850 -2982200
42440 -2982200 -3240883 -2817003 -1299887 229760 1013942 1667387 2827991 3833261 3470171
42431 3470171 1513902 -911592 -2242284 -1773709 -467840 -245892 -1922493 -4150778
42423 -4150778 -5033752 -4248715 -2696953 -765824 1591981 3432370 3283667 1270245 -804196
42414 -804196 -1901146 -2758788 -3890700 -4185258 -2643461 -378815 481469 -578388 -1975561
42405 -1975561 -1966760 -380914 1435335 1954680 891915 -497896 -716650 472846 2209411
42396 2209411 3784468 4793109 4348422 1676343 -2129663 -4390935 -3712900 -1534624
42388 -1534624 -42152 427721 969868 2057150 3089608 3424037 2794321 1135172 -1043951
42379 -1043951 -2469182 -2229660 -883887 309231 951587 1509883 2081568 2111040 1336237
42370 1336237 273312 -373053 -356174 50776 358711 358453 443042 1061833 1766349 1529489
42360 1529489 360446 -276463 652545 2193225 2575744 1348893 -505269 -1981619 -2584847
42351 -2584847 -1984847 -331854 1277343 1682643 939869 -64930 -976980 -2012760 -2928152
42342 -2928152 -3035112 -2176948 -756121 1029619 2952958 3983553 3064718 806994 -782227
42333 -782227 -572452 653723 1630883 2008759 1989255 1621247 1030536 636517 696709 1156430
42323 1156430 2043690 3280073 4095986 3627403 2232024 1144558 652698 -130974 -1359626
42314 -1359626 -1768234 -587163 1217076 2484314 3325739 4013718 3809038 2375647 1205931
42305 1205931 1839793 3448023 4074512 3687091 3811538 4321502 3102582 -389550 -3439434
42296 -3439434 -3326783 -821088 1040727 716513 -694936 -1408395 -656791 1230261 3141440
42287 3141440 3604152 2021619 -327529 -1406613 -722322 290707 370923 -3133 343391
42278 343391 1427135 2100079 1570007 183056 -1233959 -2152455 -2350257 -1716746 -414605
42269 -414605 1026056 2104903 2771924 3279597 3734012 3993723 3921026 3503393 2789253
42260 2789253 1983042 1580065 2001499 2903858 3221737 2303330 824378 108275 562494
42251 562494 1281998 1331675 900783 796332 1144309 1146481 90842 -1798729 -3547146 -4165381
42241 -4165381 -3251680 -1265442 682857 1611923 1387360 561242 -322864 -882591 -592029
42232 -592029 845952 2625916 3196792 2066936 600531 311949 946218 1160358 643306
42223 643306 344530 685089 857820 295727 -255233 207636 1526357 2588011 2392019
42214 2392019 577314 -2306223 -4569409 -4396794 -1926263 495452 1059101 614955 849601
42205 849601 1317954 214472 -2312678 -3930565 -3599899 -3057152 -3761215 -4341179 -2800157
42196 -2800157 137989 1900454 1487868 46722 -1436784 -2820880 -3326118 -1841401
42188 -1841401 660218 1329145 -669162 -2426861 -1159510 1820429 3131231 2122771
42180 2122771 1056005 1034617 695719 -629857 -1272028 -52262 1489718 1503936 792463
42171 792463 1284864 2686163 2921922 1448293 -54305 -327249 7930 -52889 -519263
42162 -519263 -935482 -971068 -185184 1493799 2830017 2308634 464987 -431230 415494
42153 415494 1185306 382432 -960429 -1413439 -1703389 -3098664 -4528715 -3793298 -1147064
42144 -1147064 748483 550836 -264432 -91789 621777 780940 584331 836638 1440568
42135 1440568 1855667 2376745 3716924 5583441 6717262 6404664 5202001 3986301 2876553
42126 2876553 1512240 122518 -332722 566596 1722982 1608291 307472 -536710 -206819
42117 -206819 -135336 -1630338 -3443897 -3280110 -1242779 145914 -484650 -1605803 -1224587
42108 -1224587 573598 2477064 3925962 4922930 4891406 3292817 980451 -458772 -712342
42099 -712342 -1021496 -2329303 -4019404 -4753824 -3936660 -2063552 -72973 1311027 1810837
42090 1810837 1529582 820478 186915 35983 231919 62829 -877877 -1845993 -1620933
42081 -1620933 -167748 1055724 834419 -312599 -866522 -135467 1173452 1967556 1873629
42072 1873629 1403465 1330735 1904748 2615711 2840739 2605480 2371192 2205642 1728968 871814
42062 871814 43444 -518590 -855922 -662795 526177 2165814 2638308 1011538 -1758687
42053 -1758687 -3916637 -4585064 -3894823 -2255011 -292213 1038615 1101200 73508 -1604002
42044 -1604002 -3658995 -5381303 -5496821 -3608480 -1121792 302474 718484 1275210 2158024
42035 2158024 2495309 2131032 2074174 2917270 3926277 4123951 3445689 2422883 1420529
42026 1420529 634587 330850 620234 1228735 1762853 2078497 2285286 2490324 2580088 2306204
42016 2306204 1760393 1626373 2452685 3688959 4173292 3707168 3214232 3042844 2345174
42007 2345174 870017 44094 977017 2429865 2367924 843043 -378405 -615311 -860561
41998 -860561 -1677015 -2348134 -2406475 -2400426 -2698489 -2907481 -2912821 -3205045 -3706999 -3493194
41988 -3493194 -2199296 -671890 184182 233371 -356608 -1179706 -1065702 960901 3801656
41979 3801656 5011850 4067336 3277538 4617270 7354641 9918686 12275438 14702015
41971 14702015 15688487 13384788 8628670 4539605 3093139 3494967 3828811 3008058 1171478
41962 1171478 -626960 -1072153 81145 1390130 1347057 428359 487154 2209054 4266842
41953 4266842 5118841 4743544 4439149 5583045 8530022 11980740 13541390 11787738 7852819
41944 7852819 4288360 2437647 1674821 1016839 378850 69229 63859 233133 597536
41935 597536 943422 718178 -268863 -1339965 -1469472 -288587 1414254 2215207 1437134
41926 1437134 126123 30579 1300030 2088234 1134353 -272634 -106757 1472635 2648017
41917 2648017 2880541 3350222 4437990 4819893 3701538 2191079 1506256 1267735 626368
41908 626368 -189291 -625666 -989366 -1590781 -1671679 -643746 367439 -136748 -1567559
41899 -1567559 -1839547 -350631 1324081 1995759 2455784 3741811 5189624 5415864 4450011
41890 4450011 3625174 3621961 3723871 3116640 2104982 1716470 2522924 4071206 5242550
41881 5242550 5153456 3986270 2871173 2583962 2522374 1616228 188006 -115522 1315055
41872 1315055 2810116 2511837 916511 -9385 222388 254334 -488090 -686595 589952
41863 589952 2147570 2454940 1883182 1666098 1649582 868229 -293669 -556861 -215394
41854 -215394 -1057543 -3416740 -5233593 -4941231 -3691552 -3513542 -4445450 -4876463 -4031006
41845 -4031006 -2751191 -2027405 -1821126 -1434732 -465688 620384 660307 -1067627 -3567156
41836 -3567156 -4575556 -2869908 282023 2469254 2503535 1004587 -741561 -1792585
41828 -1792585 -1895486 -1599883 -1730741 -2155329 -1558192 804218 3633730 4868082 4138447
41819 4138447 2935175 2492789 2595255 2508956 2005778 1163439 45449 -1027510 -1559271
41810 -1559271 -1542169 -1463917 -1485652 -1296477 -952652 -1000231 -1368882 -1031770 504757 2013951
41800 2013951 1769836 -272824 -2318839 -2772955 -1825624 -861938 -801682 -1413215 -2088117
41791 -2088117 -2767464 -3696734 -4437952 -3898120 -1857526 90775 94153 -1552251 -2583497
41782 -2583497 -1638928 6556 195354 -1399938 -3164295 -3687856 -3112706 -2430612 -2195075
41773 -2195075 -2105239 -1505746 -221922 1037006 1422929 1239894 1833833 3671149 5249592
41764 5249592 4897231 3174376 2223953 2850099 3619807 3136403 1833118 828971 206523
41755 206523 -532026 -1153766 -1050872 -433096 -18245 179554 620859 986169 429018 -796849
41745 -796849 -1268052 -437444 414473 59601 -815111 -710857 343561 837387 11130
41736 11130 -1182492 -1579050 -1203778 -679949 -145195 444134 546026 -407459 -1880972
41727 -1880972 -2669693 -2537578 -2401624 -2525510 -1663898 1024286 4039844 4980499 3695583
41718 3695583 2435615 2571895 2809211 1567468 -357845 -1088143 -652344 -761280 -1908743
41709 -1908743 -2642073 -1933826 -509526 665772 1527637 1856065 863266 -1036999 -1732145
41700 -1732145 -263867 1250994 511398 -1300680 -1166469 1045441 2249199 763989
41692 763989 -1399203 -1846881 -1098304 -1010617 -1631243 -1556521 -509607 261252 -146370 -1388593
41682 -1388593 -2690960 -3508185 -3542510 -3016911 -2746551 -3141336 -3407574 -2551876 -877050
41673 -877050 387730 682391 477353 339994 594614 1627263 3413438 4869251 4843083
41664 4843083 3777632 3217651 3563619 3581911 2442819 921889 -9680 -552750 -1193811
41655 -1193811 -1487716 -754773 737675 2276181 3776165 5373147 6486985 6395578 5418184
41646 5418184 4492973 3836582 3071120 2452900 2750671 3842878 4575051 4222972 3102763
41637 3102763 1614896 -118467 -1398761 -1174359 145083 440910 -1410292 -3663247
41629 -3663247 -3922205 -2412383 -1409503 -1890835 -2588851 -2378100 -1771905 -1581241 -1703242
41620 -1703242 -1933923 -2483852 -2820007 -1566760 1102940 2395768 131319 -3785480 -5253750
41611 -5253750 -3091659 -154120 830577 337868 127487 273036 -262608 -1314686 -1634542
41602 -1634542 -937194 -317089 -596100 -1370196 -1791276 -1382497 12881 2175720 4116399
41593 4116399 4534442 3215452 1559493 1223241 2357090 3497905 3206889 1637989 354627
41584 354627 549299 1622024 1852891 436452 -1678550 -3110506 -3499304 -3171725 -2098533
41575 -2098533 -154779 1919935 2945236 2797629 2553020 2878216 3155748 2656640 1789020
41566 1789020 1468231 1747212 1848799 1323049 448970 -432923 -1262644 -1818323 -1636433
41557 -1636433 -786472 -226489 -775823 -1934664 -2368505 -1587883 -486519 11397 106130
41548 106130 355337 414183 -452186 -1868388 -2529954 -2008460 -1246960 -917253 -488639 397768
41538 397768 840694 83582 -936214 -818038 166454 649092 400248 287048 212751 -906968
41528 -906968 -2748774 -3137002 -961155 2015274 3422552 3087976 2324378 1613503 622400
41519 622400 -236775 -57584 924962 1461589 1115461 715339 892319 1325722 1623299 1888092
41509 1888092 2175969 2344072 2629439 3407384 4190843 3945214 2694726 1679673 1484799
41500 1484799 1226530 249271 -648987 -692735 -675006 -1663467 -2988638 -3071046 -1794452 -499780
41490 -499780 167128 820022 1734514 2298680 2370585 2678224 3388401 3726951 3601649 4045839
41480 4045839 5205929 5537278 4265633 3039271 3371751 3869915 2364918 -138203 -492879
41471 -492879 1737595 3405409 2425832 551113 169715 764359 522816 -371537 -420421
41462 -420421 327031 446548 -362816 -1114869 -1648241 -2824819 -4490178 -5159796 -4225779
41453 -4225779 -2896643 -2336894 -2185911 -1566902 -452359 658242 1571075 2337502 3004268
41444 3004268 3713365 4367504 4139693 2267541 -548001 -2603147 -3206961 -3093597 -2747991
41435 -2747991 -1841965 -689203 -494474 -1316976 -1462720 -54897 1365848 1243061 548015
41426 548015 1131607 2682318 3345854 2616872 1572780 760997 -21232 -144757 1369209
41417 1369209 3662815 4528646 3474960 2188398 1394528 -379032 -3699968 -6100566
41409 -6100566 -5043165 -1642669 677367 534287 -366430 -236787 631606 1006196 572704
41400 572704 17075 -2301 469933 702802 6140 -1178393 -1298407 447534 2623400
41391 2623400 2994311 1365071 -190336 -115027 834083 1077030 339455 -576336 -1241246
41382 -1241246 -1698304 -1672548 -916435 -144288 -403156 -1413056 -1696811 -725204 188963
41373 188963 -143614 -860824 -176192 2032269 3931525 4025722 2734631 1419696 656686
41364 656686 -23580 -1160180 -2618329 -3621479 -3297667 -1452664 1026738 2831311 3434705
41355 3434705 3323593 2979586 2208547 768610 -934818 -2321569 -3380910 -4321812 -4760950
41346 -4760950 -3979206 -2006136 106688 1272575 1371915 1209284 1606536 2487928 2850635
41337 2850635 1911415 278651 -586135 -259122 91880 -433305 -962076 -238714 1168430
41328 1168430 1515399 577621 160708 1564523 3815009 4970955 4117865 1539368 -1847269
41319 -1847269 -4328865 -3900800 -453375 3131886 3635977 1154087 -1278223 -1717834 -1375237
41310 -1375237 -2093423 -3366941 -3290885 -1633015 -232166 -305649 -865675 -450179 673478
41301 673478 1061230 286725 -547686 -464796 162789 314050 -421766 -1630660 -2629208 -2900943
41291 -2900943 -2361400 -1482215 -852912 -496941 -73276 184517 -487921 -2065847 -3351975
41282 -3351975 -3582869 -3572052 -4278891 -4966640 -4103458 -1719514 568507 1815209 2565008
41273 2565008 3238232 3261222 2426816 1711670 1753577 1637539 409301 -1027242 -940531 687460
41263 687460 2074956 2132293 1741993 2139838 3102957 3530334 3138658 2569230 1985496 641671
41253 641671 -1685409 -3607712 -3431069 -1393884 392493 501538 -266104 -484044 -261711
41244 -261711 -665710 -1617936 -1889075 -1135397 -447021 -499154 -496529 393824 1706126 2594048
41234 2594048 3117963 3657096 3820860 3048968 1812322 1135788 1151446 1061333 440061 -228000
41224 -228000 -305170 307013 1159618 1451845 467944 -1567622 -3235430 -3157889 -1473296
41215 -1473296 357624 1074972 560372 -436177 -966570 -542820 298932 325794 -924994
41206 -924994 -2260809 -2045710 -91870 2249816 3610846 3579578 2541596 1415987 1291087
41197 1291087 2361970 3366606 3041703 1964713 1757459 2499647 2438437 717407 -1107915
41188 -1107915 -1250867 -209949 177380 -591984 -1421324 -1647251 -1756548 -1905230 -1226388
41179 -1226388 615182 2263000 2192051 864545 190208 934925 1800204 1341362 -240660
41170 -240660 -1782524 -2684553 -2852903 -1871049 489648 3186436 4584202 4268381 3135242
41161 3135242 1778234 155235 -1050661 -495691 1674685 3351093 3245374 2741231 3605710
41152 3605710 5154565 5435782 4242358 2933326 1853036 112464 -2154683 -3440075
41144 -3440075 -3114280 -2213205 -1487467 -353063 1545943 3244726 3752279 3218156 2116130
41135 2116130 521371 -1029906 -1263376 178212 1802431 2074905 1362284 1038042 1381446
41126 1381446 1522219 1031132 455943 378753 723416 1004205 861235 464432 462052 1077128
41116 1077128 1328368 110849 -1787516 -2078912 -64357 1982707 1661276 -368988 -1444680
41107 -1444680 -439060 1291922 2211133 2349003 2579405 3268189 4012754 4124158 3217835
41098 3217835 1670592 323820 -546128 -1428724 -2316709 -2118380 -284739 1735354 2010032
41089 2010032 732336 -46427 834134 2489830 3608756 3838960 3257600 1778369 -218906
41080 -218906 -1570063 -1382106 42925 1712353 2875227 3199830 2646534 1600056 751566
41071 751566 534061 881901 1527092 2112825 2094939 1163609 -154972 -900739 -771521 -264190
41061 -264190 260667 934708 1699697 2047826 1739358 1166142 742968 495056 417681 599530
41051 599530 792191 563121 137687 340152 1328562 2117644 1819696 699017 -464477
41042 -464477 -1349929 -1876531 -1747664 -983648 -349458 -440617 -787797 -681271 -447230 -944542
41032 -944542 -2081425 -2872361 -2847410 -2331119 -1345598 483286 2589365 3367867 2258750
41023 2258750 886729 1001711 2074414 2348421 1776636 2068622 3618730 4333599 2602357
41014 2602357 -53173 -900132 332967 1521180 1468351 1174160 1597417 2116983 1992551
41005 1992551 1689337 1646002 1149806 -170963 -917443 281130 2238019 2307294 -171103
40996 -171103 -3117183 -4398267 -3816011 -2351245 -944559 -369978 -930302 -1705110 -1206415
40987 -1206415 678559 2362122 2586866 1742007 727629 -258950 -1043847 -746045 1110942
40978 1110942 3388648 4277998 3174477 991686 -938193 -1708047 -1185200 -244267 -158411
40969 -158411 -1065013 -1533095 -370714 1653252 2700485 2033453 454516 -1005068 -1856784
40960 -1856784 -1858104 -982619 242731 1136056 1635781 2037408 2079295 1166701 -348571 -950375
40950 -950375 494304 3363005 5827491 6633243 6169220 5833910 6376891 6953727 6102164
40941 6102164 3636916 1017400 -376484 -624952 -454317 120664 1357844 2528213 2389111
40932 2389111 960424 -231204 47119 1461711 2843149 3458303 3315054 2866097 2680073
40923 2680073 2871272 2746703 1672085 346581 299001 1808829 3317606 3510389 3052035
40914 3052035 3342456 4272341 4406134 3087570 1173467 -344033 -1345475 -1943923 -1820547
40905 -1820547 -767854 731364 2014895 2906233 3463585 3562530 3250550 3080364 3454865
40896 3454865 3929530 3804121 3191828 2845055 3081504 3562365 3987026 4234273 3917936
40887 3917936 2730445 1291672 673302 889593 933073 670334 1493229 4306558 7838855
40878 7838855 9912368 9771841 8416215 7294704 7352431 8568485 9700824 9349558 7982719
40869 7982719 7806627 9802134 12285419 13530386 14192797 15604742 17439798 19079820
40861 19079820 21471325 25148180 28330707 30058630 33236979 40814469 51051476 61373649
40853 61373649 74826253 96792508 128144387 170773814 237165248 337422975 448949087
40846 448949087 514483339 488936826 386183209 266610317 179614002 130257719 99528695
40839 99528695 77038143 63867126 57384238 49826031 39456841 31837095 29634552 28896857
40831 28896857 26042067 22171851 19162273 16497265 13605015 11540753 10725614 9745618
40823 9745618 7632218 5257091 3728587 3221860 3709262 4976039 5739448 4693024 2625433
40814 2625433 1621560 2025758 2161594 1247300 469796 678018 1052921 843310 615882
40805 615882 847313 840184 83227 -609624 -402292 170579 199467 -37582 358488 1272028
40795 1272028 1582529 713851 -630244 -1412247 -1433288 -1296004 -1444641 -1659027 -1633058 -1605308
40785 -1605308 -1844587 -1778829 -539578 1571959 3154711 3492515 3218248 2856778 1987307
40776 1987307 528934 -440971 -128698 828428 1610746 2415113 3362972 3575299 2669313
40767 2669313 1834400 1917506 1869778 862029 361495 1774254 3428064 2764522 575991
40758 575991 -104757 1148337 1782892 806751 279288 1532853 3011765 3066611 2321921
40749 2321921 2063908 2530829 3796385 6022100 7846636 7028180 3906416 1735037 2249314
40740 2249314 3539169 3860809 4591503 7164458 10015761 11681618 14444947 20911936
40732 20911936 28289910 30288749 24768647 16102209 9545530 6294480 4816294 4098696
40724 4098696 3896261 3628660 2842209 2023057 1866738 2220067 2358116 1827713 620212
40715 620212 -987875 -2402425 -2906703 -2221935 -762566 727512 1745263 2335286 2783684
40706 2783684 2835237 1669423 -611856 -2047935 -893984 1512111 1958515 -147600 -1770832
40697 -1770832 -786956 859597 397510 -1471906 -2037201 -844029 314119 773230 1468424
40688 1468424 2360689 2200693 1058341 624091 1516430 2361893 2032953 948375 -264494
40679 -264494 -1588474 -2640349 -2637047 -1912769 -1886388 -2951199 -3872014 -3805573 -3446040 -3541825
40669 -3541825 -3641929 -3061093 -2039487 -1315841 -1294802 -1878206 -2411801 -1970803 -609476
40660 -609476 146099 -714856 -1864757 -1433478 93095 855299 824652 1386995 2108201
40651 2108201 1098705 -1150509 -1693508 232551 1893608 1798474 2308030 5276012 8163520
40642 8163520 7522769 4191817 1845749 1748257 1964111 1027805 -337364 -955279 -573945
40633 -573945 399449 1127058 734797 -416746 -703212 483291 1691776 1808186 1793291
40624 1793291 2455781 2432206 582760 -1388080 -1357165 -332525 -638250 -1772143 -1328131
40615 -1328131 729915 2108369 2149100 2364349 3008364 2528673 879600 118337 916781
40606 916781 1509768 1041179 976052 1989711 2338085 869844 -923969 -1542085 -1746801
40597 -1746801 -2393399 -2322710 -638797 849100 -62265 -2568697 -4125937 -4099047 -3854627
40588 -3854627 -3922766 -3361211 -1769038 -8034 1205170 2009282 2630901 3015432 3188736
40579 3188736 3091411 2256958 505918 -1307324 -2050014 -1556738 -501005 520382 1174762
40570 1174762 1332999 1552375 2844524 5045600 6212837 4793560 1761033 -605479
40562 -605479 -1458081 -1544650 -1219774 -96408 1297195 1339075 -462687 -2335450 -2340463 -903079
40552 -903079 -207681 -1262275 -2544759 -1981347 328136 2204307 2180193 1182277 838348
40543 838348 1109382 859038 107194 -54953 316602 -132320 -1547460 -2200223 -1264141
40534 -1264141 -396474 -1193884 -2692027 -3051628 -2364764 -1894357 -1640571 -825157 -87028
40525 -87028 -877939 -2813528 -3747527 -2726777 -1115247 -465878 -828655 -1505099 -2028250
40516 -2028250 -1988109 -1197196 -432641 -782692 -1888789 -2120686 -976007 2351 -581190
40507 -581190 -2020404 -2662248 -2126369 -1311884 -704481 213196 1817404 3401121 3849697
40498 3849697 3096568 2413344 2864502 3767443 3490879 1791142 221099 -201326 -357596
40489 -357596 -1090526 -1312569 288945 2662855 3553579 2764660 2158237 2508058 2488681
40480 2488681 1102153 -853479 -2286354 -3041662 -3028467 -1786750 297475 1778595 1908601
40471 1908601 1387485 904020 390669 189544 1167676 2830987 3109538 1216868 -826359
40462 -826359 -857856 563791 1317302 563935 -926671 -2245693 -2784948 -2114717 -683752
40453 -683752 162424 -125442 -571750 -503835 -678758 -1444211 -1498535 -152966 860195 -32383
40443 -32383 -1378330 -943827 468260 441842 -672213 -239941 1895548 2690480 687643
40434 687643 -1715242 -2138997 -1535014 -1794337 -2380145 -1620241 154225 1014827 207213
40425 207213 -1278190 -2381851 -2757796 -2352102 -1540705 -1364617 -2462191 -3979854 -4474246
40416 -4474246 -3638473 -2342953 -1352896 -860457 -919488 -1407046 -1736986 -1432891 -889236
40407 -889236 -910618 -1630835 -2443352 -2788709 -2488913 -1619490 -661600 -473849 -1413377 -2657532
40397 -2657532 -3014332 -2254624 -1134465 -409732 -459807 -1506631 -3267220 -4470101 -3698871
40388 -3698871 -1011103 1923323 3542704 3740154 3371332 3085666 3000283 2966572 2598123
40379 2598123 1333071 -914998 -3155165 -3874216 -2493616 -105672 1506480 1579081 925899
40370 925899 822439 1662312 2903639 3990802 4810097 5277510 5044483 3930307 2403506
40361 2403506 1327142 1195186 1655368 1809416 1155830 310571 432860 1645779 2517587
40352 2517587 1778082 185923 -270997 1054538 2781835 3545519 3529923 3421452 2973085
40343 2973085 1611588 -237423 -1510372 -1868082 -1820429 -1732393 -1528281 -1260489 -1226044
40334 -1226044 -1491788 -1795092 -1854809 -1468510 -620634 143338 -10342 -993946 -1510771 -812850
40324 -812850 -78130 -814649 -2343942 -2441233 -530518 1352462 1323155 14635 -666925
40315 -666925 -107689 737533 987786 704407 365505 282768 482358 674989 493415 89017
40305 89017 117552 693692 855829 -201723 -1695794 -1956215 -534959 1247775 2033011
40296 2033011 1838636 1324254 500750 -892663 -2151421 -1988426 -436074 698153 61890
40287 61890 -1292572 -1317597 41871 737458 -272201 -1357844 -618288 1311942 2327939
40278 2327939 1969761 1709634 2300113 2645345 1748546 264003 -652900 -881382 -902771
40269 -902771 -795033 -517393 -401547 -507791 -175235 996503 2409338 3458979 4386822
40260 4386822 5169514 4555010 1701964 -1829526 -3408838 -2493616 -938077 -246406 -170804
40251 -170804 -177119 -485390 -998347 -781882 427982 1436055 1267007 537145 190467 7162
40241 7162 -451549 -518507 428350 1324803 718248 -729195 -923731 510029 1657656 1251691
40231 1251691 342021 249437 510869 62053 -847821 -1380064 -1788778 -2759855 -3688219 -3412660
40221 -3412660 -2479333 -2757203 -4447339 -5358766 -4116977 -2442027 -2660097 -4081396 -3897878
40212 -3897878 -1337257 1225227 1732686 1061459 1055520 1524089 938072 -745139 -1950937
40203 -1950937 -2073471 -2285544 -3272598 -3835916 -2756278 -772718 582369 1222590 2110820
40194 2110820 3184720 3396869 2825709 2978377 4295437 4803029 2530433 -1471930 -3903921
40185 -3903921 -2911184 75449 2343588 2740346 2005952 1111908 316754 -255443 -153602
40176 -153602 755360 1784155 2240548 2369761 2688893 2660269 1201241 -1289260 -2702661
40167 -2702661 -1777018 166157 1060039 740921 440133 442445 56388 -435484 112352 1399431
40157 1399431 1552646 62738 -1067432 -255527 1307239 1726571 1310023 1521567 2168963
40148 2168963 1810166 396561 -640699 -803475 -1029620 -1655092 -1730308 -756325 492915
40139 492915 1317765 1864293 2232532 2231476 2267635 2912413 3360352 2225497 338290 472896
40129 472896 3197302 5278514 3987671 1053736 94686 1598045 3022153 2937273 2287126
40120 2287126 1816105 955181 -366647 -1091377 -845569 -514081 -438654 134209 1178940
40111 1178940 1376342 431298 101518 1599652 3480933 3651202 2285414 1096031 631284
40102 631284 145127 -369257 26357 1315587 2113481 1620442 688495 323062 174051
40093 174051 -641249 -1856255 -2124951 -690576 1599792 3058109 2663359 761255 -1463878
40084 -1463878 -2938150 -3178596 -2306854 -1033618 -404002 -877460 -1556759 -981817 1068676
40075 1068676 3227427 4294302 4502585 4444523 3722342 1885099 86531 154698 1907098
40066 1907098 2947232 1751511 -351948 -1266758 -1111923 -1645868 -3188303 -3886215 -2505558
40057 -2505558 -500804 -116663 -1179996 -1292557 733817 3108533 3536035 2375361 1952478
40048 1952478 3170565 4462208 4413982 3832858 4175537 5098010 5074643 3915501 3040821
40039 3040821 3194124 3382793 2627537 1530110 1176182 1274054 521635 -1371220 -3003478
40030 -3003478 -2893345 -1229936 377179 740716 316057 394733 1322395 2072163 1739639
40021 1739639 777442 145567 -161380 -724569 -1190873 -526807 1067076 1930808 1257882
40012 1257882 347173 607305 1464771 1539882 980906 993946 1541381 1325324 107787 -702636
40002 -702636 -294935 217579 -433208 -1726815 -2205214 -1492418 -452390 168273 315620
39993 315620 151034 -160298 -327856 -263256 -370636 -910537 -1277576 -600235 1017534 2520638
39983 2520638 3196868 3337439 3488409 3594766 3157257 1924377 214049 -1310622 -2153853
39974 -2153853 -2425975 -2696654 -3227955 -3540825 -3075125 -2119272 -1618698 -2034579 -2761936
39965 -2761936 -2758926 -1521451 533674 2393807 3215423 3049721 2782745 3164541 4032736
39956 4032736 4681172 4720825 4312187 3937627 4325045 6046107 8483173 9669780 8159635
39947 8159635 4888115 2209978 1199459 970365 621578 498185 1112251 2042318 2633608
39938 2633608 2925172 3231736 3544365 3865347 4330072 4516637 3623833 1965440 1179036
39929 1179036 2047861 3180748 2964624 1796599 1004596 510111 -641891 -1988478 -1930931
39920 -1930931 -394827 614277 -392142 -2639917 -4466940 -5215955 -5150184 -4530605 -3518532
39911 -3518532 -2356046 -1136452 141587 1143109 1460717 1366275 1503730 1754038 1296172
39902 1296172 -67302 -1567958 -2601758 -3242732 -3501236 -3152620 -2512114 -2235239 -2089473
39893 -2089473 -1169382 324886 908201 -31577 -1243698 -1444612 -803868 76782 1147039
39884 1147039 1937759 1206020 -1123083 -3022001 -2813284 -1362147 -419990 -139402 51322
39875 51322 -519361 -2612443 -4868197 -5110479 -3373585 -1481080 -182229 906141 1025904
39866 1025904 -1121620 -4352722 -5543291 -3970148 -2454113 -3132870 -4646320 -4921629
39858 -4921629 -4325391 -4143923 -3942995 -2695438 -1137197 -737874 -1215890 -1129028 -283477
39849 -283477 360494 659967 1253185 1858398 1498651 414428 -2979 559399 711043
39840 711043 -567934 -2428767 -3261771 -2461426 -706770 850331 1410188 1043743 503327
39831 503327 236704 -75643 -584729 -619319 123998 515756 -477540 -1728942 -1170475 1039913
39821 1039913 2472676 1858756 640501 341710 275674 -756789 -1941557 -1436679 785426
39812 785426 2747264 2983848 1977930 1062407 927590 1358557 1662194 1168790 -179095
39803 -179095 -1686567 -2683568 -3194520 -3403464 -2931947 -1459339 268564 1096919 1103050
39794 1103050 1514622 2762300 3668285 3128172 1745917 1005339 1333783 1803721 1521650
39785 1521650 588544 -274366 -474528 109048 1060240 1625626 1337464 499553 -204665
39776 -204665 -508066 -606260 -534293 -78132 601810 880055 529719 177313 433343 932078
39766 932078 786134 -184781 -1195209 -1382946 -521803 1019800 2481898 2915093 1830964
39757 1830964 -142598 -1743165 -2409598 -2665615 -2981327 -2883124 -1705519 207011 1698477
39748 1698477 2064961 1604748 969834 454892 14764 -362667 -498321 -204898 340613
39739 340613 478819 -308089 -1495469 -1707360 -250380 1855748 2887889 2252754 821792
39730 821792 -331553 -900164 -1144137 -1380062 -1751194 -2034148 -1696843 -615239 435278
39721 435278 648238 354830 445333 727760 47460 -1723042 -3121894 -3162964 -2712521 -2813268
39711 -2813268 -2801109 -1570209 75696 183228 -1385558 -2561693 -2013565 -846512 -573489
39702 -573489 -797323 -179269 1156997 1679668 741607 -431568 -358177 897336 2007920
39693 2007920 2067438 1517317 1408928 2040461 2613087 2308789 1371939 698533 549257 346132
39683 346132 -204820 -609553 -574904 -704364 -1516387 -2365204 -2220555 -1214267 -539641 -912722
39673 -912722 -1882119 -2597482 -2546656 -1597859 -86581 1092606 1193066 481069 -217553
39664 -217553 -686505 -1182332 -1305596 -266771 1509596 2380615 1656844 561439 290241
39655 290241 387329 130320 296866 1917768 4008027 4405586 2755198 974905 556323
39646 556323 964230 1198064 1445116 2201549 2785697 1966466 -267877 -2517063 -3506756
39637 -3506756 -3171939 -2177315 -975142 249041 933956 149007 -2201401 -4479995 -4590875
39628 -4590875 -2443090 -216146 406447 242342 851474 1830331 1575041 240156 -112314
39619 -112314 1436386 3300405 3733845 2984239 2239856 1742731 1009055 18764 -751803
39610 -751803 -868455 -35885 1462901 2145182 584944 -2062671 -2502631 520724 4098423
39601 4098423 4846177 3259674 2298034 2792444 2903619 1730835 697679 913406 1489483
39592 1489483 1338102 798717 533169 392520 419795 1534893 3901176 5672295 4862826
39583 4862826 1993203 -418235 -892036 -492957 -1145330 -3172579 -4952166 -4853698 -3148241
39574 -3148241 -1641820 -1435826 -1718581 -1274549 -480000 -709117 -2085082 -3192784 -3206694
39565 -3206694 -2980934 -3438919 -3972708 -3314781 -1330927 871062 2204482 2307618 1338927
39556 1338927 -222088 -1629307 -2224736 -1887034 -1060694 -383371 -202281 -251587 94128
39547 94128 1020915 1942404 2240169 1957250 1357647 396003 -657169 -747538 635356 2103809
39537 2103809 1745720 -292330 -2011496 -2301885 -1907072 -1522332 -738218 502861 1083618
39528 1083618 360436 -644410 -725813 -142599 146874 -41426 -296061 -445944 -466832 -330309
39518 -330309 -462995 -1377824 -2433181 -2273817 -1044270 -536427 -1291755 -1409833 417149
39509 417149 2505865 2655248 1475984 1069211 1548835 1285537 -69297 -1191357 -1427940
39500 -1427940 -1352499 -1086632 -127916 1098475 1426179 812258 258248 -184906 -1483783
39491 -1483783 -3504268 -4668403 -4106939 -2522203 -661809 1282420 2420480 1323798
39483 1323798 -1735684 -4411970 -5108462 -4741016 -4805237 -5168622 -4928373 -4211503 -3772328
39474 -3772328 -3587979 -3077886 -2289669 -1940127 -2505406 -3774811 -4982696 -5156662 -3908825
39465 -3908825 -2108498 -1142244 -1352785 -1890406 -2097117 -2094868 -1951089 -1382367 -530224 15562
39455 15562 174325 293028 38308 -1285031 -3080471 -3631325 -2454156 -1116065 -1122760
39446 -1122760 -2269508 -3590714 -4545177 -4685030 -3628630 -2048549 -1226434 -1010928 80182
39437 80182 2001754 2494251 507070 -1734746 -1851747 -750081 -852552 -2274030 -3087276
39428 -3087276 -2548427 -1777268 -1596470 -1653481 -1541695 -1209100 -434204 784414 1664893
39419 1664893 1652635 1405543 1570678 1445967 336713 -702253 -307127 792296 838590
39410 838590 -49685 -191032 759351 1420293 1164848 901628 1218069 1637274 1891432 2148909
39400 2148909 1920832 644259 -588732 -1077 1891613 2462844 672526 -1578046 -2525292
39391 -2525292 -2760051 -3199571 -2872452 -428271 3379028 6225092 6549245 4502507 1451329
39382 1451329 -759981 -1071069 -451014 -928496 -2874571 -4436915 -4198865 -2980327 -2243197
39373 -2243197 -2160619 -2243076 -2521913 -2983036 -2987098 -2340950 -1874358 -1989377 -1842027 -988766
39363 -988766 -494542 -1128273 -1775876 -1178364 -91342 15806 -482900 59549 1976914
39354 1976914 3942034 4824996 4414967 2723411 149741 -1907471 -2160327 -1165454 -709399
39345 -709399 -1526982 -2723473 -3222520 -2592312 -695987 2111606 4477698 5052113 4152356
39336 4152356 3379313 3500726 3718659 3107633 1814282 671685 348837 889522 1507556
39327 1507556 1104946 -365682 -1549569 -1488182 -1056467 -1482344 -2197518 -1739057 -308701
39318 -308701 389168 -231430 -1012203 -1245220 -1669793 -2684963 -3166241 -2013096 160151
39309 160151 1704742 1668791 414013 -877185 -1103003 -274471 384189 39999 -445858
39300 -445858 121560 1147744 1066202 -55062 -651879 -375619 -501987 -1298718 -1299300 3941
39290 3941 990747 572378 -104980 15411 -15687 -1005978 -1551806 -313268 1255566 913075
39280 913075 -811850 -1589982 -932697 -246071 131095 1116070 2260989 1849121 76435
39271 76435 -532481 1179638 3162659 3163165 1621357 290134 -308712 -543311 -181216 1048211
39261 1048211 2214137 2036450 575774 -1023059 -2019122 -2340244 -1897737 -738509 398111
39252 398111 649355 76665 -496769 -510924 -67713 318092 -54366 -1499910 -3085460
39243 -3085460 -3123421 -1292639 538913 600716 -451650 -718865 164630 1009827 1337164
39234 1337164 1753976 2077323 1098488 -1195934 -2950933 -2936955 -2247521 -2393538 -2981350
39225 -2981350 -2658135 -1447921 -667757 -994986 -1873091 -2505998 -2391739 -1293296 231040
39216 231040 719843 -556090 -2215574 -2273962 -657620 1145020 2463439 3657009 4174915
39207 4174915 2699481 -245528 -1993046 -1067148 993748 2227860 2750976 3211473 2716112
39198 2716112 499979 -1753932 -1812169 -302757 319232 -260127 -11012 1657687 2750716
39189 2750716 2031456 957922 1103474 1832517 1983667 1960564 2436724 2548353 1313152
39180 1313152 -280992 -566058 235383 685582 783916 1790891 3472534 3643190 1074264
39171 1074264 -2659749 -4962808 -4779356 -2852191 -507417 1066013 1142844 -3206 -1155287
39162 -1155287 -1338582 -840505 -719870 -1426829 -2186531 -1800571 -34500 1892644 2501608
39153 2501608 1772790 1116798 1338235 1400355 5630 -2211430 -3247218 -2304266 -635186
39144 -635186 264658 194046 -259297 -618943 -387872 961996 3022635 4117080 2863379
39135 2863379 -111026 -2661121 -3299888 -2527975 -2081372 -3095097 -4930818 -5770263 -4577719
39126 -4577719 -2407335 -1318801 -1994481 -3051893 -2890562 -1508986 -63542 717380 960836
39117 960836 845978 196017 -994624 -2098378 -2222189 -1046690 723599 1865495 1774307
39108 1774307 996116 395585 60058 -430886 -860227 -385553 1125661 2614528 3091684
39099 3091684 2685593 2002668 1176827 176176 -573895 -638092 -238607 190547 715763
39090 715763 1487775 2033295 1796883 1146124 1011463 1634032 2389628 2712132 2444774 1440781
39080 1440781 -282041 -1978179 -2674207 -2408664 -2176650 -2456862 -2616803 -2028183 -878819
39071 -878819 530563 2348921 4332687 5274566 4302141 2301719 985814 704929 237443
39062 237443 -1168547 -2635451 -3028568 -2626106 -2596304 -3229817 -3572263 -2819704 -1389965
39053 -1389965 -376540 -360703 -971208 -1293825 -556790 1215337 2968366 3360312 2063042
39044 2063042 114912 -1225276 -1606757 -1311474 -477634 689698 1377612 838571 -459798
39035 -459798 -1289730 -1290837 -1137025 -977684 -13821 1790419 2847414 1905745 13442
39026 13442 -767361 -128086 343445 -344565 -1283940 -1176886 -138921 580823 156485 -988092
39016 -988092 -1686276 -1165096 201223 1293215 1480845 1182751 1061840 1253242 1826388
39007 1826388 3272702 5625619 7591289 7674827 6020515 4154408 3057076 2504435 2112807
38998 2112807 1779183 1088003 -364941 -1855514 -2115871 -1395990 -1493436 -3107332 -4600532
38989 -4600532 -4316105 -2825930 -1726563 -1347328 -1074513 -1103865 -2228593 -4169055 -5513648
38980 -5513648 -5333707 -3869246 -1759008 422403 1994832 2548653 2496802 2437892 2111418
38971 2111418 903839 -735756 -1484040 -911569 -93966 -122410 -753306 -910173 -715
38962 -715 1549143 2717817 2770882 2066358 1854294 2819130 4072921 4236815 3229592 2102181
38952 2102181 1317046 372223 -746817 -1031286 24577 1357056 1645109 1079915 964656
38943 964656 1849467 2859321 2892066 1908507 807308 301763 262781 266923 478186 1440246
38933 1440246 2959374 3933655 3733987 3078053 2866316 2799732 2059018 797849 -137392
38924 -137392 -527499 -600721 16457 1648853 3157516 2998919 1755284 1635240 3068420
38915 3068420 3930122 3010662 2106049 3212728 5450129 6531891 5872819 4412070 2633857
38906 2633857 807911 137285 1365492 2877431 2479468 689084 -44061 857962 1610858
38897 1610858 1493558 2002839 3750994 4757104 3309424 581938 -1254697 -1999806 -2728677
38888 -2728677 -3290223 -2475206 -271671 1657546 1786177 89364 -2214410 -3594836 -3299740
38879 -3299740 -2195657 -2020648 -3215855 -4293299 -4120318 -3777819 -4838993 -6611212 -6774417
38870 -6774417 -4531256 -1601634 -31906 -258005 -1358458 -2021322 -1231999 775752 2183054
38861 2183054 1422816 -622875 -1659565 -1275398 -1432716 -3185960 -4844873 -4529152 -2863058
38852 -2863058 -1583302 -831232 299149 1502078 1702839 1320504 1897268 3401743 3980568
38843 3980568 2858265 1552931 1406387 1666800 1140257 184037 -367741 -958122 -2268403
38834 -2268403 -3368859 -2848955 -1332200 -909311 -2137598 -3494932 -3998699 -4385835 -5057067
38825 -5057067 -4792720 -2759243 -322592 628467 157683 -394280 -745102 -1669177 -3063280
38816 -3063280 -3689269 -2950208 -1636127 -735477 -557012 -1077427 -2034986 -2531359 -1662806
38807 -1662806 157013 1465305 1569386 1151716 935293 895391 1034991 1627506 2216765
38798 2216765 1748140 413042 -14258 1324359 2827520 2637290 1234439 368506 403145
38789 403145 445934 338551 551034 569626 -428267 -1370413 -133477 2881555 4329416
38780 4329416 2270727 -965954 -1898711 -433617 666979 22857 -825593 -145039 1594339
38771 1594339 2752807 2726017 2165099 1611777 915191 28971 -382628 285499 1396908
38762 1396908 1409651 -192561 -1868176 -1715636 65356 1412459 1104174 54394 -458540
38753 -458540 -615381 -1245803 -2155223 -2401709 -1710416 -566345 703067 1909653 2404375
38744 2404375 1630387 190354 -657490 -562097 -215174 -8909 344071 754973 522343
38735 522343 -386778 -804120 215065 2048175 3182421 2866429 1694539 845783 977165
38726 977165 1627716 1720798 955751 371192 855776 1536847 863855 -831511 -1399223 115271
38716 115271 2014834 2259981 908679 -680863 -1829129 -2548936 -2676264 -2327218 -2328757
38707 -2328757 -2826978 -2365718 40575 2705690 3077926 1323269 51825 557685 1485997
38698 1485997 1580690 1585307 2456278 3416827 3045303 1217865 -983616 -2361838 -1932534
38689 -1932534 644714 4078051 5994426 5475646 4099680 3578594 3508755 2620159 1116459
38680 1116459 201036 991 -400871 -1191227 -1535009 -946691 205454 1381095 2016851
38671 2016851 1373994 -534310 -2177980 -2030868 -703933 -194818 -1099125 -2058104 -2081364
38662 -2081364 -1810096 -1976674 -2072706 -1412858 -498616 -405306 -1383628 -2727105 -3647396 -3895661
38652 -3895661 -3837457 -4036468 -4443534 -4246142 -3130093 -2223332 -2686585 -3679983 -3166743
38643 -3166743 -754776 1751006 2806458 2548563 1441299 -635007 -3071140 -4007509
38635 -4007509 -2467943 91500 1538784 1475692 964946 868629 1440966 2581061 3506639
38626 3506639 3150850 1771280 1034382 1629688 2227613 1864799 1595846 2215278 2229475
38617 2229475 339540 -1673697 -1301429 626837 1284161 492488 639689 2131170 2550211
38608 2550211 1013582 -85934 935153 2284693 1681202 -330096 -1913601 -2655786
38600 -2655786 -2746301 -1393515 1581995 3946015 3249114 84294 -2816915 -4059499 -4345303
38591 -4345303 -4464553 -4471618 -4490233 -4588793 -4100683 -2599345 -1179706 -1160841 -1857150 -1389987
38581 -1389987 437054 1870181 1870262 1252240 850915 300448 -683227 -1279306 -737067 449762
38571 449762 1362896 1869731 2305510 2603175 2431829 1779258 885887 -60679 -792662 -836573
38561 -836573 133578 1890894 3607971 4154761 2904702 748008 -202771 1175288 3349307
38552 3349307 3667824 1431108 -1643156 -3900568 -5280484 -6083093 -5758415 -3900224 -1423482
38543 -1423482 373840 1370762 2290018 3222530 3475750 2777749 1758473 1075624 677955
38534 677955 211547 -238256 -203482 444133 1197926 1581526 1883035 2745619 4054532 4907777
38524 4907777 4930014 4829341 5146736 5333835 4908930 4598969 5023431 5001809 2956028 -296354
38514 -296354 -2128453 -1652025 -687283 -658766 -585706 743016 2424439 2824944 1983162
38505 1983162 1030264 248235 -655115 -1161697 -576046 442890 604361 -76971 -564159
38496 -564159 -701681 -1254138 -2226841 -2803511 -2967330 -3479235 -4006076 -3051067 -419414
38487 -419414 1810920 1773284 106369 -1250684 -1608357 -1739046 -2166966 -2443506 -2038178
38478 -2038178 -1142099 -463120 -527199 -1108374 -1292551 -470896 708594 1011929 360889
38469 360889 29968 709942 1357938 772131 -513313 -996472 -341079 489248 1005254
38460 1005254 1758406 2903124 3405395 2365346 396499 -993118 -950430 300475 2043527
38451 2043527 3347809 3176501 1262770 -1037690 -1729757 -473410 824228 326515 -1433796
38442 -1433796 -2435895 -1921879 -1092705 -1070594 -1469354 -1475937 -1154764 -798836 -2889 1384900
38432 1384900 2138972 1051119 -835945 -1062691 991775 3255047 3841852 3266563 2953837
38423 2953837 2968611 2518821 1712337 1348020 1524781 1801001 2274458 3093383 3261307 1615356
38413 1615356 -953320 -1995718 -741872 733350 454608 -737260 -696072 803730 1930965
38404 1930965 1485478 202753 -681435 -833882 -410036 617722 1972122 2640792 1827805
38395 1827805 97524 -1146297 -1308292 -1150098 -1553693 -2248252 -2214583 -1192414 -236247
38386 -236247 -463199 -1528655 -1899331 -760105 876173 1411700 673055 -35278 116123
38377 116123 333786 -431622 -1563534 -1270331 866696 2801986 2288055 -194072 -1843762
38368 -1843762 -1071828 450576 94661 -2169660 -3913521 -3750217 -2979625 -3105169 -3349950
38359 -3349950 -2131915 57772 1228214 1011463 1138297 2468755 3523663 2889107 1401333
38350 1401333 597553 287138 -708399 -2220207 -2848999 -2094514 -914624 -310815 -551709
38341 -551709 -1497785 -2426664 -1940217 403356 2662763 2534055 708293 119570 1594905
38332 1594905 2641379 1434509 -406670 -595785 399092 837097 927805 1973848 3309073
38323 3309073 2932583 987967 -66920 842695 1891351 1315450 -139453 -850779 -741509
38314 -741509 -667205 -524358 498722 2272869 3594132 3630837 2690061 1547592 602217
38305 602217 -181344 -783106 -821607 30650 1272382 1746887 1081419 411191 851287 1738157
38295 1738157 1531954 154177 -950459 -1000834 -610087 -202268 634595 1780590 2262290
38286 2262290 1983324 2085984 2727812 2364985 540968 -552723 732498 2372935 1307426
38277 1307426 -1741906 -2959598 -855433 1764339 1908823 175793 -758167 249048
38269 249048 2038056 2964513 2310853 479327 -1334582 -1959868 -1199231 282383 1934268
38260 1934268 3482767 4297174 3821515 2850553 3030780 4512808 5341557 3974211 1292582
38251 1292582 -792787 -1655961 -1767275 -1232319 -10025 1058437 1070024 682066 1334852
38242 1334852 2785880 3017548 1123883 -1133249 -1628685 -725764 -536745 -1777974 -2797040
38233 -2797040 -2059882 -465551 -211779 -1790350 -3246653 -2685154 -592201 1002639 1015290
38224 1015290 6292 -1187230 -2245837 -2741601 -2066849 -549254 473569 459616 569831
38215 569831 1848599 3436498 3853851 3364515 3525259 4668022 5426986 4887949 3728792
38206 3728792 2826400 2045579 1013008 9447 -551180 -632122 -82581 1310602 2752003
38197 2752003 2736791 1323628 735627 2323836 4173096 3604813 1178847 -99955 761378
38188 761378 1642433 1025967 192572 515825 894225 -194927 -1773687 -1806529 -544273
38179 -544273 17733 -408735 -1168 1899932 3449461 3054212 1579052 712056 664023
38170 664023 730715 858378 1225703 1226383 369262 -464120 -154491 705218 506954 -950049
38160 -950049 -2256368 -2582786 -2480651 -2244066 -1179755 671842 1561804 144092 -2259968
38151 -2259968 -2952956 -1167405 1155417 1907878 966601 -538806 -1979401 -3313940 -4041662
38142 -4041662 -3369481 -1647308 -584727 -1277460 -2614615 -2590268 -918302 739494 1164699
38133 1164699 971147 1172531 1581647 1529971 1223615 1232186 1286414 812272 193664 212775
38123 212775 557556 259121 -565472 -878188 -611565 -818228 -1710057 -2172974 -1705594 -1205996
38113 -1205996 -1114454 -447307 1211835 2284605 1269136 -854927 -1880153 -1282127 -360979
38104 -360979 -62303 -199139 -475119 -777600 -638352 192038 774560 45368 -1157188
38095 -1157188 -699997 1839151 4184151 4058414 1802498 -476924 -1581353 -2132771 -3092781
38086 -3092781 -4133989 -3840571 -1578877 1121602 1843274 273293 -1080405 -143430 1673813
38077 1673813 1307932 -1509662 -3663129 -2851084 -491874 487534 -714916 -2565920 -3552539
38068 -3552539 -3364013 -2282322 -751071 433333 429457 -866192 -2659391 -3904814 -4021028
38059 -4021028 -3215056 -2244325 -1616792 -1037432 -9929 1193003 1840162 1916058 2077525
38050 2077525 2374646 2048325 863315 -399164 -1139338 -1557492 -1681171 -1035037 85537
38041 85537 362099 -577496 -1230819 -467424 527156 83844 -1213738 -1468582 -456877
38032 -456877 338163 370546 606384 1325390 1419705 507966 -75130 594993 1353574 628379
38022 628379 -1154048 -2098424 -1293878 289624 1126210 570613 -910904 -2323282 -2905438
38013 -2905438 -2606525 -1836815 -845129 263037 925837 274303 -1704529 -3643296 -3951744
38004 -3951744 -2318270 207502 2356397 3557273 3912843 3601510 2450560 287710
37996 287710 -2191287 -3424362 -2554566 -778416 -210908 -1313686 -2376903 -1859071 -302917
37987 -302917 654993 385427 -407596 -924271 -1001227 -886872 -1000823 -1723858 -2765061 -2892356
37977 -2892356 -1038592 2214818 4840199 5312712 4064188 2839020 2849912 3756489 4314230
37968 4314230 3750353 2359201 893622 -228610 -912482 -978043 -293453 804037 1727257
37959 1727257 2242179 2413391 2138724 1412217 907578 1367901 2316787 2405156 1372494
37950 1372494 593692 1079717 1956797 1796127 611178 -475320 -881901 -798596 -297724
37941 -297724 607860 1326380 1217552 534647 -198606 -1384217 -3584731 -5750053 -5838841
37932 -5838841 -3562654 -1075338 -325185 -958254 -1551068 -1693710 -1819597 -1935063 -1758109
37923 -1758109 -1543702 -1579815 -1231725 292356 2316419 3021213 1654484 -477073 -1580717
37914 -1580717 -1240609 -310073 446337 996309 1570977 2102114 2254196 1880209 1373852
37905 1373852 1421001 2174758 2806176 2355281 1097405 407392 815360 842831 -1217366
37896 -1217366 -4515694 -5937789 -3826164 -416601 614892 -1426901 -3664234 -3490064
37888 -3490064 -1502438 22953 196907 -237412 -853177 -2044740 -3615393 -4312859 -3305370
37879 -3305370 -1289582 317911 763825 348086 13332 683479 2423042 4166812 4846417
37870 4846417 4632969 4234074 3277022 869376 -2114803 -3170369 -1457111 715586 1022549
37861 1022549 239479 455225 1434359 1139454 -675302 -1962909 -1659209 -1052506 -1168650
37852 -1168650 -1000863 395210 1836396 1672385 300300 -626356 -678788 -725793 -1050861
37843 -1050861 -1013563 -457633 -55054 -157407 -418769 -605827 -725364 -325492 1149334
37834 1149334 3064278 3808663 2821736 1485098 1384056 2408724 3236880 3119835 2452531
37825 2452531 1911353 1742592 1842757 2026148 2127591 2073650 1871797 1477890 839379 155948
37815 155948 -129584 222362 911026 1281139 813799 -417829 -1615728 -1857754 -1182255
37806 -1182255 -721734 -1185717 -1642983 -813593 657756 639323 -1440034 -3426724 -3206452
37797 -3206452 -1437691 -291719 -359549 -375508 362291 967435 627620 -27047 144134
37788 144134 1261800 2412471 2768022 2365093 2007099 2495086 3709831 4542384 4091266
37779 4091266 2759350 1692794 1339847 1175122 687251 -78416 -912249 -1680146 -2185842
37770 -2185842 -2422026 -2823911 -3556474 -3808716 -2791595 -1258118 -782952 -1495545 -1932434
37761 -1932434 -1416711 -1027752 -1546947 -1998530 -1366507 -505335 -924701 -2474290 -3599298
37752 -3599298 -3377304 -2121667 -472069 920551 1253241 375417 -518158 -110326 1375213
37743 1375213 2726848 3479145 3852390 3451914 1662774 -726253 -1915498 -1368267 -324371
37734 -324371 162705 282128 291276 -172719 -1089409 -1828533 -2525486 -4133858 -6302453 -6891955
37724 -6891955 -4922074 -2519292 -2201492 -3326750 -3270414 -1519766 -352570 -1312263 -3046897
37715 -3046897 -3427979 -2335510 -1272596 -1081886 -1108587 -348502 1287767 2846966 3198638
37706 3198638 2132401 657894 -18859 211128 452853 125842 -382284 -479372 -143000
37697 -143000 400128 1228137 2458219 3745134 4539533 4705211 4500519 4071843 3335380
37688 3335380 2295426 1147491 103579 -590553 -553439 399038 1777295 2702404 2834384
37679 2834384 2646350 2579116 2382191 1708989 958065 847497 1305518 1537450 1278503 1218156
37669 1218156 1863551 2678680 2886931 2599503 2505921 2803872 3098977 3117768 2833993 2032349
37659 2032349 467811 -1498058 -2999835 -3486753 -3029236 -1934144 -635359 104724 -401885
37650 -401885 -1959841 -3505698 -3987871 -2945487 -582563 1989153 2872732 904067 -2718240
37641 -2718240 -5255422 -5219870 -3587208 -2068077 -1235940 -835393 -829944 -1198138 -1351824
37632 -1351824 -709323 445384 1338436 1653876 1573206 1205647 529741 -326714 -1162265
37623 -1162265 -1838782 -2120544 -1771859 -1039270 -557971 -572701 -815080 -1280225 -2276625 -3389563
37613 -3389563 -3394984 -1845941 93899 1107200 1276971 1521542 2263219 3380351 4665390
37604 4665390 5517114 4999813 3118721 1253577 398667 -161251 -1360885 -2486299 -2177922
37595 -2177922 -598260 864798 1567234 1864752 1823543 1147673 184091 -311296 -257827
37586 -257827 -41293 354541 900099 874592 38824 -285689 1031224 2796947 3062233
37577 3062233 2224041 2266192 3188856 2780126 238091 -2428757 -3290083 -2668206 -1744857
37568 -1744857 -1019823 -886892 -1732520 -2590833 -1609753 1210090 3536429 3813850 2993253
37559 2993253 2349308 1703646 926732 1004483 2123417 2687069 1833180 1022122 1454559
37550 1454559 1913432 1170269 583824 1836913 3640338 3419200 1301507 -181441 244507
37541 244507 1605751 2847068 3684282 3566266 1925016 -538443 -2440090 -3339947 -3452601
37532 -3452601 -2551580 -844792 27461 -1049601 -2514095 -2131713 -357308 710899 933031
37523 933031 1854060 3345229 3672056 2868963 2774857 3293216 1947216 -1836353 -5083920
37514 -5083920 -5326264 -3606229 -1947831 -441926 1314755 2321227 2069533 2536896 5772601
37505 5772601 10534227 13495645 13176210 10973831 8945416 8137266 8563698 9334170 9049435
37496 9049435 7139882 4538619 2433742 1098371 543155 1138459 2572691 3325671 2444755
37487 2444755 949279 267309 205127 -215772 -814771 -697576 -21837 237918 -50888
37478 -50888 -134948 228560 527306 451854 69821 -684034 -1717166 -2312242 -1919489 -1064944
37468 -1064944 -532877 -76726 1028384 2538962 3417089 3185680 2208191 990598 67374
37459 67374 31047 675727 733444 -387778 -1300638 -499428 1111053 1327690 -25198 -875348
37449 -875348 -158326 700762 219358 -981771 -1527522 -1480695 -1848900 -2619485 -2598991 -1133773
37439 -1133773 879527 1907297 1359042 141643 -280665 652763 2157594 3092990 3040377
37430 3040377 2290687 1375384 1052459 2076894 4152598 5569388 4880310 2772948 1378363
37421 1378363 1817586 3240628 4111598 3532353 1500799 -985909 -2066983 -530181 2419049
37412 2419049 3965766 2789840 480432 -679112 -424242 -201387 -845634 -1650534 -1633224
37403 -1633224 -831171 -74798 12772 -575175 -1568373 -2727374 -3747350 -4227328 -4029779
37394 -4029779 -3444934 -2681285 -1525015 -51707 731104 -54326 -1606393 -2212746 -1681935
37385 -1681935 -1503358 -2126455 -1894926 142159 2071261 1643050 -206069 -574491 1208174
37376 1208174 2863036 2668626 1608852 1492470 2535876 3511292 3218154 1362809 -1124277
37367 -1124277 -2460568 -1625537 347487 1618143 1853322 2066725 2437595 2008438 709379
37358 709379 -110588 230542 664979 117920 -980798 -1695489 -1918828 -1898265 -1434964 -363995
37348 -363995 938669 2148052 3401303 4728800 5823458 6592444 7061152 6673613 4861121
37339 4861121 2423051 949855 598491 -63330 -1612589 -2807454 -2667475 -1869875 -1291799
37330 -1291799 -755886 -80316 249164 401565 1484743 3386426 4091142 2518954 337143
37321 337143 -603619 -915564 -1934388 -3026918 -2896856 -2233307 -2562005 -3391063 -3031605
37312 -3031605 -1625738 -809988 -741247 -45539 1351849 1957899 1559123 1794717 3168370
37303 3168370 3800042 2295597 14152 -858658 -186190 434748 -32353 -1184620 -2052132
37294 -2052132 -2029911 -1217842 -237615 494721 1229080 2151995 2582119 1824842 551166
37285 551166 131195 655817 865617 92111 -1043118 -2016725 -3080567 -4174967 -4526184
37276 -4526184 -3902847 -3095819 -2578978 -1846395 -699940 -18279 -439006 -1296050 -1702153
37267 -1702153 -1717342 -1531267 -495349 1731736 3692513 3251777 239527 -3086171 -4433037
37258 -4433037 -3587676 -1930294 -566524 481002 1517179 2356913 2634338 2558833 2708919
37249 2708919 3046368 2819856 1711045 385066 -495183 -1009898 -1158205 -268961 1716790
37240 1716790 3195698 2546284 394001 -1156371 -1241285 -756086 -438518 -124022 90758
37231 90758 -266144 -667044 175026 2127669 3342077 2898746 2196239 2690913 3631431
37222 3631431 3318145 1624547 -51843 -766701 -833009 -969105 -1476311 -2089773 -2207387
37213 -2207387 -1549744 -726569 -574136 -896552 -747886 -62253 146915 -458534 -812562
37204 -812562 -36597 1324834 2222622 2217137 1226446 -608876 -2270496 -2419797 -1276298
37195 -1276298 -548205 -831047 -787334 116377 47256 -2348020 -5231905 -5845990 -4339381
37186 -4339381 -3135434 -3275948 -3635817 -3345584 -2784174 -2184925 -1224508 -217934 -45975
37177 -45975 -581553 -603107 404901 1549636 1888952 1512982 1112433 1227764 1826216 1999561
37167 1999561 658382 -1605566 -2296774 -99585 2705636 2867551 637836 -680418
37159 -680418 460513 2017448 1853058 664794 262733 821740 1293158 1225495 764699
37150 764699 -240953 -1841459 -3238675 -3457799 -2466184 -1053312 -25033 117563 -675555
37141 -675555 -1762096 -2278080 -2104131 -1731230 -1137747 176430 1837449 2524525 1789043
37132 1789043 781350 446101 101542 -1240409 -3058593 -3940836 -3459863 -2443849 -1747138
37123 -1747138 -1588875 -1818145 -2070325 -1801569 -727773 849262 2399328 3553967 3994507
37114 3994507 3504316 2441683 1618134 1357565 1179535 696026 229925 216539 573595
37105 573595 959287 1052359 394348 -1215158 -2867916 -3059048 -1566948 88079 641659
37096 641659 573017 848202 1161119 498485 -1198135 -2993739 -4143794 -4422140 -3755264
37087 -3755264 -2508346 -1751335 -2194307 -3011231 -2649163 -789743 1248045 2076803 1603230
37078 1603230 793341 533179 777529 670975 -330087 -1506481 -1614962 -613732 264789
37069 264789 460973 944102 2374119 3537605 2826572 549442 -1478284 -2163784 -1813181
37060 -1813181 -1078177 -500859 -760506 -2022757 -3155565 -2837146 -1394142 -338366 -155671
37051 -155671 54980 592768 329584 -1444594 -3481617 -3785171 -1812176 1110436 3121288
37042 3121288 3211598 1811476 423701 301970 1205986 1826113 1572192 1353900 2222388
37033 2222388 3744038 4327860 3081507 903936 -435700 -152881 876507 1384587 1262223
37024 1262223 1272211 1436531 742538 -1191329 -3138243 -3659682 -2730960 -1261612 163803
37015 163803 1129329 859509 -779225 -2254292 -1785091 386468 2369156 3030334 2740049
37006 2740049 1952844 587752 -1058510 -2174270 -2489477 -2376948 -1872222 -774622 391049
36997 391049 932161 1388983 2696771 4003308 3423859 1330311 560588 2387760 4451062
36988 4451062 4083557 1796737 -174092 -1093460 -1593871 -1719025 -1217428 -865394 -1474406
36979 -1474406 -2238470 -1938970 -1164437 -1392025 -2366664 -2443796 -1271628 -71216 680346
36970 680346 1734644 3040066 3320988 2250353 1177193 950013 709377 -266184 -1085798
36961 -1085798 -764893 13614 -119162 -1320629 -2649447 -3332729 -2998735 -1407396 1013346
36952 1013346 2935236 3449279 3205511 3328762 3637967 3008763 1294882 -243956 -617700
36943 -617700 -319778 -438099 -1100216 -1339050 -379721 1352964 2702999 3090728 2971510
36934 2971510 2876816 2511805 1346827 -239432 -1204343 -1166477 -705996 -336733 -51216
36925 -51216 17573 -479960 -1194159 -1162507 -373580 -175169 -1304451 -2501454 -2184756 -750205
36915 -750205 63733 -376617 -1089018 -1177909 -777151 -303676 63024 27713 -634286 -1320467
36905 -1320467 -991257 398107 1680050 1924705 1321108 460438 -338481 -739627 -412057
36896 -412057 256062 398723 59819 338168 1603562 2674288 2554347 1841229 1306869
36887 1306869 246794 -2069858 -4059298 -3103042 674768 3845615 3649394 1086413
36879 1086413 -890825 -1083230 -701706 -1027176 -1789186 -1879778 -771408 989660 2253475
36870 2253475 2171223 927161 -470554 -1280452 -1656913 -2020846 -2292802 -2208465 -1969024
36861 -1969024 -1937560 -1946107 -1575119 -960979 -604968 -417206 281343 1632347 2790869 2930579
36851 2930579 2212704 1399363 836840 191703 -884111 -1989996 -1978106 -76503 2723383
36842 2723383 3975350 2315236 -607632 -1827384 -636138 861050 1010719 787663
36834 787663 1745491 3282104 3595632 2500338 1473812 1272684 1291876 1206851 1381290
36825 1381290 1369396 -64115 -2674738 -4238730 -3460329 -1909918 -1694859 -2470527 -2432924
36816 -2432924 -1292239 -274638 317459 1401032 2898345 3244226 1688550 -525042
36808 -525042 -1975949 -2629434 -2828212 -2212365 -819064 -52629 -1068214 -2857988 -3328916
36799 -3328916 -1905142 137022 1562224 2152498 2035569 1397013 938684 1387342 2256052
36790 2256052 2121867 483913 -1515527 -2518081 -2277544 -1311018 -124568 812566 1120590
36781 1120590 976528 880308 722334 -77682 -1277108 -1766180 -1279493 -915906 -1213648
36772 -1213648 -1059338 283492 1305535 139682 -2438988 -3808851 -3011684 -1594781
36764 -1594781 -951325 -783085 -662512 -1216829 -2731996 -4013491 -3857516 -2683094 -1589596
36755 -1589596 -633493 757327 2270279 2895687 2406168 1587795 1065819 774071 563125
36746 563125 541387 721782 922667 1079389 1196489 1023467 216324 -1191961 -2748969
36737 -2748969 -3818580 -3684923 -2018917 210033 945314 -837900 -3520185 -4369302 -2589861
36728 -2589861 121180 1941775 2623591 2656668 2118959 1130443 478121 790574 1550722
36719 1550722 1714423 1014250 54911 -555312 -592104 -78764 610015 791434 265745 -201000
36709 -201000 74204 362755 -789143 -3366339 -5277165 -4517068 -1454085 1619962 2953481
36700 2953481 2773371 2334621 2190822 1837368 838144 -287077 -635196 -121160 426047
36691 426047 461086 473859 1117425 1963073 1822693 324835 -1455357 -2167976 -1500333 -26414
36681 -26414 1744016 3591747 5111399 5692291 5125297 3837364 2391620 1065200 7195
36672 7195 -588904 -736189 -792273 -1025510 -1216317 -1006947 -532808 -354825 -751150 -1355112
36662 -1355112 -1572376 -1192689 -561025 -269438 -652855 -1467298 -2135127 -2394989 -2483828 -2485695
36652 -2485695 -1892291 -345571 1415485 2075828 1263341 -78922 -892618 -875781 -101854
36643 -101854 1229566 2234506 1586135 -798155 -3042136 -3294712 -1920613 -685372 -240636
36634 -240636 284060 1375927 2253102 2127913 1179700 -40012 -1078297 -1188726 212974
36625 212974 2119561 2312108 163748 -2054166 -1880804 220751 1833994 1941640 1657650
36616 1657650 1961824 2502048 2811888 3055795 3059458 2091838 389603 -397927 694318
36607 694318 2411192 2920551 2134112 1199454 485274 -373468 -889227 -45392 1624017
36598 1624017 2076218 622791 -744063 -17769 1951678 2647932 1265753 -607383 -1430482
36589 -1430482 -1315559 -1002504 -579638 166725 1033510 1667733 1993773 2005709 1740909 1714776
36579 1714776 2561556 3848335 4172315 3026541 1604518 980225 557359 -537527 -1552930
36570 -1552930 -1203744 48412 687208 743529 1576322 2994142 2948306 824733 -1191171
36561 -1191171 -1301638 -655998 -1027744 -1688273 -864981 851778 1154815 -342474 -1622269
36552 -1622269 -1530682 -1172247 -1490041 -1659145 -940408 -307137 -860621 -1988912 -2521696
36543 -2521696 -2636609 -3114205 -3524489 -2808200 -1255728 -313474 -475801 -765801 -393955
36534 -393955 414422 1503292 3319914 5698291 7207241 6663378 4696124 3009637 2514337
36525 2514337 2850832 3281838 3246483 2387165 949311 8581 393100 1438280 1803678
36516 1803678 1549779 2104699 3696609 4259094 2121484 -1200361 -2552198 -1124492 775747
36507 775747 996025 -91119 -956488 -1002611 -312584 1268233 3373086 4396600 3177152
36498 3177152 968963 206456 1441811 2905279 3057568 2106950 821646 -594534 -1823955
36489 -1823955 -1991446 -870800 328965 281148 -922886 -2193718 -2761337 -2438846 -1251920
36480 -1251920 425555 1875773 2831324 3702287 4406477 3818017 1414517 -1201997 -1774694
36471 -1774694 -154792 1629379 1985021 1237089 476198 240599 705439 1969533 3490393
36462 3490393 4175114 3785598 3481438 4119653 4674544 3463140 691048 -1397262 -1169873
36453 -1169873 491839 1498046 1162247 718400 1378534 2715396 3343766 2632642 1111453
36444 1111453 -486372 -1714437 -1972768 -684880 1471252 2372657 561504 -2730527
36436 -2730527 -4629033 -3677317 -1081949 1028148 1633474 940884 -472070 -1895206 -2418032
36427 -2418032 -1445385 670559 2810089 3902885 3584014 2336033 1090928 448567 253453
36418 253453 167860 434049 1458424 2719220 2942327 1646500 -218530 -1545022 -2246080
36409 -2246080 -2661073 -2544213 -1480271 121807 1301371 1655890 1523213 1213500 694102
36400 694102 -65972 -1045165 -2398562 -4147519 -5672468 -6157341 -5683173 -5332560 -5905389
36391 -5905389 -6835097 -6675831 -4612181 -1368833 1421019 2779664 3185014 3609228 4052131
36382 4052131 3708909 2532653 1606683 1561804 1669436 1260440 1008295 1636137 2231359
36373 2231359 1450591 -71748 -356467 864907 1598721 594805 -820416 -824753 426175
36364 426175 1577597 2186733 2648253 2698305 1452646 -1162231 -4022064 -5848967 -6043651
36355 -6043651 -4764181 -2867544 -1527595 -1248188 -1414313 -1235536 -703532 -160754 372473
36346 372473 681297 -73024 -2145059 -4117795 -4332158 -3104938 -2163440 -2034699 -1548186
36337 -1548186 -127628 1009335 602205 -950753 -2436948 -3374963 -3871265 -3768945 -2908493
36328 -2908493 -1752389 -950192 -617888 -612309 -1041498 -1865736 -2465050 -2363654 -2087822 -2569104
36318 -2569104 -3833493 -4900526 -4931614 -4019001 -2893971 -2181382 -1848121 -1234892 77505
36309 77505 1345540 1207687 -520157 -2261746 -2430436 -1153159 355593 1441905 2173742
36300 2173742 2475423 2231805 1944606 2163265 2411055 1778278 513343 -158334 78986
36291 78986 111441 -887273 -2257428 -2832085 -2251271 -900506 589797 1374764 873994
36282 873994 -241349 -486788 380140 784678 -282524 -1353787 -326519 2428381 4367328
36273 4367328 4013787 2396514 1112410 451898 45339 82174 827177 1655401 1688089
36264 1688089 1130833 1025492 1690490 2268212 2045341 1474733 1381401 1654018 1430859 445591
36254 445591 -515498 -633250 85144 1236992 2632390 3874559 3945423 2264625 19879
36245 19879 -706520 556418 2001632 1839703 310735 -1283085 -2578565 -4003263 -5208561
36236 -5208561 -5110755 -3556689 -1737833 -620682 40725 702482 1001873 464475 -427264
36227 -427264 -772504 -592030 -803268 -1834327 -2944136 -3168250 -2469428 -1581173 -993838
36218 -993838 -590423 -258210 -261288 -597913 -413954 1154757 3517607 4814387 3985242
36209 3985242 2056776 846983 943879 1632281 2266950 2704511 2604421 1447409 -508575
36200 -508575 -2109990 -2451979 -1642251 -447822 164376 -673398 -2820530 -4460381 -3617518
36191 -3617518 -787568 1149379 305389 -2055527 -3533308 -3556523 -3140143 -2749908 -2059576
36182 -2059576 -1302764 -1141337 -1224649 -404424 1393483 2819657 2942642 2266388 1541812
36173 1541812 742097 -200595 -710493 -443394 -81516 -392817 -988906 -812473 430448
36164 430448 1993734 3060011 3410841 3207018 2584438 1586156 345662 -714218 -1025679
36155 -1025679 -512927 41851 -233837 -1186665 -1869727 -1918180 -1953889 -2410768 -2760445 -2368318
36145 -2368318 -1470224 -776730 -633683 -1033688 -1880967 -2712420 -2726649 -1712047 -473352
36136 -473352 218465 536002 851803 815642 108010 -493367 -18291 989978 944948 -516334
36126 -516334 -1869001 -1663728 -309839 553665 -54369 -1533657 -2359420 -1551666 287069
36117 287069 1542635 1430299 795354 630706 599879 52059 -270598 777440 2300686
36108 2300686 1911505 -807534 -3261839 -3267766 -1946919 -1815283 -3163131 -4026127 -3177737
36099 -3177737 -1496460 -409475 -325503 -833502 -1424270 -1635157 -1134395 -16179 1271643
36090 1271643 2343660 2999178 3123646 2818679 2435032 2160321 1853357 1562071 1699050
36081 1699050 2245622 2385515 1635705 787919 812903 1267665 912233 -282880 -972500
36072 -972500 -429377 423733 417093 -286836 -599663 1334 872894 904965 -332251 -1970108
36062 -1970108 -2523414 -1533542 -195423 250751 311666 1423548 3616707 5340945 5755496
36053 5755496 5753120 6150412 6245307 5182501 3677266 3078224 3315555 3072873 1766758
36044 1766758 212354 -674902 -871812 -816532 -777934 -842902 -911412 -564775 478492 1652225
36034 1652225 1928992 1176401 515091 886228 1769864 1983691 1491463 1548054 2790861
36025 2790861 3940997 3194567 675126 -1434022 -1472916 -176795 666308 683149 927945
36016 927945 1770136 2198270 1558856 712373 659972 955403 511922 -611698 -1374674 -1430997
36006 -1430997 -1460125 -1733343 -1489539 -290317 809207 300299 -1807539 -3795992 -4133218
35997 -4133218 -3022730 -1770610 -1069610 -553449 79852 401192 138901 -27274 592286
35988 592286 1414633 1295292 366999 12918 868921 2024705 2594076 2902588 3454802
35979 3454802 3805191 3354046 2378476 1326638 -25671 -1566543 -1855913 289380 3600734
35970 3600734 5333362 4444782 2442897 1038111 423216 200255 538836 1634608 3031795
$$ [...]
##END NTUPLES=NMR SPECTRUM
##END=
