##TITLE=31Pdec_PR168_rmk
 D2O, 24 sc
 7.2.2019
##JCAMPDX= 6.0         $$ Bruker NMR JCAMP-DX V2.0
##DATA TYPE= NMR SPECTRUM
##DATA CLASS= NTUPLES
##ORIGIN= UXNMR, Bruker Analytische Messtechnik GmbH
##OWNER= root
$$ XWIN-NMR		Version 3.5
$$ Thu Feb  7 14:56:58 2019 Russian Standard Time (UT+4h)  she@DPX200
##.OBSERVE FREQUENCY= 81.013821
##.OBSERVE NUCLEUS= ^31P
##.ACQUISITION MODE= SIMULTANEOUS
##.ACQUISITION SCHEME= undefined
##.AVERAGES= 24
##.DIGITISER RES= 17
##SPECTROMETER/DATA SYSTEM= spect
##.PULSE SEQUENCE= zgpg30
##.SOLVENT NAME= CDCl3
##.SHIFT REFERENCE= (INTERNAL, CDCl3, 0, 182.463)
##AUDIT TRAIL= $$ (NUMBER, WHEN, WHO, WHERE, WHAT)
$$ ##TITLE= Audit trail, XWIN-NMR		Version 3.5
$$ ##JCAMPDX= 5.01
$$ ##ORIGIN= Bruker BioSpin GmbH
$$ ##OWNER= she
$$ F:/spectra/data/she/nmr/P31/1/pdata/1/auditp.txt
$$ ##AUDIT TRAIL=  $$ (NUMBER, WHEN, WHO, WHERE, WHAT)
(   1,<2019-02-07 14:56:00.92 +0400>,<she>,<DPX200>,
      <created by zg, POWCHK disabled, PULCHK disabled
       configuration hash MD5:
       00 E9 B6 7A A2 85 ED C7 34 08 36 98 17 FE 4E 26
       data hash MD5: 32K
       1F 1C F4 E2 D2 C5 53 FF 7F 0E A2 17 46 C6 7E 93>)
(   2,<2019-02-07 14:56:03.62 +0400>,<she>,<DPX200>,
      <Start of raw data processing
       efp BC_mod = 2 LB = 1 FT_mod = 6 PKNL = 1 PHC0 = -1435.109 PHC1 = -43.00099 SI = 64K 
       data hash MD5: 64K
       79 1B B7 45 39 35 D2 52 BF 54 2D 58 38 80 30 7A>)
(   3,<2019-02-07 14:56:25.95 +0400>,<she>,<DPX200>,
      <pk PHC0 = -52.14457 PHC1 = 142.7999 
       data hash MD5: 64K
       A7 39 4A 5B F7 BF 96 1E 55 C9 D2 00 BD 52 54 E3>)
(   4,<2019-02-07 14:56:28.73 +0400>,<she>,<DPX200>,
      <abs ABSG = 5 
       data hash MD5: 64K
       9D 3C 59 9C 5D 76 01 F3 28 5E 9D A6 F2 C2 02 63>)
$$ ##END=
$$ 
$$ hash MD5
$$ 3B FB DA 82 F7 44 AE F8 DF 73 D8 76 31 88 BB 0D
##$RELAX= 
##$RELAX= 
##$RELAX= 
##$RELAX= 
##$RELAX= 
##$RELAX= 
##$RELAX= 
##$RELAX= 
$$ Bruker specific parameters
$$ --------------------------
##$DU= <F:/spectra>
##$EXPNO= 1
##$NAME= <P31>
##$PROCNO= 1
##$TYPE= <nmr>
##$USER= <she>
##$AMP= (0..31)
100 100 100 100 100 100 100 100 100 100 100 100 100 100 100 100 100 100 
100 100 100 100 100 100 100 100 100 100 100 100 100 100 
##$AQSEQ= 0
##$AQ_mod= 1
##$AUNM= <au_zg>
##$AUTOPOS= <>
##$BF1= 81.014009
##$BF2= 200.13
##$BF3= 200.13
##$BF4= 200.13
##$BF5= 200.13
##$BF6= 200.13
##$BF7= 200.13
##$BF8= 200.13
##$BYTORDA= 1
##$CFDGTYP= 0
##$CFRGTYP= 5
##$CHEMSTR= <none>
##$CNST= (0..31)
1 1 145 1 1 1 1 1 1 1 1 1 1 1 1 1 1 1 1 1 1 1 1 1 1 1 1 1 1 1 1 1 
##$CPDPRG= <waltz16>
##$CPDPRG1= <>
##$CPDPRG2= <waltz16>
##$CPDPRG3= <>
##$CPDPRG4= <mlev>
##$CPDPRG5= <mlev>
##$CPDPRG6= <mlev>
##$CPDPRG7= <mlev>
##$CPDPRG8= <mlev>
##$CPDPRGB= <>
##$CPDPRGT= <>
##$D= (0..31)
0 1 0 0 0 0 0 0 0 0 0 0.03 2e-05 3e-06 0 0 0 0 0 0 0 0 0 0 0 0 0 0 0 0 
0 0 
##$DATE= 1549536960
##$DBL= (0..7)
120 120 120 11 120 120 24 19 
##$DBP= (0..7)
150 150 150 150 150 150 150 150 
##$DBP07= 0
##$DBPNAM0= <>
##$DBPNAM1= <>
##$DBPNAM2= <>
$$ [...]
##$SUBNAM3= <"">
##$SUBNAM4= <"">
##$SUBNAM5= <"">
##$SUBNAM6= <"">
##$SUBNAM7= <"">
##$SUBNAM8= <"">
##$SUBNAM9= <"">
##$SW= 369.568048894756
##$SWIBOX= (0..15)
0 1 3 0 0 0 0 0 0 0 0 0 0 0 0 0 
##$SW_h= 29940.119760479
##$TD= 32768
##$TD0= 1
##$TE= 0
##$TE2= 300
##$TE3= 300
##$TEG= 300
##$TL= (0..7)
0 120 53 12 22 120 120 120 
##$TP= (0..7)
150 150 150 150 150 150 150 150 
##$TP07= 0
##$TPNAME0= <>
##$TPNAME1= <>
##$TPNAME2= <>
##$TPNAME3= <>
##$TPNAME4= <>
##$TPNAME5= <>
##$TPNAME6= <>
##$TPNAME7= <>
##$TPOAL= (0..7)
0.5 0.5 0.5 0.5 0.5 0.5 0.5 0.5 
##$TPOFFS= (0..7)
0 0 0 0 0 0 0 0 
##$TUNHIN= 0
##$TUNHOUT= 0
##$TUNXOUT= 0
##$USERA1= <user>
##$USERA2= <user>
##$USERA3= <user>
##$USERA4= <user>
##$USERA5= <user>
##$V9= 5
##$VALIST= <valist>
##$VCLIST= <CCCCCCCCCCCCCCC>
##$VD= 0
##$VDLIST= <DDDDDDDDDDDDDDD>
##$VPLIST= <PPPPPPPPPPPPPPP>
##$VTLIST= <TTTTTTTTTTTTTTT>
##$WBST= 1024
##$WBSW= 4
##$XGAIN= (0..3)
0 0 0 0 
##$XL= 0
##$YL= 0
##$YMAX_a= 24515
##$YMIN_a= -26163
##$ZGOPTNS= <>
##$ZL1= 120
##$ZL2= 120
##$ZL3= 120
##$ZL4= 120
##$ABSF1= 182.463
##$ABSF2= -187.1042
##$ABSG= 5
##$ABSL= 3
##$ALPHA= 0
##$AQORDER= 0
##$ASSFAC= 0
##$ASSFACI= 0
##$ASSFACX= 0
##$ASSWID= 0
##$AUNMP= <proc_1d>
##$AZFE= 0.1
##$AZFW= 0.5
##$BCFW= 0
##$BC_mod= 2
##$BYTORDP= 0
##$COROFFS= 0
##$CY= -3
##$DATMOD= 1
##$DC= 0
##$DFILT= <>
##$DTYPP= 0
##$F1P= 0
##$F2P= 0
##$FCOR= 1
##$FTSIZE= 65536
##$FT_mod= 6
##$GAMMA= 0
##$GB= 0
##$INTBC= 1
##$INTSCL= 5.30512e-09
##$ISEN= 30
##$LB= 1
##$LEV0= 0
##$LPBIN= 0
##$MAXI= 10000
##$MC2= 0
##$MEAN= 0
##$ME_mod= 0
##$MI= 50
##$NCOEF= 0
##$NC_proc= -3
##$NLEV= 6
##$NOISF1= 182.463
##$NOISF2= 159.3651
##$NSP= 0
##$NTH_PI= 0
##$NZP= 0
##$OFFSET= 182.463
##$PC= 4
##$PHC0= -1487.254
##$PHC1= 99.7989
##$PH_mod= 1
##$PKNL= yes
##$PPARMOD= 0
##$PSCAL= 0
##$PSIGN= 0
##$REVERSE= no
##$SF= 81.0140089999434
##$SI= 65536
##$SIGF1= 159.3651
##$SIGF2= -187.1042
##$SINO= 113.3802
##$SIOLD= 16384
##$SREGLST= <1H.CDCl3>
##$SSB= 0
##$STSI= 65536
##$STSR= 0
##$SW_p= 29940.119760479
##$SYMM= 0
##$S_DEV= 0
##$TDeff= 32768
##$TDoff= 0
##$TI= <>
##$TILT= no
##$TM1= 0
##$TM2= 0
##$TOPLEV= 0
##$USERP1= <user>
##$USERP2= <user>
##$USERP3= <user>
##$USERP4= <user>
##$USERP5= <user>
##$WDW= 1
##$XDIM= 65536
##$YMAX_p= 328782747
##$YMIN_p= -1154921
$$ End of Bruker specific parameters
$$ ---------------------------------
##NTUPLES= NMR SPECTRUM
##VAR_NAME=  FREQUENCY,     SPECTRUM/REAL,   SPECTRUM/IMAG
##SYMBOL=    X,             R,               I
##VAR_TYPE=  INDEPENDENT,   DEPENDENT,       DEPENDENT
##VAR_FORM=  AFFN,          ASDF,            ASDF
##VAR_DIM=   65536,         65536,           65536
##UNITS=     HZ,            ARBITRARY UNITS, ARBITRARY UNITS
##FACTOR=    0.456856943014862, 1,           1
##FIRST=     14782.0589164792, 0,            0
##LAST=      -15158.0608439998, 0,           0
##MIN=       -15158.0608439998, -1154921,    0
##MAX=       14782.0589164792, 328782747,    0
$$ Real data points
##PAGE= N=1
##DATA TABLE= (X++(R..R)), XYDATA
$$ [...]
42178A5683K26936J29328r7280j42820L4533J05187j04328l15944k20561P8384
42168b90882K55987J97768L7360q2884j07803m3179K4379j6720j33838j62043
42158c21855n2292N8153R1508J35854K07313J49363p1402k06813p7965J20832
42148C2696J11579n0054j15876n8543m5593r5651p2564J3301J541j02108q5765
42137d67037J22351L01218K37773J4951j10588k1015J51599J82357m22k09823
42127B01364j99194J062Q6210p9505k12397k0988K99657L10999j1885k42238j41116
42116h031M6520M8162m3819l7414K835p1550j81389j56777l7651J9694J8382N3074
42104c47964P0333l5696j61833j13279N4152J04078L0286P4335K68862L06192
$$ y = [15683, 242619, 371947, 274667, 131847, 166380, 271567, 167239, -148705, -369266, -290882, -34895, 162873, 200233, 117349, 9546, -33633, -9254, -25974, -159812, -321855, -374147, -315994, -224486, -88632, 118681, 268044, 196642, -10171, -88136, 32696, 144275, 94221, -21655, -80198, -125791, -221442, -294006, -280705, -279164, -381272, -467037, -344686, -43468, 194305, 209256, 98668, 77653, 229252, 411609, 411187, 201364, 2170, 3232, 89442, 9937, -202460, -223448, 76209, 387208, 375323, 133085, -8031, 38489, 86651, 42832, 5418, 8253, -63297, -244686, -401463, -439114, -419420, -401038, -347964, -277631, -313327, -475160, -588439, -534287, -430209, -399923, -325588, -56726, 249466]
42094B49466L1776k40035j69205Q2557R9617j46285k71285p6865J85785K30759
42084b3715J04451j0240q9537j66279j47223K1307J57454P5474r0185o4890J28077
42073a05306K01830O1802p7247o9660l1428n8665m2936Q1728J63523Q9366o343
42062B06664Q652J6176j14399k27218j00477J64896K67737J34502n2657j81928
42052A21948k68997k39192R222L01317K82552p8895l77129k97443j2348J22256
42042d36709N5758J1144R7659J83905J28415l2428j54646j57174q7096l6408j9131
42031d46711K6531J04538J22861N6715L5327J37457K15035J05149q2731j25675
42021A48496n4488p5899j69320j01559J25515K05236J6838j59391r0417O2951
$$ y = [249466, 281242, 41207, -127998, -45441, 54176, -92109, -363394, -440259, -254474, -23715, 80736, 70496, -19041, -185320, -332543, -311236, -153782, -78308, -168493, -233383, -105306, 96524, 158326, 81079, 11419, -20009, -78674, -121610, -39882, 123641, 213007, 206664, 215316, 231492, 117093, -110125, -210602, -45706, 222031, 356533, 303876, 121948, -147049, -386241, -377019, -75702, 206850, 127955, -249174, -546617, -558965, -436709, -380951, -369807, -272148, -88243, 40172, 7744, -146902, -304076, -391172, -427580, -446711, -420180, -315642, -192781, -136066, -100739, 36718, 251753, 356902, 274171, 148496, 94008, 18109, -151211, -252770, -127255, 77981, 94819, -64572, -154989, -92038]
42011i2038O4225k3245l5567k6941r7799j22671K9064J75005O9342j49624j23908
42000c34157J65788L59707K47680J6057r4253r6103j17484j68131j66952p6950
41990b64798O4590J73944J70155P4023J3245L3029m75j57995k38796m4960K35200
41979E7162K32361l9636j72940J8511K21493J21248j28167j74448O564J36009
41969B78157P4765k7889j6272N3758L4934r3885j97252j39308N0049J75768Q1183
41958B74008j55273k95821k21087m2640Q0475J23680J36699J11511J7515q8278
41948e9211r7206N613J04401Q4646k7516q5958K313J43246J51227j0377j70867
41937D0311j85362j19145r6781q0235L1895J63666J42616J446l9059P8058J51370
$$ y = [-92038, -27813, -51058, -86625, -113566, -211365, -334036, -304972, -129967, -60625, -210249, -334157, -168369, 191338, 439018, 455075, 360822, 264719, 147235, -20896, -187848, -264798, -200208, -26264, 143891, 217914, 231159, 264188, 263713, 105718, -133078, -178038, 57162, 289523, 249887, 76947, 95458, 316951, 438199, 310032, 135584, 142148, 278157, 352922, 325033, 308761, 362519, 397453, 303568, 106316, -32992, 17057, 192825, 274008, 118735, -177086, -398173, -440813, -360338, -236658, -99959, 11552, 29067, -59211, -156417, -150804, -46403, 38243, 10727, -75231, -72918, 70328, 221555, 211178, 40311, -145051, -264196, -360977, -441212, -409317, -245651, -103035, -101589, -140648, -62590, 88780]
41926H8780O1365l0565L4967J39925Q9708o3319j16408m2702L411l1700l2917
41915A00545M8251Q3613k4363j58328j26038O6283J87426N2429k35982l80755
41905c86919k30689M1431J55652N7899o6933p8327k9511j2722o108M8194J25669
41894c82364J66111J55112R0018m1095j71442j55476L4386K02622J50488o2834
41884a4474k05712j68941m3428N8254J12660J21528P3159j188k9618J0083O7311
41873b0366R0963O0430l8749j79500k43674j23366J02857K06707Q0449j17462
41863a81711j58472j7857J31663J54982Q2795Q235m5209j00783j30648o2572J04979
41852b14598K49919K35831O4519j19749j85889j39583o9488j2050O5231J50775
$$ y = [88780, 150145, 119580, 154547, 294472, 384180, 320861, 204453, 161751, 165162, 133462, 100545, 148796, 232409, 208046, 49718, -76320, -10037, 177389, 229818, -6164, -386919, -617608, -576177, -420525, -362626, -429559, -507886, -537397, -550119, -556227, -508033, -382364, -216253, -61141, 28877, -12218, -183660, -339136, -304750, -102128, 48360, -14474, -220186, -389127, -432555, -374301, -261641, -140113, -66954, -68142, -97760, -87677, -20366, 70597, 131027, 92278, -87222, -330896, -454262, -351405, -144698, -64249, -181711, -340183, -358040, -226377, -71395, 11400, 19635, -25574, -126357, -257005, -319577, -214598, 35321, 271152, 335671, 215922, 30033, -109550, -179038, -191088, -125857, 24918]
41842B4918J48639J4166j31645j33036l0090k0363j49138j97083n15K56687K75064
41831E7604P9474k9969M9790R9074q478p9403L2988J18816n8931l28804l25333
41820c93172k8419K22702K03474J0543j72116k42754j39549J03151K67950J83993
41810A5803J6353M2065J78727R0529k31418l98893k20852L4791J16094J27871
41800b28930K01100K07300O1759l6379L8571N9793j50294l38473k09578O1503
41790c33628J09917l5568p0644M5097J01668P8497J33916K21530J43843m2211
41780C52417q4649J3939J5991q6349n8989R1134P6164j38191k11436K811J94453
41769A67295J10354o3659q2183m0771j05680j59301m6479P9892J1010j13088j1511
$$ y = [24918, 173557, 187723, 56078, -76958, -107048, -127411, -276549, -473632, -474147, -217460, 57604, 137078, 107109, 156899, 255973, 247495, 168092, 201080, 319896, 260965, -67839, -393172, -421591, -198889, 4585, 15128, -156988, -399742, -539291, -436140, -168190, 15803, 32156, 74221, 252948, 343477, 112059, -286834, -507686, -472895, -356801, -228930, -27830, 179470, 241229, 204850, 243421, 303214, 152920, -185553, -395131, -333628, -223711, -259279, -329923, -284826, -183158, -104661, 29255, 250785, 394628, 352417, 267768, 281707, 297698, 211349, 152360, 243494, 319658, 181467, -29969, -27158, 167295, 277649, 213990, 131807, 91036, -14644, -173945, -220424, -140532, -129522, -242610, -254121]
41758b54121K50519L35394J35500j16654k24439k24166j85235p6969Q9313J83967
41748h6891J22288j6301j00310r2486m1708J579K4191M0929O2410O6430L0048
41737A0179n675K9694J14601J36036N1093m9867r1614j07725j13670k6584J63800
41726A10268K72006J38521j08603k05400j20256o4000j30947j51917J0636K07622
41716d2070K01104J4942r3880k14J22543O5293j17501j99372j06371J0955L0601
41705a13970J3957M4964P7019N4924M3089P6613K2443j98896l63853j94866J81508
41694c57068L27568Q1961k32398k69088n4347J88575L36176L28282J02882k17096
41684B35447l04849n1051J94749Q8572j77355j54143J63599L18051Q0655k23984
$$ y = [-254121, -3602, 331792, 467292, 350638, 126199, -97967, -283202, -360171, -270858, -86891, 35397, 19096, -81214, -173700, -215408, -213829, -189638, -148709, -86299, -19869, 10179, 4504, 34198, 148799, 284835, 335928, 286061, 194447, 86722, -26948, -53532, 110268, 382274, 520795, 412192, 206792, 86536, 22536, -108411, -260328, -249692, -42070, 159034, 173976, 80096, 79882, 202425, 267718, 150217, -49155, -155526, -144571, -113970, -100013, -55049, 21970, 76894, 119983, 196596, 219039, 20143, -343710, -538576, -357068, -29500, 52461, -179937, -449025, -503372, -314797, 21379, 349661, 452543, 235447, -69402, -120453, 74296, 162868, -14487, -168630, -5031, 313020, 393675, 169691]
41674A69691k18960J2905J29001L0783p4449k2914J10955J68383J04629q302r2700
41663C09022j25984j21002q9954l7981K6175R1562J45431J52256O2692j02607
41653C09610k08557j42329P284L1224j04728j86761n7751J41369J70358K8053
41643a2228p6673m1151K0630j2483j03905j47771j09165k1594P6075J45649J44462
41632a38154O7239k5075n1663R171R2428J04079J8197q8839j19054n3949M8562
41621a37058J23807J22125J6987j21982j23350Q1898K88119K25069n9103k27059
41611A89453j09754P6465O2573j23300k69041k69456j58741R96J21623J12280
41601c66902K4472K6775J25666J10529q0861j86435k6921J58099P8307j19235
$$ y = [169691, -49269, -36364, 92637, 123420, 48971, 26057, 137012, 305395, 410024, 401722, 309022, 183038, 62036, -27918, -65899, -39724, 51838, 197269, 349525, 412217, 309610, 101053, -41276, -33992, -2768, -107496, -294257, -352008, -210639, -40281, -12228, -88901, -130052, -109422, -121905, -225810, -373581, -482746, -504340, -428265, -282616, -138154, -70915, -95990, -147653, -138482, -46054, 58025, 76222, -12617, -131671, -185620, -137058, -13251, 108874, 125861, 3879, -119471, -37573, 250546, 475615, 416512, 189453, 79699, 156164, 218737, 95437, -173604, -443060, -601801, -600805, -479182, -366902, -342430, -315655, -189989, -79460, -160321, -346756, -373677, -215578, -137271, -256506]
41591b56506r7112R8776J35505k2034p7962M0795O1980j03488j54265Q7101L34488
41580D7278K71010J9994j01403o2610m7993p5246j0140J18605J25360j3177j03495
41569A68183m7866N764p7475j79435r9424J18613K05508L3950j86517j87332r005
41558b55036Q1645L30n5859L6362J20830N1740l9950J4459J05555L5936j20893
41547b4881j53846r3937j21181j66105O746L17531L82890R7127j80630j64781
41537a01067j6927N134n5168m5186j5857o9132r9947L5471K36034K81451J37346
41526B92152n4947j84950k09999j13979J8939L0054p2782p0127J21135K59843
41516A5339J37888q1253j22060o949O2979O6380R7908Q7078q4314k72754k20540
$$ y = [-256506, -353618, -254842, -119337, -141371, -219333, -178538, -116558, -220046, -374311, -287210, 47278, 318288, 338282, 236879, 174269, 126276, 51030, 40890, 159495, 284855, 271678, 168183, 120317, 126081, 48606, -130829, -230253, -111640, 93868, 127818, -58699, -246031, -255036, -173391, -173061, -228920, -192558, -71728, -19988, -59938, -45479, 60076, 96012, -24881, -178727, -272664, -393845, -559950, -553204, -235673, 147217, 244344, 63714, -101067, -117994, -112860, -168028, -213214, -229071, -298203, -398150, -362679, -126645, 154806, 292152, 237205, 52255, -157744, -271723, -252784, -222730, -295512, -365639, -244504, 15339, 153227, 71974, -50086, -57035, 5944, 72324, 170232, 257310, 172996, -99758, -320298]
41505c20298K7069J71072J04865L07m1977r8615j49701l6670K09052K96629Q1615
41494B43348j94355k22852q920K00750K22926O0269j53956k44355j37932K4464
41484b10613L7246q9462j51646o7036L1227N9846J12940K24396K30085K7969k04254
41473F98k33581q3384M9998P9614N3970m603j01960j66490j12423J5992J03782
41462c98387J38929J87218K20268J28489p6874k19272j73683k9214L2808l7147
41452b26865j21328r6833K6114J37511J60512J12502M2685k8263p1254k3919J04689
41441A5551J54867j5475k82142l39084r4075J75666J77565j6456j02464K7158
41431b98889J75323J45215j8162j30666q9135O0681J87841J70044O76j67705j62707
$$ y = [-320298, -293229, -122157, -17292, -16985, -58962, -157577, -307278, -343948, -134896, 161733, 243348, 48993, -173859, -182779, 17971, 240897, 301166, 147210, -97145, -235077, -210613, -173367, -262829, -414475, -481511, -450284, -390438, -277498, -53102, 176983, 204952, 698, -232883, -316267, -266269, -186655, -132685, -137288, -239248, -405738, -518161, -502169, -398387, -259458, -72240, 148028, 276517, 199643, -19629, -193312, -222526, -189718, -226865, -348193, -445026, -418912, -281401, -120889, -8387, 34298, 6035, -65219, -89138, 15551, 170418, 154943, -127199, -466283, -560358, -384692, -207127, -223583, -326047, -298889, -123566, 21649, 3487, -127179, -216314, -155633, 32208, 202252, 202928, 35223, -127484]
41420a27484l029J10612M9241q8533j28539m4295N0052O8745L0517J017L0432
41409e1264J16805J73380Q5491j24043k51720j48352N6506J12975K938n4943K9436
41398e2791O9246p4020k17683j04897J94307L49489K01872o4313j92050j31169
41388b2009j2951K8477l5922j20116j03894J7167R4762K2390r6573j00159j6083
41377c44911J3894l674M8812J31537Q6708l4721P858K12182K44625m4367l26854
41366h911k71631l9781J5261p7824k9511J45573J32032j15902k37458k3139K45861
41355b65430K15010m8124k03499j11025P0746J60048J26841L1973n1131n5940
41345a30531L0424J32002J54212Q2450k2698j00429j27090j09954p4321l5036
$$ y = [-127484, -130513, -19901, 29340, -59193, -187732, -232027, -181975, -113230, -82713, -81696, -51264, 65541, 238921, 324412, 200369, -51351, -199703, -143197, -30222, -27284, -82227, -52791, 16455, -57565, -275248, -380145, -185838, 163651, 365523, 301210, 109160, -22009, -34960, -6483, -42405, -162521, -266415, -249248, -154486, -132096, -228669, -328828, -344911, -331017, -334691, -285879, -154342, -67634, -102355, -94497, 117685, 362310, 317943, -8911, -280542, -320323, -305062, -382886, -412397, -266824, -134792, -250694, -488152, -511291, -265430, -50420, -98544, -302043, -413068, -342322, -182274, -55433, -23460, -74591, -130531, -100107, 31895, 186107, 268557, 245859, 145430, 18340, -91614, -165935, -200971]
41335b00971K5341J12769J63741R9718m7750j40893r9023K644L6241k7407j11360
41324a86950j35137q0972J6165J02757J35660J02816K6197n1779q7303n9382J4667
41313b03261R8497J64103J76669Q4835j00274k34363j62044O8943K34341K11829
41303C39275J00290J3941o8223j49721j10698P2309J75063K2304k00626j97551
41293c637k1545J9250j33803k16041r6938K4559j3556p4710R352J52397J82078
41282a72594J10115N0207J3411l7227m9043L0012J16816J07822N0277M9704P4902
41271C44402Q254j47714k50345j94103j7868J43077J51188k9812k50431k62533
41261e05885R460L31729L94440J53493j43640k43648j16841P7014J67348J10220
$$ y = [-200971, -175630, -62861, 100880, 200598, 152848, 11955, -87068, -84424, -48183, -75590, -186950, -322087, -403059, -386894, -284137, -148477, -45661, -19464, -71243, -158546, -217928, -203261, -104764, 59339, 236008, 320843, 220569, -13794, -175838, -106895, 127446, 339275, 439565, 453506, 385283, 235562, 124864, 197173, 372236, 394540, 193914, -3637, -25182, -5932, -139735, -355776, -452714, -428155, -441711, -516421, -507069, -354672, -172594, -62479, -12272, 1139, -36088, -85131, -55119, 61697, 169519, 219796, 269500, 344402, 352656, 204942, -45403, -239506, -257374, -114297, 36891, 7079, -243352, -505885, -496425, -164696, 229744, 383237, 239597, -4051, -120892, -43878, 123470, 233690]
41251B33690L89l9875L151K5256o0207k08434k83154j93385J0539J67522J63591
41240a80917P6959R2178K22294K37308n806k83093k62476K3970K15112J20160
41230B55689p7522j54949j21770p0016p402L2399m9655j96966j68277Q9323K65754
41219b03392J15482j44268j46066P0459J44245l2695j70841n1813J59314J96574
41209f3001P3421O967P1264J05638k3237j94419j69908O1306K11149O0988k03890
41198f3722k13991P1341L05834K46129N0899j6930M2944O2454j5920j30210k25615
41187A13213k38028j01032Q7401Q6686j27131k26912J8487L59009M01048J65895
41177E38636p210j17j0587j51026k85309k86371j82620k4976J51834K32409J25110
$$ y = [233690, 234079, 194204, 197355, 222611, 162404, -46030, -329184, -522569, -512030, -344508, -180917, -103958, -11780, 210514, 447822, 442016, 158923, -103553, -79583, 135529, 255689, 178167, 23218, -98552, -168568, -175970, -143571, -193226, -390192, -558469, -469146, -203392, -87910, -232178, -378244, -307785, -163540, -196235, -367076, -418889, -259575, -63001, 10420, 17387, 88651, 194289, 171052, -23367, -193275, -131969, 79180, 140168, -63722, -277713, -206372, 99462, 345591, 396490, 379560, 422504, 484958, 469038, 338828, 113213, -124815, -225847, -138446, -51760, -178891, -405803, -387316, -28307, 372741, 538636, 531426, 531309, 520722, 369696, 84387, -201984, -384604, -409580, -257746, -25337, 99773]
41166I9773l7707m4522N9926M3059j15664j80614n0405R3659R9881M3903K9393
41155D0682L2671L3860P9250J35745J02591K6098N9083J52096P4047j69670k62000
41144C04453p0721J03749p8j83946j30121Q3418J49707M4054N68O2559K6397j54714
41132B35325k41159p4114J73834K35817P3251j41562k41310j75168n532J24884
41122c5734R8812l2262p3999P4580K64138K51214j4164l27258m48122l18705n9457
41111f20957J68705K55413J70427k629r4105j4804J12868J00596l1806p3246N9774
41100C0236J94727J70753N4504l0635j04318j89977j62631L1990J65136J7353
41090A77138k30185k17516M6154K02880J01109l3956l1064n762n2793n5608L1759
$$ y = [99773, 62066, 17544, 77470, 120529, 4865, -175749, -226154, -132495, -32614, 11289, 40682, 73353, 107213, 186463, 322208, 424799, 450897, 509980, 662076, 736123, 566453, 304453, 233732, 337481, 337403, 153457, 23336, 106754, 256461, 300515, 301083, 363642, 390039, 235325, -5834, -79948, 93886, 329703, 402954, 261392, 20082, -155086, -160618, -35734, 63078, 30816, -43183, 31397, 295535, 546749, 532585, 205327, -242795, -561500, -620957, -452252, -196839, -26412, -29041, -123146, -137950, -25082, 75514, 43708, -29538, 30236, 224963, 395716, 450220, 419585, 315267, 125290, -37341, -5351, 159785, 177138, -53047, -270563, -224409, -21529, 79580, 45624, 14560, 8798, -43995, -99603, -67844]
41079f7844K9640j37400k37935r2574J10674J11144k7307q0991m3979m9162n2969
41068e38703Q5436K80849K82507N6415j49158j52598m1354K7022M9792J18344
41058A8552K37771K96979K01930M976j28531j16973q0352j61335k73346k04049
41048b04378L3147J79715J18463K4479K0489l8057k40038l48568j38838J86116
41038d07470K37230j6549k51363k60699j24775M9132K48894M01038L63449J40845
41028C79732q5114j80654j59297o7733M9390Q9160q215j08258l5674J30483J39133
41017A42953m4520j74420r9414L0034K4542p6310j19078o5418J4635P0080R1826
41006b05090Q4138P1371O6379K1754r2255j73113q9304R6014J68022O2115m3762
$$ y = [-67844, -38204, -175604, -413539, -506113, -395439, -284295, -311602, -392593, -436572, -485734, -538703, -453267, -172418, 110089, 166504, 17346, -135252, -176606, -149584, -99792, 18552, 256323, 553302, 755232, 760208, 631677, 514704, 434352, 273017, -329, -204378, -171231, 8484, 126947, 151426, 171915, 133858, -106180, -454748, -593586, -407470, -170240, -186789, -438152, -698851, -823626, -774494, -525600, -124562, 238887, 379732, 294618, 113964, -45333, -113066, -63676, 25484, 17269, -90989, -126663, 3820, 142953, 98433, -75987, -175401, -145367, -120825, -197135, -316213, -381631, -366996, -296916, -205090, -120952, -49581, 16798, 38552, -53703, -226816, -316120, -220106, -52084, 10031, -33731]
40995c3731l059R0239O3409q2118j83041j11852J01217K88823K70174L3728j99448
40984B34341j98033o732J14935M3533p4049o9638K8078R5037Q7814L3044m1308
40973B47022q4977m1620M5700N1818m6087j17637p9444j9911l9072q7081o9678
40962b40967j2612n052n2473q7369o7869J1305J35760K29074J80723J837j30553
40951c8196p9365P5362J56147J11955K7849j7493l546N8597J06288M4931j11070
40940C31459j89650p1857J16075J56372K8813j03957j53943j71833j65710n6029
40930b80260J37150K39043J46372k3715j08354j06402j02635r3083k6187N5353
40920a62718O5180K3188N357k2020j42238k68927j97406O6076K36835J36004m3978
$$ y = [-33731, -36790, 53449, 116858, 34740, -148301, -260153, -158936, 129887, 400061, 433789, 234341, 36308, 29576, 144511, 188044, 113995, 44357, 72435, 167472, 255286, 288330, 247022, 162045, 120425, 166125, 217943, 171856, 54219, -25225, -45136, -84208, -171289, -240967, -253579, -258631, -311104, -398473, -466342, -455037, -319277, -90203, 90520, 92357, -38196, -117561, -42199, 113948, 225903, 253752, 236259, 232713, 291310, 397598, 442529, 331459, 141809, 69952, 186027, 342399, 371212, 267255, 113312, -58521, -224231, -280260, -143110, 95933, 242305, 218590, 110236, 3834, -98801, -191884, -218071, -162718, -97538, -74350, -68993, -91013, -233251, -502178, -699584, -633508, -396673, -260669, -304647]
40909c04647k8896J40949K21567J52294P2809K0997r6848k35201k03530K498J31814
40898a26194M4180r3363r3559j213P5131J50355K18408J48067q1219k46204j91805
40887a97416p5449p7930q5759O7459K47029K26313Q4705N0164Q0112k7871k09552
40876H1805k16390o5647n001n8903k6773P4184J3804j63859j30612J43831K72116
40865h1445P7583j17755n4133O3255K682p4182K5426J17838q035j51974m3215
40854b43955J40519N9702j72039j52473J27382K56859O5302j40074q6753Q7073
40844e8457J21068K0720k2140O4354J57382J15142m3081j36483l8977J12597O6986
40833C59111j49757k13906O040K00887Q0503j66966j76549L6818J75227J57368
$$ y = [-304647, -333543, -192594, 28973, 181267, 254076, 275073, 178225, -56976, -260506, -258008, -126194, -82014, -175377, -268936, -270149, -195018, -44663, 173745, 321812, 240593, -5611, -197416, -272865, -350795, -436554, -369095, -122066, 104247, 188952, 239116, 319228, 291357, 81805, -134585, -200232, -205233, -264136, -290909, -216725, -202921, -366780, -497392, -353561, -81445, -3862, -121617, -175750, -112495, -109813, -183995, -158569, -40731, -48766, -200740, -243955, -103436, -43734, -215773, -368246, -240864, 15995, 81297, -58777, -145530, -58457, 62611, 83331, 61191, 125545, 282927, 398069, 354988, 218505, 179528, 292125, 359111, 209354, -4552, 1488, 202375, 282878, 115912, -60637, -23819, 151408, 308776]
40823C08776J35436J14325l8053k38865k47591p8947J5716j3461J8388J07773
40813H3497L2779j79041j92731P6916K67891J31074r9068j32340n8496o9718p5046
40802b14283O9408K02051Q6186j78822l05472k35329j09259L4503K17560L01147
40792a32310J46004q2501r5925P6846J49326M4980l5433k3901r9559k98753l51420
40781g02646r2351K23369K44384j208j75760q6647J27776K36406J78650O9096
40771B1069L6557R5006J46775J06080Q997l7682p006K0082j2000n6906o0041m8211
40759B12720o4854p6310j6817J00809J81400J47837J2508j35706j91720j10455
40749E9412M0815J25186O7529o3376j28170o4434N8294J22234Q0800n321m4711
$$ y = [308776, 444212, 558537, 520484, 281619, 34028, -44919, -29203, -42664, -24276, 83497, 116276, -62765, -255496, -178580, 89311, 220385, 121317, -11023, -69519, -139237, -214283, -144875, 57176, 143362, -35460, -340932, -576261, -685520, -651017, -433457, -132310, 13694, -68807, -164732, -87886, 61440, 106420, 70987, 47086, -52473, -351226, -702646, -794997, -571628, -327244, -328452, -504212, -590859, -463083, -226677, -48027, 21069, 57626, 152632, 299407, 405487, 414484, 376802, 369796, 389878, 377878, 320972, 260931, 212720, 147866, 71556, 54739, 155548, 336948, 484785, 497293, 361587, 169867, 59412, 100227, 225413, 292942, 229566, 101396, 36962, 95256, 217490, 298290, 292969, 248258]
40738B48258k4976k6906j05721j84036j28716N6021J89487J23912o0846j51017
40728f4540o3316P4119J12057N6981Q652k080k5367p3070q0637k218J21972K13923
40716B76476K20448J15858q2562k62386k62488n8647J48051J35182o7529k21410
40706e9007j95768j04795q2180o8186N7085K34852K89318J83528M2018p1318k07050
40695A8497l26897k62253L533K01720J18597p0227m5601J61941K15662P670j63497
40684a40855n6226J53853J66241o519j24023r1210m938O9609J25499Q7755q9495
40673H9691k37855j39790J28004K64113J66548L4694J7737K9992j3255m1269j3437
40662B85173j2895m4613P853J07093L2101k14450k88549l6065J78083R964k75325
$$ y = [248258, 223282, 196376, 90655, -93381, -222097, -166076, 23411, 147323, 86477, -64540, -127856, -53737, 58320, 115301, 123953, 121873, 96506, 23436, -57201, -59419, 62553, 276476, 496924, 612782, 530220, 267834, 5346, -53301, 94750, 229932, 162403, -59007, -254775, -359570, -441750, -509936, -452851, -217999, 71319, 254847, 296865, 225547, 18497, -308400, -570653, -567120, -365400, -246803, -317030, -362631, -200690, 14972, 22642, -140855, -197081, -43228, 123013, 116494, -7529, -98739, -103677, -34068, 91431, 179186, 89691, -148164, -287954, -159950, 104163, 270711, 305405, 323142, 353134, 339879, 298610, 285173, 272278, 227665, 235518, 342611, 374712, 160262, -128287, -164352, 13731, 23695, -251630]
40651b51630j92828J78074L06814M3987j82237o7939J52745J68593N4615K6590
40641B36784M9510k6842j57338j93101j39186r4053m5710O9012J93039K19722
40631A11837J63616J05631M1916o4593j55282j51791j02139j01262j12836k4034
40621b88937J43451K24724J29993l6734j04780k1236J01026Q9299j09148l29561
40611b01903l33983r4054J50555J79463M6037m7656l6340r963j471O8521K11264
40600f9530K82594J62704n3339j42297k2192J39746J29464m4066j62887r4779
40590A25418L2182K9535p5703j11724m8615k0657o6718o4635K0637M3310n7363
40579a94333j05817K7243J68643Q8614j19097j52373N2969K33474J72147l7144
$$ y = [-251630, -444458, -266384, 40430, 84417, -97820, -165759, -13014, 155579, 210194, 236784, 286294, 259452, 102114, -90987, -230173, -324226, -369936, -300924, -107885, 111837, 275453, 381084, 423000, 358407, 203125, 51334, -50805, -152067, -264903, -288937, -145486, 79238, 209231, 172497, 67717, 46481, 147507, 236806, 127658, -201903, -535886, -629940, -479385, -299922, -253885, -301541, -337881, -347844, -349315, -280794, -69530, 213064, 375768, 322429, 180132, 157940, 297686, 427150, 383084, 220197, 125418, 157600, 187135, 111432, -292, -48907, -69564, -136282, -200917, -180280, -136970, -194333, -300150, -272907, -104264, -15650, -134747, -287120, -234151, -677, 171470, 134326]
40569A34326j53605p3143J08523K16752J45158m6357j75728j44372o2276p8333
40559a29055j47257j10347K9709R8599L0677k4074N9147J84319J78410K7869j23908
40548G4089j51968n5155O2710P5611m4338j66519j33576L2628J53433J41197R7817
40537H5929J14303J15505J2817j05587q6195M8369J15316J4757j58463k44425
40527h7674j70036J9450J95045K20072P5447r8358j57723j25280j10384j05694
40517c45135j3347J30651J43405k4387j60748o8079J55963K58559J67175K7519
40507B71576m1041o0641p6147p6547n5387k6147L3627J32672J66333K2695j98376
40496I2617k59498j31662n9015j71848k51023o4962K38508L30384J80861N7203
$$ y = [134326, -19279, -92422, 16101, 232853, 378011, 331654, 155926, 11554, -50722, -129055, -276312, -386659, -356950, -258351, -227674, -251748, -192601, -8282, 170128, 197997, 74089, -77879, -133034, -70324, 5287, -39051, -205570, -339146, -306518, -153085, -11888, 85929, 200232, 315737, 328554, 222967, 136772, 185141, 300457, 315214, 156751, -87674, -257710, -238260, -43215, 176857, 252304, 153946, -3777, -129057, -239441, -345135, -358482, -227831, -84426, -108813, -269561, -337640, -181677, 76882, 244057, 271576, 230535, 169894, 93747, 17200, -38187, -64334, -30707, 101965, 268298, 290993, 92617, -166881, -298543, -357558, -529406, -780429, -845391, -606883, -276499, -95638, -38435]
40486c8435P7776O8477q0128j89388p4170J47273K11673P4635o1403m8448K8893
40475A16755P182j17627j79453o6192J05818J17566n3319j73334o4591J38666
40465a68529J81675N2476l0646L9381J31866J11835J0972q5960j58810j92943
40455a08683j49285n4315J2081N3253J24878J50181j1687k46390k01068K13855
40445b17180N78639M65312J7913k47037j25891Q0418N2511j45937k42941j41809
40435G3998R542N3831P417r666L0356J9621r1196j51214q287K05539K11465J8428
40423C69834n6973R8995J76769n5838l24177k46495M6762R9001j61908l27633
40413c81663j49786J22936J76102O9505N1008J60934K33894J66292J2593j15959
$$ y = [-38435, 39341, 107818, 27690, -161698, -235868, -88595, 123078, 197713, 136310, 87862, 116755, 123937, 6310, -173143, -239335, -133517, -15951, -69270, -242604, -307195, -168529, 13146, 65622, 34976, 74357, 206223, 318058, 329030, 243070, 84260, -108683, -257968, -312283, -300202, -246949, -122071, 28110, 16423, -229967, -431035, -217180, 361459, 826771, 844684, 597647, 471756, 552174, 604685, 458748, 215807, 73998, 83540, 137371, 144788, 135122, 165478, 185099, 93903, -57311, -65598, 139941, 351406, 369834, 312861, 411856, 588625, 532787, 208610, -37885, 8877, 107878, -54030, -381663, -531449, -408513, -232411, -162906, -111898, 49036, 282930, 449222, 461815, 345856]
40403C45856j43073p3555J253R386R910Q8519J61867O3038j62295k56977j20086
40392g6157L5306M197j25847j60303r3092l3858J8356J18039J84992R5922p7518
40381a09963j32432l1576N7677M1565K6319J04316J85264J47763L1886m5594p9143
40370A96082j38459j98710j61072l6785M2225L3060N4785J71546K40113J10526
40360C13311j18624k17287j44989o4792m9907O617J38451J80004J9001j92652
40350a30867k34415j05100L1764Q7459Q1537K8257m5487l9929R1675K10932J55685
40339A31511r964p8251J987Q6860Q5239N8882N7218K7523n8076j21840q6328K3848
40327A18609J10747P2910j20137l38247l43993o7157K41433K91054J18042j9730
$$ y = [345856, 202783, 129228, 130481, 139867, 149777, 238296, 400163, 463201, 300906, 43929, -76157, -40851, -36654, -162501, -322804, -415896, -449754, -431398, -313359, -128367, -32445, -109963, -242395, -273971, -216294, -174729, -148410, -44094, 141170, 288933, 320819, 275225, 196082, 57623, -141087, -302159, -338944, -296719, -263659, -208874, -37328, 202785, 313311, 194687, -22600, -167589, -232381, -282288, -275671, -137220, 42784, 61785, -130867, -365282, -470382, -438618, -351159, -269622, -241365, -286852, -326781, -235106, -24174, 131511, 121547, 43296, 45283, 132143, 217382, 276264, 333482, 361005, 302929, 181089, 94761, 118609, 229356, 302266, 182129, -156118, -500111, -567268, -325835, -34781, 83261, 63531]
40317F3531l9722o8627j16061l0012J69043K22919L3027j52456j15424J7842M4189
40306B8249L6015J57967K98419K01301r6595k66208j50344L4204M4539n5178n7977
40295A74392L2469J3687j76439l21101k11110M6764J57883M6977l8786R9893L01021
40284A25650K54278n7794l15695k52999O0582L41766L72735J39755j85160l65914
40274A17204k97592j05791J1259J2332n466k06j2175k5112K7658J11344J12374
40263e4171L5465R612O1905O0787n2512j43699q9711L2522O6142j1596q7088o1718
40251b34062N3458J52415J28382m30q5492l5516N0115L7124l4214l7736K4341
40240A8385P2046J24679K13629K08181o212k44937k28419l1330J4157j43146k12371
$$ y = [63531, 23809, -44818, -160879, -190891, -21848, 201071, 234098, 81642, -33782, -15940, 28249, 64264, 222231, 520650, 721951, 625356, 359148, 208804, 243008, 287547, 232369, 174392, 206861, 220548, 44109, -276992, -488102, -441338, -283455, -236478, -275264, -175371, 125650, 379928, 322134, 6439, -246560, -185978, 155788, 528523, 668278, 483118, 117204, -180388, -286179, -274920, -262588, -268054, -268260, -280435, -305547, -277889, -166545, -54171, -18706, -9094, 52811, 113598, 61086, -82613, -172324, -139802, -73660, -85256, -172344, -234062, -180604, -28189, 100193, 99763, 14271, -21245, 28870, 65994, 31780, -5956, 18385, 90431, 215110, 428739, 636920, 630708, 385771, 157352, 126022, 140179, -2967, -215338]
40229b15338p8913K5675k3507l8839O7443P7953r4575j61086O2622K81896J72191
40218G5522r5466j48681O466Q4137J7405k5159l658l0098r4097p1393L9702J36925
40206a08395J99947K41832J84010M897j16096m7733L5760q4703k85185k71420
40196b47086m4444J14007P0738l0152m7726o444J7819j3687j01007j60334p5366
40185e23682Q7593R1089r5386j68655M0283K47263J61258k9800p17J36091N6624
40174A961j63783j71731M3791J62245J06913J05579J91838J47246l1002r0762
40164C02295p881l5639j99016k12140k846J41960P8017J369J5453l7810j60927
40153a17165r2031J84039K84299L7065k01585j24426N6471L6426p9571n9865J8848
$$ y = [-215338, -294251, -268576, -292083, -330922, -263479, -185526, -280101, -441187, -378565, -96669, 75522, -19944, -168625, -162159, -78022, -60617, -85776, -89434, -119532, -213629, -285022, -245320, -108395, 91552, 333384, 517394, 522291, 406195, 358462, 394222, 309519, 24334, -247086, -291530, -177523, -106785, -136937, -184663, -191107, -173288, -186975, -287982, -448316, -523682, -436089, -345000, -440386, -609041, -568758, -321495, -160237, -190037, -190754, -54663, 1961, -161822, -333553, -289762, -127517, -20604, 84975, 276813, 424059, 393057, 302295, 294414, 258775, 59759, -152381, -155227, -13267, 64750, 66119, 81572, 43762, -117165, -209196, -25157, 259142, 296207, 94622, -29804, 26667, 63093, -16478, -76343, -57495]
40142e7495P84R671J83222L12548J52439j23561j80419n6130l9813j56502j75184
40131a30440m5875M7325K8348n143k4721p8345q8912N7926K43052K19898j849
40120B21264j47849q0871M0074N3405J9258O0403J49412J61007M7331j08790j78202
40109B36442j09338J0982N0894j057m0392k8813m0596q3320l9537J18616K23948
40098B97829J50832K697p5011j08220j59385j45398N553J53520J28733P198k5298
40087B33050P640n6657j85483j58597P4432K84372K73030J08195l0117r4784j64079
40076B91002k66576l08282j85144N2305J90147P6461j54279j96098N4521L59239
40066h6704M30344K42000k1559k00642k46037j80316p8549j4603L0259J14614
$$ y = [-57495, -56711, -47040, 136182, 448730, 601169, 477608, 297189, 241059, 201246, 44744, -130440, -176315, -128990, -100642, -105785, -130506, -208851, -297763, -239837, 3215, 223113, 221264, 73415, -7456, 32618, 86023, 105281, 165684, 315096, 476103, 523434, 414644, 236442, 127104, 138086, 188980, 187923, 147531, 118718, 78122, -5198, -44735, 73881, 297829, 448661, 451358, 376347, 268127, 108742, -36656, -31103, 122417, 251150, 258348, 233050, 240690, 184033, -1450, -160047, -85615, 198757, 471787, 579982, 549865, 455081, 291002, 24426, -283856, -469000, -416695, -226548, -150087, -304366, -500464, -445943, -86704, 343640, 585640, 564081, 363439, 117402, -62914, -141463, -156066, -125807, -11193]
40056a1193J78943J00082o4599r6178M7542J40185M4755p7125o4434j7051n7549
40045A23378p1674O1841J84182Q3799j36193j98956n7352R5578J25087L8629j19381
40034A28938k41519j60579R5694K13405R079k45321k14482k2233o839j24525n6042
40023f24424J83159K43860O1222l1714R9785J69007J0263j13532L609J23021j5223
40012A09033k06678j04635J88401K56060J093k32413j78507K4192J09295M3422
40002I263l0677n7993j03464j66329j26319O7239K53747K22669q668j96450j67171
39991c04153K160J38560J77113J38381L9040o1548m7118Q7096J58090L4721j47273
39980B15069j74697o9138k2393q6821j28659o2967M0400P9627K1364r2777j41614
$$ y = [-11193, 167750, 267832, 203233, 107055, 154597, 294782, 339537, 262412, 197978, 180927, 123378, 51704, 113545, 297727, 381526, 245333, 46377, -10975, 84603, 209690, 248319, 128938, -112581, -273160, -177466, 35939, 45018, -200303, -414785, -437018, -443857, -568382, -624424, -441265, -197405, -136183, -167897, -68112, 100895, 111158, -2374, 1235, 124256, 109033, -97645, -202280, -13879, 242181, 243274, 10861, -167646, -143454, -34159, 9263, -21414, -79407, -182871, -349200, -475519, -408280, -154533, 68136, 59468, -136982, -304153, -301993, -163433, 13680, 152061, 191101, 129553, 82435, 169531, 327621, 362342, 215069, 40372, -28766, -51159, -137980, -266639, -329606, -289206, -209579, -188215, -280992, -422606]
39969d22606l274K57941L99719L11599J54854N6476j01027l60198m31093j08855
39959b46464K71899K42577q6497k10629m0255L1813j18292j33984J27908K77465
39949A15541N4532j95667q7378J78034J82196k8654r9746N629J2760j29691j69100
39938a61544o092J45829J20600J6586l3027n7420j06845j11141j2242R0947O4830
39927d9519n4222r4729J6045J43771J19009l2472j20430n5290L2691P813n7169
39916a44502j6380R4560J21535N1164k418m1034j71777l34152k96688j4138K39976
39905e13854K25367L8797o4859m821J01004J23778K4809j34795k12274j12909
39895e29757O0666J21354P5573R9606K06972J88004k0212j66997o6797Q7727K5166
$$ y = [-422606, -425880, -167939, 231780, 543379, 698233, 754709, 653682, 293484, -137609, -246464, 25435, 268012, 181515, -29114, -69369, -37556, -155848, -289832, -161924, 115541, 170073, -25594, -112972, 65062, 247258, 218604, 118858, 124487, 137247, 7556, -161544, -167636, -21807, 98793, 115379, 82352, 24932, -81913, -193054, -205296, -114349, -49519, -103741, -198470, -182425, -38654, 80355, 47883, -72547, -127837, -95146, -87333, -144502, -160882, -66322, 55213, 106377, 103959, 62925, -108852, -443004, -739692, -753830, -513854, -288487, -249690, -314549, -319370, -218366, -94588, -69779, -204574, -416848, -529757, -469091, -347737, -272164, -172558, 34414, 222418, 202206, 35209, -31588, 56139, 81305]
39884H1305j70364j98662j8301J00130p659j66346j22244J08634K62640J62708
39874C1841n4450j06136N9673J84692P6179r6345p3688O0251J9478j73757j90752
39863b63014N4629K46636J79901M9913M2550J2397j56996k24952J1530K75872
39853B28466J83253j39353k41808m1792J18975O6995r57M6741N7596n8149j18876
39842A01091J019J17749L3023j29246j22615K2548N2117j07016k29866j22647
39832c83843J10049K29359J77451Q6293K5401p3413k01763j83877N2241K65098
39822A02996J83424q6391j94072n2843P8377M5061P438Q9716J31781j2287j84462
39811A08738j68597k9344L4194J0007P675J4630l0930m1193Q7542K28126J67992
$$ y = [81305, -89059, -287721, -306022, -205892, -213551, -379897, -502141, -393507, -130867, 31841, -22609, -128745, -69072, 115620, 191799, 95454, 21766, 82017, 101495, -72262, -263014, -208385, 38251, 218152, 268065, 310615, 323012, 166016, -58936, -47406, 228466, 411719, 272366, 30558, -11234, 107741, 174736, 173779, 220520, 278116, 219967, 101091, 102110, 219859, 252882, 123636, 1021, 23569, 75686, -31330, -261196, -383843, -273794, -44435, 133016, 219309, 244710, 171297, -30466, -214343, -162102, 102996, 286420, 200029, 5957, -46886, 31491, 76552, 83990, 173706, 305487, 293200, 108738, -59859, -89203, -55009, -45002, -37327, -22697, -53627, -94820, -7278, 220848, 388840]
39800C88840n2867j94551j72772j23390j25206r3640J8511J11004Q4469l1691
39790a91293j35230j48403o5882K4780J7685n2567k4748J29475K01362M2081j79804
39779c82544k04323l9057J16055J87076K30922K17705P8922p6287o3246P4821
39769A40044J19732K6598m2103l7091r3310k26370k40793n6463J17099Q5638m3346
39758b50365m7263Q2657J72755J34364L6634m0906q7058r8820n2843M0598J20428
39747A0181J37887J02448M4878l6249j48795k33449j85719j675J57608J39532
39737a3353L620o0016L589O5406L2879l1254m3265q059M6586J07268J15304K1693
39725B40398p5310k8087R9156Q4131r4265k01454j27586m3505n9886l1287J24756
$$ y = [388840, 335973, 141422, -31350, -154740, -279946, -373586, -355075, -244071, -159602, -191293, -326523, -474926, -540808, -516028, -498343, -550910, -575658, -446183, -244821, -202740, -382544, -586867, -625924, -509869, -322793, -91871, 125834, 204756, 128469, 65223, 140044, 259776, 286374, 244271, 207180, 113870, -112500, -353293, -409756, -292657, -207019, -250365, -297628, -214971, -42216, 92148, 128782, 87876, 818, -98002, -150845, -110247, 10181, 148068, 250516, 295394, 259145, 110350, -123099, -308818, -310493, -152885, -13353, -9733, -69749, -66160, -754, 32125, 871, -42394, -50453, -3867, 103401, 218705, 240398, 165088, 137001, 236157, 320288, 226023, 24569, -103017, -146522, -206408, -237695, -112939]
39714a12939K09034P0179j10771j15209k4185j800J6119J28841J93781N6682j37369
39703A72363j70853r7516n6587K7796K11047K31791j19277n20004m74311k8768
39693h24319L26443L72546L02851K26058M6655j59923j61920k0409m9511k46623
39683a88152k34597R7801L52880K13126j18826k81218k19069p6273Q3482K24120
39673a46726K35596R1046n6842p8516k5415l211l5938r9226j35516m0387J87183
39662a07952L22398J65227j35447k57416j46289p287O6198J34127J49249J5475
39652A98283j35863r4901M5186L3812p7033m5586O1325j8067j73464l7318L13149
39641F9523L76011M4151k04522q9422J05134J34760J49319K02046L5503l30977
$$ y = [-112939, 96095, 166274, 55503, -59706, -83891, -85691, -69572, 59269, 253050, 309732, 172363, 1510, -96006, -152593, -124797, 86250, 318041, 198764, -321240, -795551, -824319, -497876, -125330, 177521, 403579, 450234, 290311, 128391, 107982, 58471, -188152, -422749, -324948, 27932, 241058, 122232, -158986, -378055, -454328, -370846, -146726, 88870, 179916, 123074, 44558, 19143, 15932, -20006, -119232, -254748, -295135, -107952, 214446, 379673, 244226, -13190, -159479, -166766, -100568, 33559, 182808, 198283, 62420, -32481, 12705, 46517, -30516, -76102, -14777, -32844, -206308, -243626, 69523, 445534, 489685, 285163, 195741, 300875, 435635, 584954, 787000, 822503, 491526]
39631D91526m17668n9583K28586P7398j37447m662J85098l862l46435l52603r1692
39620d31344K1124l4744J9195J61273J59484O8230Q4812R6359r7389k99794j96015
39609d48809O5770J18202J9968Q5780K40779J62907n3532k7695J77997J27327
39599D68694j85918k81322k3734J52887J7626j00002K7956J04029j15916l29889
39589b65589j86836J15663J66686l064l8206J31634K11290L2838k02655k30578
39579b68817n4525J11192J16777J2773n6631k8822M6718J12683J43827R0911p0457
39568A55629k05425j22688J12738J92624J6059j31394l8755P7965l0738j81364
39558a55349p2219J57366J44084o6991j11256M2363O7116p2606j8352K90604L79777
$$ y = [491526, 73858, 14275, 242861, 320259, 182812, 178150, 363248, 359386, 12951, -339652, -431344, -410220, -444964, -425769, -264496, -105012, -36782, 48030, 144389, 47000, -252794, -448809, -383039, -264837, -244869, -159089, 81690, 244597, 191065, 163370, 341367, 468694, 282776, 1454, -22280, 130607, 148233, 48231, 76187, 180216, 64300, -265589, -452425, -336762, -170076, -173140, -211346, -79712, 131578, 164416, -38239, -268817, -323342, -212150, -95373, -82600, -139231, -168053, -121335, -8652, 135175, 226086, 155629, -49796, -172484, -59746, 132878, 148937, 17543, -21212, 56753, 26015, -155349, -227568, -70202, 73882, 6891, -104365, -62002, 5114, -67492, -85844, 204760, 584537]
39547E84537j4407m31248l23560J23833K74321m0686l48214k61189L3204J39377
39537b64032J1148p6938K8383J85450K20757J63229J25707J02942L9593l358N1193
39526E84074R0500n2671k73970k87140p7960M2682o2020j37661O152J59415Q5515
39515G6916o7024l7134J08138J34989M4424j4807n4805j44737j73354m6579N4236
39504a19737m1652j34596L5490K94562K78421L2618q4464N61L8839m3626p9363
39493A77053n9625j38441k44631j49355P1165J04192m6794n5515J36804K21970
39483A6823R9459M0461J41122J22053j23325k64623q5817J25690M8545j69659
39473d9271j99040l2327J06746J39257J34764J06197L5465k2786k8516k4529k0277
$$ y = [584537, 570130, 138882, -184678, -60845, 213476, 172790, -175424, -436613, -403409, -264032, -252884, -329822, -301439, -115989, 104768, 267997, 393704, 496646, 536239, 532881, 584074, 674574, 621903, 347933, 60793, -17167, 25515, -36505, -174166, -168014, -8599, 76916, 9892, -27242, 80896, 215885, 260309, 245502, 190697, 45960, -127394, -173973, -119737, -161389, -295985, -260495, 34067, 312488, 345106, 260642, 261203, 300042, 256416, 177053, 117428, -21013, -265644, -414999, -343834, -239642, -286436, -341951, -205147, 16823, 116282, 156743, 297865, 419918, 296593, 31970, -53847, 71843, 120388, -49271, -248311, -280638, -173892, -34635, 100129, 206326, 241791, 219005, 190489, 165960, 145683]
39462A45683L3831R3296M0479q7361j19489m8744m8417j42677j49948k0084Q0719
39451b22712R6324J58355K49061J56731j00431j94852k1276P7784j35700l78253
39441c14969k86303K2811J64664M2432j29569j94233j59978o1681N1318Q7586
39431g77922M6872O2337J78043K44326J62727M9440K2442K8727J8982O7869J65204
39420B69047J27569r5050k55707j60623L1586P6428M703j3466K0321L904l1713
39409b3001K592O1160N5552L3978Q1206J42939J22734N3485J4904j6067q2341
39398D47141j17044m5400O7136R5449J4678j07094j96031j94305r2561J7924K9763
39387h0344l1267n9831m6345m1834k858J19283J97472R3950n8280m3004M2091
$$ y = [145683, 179514, 272810, 313289, 225928, 106439, 57695, 9278, -133399, -283347, -303431, -222712, -126388, 31967, 281028, 437759, 337328, 142476, 121200, 198984, 63284, -314969, -601272, -578461, -413797, -371365, -500934, -695167, -855145, -916826, -865508, -777922, -731050, -668713, -490670, -246344, -83617, -34177, -11735, 16992, 35974, 103843, 269047, 396616, 301566, 45859, -114764, -83178, -6750, -2047, -15513, 4808, 8712, -23001, -20409, 40751, 96303, 130281, 211487, 354426, 477160, 530645, 545549, 529482, 447141, 330097, 284697, 351833, 447282, 461960, 354866, 158835, -35470, -128031, -110107, -80344, -111611, -171442, -217787, -259621, -262479, -143196, 54276, 148226, 89946, 46942, 89033]
39376H9033n0003k10256r4637K38091L27634N3120j59360n2323P0615o7455k39731
39365i5272j66983m247J331m0035O1880J83722J49236P7244J04915P1062j45546
39354A97307k76691p0093K25800K19748n980q0603L9363Q6171j9632j12516j38973
39343F3901j85387k10950r6569R0610J77863J65719J64957J58818R1355O3714
39333D84031J54334J73939p8786m12759m30976q7883K38333K37830p294k12058
39323E8711k16403r0402j0771m1197m0889J14149K68098J67576j05772j96406
39313i3306j9886J11906K4710m5869R4790K52833J97107K9706m9804n5614n8834
39302C87739j2851N6432k190j43186j05432J07519J48314p2098j86085k3685P2361
$$ y = [89033, 39030, -171226, -265863, -27772, 299862, 352982, 193622, 141299, 211914, 144459, -95272, -262255, -266502, -265171, -305206, -243326, -59604, 89632, 166876, 271791, 342853, 197307, -79384, -149477, 76323, 296071, 290091, 209488, 248851, 335022, 315390, 202874, 63901, -121486, -332436, -429005, -338395, -160532, 5187, 170144, 328962, 420317, 484031, 638365, 812304, 733518, 320759, -110217, -198100, 40233, 278063, 270769, 58711, -157692, -248094, -258865, -300062, -340951, -226802, 41296, 208872, 103100, -93306, -113192, -1286, 23424, -22445, 72345, 325178, 522285, 551991, 502187, 446573, 387739, 374888, 431320, 429130, 285944, 180512, 288031, 436345, 364247, 178162, 154477, 226838]
39291B26838q8593j41863J42058L38396P5930k62731j64160J54315J75207k1219
39281D34178l980J71438J07484j57815k18860k2456J11097Q2845N5087Q400j87000
39270C80418l63546k49035L2293J35307M2402k1053m0313j07529p7263J67959
39260a00360L27569R1452k76699l08527o2040P3713O2965J12942J21545j11239
39250f8679l24161j26371K71628L33043N8991r6614l9016n9750j58460n3349J82314
39239h0424J82162l9158j17569o119J7511m9717L6148K02450J59589n200L0623
39228C30296J76089P2814k01639k47764p2514k3871r5485K102J78856J05390q1134
39217A43140K9557L05691K39239j32532k73741q2582K9265l3711L8371K21583
$$ y = [226838, 138245, -3618, 138440, 476836, 552766, 290035, 125875, 280190, 455397, 434178, 430198, 601636, 709120, 551305, 332445, 309989, 421086, 503931, 559018, 567418, 380418, 16872, -232163, -199870, -64563, -22161, -43214, -83527, -191056, -268319, -100360, 227209, 318661, 41962, -266565, -328605, -254892, -191927, -78985, 42560, -68679, -392840, -519211, -247583, 85460, 144451, 47837, 8821, -50929, -209389, -262738, -80424, 101738, 62580, -54989, -61108, -43597, -93314, -57166, 145284, 304873, 299673, 330296, 506385, 579199, 377560, 129796, 57282, 33411, -62074, -59972, 118884, 224274, 143140, 172697, 478388, 717627, 585095, 311354, 228772, 258037, 224326, 262697, 484280]
39207D84280J51337j23094j74757J838J7505j14348k9925J80186Q4718k10688
39197B67052j98431O3980O5259j31470J0528L89850L42697j18013k55561Q4247
39187E20138K45704J244j23095L5783j0212l16451k88728J46949L01922j9769
39177D93485j70546Q9907J70961j26447j66753K65307M53091L4964l37362j98022
39167E08585j2961j39014j42479K12571L70634L8960j96688L4444J99069p2253
39157H00868k46102Q6281M22794L05134J30236L10643N10199L73284J58713O5936
39147B917986j86856n94748o23229k18474n3173l11435l32464Q0371K17332j56308
39137G39002k77570J60580L73769l3254l17690m5674J08073k25720l25241J67017
$$ y = [484280, 635617, 512523, 337766, 339604, 357109, 242761, 212836, 393022, 477740, 267052, 68621, 132601, 197860, 66390, 76918, 466768, 809465, 691452, 435891, 520138, 765842, 767086, 643991, 679774, 669562, 353111, 64383, 211332, 513254, 493485, 322939, 412846, 583807, 457360, 290607, 555914, 1009005, 1043969, 706607, 508585, 495624, 356610, 214131, 426702, 797336, 836296, 639608, 674052, 873121, 800868, 554766, 641047, 1063841, 1368975, 1499211, 1809854, 2320053, 2693337, 2852050, 2917986, 2731130, 2136382, 1513153, 1294679, 1241506, 930071, 597607, 677978, 895310, 739002, 461432, 622012, 995781, 962527, 644837, 599163, 707236, 481516, 156275, 323292]
39127C23292M46157P3567j56912K18318M07035n3404l26722J02048M00051J7115
39117A450545k56889P8225K16748k45558l50761L12969N93900r0044n40044k3840
39107A145251L18678k39790m99689K78291P30981n7333o65693L1560O96010J24861
39097A863127l99955L05633Q72099N1482o62539J49138R44924J36191p17275J29343
39087B672168J092149K47666q19045N265J181696M54829o79991J17106J329926
39078E601769N54338n66702M95351J908148R67547k01745J411447L357470K278468
39069A5806091J201762M186686P582625O338779M979632J0373500J7724158J9419110
39061H7612343K4724783M8725905P8009788P2626019J7083909n0125841p7963413
$$ y = [323292, 769449, 843016, 686104, 904422, 1311457, 1258053, 931331, 1033379, 1433430, 1450545, 1193656, 1271881, 1488629, 1243071, 892310, 1205279, 1799179, 1709135, 1169091, 1145251, 1463929, 1224139, 724450, 1002741, 1733722, 1676389, 1010696, 1042256, 1738266, 1863127, 1463172, 1768805, 2640904, 2692386, 2029847, 2178985, 3123909, 3260100, 2542825, 2672168, 3764317, 4011983, 3192938, 3198203, 4379899, 4834728, 4154737, 4271843, 5601769, 6156107, 5589405, 6084756, 7992904, 8960451, 8758706, 10170153, 13527623, 15806091, 17007853, 21194539, 28777164, 35115943, 40095575, 50469075, 68193233, 87612343, 112337126, 161063031, 239072819, 311698838, 328782747, 278656906, 200693493]
39054B00693493o0816737l4289103k3500924k1146556j4444071p131459o576788
39047C2787855q463508n938655j869851j824876l583632k439233j03140m69500
39039H095460j962856j135477N81595M1515j472785r92492M63703J87139j032662
39030B773140q07282K12747Q529p03812j42015P81211K27422q69563n32455N05540
39020A453462K69900p38458o46802K80650M06189j49297r0534L64789J25213m14812
39010H60300j99629K66374q4648o64629l18148L91232K49950k83332p4485M03695
39000E46680O1236n35140j88342N45470L25646m36883l38618M17828M81768j56904
38990G22741l59664m6195p4745l33339j7684N45578L51648l26416l59842J68354
$$ y = [200693493, 139876756, 105587653, 82086729, 60940173, 46496102, 39364643, 32787855, 24324347, 18385692, 16515841, 14690965, 11107333, 8668100, 8564960, 8095460, 6132604, 4997127, 5578722, 5620237, 4147452, 3154960, 3618663, 3805802, 2773140, 1965858, 2178605, 2187134, 1483322, 1341307, 2122518, 2349940, 1480377, 947922, 1453462, 1723362, 984904, 338102, 618752, 1024941, 875644, 785110, 1149899, 1275112, 860300, 660671, 927045, 842397, 177768, -140380, 250852, 500802, 217470, 142985, 546680, 607916, 72776, -115566, 429904, 755550, 318667, -19951, 397877, 879645, 722741, 363077, 316882, 242137, -91202, -108886, 436692, 788340, 461924, 102082, 270436]
38980B70436K12337k08777j26891M40262N20305K6495j83253K0757j7601k44116
38970G09954J6869N80234O05418J83293J57790M82736L26449k87536n18810l12903
38960A943494l98723p38983n63980N0346K13416j26366j20537L04771K89952k76199
38950E77191m76394l3165K37148k9675j75333J15353K37264r3673k76188J6748
38940I9276K51173O8995j33931q7950j15040l22291k81962J02971L04958Q7769
38930b6032j19332m4083M7694J8090Q9002K25766J03713j76455j67830N6728K69
38919G530k65885j79192J99731K10449j64350j98306K46314M29046N7641k26666
38909A16312n3679Q7956j00183j55556J61419L14194j9179l17547j53737Q1836
$$ y = [270436, 482773, 273996, 147105, 587367, 1107672, 1134167, 950914, 971671, 954070, 709954, 726823, 1307057, 1912475, 2095768, 2253558, 2736294, 3062743, 2775207, 2256397, 1943494, 1544771, 805788, 241808, 292154, 505570, 379204, 258667, 563438, 853390, 577191, 100797, 67632, 304780, 275105, 99772, 215125, 452389, 358716, 82528, 99276, 350449, 419444, 285513, 197563, 82523, -239768, -521730, -418759, -113801, -26032, -145364, -189447, -141753, -123663, -34661, 191105, 294818, 118363, -49467, 7261, 7530, -258355, -437547, -237816, -27367, -191717, -390023, -143709, 285337, 342978, 116312, 62633, 150589, 50406, -105150, 56269, 370463, 351284, 33737, -120000, -38164]
38899c8164l2968k24159j44550l674l9394l9132J16853J06335j69268k48795Q6006
38888f30910L48107J69519p8126J1461J97609J33068k0978l4439q4656k86169
38878b75514l02073O3935M06015L35435O8849m9635j02493k29447k28243O712
38868c06459J47538j878r7976J25877L39930K01606l5472j4463Q5276n2571k54389
38857A37019j86369L2008P7377m767L1427J46121J43142N6394J8460k7858j49922
38846B73032k06177j09134l6849j08411j51803n4793m445j05812j29952O2086
38836e72258K14620J12277l6535K5575J78299J83651O8636k4001p1348m7325J05214
38825A36805K25304O1840k19756j64444J87913K56757j11213l20455k8469K46004
$$ y = [-38164, -71132, -295291, -439841, -443515, -482909, -522041, -405188, -298853, -468121, -716916, -630910, -282803, -113284, -191410, -179949, 17660, 150728, 129750, 95311, 10655, -275514, -577587, -513652, -107637, 227798, 296647, 247012, 144519, -84928, -313171, -306459, -158921, -160799, -258775, -132898, 207032, 408638, 373166, 358703, 443979, 391408, 137019, -49350, -17342, 60035, 55268, 86695, 232816, 375958, 432352, 450812, 422954, 273032, 66855, -42279, -79128, -187539, -339342, -394135, -398580, -504392, -634344, -572258, -357638, -245361, -281896, -256321, -78022, 105629, 174265, 150264, 78916, 31591, 136805, 362109, 423949, 204193, 39749, 227662, 484419, 373206, 52751, 24282, 270286]
38815B70286J3923l53917k96848J5314J01004J8425J02120K48576J61583j1223
38805B69243M5792J85016Q1657j14957o0556R6422l0779l18971l11293j3948J32047
38794d0327N893p4909L4988J36792J23041Q8279K0126j55589k60289o4734K28625
38783D1896J89712j52258l06299n5870K50504K48128J3316j60931j50341l2823
38773a14966O0170M4436l9404n5953K3857N7870j6850m9538M5130R4878k6662
38762B2968j39510o0844O8157N5286J9226J38475K59653J38985j02617j61806
38752B37973n3115l5125j41123j67289o1072L4070P2877J27379J61502Q0762m4052
38741B12787o8034k2973l8506j02075j21528j10359r6981m626J57337J77747k9214
$$ y = [270286, 284209, -69708, -366556, -351242, -250238, -231813, -129693, 118883, 280466, 269243, 315035, 500051, 581708, 466751, 406195, 502617, 471838, 152867, -158426, -172374, -40327, -34434, -109343, -74355, 62437, 185478, 273757, 293883, 138294, -121995, -186729, 41896, 231608, 79350, -226949, -282819, -32315, 215813, 229129, 68198, -82143, -114966, -54796, -10360, -49764, -105717, -81860, -23990, -40840, -90378, -45248, 49630, 22968, -116542, -177386, -109229, -53943, -34717, 103758, 363411, 502396, 399779, 237973, 184858, 149733, 8610, -158679, -219751, -185681, -112804, 14575, 176077, 256839, 212787, 144753, 121780, 83274, -18801, -140329, -250688, -347669, -352295, -194958, -17211, -46425]
38730d6425j96139q5589J21837J38711M3841Q3290J98232J44553n9550j78097
38720A64664j36622l3973Q9659J95811J35642r4437j95239L295J95224O2295j78498
38709B07821j38347P9224Q9269r8069j61373q3938j15504k06726o4318K47964
38699b43997L28319R7250q2368j5962P6044J6235o7743n1387k137L1978Q7875
38688A74107J01571j3144j09080R360J78703O9021k32609k91530j2389K14858
38678H8868J43541j2926k5629J8898K989N252N2119j4560k20110l08270j20177
38667c90005J23721J24763r4309k62932k04455K0427K19535K48220J37336L4261
38657d3438j7875j20482k61338k29351M0911K75046K46558J14418R3442O6826
$$ y = [-46425, -242564, -328153, -206316, -67605, -23764, 59526, 257758, 402311, 342761, 164664, 28042, -5931, 83728, 279539, 415181, 320744, 125505, 128800, 324024, 386319, 207821, 69474, 148698, 237967, 139898, -21475, -105413, -220917, -427643, -491961, -243997, 84322, 181572, 99204, 83242, 159286, 175521, 107778, 56391, 54254, 86232, 174107, 275678, 262534, 153454, 162814, 341517, 410538, 177929, -113601, -125990, 88868, 232409, 219483, 193854, 212752, 215741, 220993, 273112, 258552, 38442, -269828, -390005, -266284, -141521, -235830, -498762, -703217, -682790, -463255, -215035, -77699, -43438, -61313, -181795, -443133, -672484, -631573, -356527, -109969, 4449, 97891, 164717]
38647A64717j12552k20194j3487K55394J89551q5848j46531J0998N3940j9879
38637G6109O9437K48411J65499j11430j41517J02964J65657q5960k47594j19360
38627A22216q986r9262j37056J3769J00031Q604n92J53635J56507r1241k14594
38616C031l1500Q5892j17822k91406q3553K41654K54502K2549j22997j34379j34560
38605c08589p1252J05491J93390M4589j24206o3155J13347J59811P4887k6869
38595I7444j40304k15141r0348J64792J97381o7952k04843N6420L52353K55588
38585D05390o2666j80335r7380q5928j42658p3234P9571J33371J21901J67872
38575B65904J83910O1306m6720J5803Q8447j2989j35802r1837m0049j58941k34203
$$ y = [164717, 52165, -168029, -181516, 73878, 263429, 177581, 31050, 42048, 95988, 76109, 145546, 393957, 559456, 448026, 306509, 409473, 575130, 489170, 241576, 122216, 113230, 13968, -123088, -109319, -9288, -684, -1276, 152359, 308866, 217625, 3031, -28469, 57423, -60399, -351805, -435358, -193704, 60798, 83347, -39650, -174029, -308589, -379841, -274350, -80960, -36371, -160577, -223732, -110385, 49426, 124313, 97444, -42860, -258001, -348349, -183557, 13824, -54128, -258971, -202551, 149802, 405390, 342724, 162389, 65009, -20919, -163577, -236811, -157240, -23869, 98032, 265904, 449814, 511120, 464400, 480203, 568650, 555661, 419859, 328022, 287973, 129032, -105171]
38564a05171m3577J37304m2415l28775k16312J87825L02528Q326k01547m0355
38554c42169K01547K17040Q6649k6489j31499k03713j21721M4358M4735j20426
38544c51688j40369R7950K92174J91868k8982p3350N4568J37325P8167l7471r8590
38533A21602n9363M1219Q8272J1111r1359o4355O7910J25247L0785j00526j41337
38522B9206q6223l927L1230k0772r7939o7633P6059J53053O1089m6481k0155J6637
38510B4144j00388k31348j29823J15571J80394P818j29790q3123k440l515J9108
38499c33392J30116J87137R2679r455M0275J59079J57657K4112q4676p8572k6395
38488B58565j5296j6235N3813J61775J41547p9540l07083k83864m7678J09568
$$ y = [-105171, -148748, -11444, -53859, -382634, -598946, -411121, -108593, -100267, -301814, -342169, -140622, 76418, 163067, 136578, 5079, -198634, -320355, -275997, -231262, -351688, -492057, -394107, -101933, 89935, 60953, -12397, 42171, 179496, 257663, 220192, 121602, 62239, 103458, 191730, 202841, 111482, 47127, 115037, 240284, 271069, 170543, 29206, -57017, -60944, -29714, -50486, -148425, -216058, -139999, 13054, 74143, 27662, 7507, 24144, -76244, -307592, -437415, -321844, -141450, -133632, -263422, -346545, -348985, -352500, -333392, -203276, -16139, 76540, 67085, 107360, 266439, 424096, 448208, 363532, 284960, 258565, 243269, 227034, 280847, 442622, 584169, 504629, 197546, -86318, -133996, -24428]
38478b4428O0994j5132J0827L963j33777k14362o0533J60275J75615K2124n7693
38467g2127l138N5824O8056O7121L867j55571k50345j15689J21255K03299J24841
38456D7393P6628Q4631O587j51408k18372j56140j00259r7722n5065M6978J21520
38445c95229J55712K00940K03063P2865r5440j14266p21M5998m2240j32945j27132
38434b29395n3633N0367J50035J42256j5880j57448j03471M8822O8790m1452q0184
38423b21193O655P9853P8885Q0498J03448R0385N6342M1356j7623j46719j80273
38412b8386j0895J39107K0118j95323j47251J14077J91576j9027j87698r3987
38402b17689R3357J69274J61564J37039N2122r1793j95696k28733k23780j22455
$$ y = [-24428, 36566, 21434, 32261, 36224, -97553, -311915, -372448, -212173, -36558, -14434, -72127, -75265, -19441, 48615, 115736, 119603, -35968, -286313, -402002, -280747, -77448, 47393, 124021, 208652, 215239, 63831, -154541, -310681, -410940, -508662, -563727, -516749, -395229, -239517, -38577, 164486, 237351, 141911, 27645, 26924, 72922, 30682, -102263, -229395, -283028, -232661, -82626, 59630, 43750, -113698, -217169, -168347, -99557, -141009, -221193, -214538, -134685, -55800, 24698, 128146, 218531, 274873, 316229, 298606, 151887, -28386, -39281, 99826, 119944, -75379, -222630, -108553, 83023, 63996, -123702, -217689, -124332, 44942, 206506, 343545, 395667, 303874, 108178, -120555, -344335, -466790]
38392d66790J13744K88630J80439q4663k01686j55392j42096j21986Q2590L07541
38382a99669K09535q9227j02713K02922L12985L4295j79835l3088J11590r0104
38372A76691l38166k07583J42561K69975J34130J6875J0197Q590J2239O0803M1141
38361C27453j10564j99212o8714R0070L5622j24188j46410o9474p8148j23696
38351d67261k8255J57879K33919J86700J50663J21708M051j29895j10132L8070
38341A57447J16083M4237o6172j03350n3190N0817J37125J08756m1000j89750
38331A61003k40016k16270j53933l1433J24075K15684K17047J78320Q3059r1980
38321B45556j91448m8645J57152P2407k52764l72545j36067Q5660L9493k3693
$$ y = [-466790, -353046, -64416, 116023, 31360, -170326, -325718, -467814, -589800, -507210, -199669, 9866, -79361, -182074, 20848, 333833, 368128, 188293, 155205, 266795, 176691, -161475, -369058, -226497, 43478, 177608, 194483, 204680, 213270, 225509, 286312, 327453, 216889, 17677, -51037, 39033, 74655, -49533, -195943, -265417, -343565, -467261, -495516, -337637, -103718, 82982, 233645, 355353, 359404, 229509, 119377, 157447, 273530, 317767, 251595, 148245, 95055, 145872, 282997, 391753, 350753, 161003, -79013, -295283, -449216, -480649, -356574, -140890, 76157, 254477, 337536, 245556, 54108, 5463, 162615, 235022, -17742, -390287, -526354, -440694, -401201, -424894]
38311d24894J30314K75941J55056n5474q3730j8813m8257p2955K8593P3766q5712
38300a26165k09975o7400J23708P9343l6920M8116J70006L4842j90166j44618
38290c19229P9028J13544k9923l9012J09208J75103J48439J79925J51267j28906
38280D39444m14724k95911R6100K47594P3805l7983L2958K733j79872k00381J1780
38269b24457J39212O8621N4836J63808J30172p3773j10230R0440J48042q2372
38259C04299k17038k0670J73960O4068j13336n4432P7715M896j60285j71559r4085
38248b06467j04558j26333k7586P2205L3659j1568P4725J31167j3031j75715q8099
38237d41601J75837L48159L51992K52357M2417k19256k84165n4491J60834O3659
$$ y = [-424894, -294580, -18639, 136417, 80943, -2787, -21600, -69857, -142812, -114219, -40453, -126165, -336140, -403540, -279832, -200489, -237409, -189293, -19287, 15555, -174611, -319229, -240201, -126657, -156580, -195592, -86384, 88719, 237158, 417083, 568350, 439444, 24720, -271191, -175091, 72503, 146308, 108325, 141283, 144016, -35856, -236237, -224457, -85245, -16624, 38212, 202020, 332192, 258419, 148189, 238629, 386671, 304299, 87261, 66591, 240551, 304619, 191283, 136851, 214566, 219462, 59177, -112382, -206467, -311025, -437358, -464944, -392739, -359080, -370648, -295923, -164756, -177787, -353502, -441601, -265764, 82395, 434387, 686744, 729161, 509905, 225740, 171249, 332083, 395742]
38227C95742j68996j89566l5995J7244j9220P3835K43055K23451L6612k2129R6322
38216F50355J21606l2336j12508K636O7908j03515l05083k62875n1737O5148L9947
38205G9546L0102Q8505J11403O6591N3497R9536P5022r7664k73227k52261o3363
38194h2313O9732M2002j0428L7458Q8515N710j22905j05098L5594Q9360Q12n2881
38182d442L2519J24950Q3639l6805j10943j16753r1065m7150j4988l2597m4907
38171b58542L5060J26702M6248j65784k22237j5666J76472R5102j07890j14294
38161d04829Q0234J88588N7883j57056k30492j13061N9274J12993J4777p1398
38151d63087J2015J62338J42560k3741m7961J39929K17906j3421k48826j27230
$$ y = [395742, 226746, 37180, 1185, 18429, -791, 73044, 316099, 539550, 576162, 554033, 650355, 771961, 739625, 627117, 629753, 697661, 594146, 289063, 26188, -25549, 39599, 79546, 109648, 198153, 309556, 376147, 429644, 529180, 604202, 506538, 233311, -18950, -82313, -12581, 29421, 18993, 56451, 144966, 150676, 27771, -77327, -41733, 47627, 48439, -4442, 28077, 153027, 236666, 199861, 88918, -27835, -118900, -166050, -181038, -213635, -258542, -223482, -96780, -50532, -216316, -438553, -454219, -277747, -182645, -290535, -404829, -324595, -136007, -78124, -235180, -465672, -578733, -519459, -406466, -391689, -463087, -451072, -288734, -146174, -169915, -217876, -77947, 139959, 126538, -122288, -249518]
38141b49518J77304K08120o7610k30753o4826J67832J81449N0226j4515o936n3786
38130I6987j54014j68942j7811K15253L45489K39008m7045k80634k81691j16398
38120a69798J2639K9566K4321N9098Q2365N1465O773k2551q0566j90545k71200
38109d68433k15184k6297J64186K18576J19910k1940q6362m5478N2815J50277
38099a57930J84343J04722k6477l6644J14377J85302l7425l49422l42604q741
38089c70499K18822J10323n1335R567J12256n456j83455j08674J29214J82847
38079D3610K3690n9341J3582J9849j04913j25299O2328K10124J00159j26527k05914
38068a48652j13272j1850J5231J8235M8850R2972R6283J6705r8815j12926K6497
$$ y = [-249518, -72214, 135906, 68296, -162457, -227283, -59451, 121998, 172224, 157709, 150773, 96987, -57027, -225969, -243780, -28527, 316962, 555970, 508925, 228291, -53400, -169798, -157159, -127593, -103272, -44174, 38191, 89656, 96429, 73878, -6688, -197233, -468433, -683617, -709914, -545728, -327152, -207242, -229182, -315544, -361022, -308207, -157930, 26413, 131135, 104658, 68014, 182391, 367693, 330268, -19154, -361758, -370499, -151677, -41354, -92689, -83122, 29134, 23678, -159777, -268451, -139237, 43610, 67300, 7959, 21541, 41390, -63523, -188822, -126494, 83630, 183789, 57262, -148652, -261924, -273774, -258543, -240308, -191458, -98486, -2203, 14502, -84313, -197239, -170742]
38057a70742J56173J00537l6465j275J86116K04642q2842l73439l29819m7759
38047c94873J10264L4566l6326O8231J81094N6237k46497m06686k50779M2011
38037h42758K00958J99218J95489K32693K00212Q5714L2844P9192N8921j07495
38027C34988k31948j40811L6564O6155m4241j11791p4430j056Q8436J87405J84111
38016B93382J3329j63949j68816r0840j09899j52047l5773J41053J27012l0201
38006a76749n6184M6120L184j83660j77970Q2534K04074q592j75343N2716M01259
37995A1389L96840R3736p1606K6526J06867P618j06255q7538k0382j3439l1431
37984C12325j8363r873n3561j35836k12562k21180r3712J30475K58768J54005
$$ y = [-170742, -14569, 85968, 49503, 48228, 234344, 438986, 356144, -17295, -347114, -394873, -284609, -250043, -286369, -218138, -37044, 19193, -227304, -633990, -884769, -842758, -641800, -442582, -247093, -14400, 185812, 271526, 304370, 383562, 442483, 334988, 103040, -37771, -1207, 64948, 20707, -91084, -165514, -166570, -78134, 109271, 293382, 306711, 142762, -26054, -116894, -226793, -378840, -414613, -273560, -146548, -176749, -232933, -186813, -183629, -367289, -545259, -462725, -258651, -267243, -442586, -389870, 11389, 408229, 501965, 430359, 456885, 563752, 571370, 465115, 377577, 357195, 343756, 312325, 293962, 284089, 230528, 94692, -117870, -339050, -432762, -302287, -43519, 110486]
37974A10486n4152j16707J1481J51471J73579J19989N7610j8577r7613j08532
37964B29035k3597Q0535J02384N088j63421k80559k21626j0900J44266P7933j15777
37953a76639k06661j29009j6604L1575N1379P5080O7085L7554N9398J13439P2485
37942b0918p7881j53955k9981J45098J40274k7389j24279l6544Q8446O8435p3040
37931a01734j58907q0230R5924K07561J51355k3038j58489j52235o1146k417J9667
37920b63689Q9183J83732J48649o3561k61957k50569r0945K1395N6697J29852
37910c01213K29955K11417P1264j1658J7108j0150j58058k17628m8933J31263
37900h6633N7127j60670k05660m0432Q5097N3549m156j0688n2814j37330j18050
$$ y = [110486, 56334, -60373, -48892, 102579, 276158, 396147, 453757, 435180, 337567, 229035, 205438, 285973, 388357, 393445, 230024, -50535, -272161, -283061, -138795, -60862, -176639, -383300, -512309, -528913, -497338, -445959, -370879, -303794, -266240, -206842, -93403, -20918, -98799, -252754, -282735, -137637, 2637, -24752, -149031, -185575, -97129, -28694, -101734, -260641, -340871, -244947, -37386, 113969, 90931, -67558, -219793, -280939, -283356, -263689, -174506, 9226, 157875, 94314, -167643, -418212, -509157, -487762, -431065, -301213, -71258, 140159, 211423, 199765, 216873, 206723, 48665, -168963, -217896, -86633, -29506, -190176, -395836, -436268, -351171, -297622, -301778, -312466, -365280, -502610, -620660]
37889f20660M0256J68195J67686J58737K30542K56354J08647j10413k15026j89094
37879d776j52250j70603k17677k37201j59725M1653K42213K43807M8528q8236
37869d54267J2391K07646K44327Q6812j07300k23740k44987j57358K5918J93618
37859d16940K30111J56220P8284M1589K5277K4028L5492J8237m4906q9610n6534
37848A248J6079N2618L2236k9991j07743j20716J3262K12197K53611O5863j40436
37837B48228j53574l5567K8415J7590L0309O1779L1661l3202l7519M382L156l6254
37825A29404m9668p1955j78096k95208k59059n6461J50645K41312K28352J50203
37815a0531K8957o4518n3724K7646Q6108J11543J36637J02335n8317k32141k25778
$$ y = [-620660, -580404, -412209, -244523, -85786, 144756, 401110, 509757, 399344, 184318, -4776, -157026, -327629, -545306, -782507, -942232, -900579, -658366, -414559, -366031, -454267, -441876, -234230, 10097, 96909, -10391, -234131, -479118, -636476, -610558, -416940, -186829, -30609, 47675, 89264, 114541, 138569, 174061, 192298, 147392, 57782, 1248, 17327, 69945, 102181, 72190, -35553, -156269, -143007, 69190, 322801, 388664, 248228, 94654, 59087, 87502, 105092, 135401, 197180, 228841, 195639, 158120, 162502, 165658, 129404, 79736, 7781, -170315, -465523, -724582, -781043, -630398, -389086, -160734, -10531, 18426, -46092, -99816, -72170, 13938, 125481, 262118, 364453, 306136, 73995, -151783]
37804a51783n8397M9093K925n2779o452M8171N283o5816n0331K4590N0658o36
37792b05474o5803o9237K8705J75700K03432l553k81470l04980j6113K43161J67036
37781a28596r9330j70769N0631K74563K27579l2748k42119k23239n517K36853
37771a12692L07517J35102j35892k59328j50004K1013N3570k3114k5259Q6996
37761a02091J40977K7704j06433p3529N7759O5388o4883j01601O2718K12758J08777
37750B27544j62999k96309j42951J49939L29323K54759j8957k75070k99186r9355
37740c33262Q9542Q6913l5423j07769q6819j4145J05342K25351J97310j4035j76634
37729f3629q4806R7056N3242j93430l12490j62863N3939J58064J92311J96259
$$ y = [-151783, -210180, -161087, -158162, -210941, -217393, -169222, -163939, -229755, -280086, -255496, -204838, -205474, -271277, -340514, -311809, -136109, 67323, 63770, -217700, -522680, -538793, -295632, -128596, -227926, -398695, -348064, -73501, 154078, 121330, -120789, -344028, -349545, -112692, 194825, 329927, 194035, -65293, -215297, -194284, -140714, -163828, -189087, -102091, 38886, 66590, -39843, -113372, -55613, 9775, -55108, -156709, -93991, 118767, 227544, 64545, -231764, -374715, -224776, 104547, 359306, 340349, 65279, -233907, -333262, -243720, -156807, -192230, -299999, -386818, -400963, -295621, -70270, 127040, 113005, -63629, -148435, -51379, 1863, -191567, -504057, -666920, -612981, -454917, -262606, -66347]
37719f6347R6456o2826p2994J02965K10119Q4342r1185r9548k4599m8746j21145
37708i3508q1335L8070Q4322M7858K0212j0612r3888j36806k7443J34529J64312
37697D5711Q6546O1163P1294l7731k19914k24432J3095K43195K65242J77935J36138
37686F18242P9373j04824l02874k87327m7793J82572K23483J18091k504q2081
37676C94358j16169q3694M477N3494j1082j07104p8997O2610J11114m5812k24001
37665d0806j78507L6077J40547M5980m0767K3624J03353N7229o639M5439R0388
37654B75918m2982k21027j71730O2105J63115L4049p6908j0421O7411m92q2328
37643c290j2145J07509Q9669k0711m9521J2037M1755J8579N299j5338p3556o7804
$$ y = [-66347, 30109, -32717, -105711, -2746, 207373, 291715, 200530, 100982, 76383, 27637, -93508, -174843, -136773, -52451, -4593, 15619, 5007, -88881, -225687, -253130, -118601, 45711, 132257, 193420, 264714, 226983, 7069, -217363, -204268, 38927, 304169, 482104, 618242, 697615, 592791, 289917, 2590, -45203, 137369, 360852, 478943, 476439, 394358, 278189, 194495, 198972, 252466, 241384, 134280, 55283, 117893, 229007, 183195, -40806, -219313, -183236, -42689, 3291, -37476, -13852, 89501, 146730, 140091, 185530, 275918, 232936, 11909, -159821, -97716, 65399, 99448, 22540, 12119, 79530, 79038, -3290, -15435, 92074, 181743, 161032, 111511, 123548, 165303, 183882, 189181, 173843, 100287, 32483]
37631C2483P7566J85643L0024k71590l59860j42454R5168J39468J06638J46835
37621C9921J86683J29265N1578J4805q3114k57392k80825l8418J83722Q2796j63405
37610a34384j50008J20711K61011J11802q0923j35003j59560k04906r1426K11491
37600b51195L84563J99343j07808j75707j8777Q6972L9533n2415j30388j96266
37590b22145j60125L9756K29723J84685k0504j03422P247J07862P5513K0684L7513
37579A96787M6366k5755j04518j06705o6880l9724n721M7187N9595n221q5460
37568i0049r7475l1361N5239Q9140L5031n1489o4397P42J9999m4038l0420J55275
37556e3803K98690J46220j67038k55382l6137J61113Q9468j04378j67947q0984
$$ y = [32483, 110049, 295692, 325716, 54126, -305734, -448188, -353020, -213552, -106914, 39921, 226604, 355869, 407447, 422252, 339138, 81746, -199079, -237497, -53775, 29021, -134384, -284392, -163681, 97330, 209132, 128209, -6794, -166354, -371260, -462686, -251195, 133368, 332711, 224903, 49196, 30419, 117391, 156924, 104509, -25879, -222145, -382270, -342514, -112791, 71894, 51390, -52032, -44785, 63077, 138590, 159274, 196787, 243153, 217398, 112880, 6175, -60705, -100429, -106150, -58963, 632, -4589, -90049, -187524, -218885, -163646, -74506, -39475, -90964, -155361, -154619, -134620, -178658, -209078, -53803, 244887, 391107, 224069, -31313, -67450, 93663, 183131, 78753, -89194, -170178]
37546a70178L1369J04014J05304o963j60884j69986O879J63988J36527K6071l290
37535F2851J1186n3127j55092j48656j6787J16780J66508J51716J19655R3456
37525C48490O7692Q314r8327j89590j98398j60637j33664n6734J24805K50701
37515c7348J25469j12594j31074N8688R6077r5121j25115J82255L99999J64523
37505E25759j85422j37759J45694J11012k46016l77393j00234J31441O100j76200
37495c03018p0768J57526J86078P5658P9314J58309Q0776j27367j97307n3028
37485a3827Q0274M2966l8575O031J18883J25985J5037n7900j5897L2255k2513
37474B72719j19580j40673r8864p7639m9914N7445J53120O9620j18116j32036
$$ y = [-170178, -138809, -34795, 70509, 63546, -97338, -267324, -260445, -96457, 40070, 66141, 62851, 74037, 20910, -134182, -282838, -299625, -182845, -16337, 135379, 255034, 348490, 416182, 424496, 326169, 136579, -61819, -222456, -356120, -412854, -288049, -37348, 88121, -24473, -155547, -96859, -782, -95903, -221018, -38763, 361236, 525759, 340337, 202578, 348272, 459284, 213268, -164125, -264359, -132918, -126818, -303018, -373786, -216260, -30182, 45476, 124790, 283099, 363875, 236508, 39201, -13827, 66447, 109413, 70838, 76869, 195752, 321737, 336774, 278874, 262977, 295232, 272719, 153139, 12466, -86398, -164037, -213951, -156506, -3386, 66234, -51882, -183918]
37464a83918O7221J70234P131j59664p8743M5726r2927l29852k46343J43652L78476
37453b79007K25623m0564j07045M988J44283K66708L17966J72706j28506l10053
37443B67099k02757K2974J07846K6655o5345o4346J6952R9606Q2067n4407j64101
37432G2243j04866K7239L0340n9801k6361J21372J24043o7991j56506L0025K47335
37421B37072K27190P0083O941K1223k5778j00723j00413p9752j22103j36020k9868
37410c2148O2500j0909j28492q2719O2334Q3894k5567q3912m7766k8847k7035
37399b58667O8373K21074K54756J31360m531o6589j01985j30643j19548j09708
37389a16108j56672j57794K9865K95545L41483Q3892k28702l41738k42043n1463
$$ y = [-183918, -116697, 53537, 60668, -98996, -177739, -132013, -224940, -554792, -801135, -657483, -279007, -53384, -93948, -200993, -196005, -51722, 214986, 532952, 705658, 577152, 267099, 64342, 87316, 195162, 221817, 156472, 92126, 109078, 208684, 290751, 236344, 72243, -32623, -5384, 24956, -34845, -61206, 60166, 184209, 116218, -40288, -10263, 237072, 464262, 534345, 541286, 562509, 536731, 436008, 335595, 255843, 133740, -2280, -32148, 30352, 19443, -109049, -191768, -129434, -45540, -71107, -155019, -202785, -231632, -258667, -190294, 30780, 285536, 416896, 412365, 345776, 243791, 113148, -6400, -116108, -272780, -430574, -400709, -105164, 236319, 320211, 91509, -250229, -492272, -543735]
37379e43735J16290J55666L7497q0394j8463J23140P1156j75883k99853j51677
37369g66256K4406J7553q293J52833L40924K77450L9420o6069n46o776j46021
37358a41375j79907J8438K45028K79804J68431M8248p9107k22507k44930n8043
37348a65920J58956J71891L8312j198P6821O4462q2273j32441L1557J83159Q7131
37337D30457j46051k54426k01865j20194k1375J39127K11050J0583k81460k53858
37327d88012J23048L79757K05687j06567j17081J43194L17846K73867J51194L614
37317H86547k20416l85791k56884P0444J86036n3532k76687j27357K12448K92350
37307C27158K8107k19733j59438Q9638K15464R7639j17792k32731j90049p4528
$$ y = [-543735, -427445, -271779, -234282, -314676, -333139, -209999, -138843, -314726, -614579, -766256, -741850, -724297, -732590, -579757, -238833, 38617, 78037, 11968, 11422, 4646, -141375, -321282, -302844, -57816, 221988, 390419, 438667, 359560, 137053, -107877, -165920, -6964, 164927, 203239, 202041, 278862, 343324, 261051, 128610, 160167, 343326, 430457, 284406, 29980, -171885, -292079, -313454, -174327, 36723, 47306, -234154, -488012, -364964, 14793, 220480, 113913, -3168, 140026, 457872, 731739, 882933, 886547, 666131, 280340, 23456, 93900, 279936, 226404, -50283, -177640, 34808, 327158, 355265, 135532, -23906, 65732, 281196, 378835, 261043, 28312, -161737, -236265]
37297b36265J0739L7899L4762R824n8742j55918k01192j28613J9946J23410J14176
37286d29974N1423L1065M4212m634j17616j40758J8696J90715J33347r1222j53246
37275d67992O5358K65647J66921o7859r4978P5663J33575m875q2056L5405J22823
37264A47632j2701j96117j69138m258L4460p7323j09361M3005K13037K25349J08457
37253B03042q671o0040m2586K7611J00020J17806R3635P5468M4925j7844K3307
37242E56673L37484P69025Q47505L54776l04921n67778m12519k77443l54229l80114
37232E68459j90665l0170q9667j36746M6985J87977o0120m39014l71902J42015
37222c72848M79417L02070k7414j07907n7641j23146j89501p0063O7054j2175
$$ y = [-236265, -225526, -187627, -152865, -143041, -201783, -357701, -558893, -687506, -667560, -544150, -429974, -378551, -347486, -303274, -307908, -425524, -566282, -547586, -356871, -223524, -314746, -467992, -402634, -136987, 29934, -37925, -132903, -57240, 76335, 71460, -10596, 24809, 147632, 134931, -61186, -230324, -234582, -200122, -277445, -386806, -343801, -130764, 94585, 203042, 194371, 134331, 91745, 119356, 219376, 337182, 430817, 506285, 551210, 533366, 556673, 894157, 1663182, 2510687, 2865463, 2560542, 1992764, 1580245, 1302802, 948573, 568459, 377794, 347624, 257957, 121211, 168196, 356173, 296053, -142961, -514863, -372848, 106569, 408639, 381225, 273318, 215677, 92531, -96970, -167033, -99979, -112154]
37212a12154j57096r8378N4239K8228p5857M6156L05987L13220M0933j11648J9088
37201B52718J28474L622j42047r2575J2943j3671q2035n1517n6k0342j0443Q6838
37189G1909R0676j02619k46266q8027J99931K53890M6183j29669j07440J1875
37179D43J07936J56563J32029L2001l3469J0944L1291j16006k84338k08843O2518
37168a08931K07177J05856k0446j1686n237j33893k42871j14171J78145L37677
37158A91620K07590p9308k77995k60275r1148N2586M7808o3603j41608j09533
37148e23866k017J14281J80213J28766n1883k32674k39448o5311J14258J68631
37138d09050J52302J77335K42653K52554J48498j8806j18074m8243J27843K02572
$$ y = [-112154, -269250, -367628, -313389, -285161, -361018, -314862, -8875, 304345, 345278, 233630, 252718, 381192, 384814, 242767, 150192, 163135, 149464, 67429, 15912, 15856, -4486, -14929, 71909, 162585, 59966, -186300, -274327, -74396, 179494, 225677, 96008, -11432, 443, 108379, 264942, 396971, 428972, 395503, 406447, 437738, 321732, 37394, -171449, -108931, 98246, 204102, 183656, 171970, 166733, 32840, -210031, -324202, -146057, 191620, 399210, 319902, 41907, -218368, -309516, -256930, -209122, -272725, -414333, -523866, -525883, -411602, -231389, -102623, -154506, -387180, -626628, -691939, -577681, -409050, -256748, -79413, 163240, 415794, 564292, 545486, 427412, 379169, 507012, 709584]
37128G09584O4592j35135j85534j17007j11264j59579p7705J15536J43904p9325
37118A68067k47928j13557J21581J36456k697q882J04162O4894j41974k16837
37108a36715n2091Q9825L1623m2686M0652J19547L228j57846j18980L6656N8477
37097a28310k4782K1625J89555K28751R8216M0396J31588J27592q9045k49470
37087C46116j20707R3572O8489j29277j71606P500J51637J07396R63l2853k6748
37076B94482k9057j2197o109j05797k56618k43151j3368J79620J15425p8369j32650
37065b87789k5930N1055L7980O3773J62444J69158j2832k21843k46268j07523
37055d17775R813L7474O6620J28476J13418k8207j58373j43965o2296n8190q3890
$$ y = [709584, 774176, 639041, 453507, 336500, 225236, 65657, -12048, 103488, 247392, 168067, -79861, -193418, -71837, 64619, 61922, 53040, 157202, 222096, 80122, -136715, -188806, -98981, -67358, -110044, -69392, 50155, 53383, -104463, -223443, -186787, -128310, -153092, -131467, 58088, 286839, 385055, 425451, 557039, 684631, 595586, 346116, 225409, 318981, 387470, 258193, 86587, 94087, 245724, 353120, 354083, 321230, 294482, 265425, 253228, 247119, 141322, -115296, -358447, -371815, -192195, -76770, -155139, -287789, -313719, -262664, -224684, -160911, 1533, 170691, 157859, -63984, -310252, -417775, -407962, -370488, -303868, -175392, -61974, -90181, -248554, -392519, -454815, -513005, -596895]
37044e96895R790J62323J46168l4434p3485J61597L54960J88054j54594k45703
37034h2219m3166J09963N6885k343M4899J3379j88233l06130j22662J73195K59019
37023h7413J26978k33l8562n5132l7012O4433J33346J8923j69204j72496J3367
37012b03005J25663N6352l105O9771J02504n0184j95624p5087J91306K27046n6120
37001A89517l16770k64153m0772L9768l8389l1245J30672K31673J47025N8810
36991A06136J36044K21993Q6206j62235k15155n0445N0866k0988n8221M8596R5757
36980B38554m9427j61845k1917J80993J30703r6134j45746M8976J67838p653k90875
36969f533l55908j08513K73047N15896M37713R7224k16369k67568j38889q0710
$$ y = [-596895, -587105, -424782, -278614, -313048, -386533, -224936, 130024, 318078, 163484, -82219, -125385, -15422, 41463, 39120, 84019, 97398, -90835, -396965, -519627, -346432, -87413, 39565, 39332, 770, -54362, -91374, -26941, 106405, 125328, -43876, -216372, -203005, -77342, -20990, -24095, 45676, 148180, 97996, -97628, -172715, 18591, 245637, 189517, -127253, -391406, -432178, -392410, -430799, -462044, -331372, -99699, 47326, 106136, 242180, 464173, 550379, 388144, 172989, 122544, 173410, 152422, 94201, 142797, 238554, 189127, 27282, 5365, 186358, 317061, 220927, 75181, 124157, 291995, 284342, -6533, -362441, -470954, -197907, 317989, 755702, 852926, 636557, 368989, 230100, 149390]
36959A49390j44326j56690m4374M3394j5631j39602j89871j38306j9988J36799
36949e19205K66390K82276J98569J16055M8609r2984k93075l68765k11983L3182
36939e40931J42023O8334n6816j07470o1561K5700Q3365R3811J14270J76646J93231
36928A30602P2965q7267q5796Q5306J94698R0011r6953j58087q2920p089M644
36917F0114m658L603K7907O4558R8173Q6697J5627o6664j09018j14715j13231
36906e1607j19903j36378j42180r3092J0463Q2330O3817L3597Q5468J48982R6146
36895b2357j2599M631J42963J94280O6150j08515k16612k74573k48495n2832J85045
36884c42914J78495n8200j43016P3903K06712n4069l63256j97285L17175N54836
$$ y = [149390, 5064, -151626, -196000, -152606, -168237, -307839, -497710, -636016, -656004, -519205, -252815, 29461, 228030, 344085, 392694, 299710, 6635, -362130, -574113, -540931, -398908, -330574, -387390, -494860, -556421, -530721, -447356, -353545, -239275, -62629, 130602, 203567, 116300, 30504, 115810, 310508, 400519, 303566, 145479, 62559, 55470, 60114, 55456, 59059, 86966, 151524, 249697, 336394, 352021, 285357, 176339, 61624, -51607, -171510, -307888, -450068, -543160, -532697, -450367, -386550, -352953, -267485, -118503, -22357, -34956, -30325, 112638, 306918, 373068, 264553, 47941, -226632, -475127, -527959, -342914, -164419, -222619, -365635, -291732, -85020, -139089, -502345, -699630, -382455, 172381]
36874A72381K80000j10233k35879j58720o7695L0290J32838J07391n5273j24707
36864b9607K6002J87091J25677o2678j27499l2071O4774Q0600N8864K3620l0845
36853B83928n4779o625L6257k6059j38781j49123l0508P3611M2478q0624j61243
36842b11468j22801m187R2970J05830P2752P9250J38616J70602J13864M395q3348
36831C56475j15884r4234l4450R558k5540j15144j48411p9974n734k1528q0618
36820c55484p7873j4289K3557J0677Q025N2561J09430J31852J02395K4696o4430
36809d8883r2961l0965M6429M0760m3450j22539j54246j44522o0679J35689L50247
36798a25120L77059J31400k10021l69393k35695N5120K61255K38641O1221m6043
$$ y = [172381, 452381, 342148, 106269, -52451, -120146, -89856, 42982, 150373, 95100, -29607, -3605, 183486, 309163, 246485, 118986, 86915, 151689, 232289, 291153, 314773, 283928, 229149, 222524, 258781, 232722, 93941, -55182, -85690, -12079, 30399, -50225, -211468, -334269, -338456, -245486, -139656, -66904, 12346, 150962, 321564, 435428, 439823, 356475, 240591, 146357, 111907, 121465, 95925, -19219, -167630, -247604, -253338, -274866, -355484, -433357, -447646, -424089, -413412, -405387, -352826, -243396, -111544, -9149, 15547, -48883, -141844, -172809, -126380, -85620, -129070, -251609, -405855, -550377, -611056, -475367, -125120, 251939, 383339, 173318, -196075, -431770, -376650, -115395, 123246, 184467, 138424]
36788A38424M5733J96585J72569j4265j07022N855J07482M83j59522j15459M7879
36777C18742K6335j84100k42454p164K10100J08207j60381k46373r8183O8225
36767b07046J47116J94266J78498p274k75173l56641j59023J00389J91346J27173
36757f6369N4385M6737Q6952J19950O4089r9817k13170q0057K17492L34160R8268
36746E62620k43123l56111k35093j09099o7829o983J10432J63290O9821q2342
36736a94417j52908r9597J7193J09168J23660Q5918P8298J34182J72295R1109
36726C64901q5748k13343j78219k1547R0380K7189j45820j99677n221K66976L28126
36715B27997J41204m6564o2535j2128m6793j20961j17357n5981j4142L5966J38563
$$ y = [138424, 184157, 380742, 553311, 539046, 432024, 437879, 545361, 545844, 386322, 270863, 318742, 345077, 160977, -81477, -88641, 121459, 229666, 69285, -177088, -275271, -207046, -59930, 134336, 312834, 305560, 30387, -326254, -485277, -384888, -193542, -66369, -11984, 34753, 121705, 241655, 305744, 205927, -7243, -87300, 130192, 464352, 562620, 319497, -36614, -271707, -380806, -448635, -455618, -345186, -181896, -112075, -194417, -347325, -446922, -429729, -320561, -196901, -110983, -32685, 101497, 273792, 364901, 279153, 65810, -112409, -133956, -43576, -16387, -162207, -361884, -367105, -100129, 227997, 369201, 322637, 260102, 247974, 201181, 80220, -37137, -93118, -107260, -71294, 67269]
36704F7269K09392J56642N8290M0736O1407o31j07561j17097k7731K8094N484
36693C74294k7774n7228j16703j42120l9922J06042J12147j1540o7802J613L3652
36682A64659n0389r9577r425P4980l833j42142j29989K2640J07468L1797n6688
36671i0499J0490J85404K53685R6196j56661k71168j84120m7066R818K7155O2211
36660a04555M1687q1246j55461k9185J64741J59873m5620j89779j42218m3329
36650d25092j5571P578Q6845J43433J22011Q9895P9249K0634p5345o9446O4618
36639B8809J43208M2804j08872j40453p2661j8569o37J0824J9090N9828J78426
36628A41797K65169J18861k13350l92722k41515m718L2956m5238q447J08926J13836
$$ y = [67269, 276661, 433303, 491593, 532329, 593736, 593105, 485544, 368447, 340716, 368810, 374294, 346520, 289292, 172589, 30469, -9453, 96589, 208736, 197196, 129394, 131007, 164659, 114270, 14693, 5268, 80248, 76415, -65727, -195716, -173076, -65608, -33811, -90499, -80009, 105395, 359080, 455276, 298615, 27447, -156673, -203739, -193921, -166766, -104555, -62868, -144114, -299575, -328760, -164019, -4146, -49766, -239545, -381763, -425092, -440663, -433085, -346240, -202807, -80796, 9099, 88348, 108982, 33637, -35809, 28809, 172017, 214821, 105949, -34504, -107165, -125734, -126371, -115547, -96457, -36629, 141797, 406966, 525827, 312477, -80245, -321760, -326478, -293522, -338760, -347207, -238281, -124445]
36617a24445J8219j6176Q322k8595p9473M485J56629J42791o4156k22994j72505
36606c77898j6317Q0445Q6887N8891M9076Q5485J27180P4700o5989j25951k5223
36595d8714N7501k8367j11722K1587K06709J28942j16070j26088J47593L03783
36585D35154J42353m4591p059O7730m6114j91618j27483M3262Q3061L0267N6383
36574D41345R6967j7760j93171j90562m2363M20r6344j07295M1476J41591N6761
36563A31065p0004p0788J1524N6834N1323K6447k7750q6340p0528J340j0110j35864
36551a92851j96217n9258J36388J80364R9742P4415J16561O4437j03403j80795
36541f0617m7659J16956Q1415j02627j86452q6773K7319J9732k2999K9140J22625
$$ y = [-124445, -106226, -122402, -114080, -142675, -222148, -217663, -61034, 81757, 17601, -205393, -377898, -394215, -313770, -226883, -167992, -118916, -33431, 93749, 168449, 102460, -23491, -48714, 8787, -19580, -131302, -109715, 96994, 225936, 109866, -16222, 131371, 435154, 577507, 532916, 525857, 593587, 547473, 355855, 228372, 271634, 354695, 384962, 441345, 538312, 520552, 327381, 136819, 94456, 94876, -1468, -108763, -67287, 74304, 131065, 61061, -9727, 1797, 58631, 109954, 136401, 108651, 22311, -48217, -46877, -56987, -192851, -389068, -448326, -311938, -131574, -31832, 42583, 159144, 223581, 120178, -60617, -108276, 8680, 90095, -12532, -198984, -285757, -258438, -238706, -261705, -232565, -109940]
36530a09940J10562l283o1879J4354J28830J69545J52307J40230J10056k332j57217
36519D91233k13472j03242N6409Q3915m3627j46967o4529J25242J85627K7371
36509C97960j73308k13840j14368k7604M193N0600J09104J02332M8059M2371N5392
36498B80891m7612k25242k33706o240J71690O8103j12463k7384K54835L35944
36488D58816Q5985j79957j85290l9919K9412K3253M5834N2153l9971j27236o1440
36477F1640P0083N1011j13997j95256q8911N3628Q4738L8429j4002q1614j29382
36466b63633l0419K10976L43728J59373j94530l64581k09709P5448K21834J41773
36456I0260n1412j64667q4502R6850J57567K8668q8625p077J58448J73682O0933
$$ y = [-109940, 622, -2661, -64540, -50186, 78644, 248189, 400496, 540726, 650782, 648450, 491233, 277761, 174519, 230928, 314843, 271216, 124249, 59720, 184962, 370589, 397960, 224652, 10812, -103556, -131160, -126967, -76367, 32737, 135069, 183128, 225499, 280891, 233279, 8037, -225669, -231909, -60219, 7884, -104579, -131963, 122872, 458816, 544801, 364844, 179554, 139635, 169047, 192300, 238134, 290287, 250316, 123080, 61640, 131723, 182734, 68737, -126519, -215430, -161802, -77064, -38635, -52637, -134251, -263633, -294052, -83076, 260652, 420025, 225495, -139086, -348795, -273347, -51513, 90260, 38848, -125819, -210321, -113471, 44096, 72764, -15861, -22938, 135510, 309192, 370125]
36445C70125M2253J45091J50604k7920j95020j94536j24179j02853o9054K6342
36435B0853N9024l2936o2020J15007K93009J92849q6490j99868p1637L8308k5995
36424B40104j23393j11574n0824j7603L5056J06672N9276j44403k88406j69237
36414d64332J01778K34702J31147l4305o8937L1252J28546J09009j1060j03803
36404E3997o2346P0886J46247R3817J0540K4543J24763J77740R1645p4357j65688
36393D91787r6913L9878P0798l4984j11320l3171P8445J6918k01332l48091k87735
36382d15720j09717M8988J47051J72992J02650j4214o1357q867O2735J20953K09671
36371B55165K81937J96363l6533j95586j52716n4183o3125j09463p3790l8371
$$ y = [370125, 412378, 557469, 708073, 680153, 485133, 290597, 166418, 63565, -5489, 20853, 79877, 46941, -15079, 99928, 392937, 585786, 499296, 299428, 227791, 266099, 240104, 116711, 5137, -45687, -63290, -28234, 78438, 137714, -6689, -295095, -464332, -362554, -127852, 3295, -31010, -99947, -68695, 59851, 168860, 157800, 53997, -8349, 62537, 208784, 302601, 313141, 337684, 462447, 640187, 731832, 657475, 491787, 394874, 434752, 505550, 470566, 359246, 326075, 404520, 421438, 220106, -127985, -415720, -525437, -476449, -329398, -156406, -53756, -67970, -129327, -138194, -75459, 45494, 255165, 537102, 733465, 696932, 501346, 348630, 294447, 231322, 121859, 48069, 9698]
36361I698j18786j87057m6734J88964J98590n9009k46764j25369J17083J57954
36351a11430j1771j15407J4117K37694L12009J72059l5649j46344j35061p3751
36341A06466J045R7574J70378J32698K656q2733p0496q4277k02379k69221j05760
36330c04049J73733K75120J38650J0453N2915J10667o119j87153j73031L9866
36320A31052J59004j2969l05628l89215j71843J18777K30362J54241N4563J7640
36310a4016j5573q2984r7449K3809K02928K63791J30545r3251k32287j96033n2922
36299a63442L3190j7547p9898L3587K83669L84653J61298j91741l43508k31881
36289a31620o9898n350K5411R7209J45248Q8301l2035j13856j06430j0194J41594
$$ y = [9698, -109088, -296145, -342879, -153915, 44675, -14334, -261098, -386467, -269384, -111430, -123201, -238608, -224491, 13203, 325212, 497271, 461622, 315278, 180217, 106466, 107511, 205085, 375463, 508161, 510817, 428084, 357588, 273311, 70932, -198289, -304049, -130316, 144804, 283454, 293907, 346822, 457489, 451370, 264217, 91186, 131052, 290056, 277087, -28541, -417756, -589599, -470822, -240460, -86219, -31656, -14016, -29589, -112573, -210022, -186213, 16715, 280506, 411051, 317800, 85513, -110520, -163442, -130252, -147799, -227697, -194110, 89559, 474212, 635510, 443769, 100261, -131620, -201518, -206868, -181457, -84248, 61000, 149301, 117266, 3410, -103020, -113214, 28380]
36278B8380K58357K48613J48025Q9777J00301M6413j39863l12762l05064j61586
36268E91l9590L3258J23518J72789M0041k11510k96450r0096J49833J15618j18714
36257a20712k12659n4654J00691L3868j29205j41433M21J02526Q9405O6071R1875
36246a73806R0317J5308n7685o2804l0703J2789J00831K04441J91889J9618j43021
36235A67174j11801N8701J50891P2724n6899r7215m0401M0269R9831J31351J18998
36224E33623M0428p6521j33788n5475Q2991R4400q1033k54716k28818q1179l1087
36213a91175p6680j8330J53892K00714M7853o1010Q665K7726j67366l00033p2701
36202d48445K77856K86738j4052j51846M1512K18394J10322j13984k21218k41528
$$ y = [28380, 286737, 535350, 683375, 773152, 873453, 919866, 780003, 467241, 162177, 591, -38999, -5741, 117777, 290566, 330607, 119097, -177353, -267449, -117616, -1998, -120712, -333371, -388025, -287334, -253466, -382671, -524104, -523683, -421157, -331752, -265681, -173806, -83489, -68181, -125866, -188670, -219373, -206584, -105753, 98688, 290577, 310195, 167174, 55373, 114074, 264965, 337689, 280790, 183575, 143174, 183443, 283274, 414625, 533623, 574051, 497530, 363742, 308267, 391258, 485658, 404625, 149909, -78909, -160088, -191175, -267855, -286185, -132293, 68421, 116274, 55264, 63929, 91655, -75711, -375744, -448445, -170589, 116149, 102097, -49749, -8237, 210157, 320479, 206495, -14723, -256251]
36192b56251k38715j12231J44776K96701K15060J05358J42342J51763n4668k77472
36182A16663k15994K3481Q9051n2518j07097J8758P8076n5443j44280K3912K66960
36171D1569K50087m6023l05803k77452l6860J49332J26585j5470q0800j043J02025
36160i3853R4630Q679k1993L9455Q9012L3311r3930j81695j52820j6974J39748
36149a56430K10837J53480K4632q2316j17647p6077L3379J68249K41489J93720
36139E93316O2779o3097j37682j61426j34363o8614k1144m2315r7218r8666k3643
36128a92073M9555L3883n9989j22963o2578P4349J33142N2632k1768O3464K03217
36117A50871J48863r4461k15954n0681J49751R5146r6149j12123K4393k756k52261
$$ y = [-256251, -494966, -607197, -462421, -165720, 49340, 154698, 297040, 448803, 394135, 116663, -99331, -75850, 13201, -39317, -146414, -127656, -49580, -105023, -249303, -225391, 41569, 291656, 245633, -60170, -337622, -374482, -225150, -98565, -114035, -194835, -195878, -93853, 777, 9456, -12537, 26918, 115930, 149241, 55311, -126384, -279204, -296178, -156430, 54407, 207887, 232519, 150203, 32556, -43521, -10142, 158107, 399596, 593316, 656095, 592998, 455316, 293890, 159527, 90913, 69769, 27454, -69764, -168430, -192073, -142518, -108635, -168624, -291587, -354165, -279816, -146674, -94042, -115810, -52346, 150871, 299734, 205273, -10681, -61362, 88389, 183535, 87386, -24737, -344, -3100, -255361]
36106b55361l86445j87819J05530J69404N0915J9668J30812J97910J22707J2578
36096b0101j7231K9255J01013J46479R3656o8338j96044j36206L6815R8249J950
36085F9497o1171J6634R2881L5583n1849l0880K1227k8336r4307j3673J27454
36074H3060R3448r8480j75596m8684M8324l6864j22400k4001J13974O2811r9692
36063b04100j16960L7643J50408J15893M8116M9292P9756P8425M7656L548l2824
36052B56853j5539M1028K4871q9957j27408L5469K11037J43713q4074j78752j00720
36041A16521o7674j19960o0903J26976J95844P0123p135Q2432J15620m3257j62410
36030B46177n7730M8015r4798l09056k81135p5509K6928K5602J23790K70512K06677
$$ y = [-255361, -641806, -829625, -724095, -554691, -503776, -484108, -353296, -155386, -32679, -20101, -37332, -8077, 92936, 239415, 333071, 264733, 68689, -67517, -30702, 67547, 69497, 8326, 24960, 117841, 153424, 101575, 70695, 91922, 63586, -30721, -44394, 83060, 176508, 78028, -97568, -146252, -97928, -134792, -257192, -281193, -167219, -104408, -204100, -321060, -283417, -133009, -17116, 31000, 80292, 160048, 238473, 286129, 289677, 256853, 241314, 282342, 307213, 217256, 89848, 125317, 336354, 480067, 395993, 217241, 116521, 48847, -71113, -132016, -5040, 190804, 260927, 253792, 336224, 451844, 408587, 246177, 188447, 236462, 141664, -167392, -448527, -524036, -497108, -471506, -347716, -77204, 129473]
36019A29473n5694j94803o2307J28019J63059R4673N4980M8952L1315R751j0870
36008C36548n6098j14198j48091j63036j50701k8180K12261L67212K37180o7774
35998D25123k44165j87403o5502k9562o1858j00597j14223n5946P5865J55264
35988b03004P9274n1563q3806n4192o8412n4068Q9948K10551J04530p8122k3197
35977a32061J97478K01270n7649j85704n554J53521K3395j71141j26152M8472
35967e4125O7195o4728j34223p7534J6877J07041J70959J25679l3814j55661j41388
35956a73722o9897L608J44498L01510K50624l4955k37748j44201L2694K5779p0696
35945B7494m3223N3604P1715P8702J51284J10560j57026l53972j75758J46752
$$ y = [129473, 73779, -121024, -183331, -55312, 107747, 202420, 257400, 306352, 337667, 347418, 336548, 280450, 166252, 18161, -144875, -295576, -323756, -111495, 255717, 492897, 425123, 180958, -6445, -71947, -101509, -163367, -263964, -378187, -434133, -358268, -203004, -123730, -175293, -259099, -313291, -381703, -435771, -345823, -135272, -30742, -108864, -132061, 65417, 266687, 209038, 23334, 17780, 171301, 194696, 23555, -102597, -54125, 13070, -51658, -185881, -263415, -246538, -139497, 31462, 157141, 123327, -32334, -173722, -243619, -240011, -95513, 205997, 456621, 421666, 183918, 39717, 72411, 98190, 27494, -15729, 37875, 109590, 188292, 339576, 450136, 293110, -60862, -236620, -89868]
35935h9868J74859m2272j05435L4429O7372m8779l3324J30894J37431l6318m4415
35924A44574J57044J47762k01915l90160o5318L51740K90460j09041k71424o0162
$$ y = [-89868, 84991, 42719, -62716, -28287, 39085, -9694, -43018, 87876, 225307, 188989, 144574, 301618, 449380, 247465, -142695, -208013, 143727, 434187, 325146, 53722, -6440]
$$ [...]
##END NTUPLES=NMR SPECTRUM
##END=
