##TITLE=31Pdec_PR167_rmk
 D2O, 24 sc
 7.2.2019
##JCAMPDX= 6.0         $$ Bruker NMR JCAMP-DX V2.0
##DATA TYPE= NMR SPECTRUM
##DATA CLASS= NTUPLES
##ORIGIN= UXNMR, Bruker Analytische Messtechnik GmbH
##OWNER= root
$$ XWIN-NMR		Version 3.5
$$ Thu Feb  7 14:45:40 2019 Russian Standard Time (UT+4h)  she@DPX200
##.OBSERVE FREQUENCY= 81.013821
##.OBSERVE NUCLEUS= ^31P
##.ACQUISITION MODE= SIMULTANEOUS
##.ACQUISITION SCHEME= undefined
##.AVERAGES= 24
##.DIGITISER RES= 17
##SPECTROMETER/DATA SYSTEM= spect
##.PULSE SEQUENCE= zgpg30
##.SOLVENT NAME= CDCl3
##.SHIFT REFERENCE= (INTERNAL, CDCl3, 0, 182.463)
##AUDIT TRAIL= $$ (NUMBER, WHEN, WHO, WHERE, WHAT)
$$ ##TITLE= Audit trail, XWIN-NMR		Version 3.5
$$ ##JCAMPDX= 5.01
$$ ##ORIGIN= Bruker BioSpin GmbH
$$ ##OWNER= she
$$ F:/spectra/data/she/nmr/P31/1/pdata/1/auditp.txt
$$ ##AUDIT TRAIL=  $$ (NUMBER, WHEN, WHO, WHERE, WHAT)
(   1,<2019-02-07 14:44:28.70 +0400>,<she>,<DPX200>,
      <created by zg, POWCHK disabled, PULCHK disabled
       configuration hash MD5:
       00 E9 B6 7A A2 85 ED C7 34 08 36 98 17 FE 4E 26
       data hash MD5: 32K
       5D AC 51 2F 46 1A 46 37 61 5F E1 43 79 25 E3 CA>)
(   2,<2019-02-07 14:44:36.96 +0400>,<she>,<DPX200>,
      <Start of raw data processing
       efp BC_mod = 2 LB = 1 FT_mod = 6 PKNL = 1 PHC0 = -1484.58 PHC1 = 90.599 SI = 64K 
       data hash MD5: 64K
       92 C1 DC 51 F4 7C 9D 39 9B A7 E5 BD CD 3F 7C B9>)
(   3,<2019-02-07 14:45:01.71 +0400>,<she>,<DPX200>,
      <pk PHC0 = 49.47098 PHC1 = -133.6 
       data hash MD5: 64K
       B9 51 F0 B5 71 DF C8 F6 F9 F3 AC AF 15 60 45 7D>)
(   4,<2019-02-07 14:45:04.57 +0400>,<she>,<DPX200>,
      <abs ABSG = 5 
       data hash MD5: 64K
       A9 69 E9 1C 04 8E 52 81 13 81 07 9C 19 4A C0 84>)
$$ ##END=
$$ 
$$ hash MD5
$$ AD B1 4D F3 3C E0 10 14 BE 36 D6 20 7E AB E9 34
##$RELAX= 
##$RELAX= 
##$RELAX= 
##$RELAX= 
##$RELAX= 
##$RELAX= 
##$RELAX= 
##$RELAX= 
$$ Bruker specific parameters
$$ --------------------------
##$DU= <F:/spectra>
##$EXPNO= 1
##$NAME= <P31>
##$PROCNO= 1
##$TYPE= <nmr>
##$USER= <she>
##$AMP= (0..31)
100 100 100 100 100 100 100 100 100 100 100 100 100 100 100 100 100 100 
100 100 100 100 100 100 100 100 100 100 100 100 100 100 
##$AQSEQ= 0
##$AQ_mod= 1
##$AUNM= <au_zg>
##$AUTOPOS= <>
##$BF1= 81.014009
##$BF2= 200.13
##$BF3= 200.13
##$BF4= 200.13
##$BF5= 200.13
##$BF6= 200.13
##$BF7= 200.13
##$BF8= 200.13
##$BYTORDA= 1
##$CFDGTYP= 0
##$CFRGTYP= 5
##$CHEMSTR= <none>
##$CNST= (0..31)
1 1 145 1 1 1 1 1 1 1 1 1 1 1 1 1 1 1 1 1 1 1 1 1 1 1 1 1 1 1 1 1 
##$CPDPRG= <waltz16>
##$CPDPRG1= <>
##$CPDPRG2= <waltz16>
##$CPDPRG3= <>
##$CPDPRG4= <mlev>
##$CPDPRG5= <mlev>
##$CPDPRG6= <mlev>
##$CPDPRG7= <mlev>
##$CPDPRG8= <mlev>
##$CPDPRGB= <>
##$CPDPRGT= <>
##$D= (0..31)
0 1 0 0 0 0 0 0 0 0 0 0.03 2e-05 3e-06 0 0 0 0 0 0 0 0 0 0 0 0 0 0 0 0 
0 0 
##$DATE= 1549536268
##$DBL= (0..7)
120 120 120 11 120 120 24 19 
##$DBP= (0..7)
150 150 150 150 150 150 150 150 
##$DBP07= 0
##$DBPNAM0= <>
##$DBPNAM1= <>
##$DBPNAM2= <>
$$ [...]
##$SUBNAM3= <"">
##$SUBNAM4= <"">
##$SUBNAM5= <"">
##$SUBNAM6= <"">
##$SUBNAM7= <"">
##$SUBNAM8= <"">
##$SUBNAM9= <"">
##$SW= 369.568048894756
##$SWIBOX= (0..15)
0 1 3 0 0 0 0 0 0 0 0 0 0 0 0 0 
##$SW_h= 29940.119760479
##$TD= 32768
##$TD0= 1
##$TE= 0
##$TE2= 300
##$TE3= 300
##$TEG= 300
##$TL= (0..7)
0 120 53 12 22 120 120 120 
##$TP= (0..7)
150 150 150 150 150 150 150 150 
##$TP07= 0
##$TPNAME0= <>
##$TPNAME1= <>
##$TPNAME2= <>
##$TPNAME3= <>
##$TPNAME4= <>
##$TPNAME5= <>
##$TPNAME6= <>
##$TPNAME7= <>
##$TPOAL= (0..7)
0.5 0.5 0.5 0.5 0.5 0.5 0.5 0.5 
##$TPOFFS= (0..7)
0 0 0 0 0 0 0 0 
##$TUNHIN= 0
##$TUNHOUT= 0
##$TUNXOUT= 0
##$USERA1= <user>
##$USERA2= <user>
##$USERA3= <user>
##$USERA4= <user>
##$USERA5= <user>
##$V9= 5
##$VALIST= <valist>
##$VCLIST= <CCCCCCCCCCCCCCC>
##$VD= 0
##$VDLIST= <DDDDDDDDDDDDDDD>
##$VPLIST= <PPPPPPPPPPPPPPP>
##$VTLIST= <TTTTTTTTTTTTTTT>
##$WBST= 1024
##$WBSW= 4
##$XGAIN= (0..3)
0 0 0 0 
##$XL= 0
##$YL= 0
##$YMAX_a= 13121
##$YMIN_a= -13337
##$ZGOPTNS= <>
##$ZL1= 120
##$ZL2= 120
##$ZL3= 120
##$ZL4= 120
##$ABSF1= 182.463
##$ABSF2= -187.1042
##$ABSG= 5
##$ABSL= 3
##$ALPHA= 0
##$AQORDER= 0
##$ASSFAC= 0
##$ASSFACI= 0
##$ASSFACX= 0
##$ASSWID= 0
##$AUNMP= <proc_1d>
##$AZFE= 0.1
##$AZFW= 0.5
##$BCFW= 0
##$BC_mod= 2
##$BYTORDP= 0
##$COROFFS= 0
##$CY= -3
##$DATMOD= 1
##$DC= 0
##$DFILT= <>
##$DTYPP= 0
##$F1P= 0
##$F2P= 0
##$FCOR= 1
##$FTSIZE= 65536
##$FT_mod= 6
##$GAMMA= 0
##$GB= 0
##$INTBC= 1
##$INTSCL= 5.30512e-09
##$ISEN= 30
##$LB= 1
##$LEV0= 0
##$LPBIN= 0
##$MAXI= 10000
##$MC2= 0
##$MEAN= 0
##$ME_mod= 0
##$MI= 50
##$NCOEF= 0
##$NC_proc= -4
##$NLEV= 6
##$NOISF1= 182.463
##$NOISF2= 159.3651
##$NSP= 0
##$NTH_PI= 0
##$NZP= 0
##$OFFSET= 182.463
##$PC= 4
##$PHC0= -1435.109
##$PHC1= -43.00101
##$PH_mod= 1
##$PKNL= yes
##$PPARMOD= 0
##$PSCAL= 0
##$PSIGN= 0
##$REVERSE= no
##$SF= 81.0140089999434
##$SI= 65536
##$SIGF1= 159.3651
##$SIGF2= -187.1042
##$SINO= 113.3802
##$SIOLD= 16384
##$SREGLST= <1H.CDCl3>
##$SSB= 0
##$STSI= 65536
##$STSR= 0
##$SW_p= 29940.119760479
##$SYMM= 0
##$S_DEV= 0
##$TDeff= 32768
##$TDoff= 0
##$TI= <>
##$TILT= no
##$TM1= 0
##$TM2= 0
##$TOPLEV= 0
##$USERP1= <user>
##$USERP2= <user>
##$USERP3= <user>
##$USERP4= <user>
##$USERP5= <user>
##$WDW= 1
##$XDIM= 65536
##$YMAX_p= 282253274
##$YMIN_p= -11818614
$$ End of Bruker specific parameters
$$ ---------------------------------
##NTUPLES= NMR SPECTRUM
##VAR_NAME=  FREQUENCY,     SPECTRUM/REAL,   SPECTRUM/IMAG
##SYMBOL=    X,             R,               I
##VAR_TYPE=  INDEPENDENT,   DEPENDENT,       DEPENDENT
##VAR_FORM=  AFFN,          ASDF,            ASDF
##VAR_DIM=   65536,         65536,           65536
##UNITS=     HZ,            ARBITRARY UNITS, ARBITRARY UNITS
##FACTOR=    0.456856943014862, 1,           1
##FIRST=     14782.0589164792, 0,            0
##LAST=      -15158.0608439998, 0,           0
##MIN=       -15158.0608439998, -11818614,   0
##MAX=       14782.0589164792, 282253274,    0
$$ Real data points
##PAGE= N=1
##DATA TABLE= (X++(R..R)), XYDATA
$$ [...]
46570a848468L83457L02172R4118K14373N16438N01370J30635j39108j14833q3578
46560d3424j71182r0472K34589L74659P4693k86118l07588j45781l7522K12840
46550a85306O76881P44226p0062j084390j134401k06491N20923L53982r6171n7821
46540e38630K70616K69422l3451j10013J59941L45157J48540k23070l98680k51694
46530c61862O3920K91895K77551J14290N1859J69589K32857M521l81338n26448
46520f3166k49364J73552L11246O6447k25095k07926P2089K76971K38528R3579
46510D86861m0741k21919l98667l12796P1669L46500J88445j57243k80800k11170
46500e29861j73219m2499L57728O36360K53208m97260p10159j81314K92536J58017
$$ plain form
46570 -1848468 -1465011 -1162839 -1068721 -854348 -337910 163460 294095 154987 40154 -43424
46560 -43424 -214606 -305078 -70489 304170 378863 92745 -214843 -360624 -398146 -185306
46550 -185306 491575 1235801 1165739 81349 -1053052 -1259543 -738620 -384638 -480809 -538630
46540 -538630 -268014 1408 -32043 -142056 17885 363042 511582 288512 -110168 -361862
46530 -361862 -297942 -6047 271504 385794 437653 607242 840099 844620 463282 -63166
46520 -63166 -312530 -138978 172268 238715 13620 -194306 -122217 154754 393282 486861
46510 486861 446120 224201 -174466 -487262 -415593 -69093 119352 -37891 -318691 -529861
46500 -529861 -703080 -745579 -387851 248509 501717 4457 -705702 -887016 -594480 -436463
46490d36463j35701j8935K82490K74549O2060M4419J52918L9515k39930l30523
46480c05601j93475q8102p0743J0720J24931R2979n9250j46475j26759n6151R5326
46469g22600K80051K55806k2260j67507O8224K93588O4155l08783j72785M09857
46459b2254P05382L71390j71231m58797m63962k87211L1395K73975J74644q7400
46449F5931o0695K13315K06804j74338l40639K8591M23306L02346r3164k07784
46439C63673j1761J37788J34522J08432K1960k24162m39724l45179l2264J43368
46429a43347N9127r0690j34520q0186L291M9449J3192l4648L6798J71013J52814
46418B293j0735m1272J31100K09108O3839N088K04191K91993l6090m26615m04380
$$ plain form
46490 -436463 -572164 -591099 -308609 -34060 28000 72419 225337 264852 24922 -305601
46480 -305601 -499076 -587178 -657921 -647201 -522270 -429291 -488541 -635016 -761775 -817926 -722600
46469 -722600 -442549 -186743 -209003 -376510 -308286 -14698 49457 -259326 -432111 -22254
46459 -22254 683128 1054518 883287 424490 -39472 -326683 -295288 -21313 153331 65931
46449 65931 5236 218551 425355 251017 -89622 -61031 362275 664621 571457 363673
46439 363673 351912 489700 624222 732654 754614 530452 90728 -254451 -286715 -143347
46429 -143347 -84220 -174910 -309430 -389616 -386325 -336876 -323684 -358332 -321534 -150521 2293
46418 2293 -8442 -49714 81386 290494 354333 359421 563612 855605 819515 392900 -11480
46407a1480j39659p9841j30403R8596M51067M07687K1628j30346L2519n7851n66565
46396a04648q42065m11674K74888N45814M16126L06279K73639O5121l00682m86532
46386b63734k97778J04404L81882K75707j42723m00909j01246M47691M94199r8692
46376C98801n72275l58646R4460P7362k80201l20351M6510K95858K10886J17692
46366b89904J69522Q3460k32220l78702q0234L47903M56788K64885J01465Q5005
46356E27968N2682j10300l03253l46244j79936N3530J39432O1905M9266K06410
46346A51460K62980l0975l94137l09662J90321M92161K52200j56062k37945l3999
46336A86342P9306n4557k79401l68221j65704K72420N41265K23104m46395o58242
$$ plain form
46407 -11480 -151139 -230980 -361383 -262787 188280 595967 617595 487249 519768 461917 -104648
46396 -104648 -946713 -1358387 -1083499 -537685 -121559 184720 458359 523480 222798 -263734
46386 -263734 -561512 -457108 -75226 200481 57758 -343151 -444397 3294 497493 398801
46376 398801 -173474 -532120 -437660 -360298 -640499 -960850 -914340 -618482 -407596 -289904
46366 -289904 -120382 -36922 -269142 -647844 -728078 -380175 76613 341498 442963 527968
46356 527968 580650 470350 167097 -179147 -359083 -305553 -166121 -104216 -54950 151460
46346 151460 414440 383465 -10672 -320334 -130013 362148 614348 458286 220341 186342
46336 186342 265648 211091 -68310 -436531 -602235 -329815 211450 434554 -11841 -670083
46326f70083q7030N52674M52591j61077m26851j10012K21235J85036L1494J5211
46316C188j458r2277j3320K68837L16051j02295n03466l53170J01139K12634o6737
46305b30874j83317Q1426K96565J32460j27956j06005P5853P9399o7520q4949
46295a34918L3014J9310j86568l26489k18050L9220K84677M39709M02237J15378
46285D67520j98811k24027o5345j70079n58457o21214l2627O16183O28806K47638
46275H9587J94689M48801L33191k44556n67246k94285K3415l3790p5543K27348
46265A01611L96344k461m30046j86001L42584K36716m37668p12177k46597K43255
46255f94440K10519j8075l5113L393q0547l4665K65021M05682Q1055l42866l74298
$$ plain form
46326 -670083 -757113 -204439 248152 87075 -339776 -449788 -228553 -43517 -12023 3188
46316 3188 1730 -90547 -103867 164970 481021 378726 -124740 -477910 -376771 -164137 -230874
46305 -230874 -414191 -332765 -36200 96260 -31696 -137701 -61848 17551 -49969 -134918
46295 -134918 -101904 -82594 -269162 -595651 -813701 -774481 -489804 -50095 352142 467520
46285 467520 268709 44682 -20663 -190742 -749199 -1370413 -1403040 -786857 -158051 89587
46275 89587 284276 733077 1066268 821712 254466 -39819 -16404 -50194 -125737 101611
46265 101611 497955 495494 65448 -120553 222031 458747 21079 -691098 -937695 -694440
46255 -694440 -483921 -501996 -537109 -533716 -614263 -648928 -383907 21775 102830 -240036 -614334
46244f14334q8336J59450K97302L65603J88415k70349n58883k85285K39130M19731
46234a47556K20822O7157R2193M5170j42388k35408j39435j2228Q1167K24778
46224E4272L58444L02874Q3332j11285k58754m35376m78958j54226L38323M71375
46214A70021J01931l23604l88375j64164O3804J63517R7608j47130l79752k75332
46204a081476J55115M50732K96211l1839r0831Q7448J28988n1095j44946J0537
46194b71156J60763O1920q5078Q0972M61914N15934Q940n51927n33318m0651K46557
46183E4870N3057j87963j29673m7689k37769l89736j08412L12388L01641k4312
46173d03598m7541K66881K68243k56913o30213l03880K94683M17931L6670k82194
$$ plain form
46244 -614334 -702670 -543220 -245918 119685 308100 37751 -521132 -806417 -567287 -147556
46234 -147556 73266 140423 232616 277786 135398 -100010 -239445 -251673 -170506 54272
46224 54272 412716 715590 798922 687637 428883 -6493 -485451 -639677 -301354 170021
46214 170021 271952 -51652 -440027 -604191 -540387 -376870 -279262 -426392 -806144 -1081476
46204 -1081476 -926361 -475629 -179418 -211257 -302088 -214640 -85652 -136747 -281693 -271156
46194 -271156 -110393 -48473 -133551 -52579 409335 925269 934209 382282 -151036 -191687 54870
46183 54870 107927 -80036 -209709 -257398 -495167 -884903 -993315 -680927 -379286 -403598
46173 -403598 -451139 -184258 83985 -172928 -803141 -1107021 -812338 -394407 -357737 -639931
46163f39931k14319R2687M01301N36015L15682k20968o13358m20272J60526M78752
46153a23885K45616j72669l14757j54636M1173J22675J37901J47832J39424R3235
46143A61909K9162k5691o2899p1234k5837O1539J05379M1065m0369J6685J55365
46132C45074J05443j98511m03370k01597J54168J56559k14854m64851l11888k6363
46122a060190O4040K985l7322n6843n2333J30671M86541O52300L33206k43175
46112B19880n69197m34733n5976K43266K88402J11560p7764o9629J02892K12764
46102b8535J54706J8934j36430k88874k39984J74289O04652M51364k11947n60985
46092f2810j85530K72249J19616l24307l23683P5493K29161L226j24916K2421
$$ plain form
46163 -639931 -854250 -761563 -360262 175753 491435 270467 -342891 -763163 -602637 -123885
46153 -123885 121731 -50938 -365695 -520331 -479158 -356483 -218582 -70750 68674 161909
46143 161909 191071 165380 102481 31247 5410 66949 172328 213393 173024 189709 345074
46132 345074 450517 252006 -151364 -352961 -198793 -42234 -257088 -721939 -1033827 -1060190
46122 -1060190 -996150 -993165 -1030487 -1087330 -1139663 -1008992 -522451 129849 463055 219880
46112 219880 -349317 -784050 -840026 -596760 -308358 -196798 -274562 -344191 -241299 -28535
46102 -28535 126171 145105 8675 -280199 -520183 -345894 258758 710122 498175 -62810
46092 -62810 -248340 23909 143525 -180782 -504465 -428972 -199811 -196585 -321501 -299080
46082b99080R2401p5441j88352q0064M2775O0118J07621J72147M5431j89774j51938
46071d64156J94148L86164J60361j63925k16296o5967M7372P8631M3265j13312
46061a13715k84664j90928J75942M21811K78772n4077k87176m06985m53482l04746
46051a219248L4944K53932J42260p7651r7340M9862J59834K06151K56854K66871
46041b3531J97968J44120J39492O5222q9206j51894j19885k35405m98021n02584
46031a073724p2787L38624K76361m1340j19499N1696J37940J15182K18204L74847
46021B05504K65310o9964j95675P6372M21225M59726J65028k29336m44670k84846
46011C68674J61375M59154K54498k58090n66575m83779k59872j21970n2129m174
$$ plain form
46082 -299080 -206679 -282120 -470472 -550536 -507761 -447643 -340022 -167875 -122444 -312218 -464156
46071 -464156 -270008 116156 276517 112592 -103704 -169671 -122299 -43668 -403 -113715
46061 -113715 -398379 -589307 -413365 8446 287218 233141 -54035 -461020 -914502 -1219248
46051 -1219248 -1184304 -930372 -788112 -865763 -963103 -913241 -753407 -547256 -290402 -23531
46041 -23531 174437 318557 458049 523271 434065 282171 162286 -73119 -571140 -1073724
46031 -1073724 -1146511 -807887 -531526 -572866 -692365 -640669 -502729 -387547 -169343 205504
46021 205504 470814 400850 205175 281547 702772 1162498 1327526 1098190 653520 368674
46011 368674 530049 989203 1243701 985611 419036 -64743 -324615 -446585 -498714 -502888
46001e02888K057J6018Q8363R1347r1562k63491j58116Q3402J00466o1140q46
45990f96390L18848M30835R7462k94930l12605m6389J45975J30344j4615j95271
45980d36736k63793o9046K46664K99156J1439k12872q6003J47607J64989P2572
45970a26023J11199J80609P1130q8832n3069P1963J5094j50953j24873J03016
45960I261K59432K31206J08825r9237l67124l94821K5156M54072K36029m61646
45950A153o96976p0600O34230N30135j72026n68348l17726R8563K09412O8594
45940b83589p7729j51202j32021N0507L23401L99185J05313l29931m88588k26829
45930h11483J85268L94690L47159K59341K43975J36542j80380m46331l07111J17054
$$ plain form
46001 -502888 -500831 -484813 -396450 -305103 -396665 -660156 -818272 -734870 -634404 -695544 -696390
45990 -696390 -377542 53293 150755 -144175 -456780 -503169 -357194 -226850 -241465 -436736
45980 -436736 -700529 -769575 -522911 -223755 -212316 -425188 -511191 -363584 -198595 -126023
45970 -126023 -14824 165785 236915 148083 95014 166977 182071 31118 -93755 9261
45960 9261 268693 499899 608724 509487 142363 -252458 -227302 226770 462799 1153
45950 1153 -695823 -766423 -132193 397942 225916 -342432 -660158 -561595 -352183 -283589
45940 -283589 -361318 -512520 -644541 -594034 -270633 128552 233865 -96066 -584654 -811483
45930 -811483 -626215 -231525 115634 374975 618950 755492 575112 128781 -178330 -61276
45920f1276L15355J23376j9396K25943N12802L08417k84842o63642n53613k55555
45910c52431r3925m6479K0756J07673J63909J59042L5796j73234k36503k4563
45900d39959J80847O6431j38788Q880L33505K13505l23922m67901R6854N54870
45890H4322J65334n56493o10125J127L93944J76922j46620j20468P4026J02013
45880d36018l4024j63435j92411p2415J49444K47324J02139l1311Q2254J75871
45870a72582j12492n24392m89140m5196K25305J45378R5705J93687J15854j30648
45860f98521q3083K94148M18957R8780r1570J68297L81940J89058L0658K35828
45850I44492K84377k24498o37560k40344M48965M52244p9936k12745J41393J63769
$$ plain form
45920 -61276 254079 377455 358059 584002 1096804 1405221 1120379 456737 -96876 -352431
45910 -352431 -446356 -492835 -472079 -364406 -200497 -41455 -5659 -178893 -415396 -439959
45900 -439959 -259112 -192681 -331469 -322589 10916 224421 -99501 -567402 -470548 84322
45890 84322 249656 -306837 -916962 -915835 -521891 -344969 -491589 -612057 -538031 -436018
45880 -436018 -470042 -633477 -825888 -898303 -748859 -501535 -399396 -430707 -348453 -172582
45870 -172582 -285074 -809466 -1298606 -1343802 -1118497 -973119 -877414 -683727 -567873 -698521
45860 -698521 -781604 -487456 -68499 30281 -61289 107008 488948 678006 708664 944492
45850 944492 1228869 1004371 366811 126467 575432 1027676 947740 734995 876388 1040157
45840A040157l59741o63536l10532J67970K36104P6194J5804j2188j03747j28832
45830d2347j21403l04223m97027j79604N71829R15309M06302l05231m07842j4164
45820B1599J99774J0732k25693j95492O3319L06689K76745o3671l60222k25419
45810a91639J64369K56673j6246j28848J21319K51905l4339k93051j11969J80498
45800A98672J38030l3118L7544J26332j28803m17463k01570K93754L54715p7861
45790B90232l35712r8819J99780J71047K0539P0378K28154J98934q8368m49090
45780B07075o23348m29906M8170M38160M50835K20740O8877O7978R7347J33811
45770F79739J63563J9549l06429m22539p8747K75703N2304n20995o60350j80294
$$ plain form
45840 1040157 680416 16880 -293652 -125682 110422 186616 202420 190232 86485 -42347
45830 -42347 -163750 -467973 -965000 -1144604 -572775 342534 748836 443605 35763 21599
45820 21599 221373 232105 6412 -189080 -125761 180928 457673 394002 33780 -191639
45810 -191639 -27270 229403 213157 84309 205628 457533 423194 130143 18174 198672
45800 198672 336702 303584 341128 467460 338657 -78806 -280376 13378 368093 290232
45790 290232 -45480 -144299 55481 226528 247067 317445 545599 744533 656165 207075
45780 207075 -416273 -846179 -798009 -359849 90986 311726 380603 448581 545928 679739
45770 679739 843302 862851 556422 133883 55136 330839 383143 -137852 -798202 -978496
45760i78496L05898L76403K76875K55778J32629j78104l33167j27067J12689P7582
45750g8980k2884Q5337J95191j1821l50785l68352k5878K75847K80352J36903
45740A14930Q3613J21919O4902j79849m04922k59008K70440O69589M81050l7001
45730I25663k48896p6406m1242l11113l69580P2587M69846K35236l40138n32574
45720b16617k19831J09212J57605O3058m0905j68455k17456l3269K42045K76209
45710d8404K8857k09163k65739k49648k42183j42453J05246L59750M25249K17438
45700b1050j76135m83025m18747l6986K54188K13517Q7032J67868L09697K29231
45690A25590K9445k6917m2517k54451m45751k04705K89747M04416L2991k21443
$$ plain form
45760 -978496 -672598 -296195 -19320 236458 369087 190983 -142184 -269251 -156562 -78980
45750 -78980 -101864 -16527 178664 166843 -183942 -552294 -578172 -302325 -21973 114930
45740 114930 198543 320462 385364 205515 -199407 -458415 -187975 481614 962664 925663
45730 925663 676767 600361 559119 248006 -121574 -48987 420859 656095 315957 -216617
45720 -216617 -436448 -327236 -169631 -106573 -147478 -315933 -533389 -566658 -324613 -48404
45710 -48404 -19547 -228710 -494449 -744097 -986280 -1128733 -1023487 -663737 -238488 -21050
45700 -21050 -197185 -680210 -1098957 -1135943 -881755 -668238 -581206 -413338 -103641 125590
45690 125590 155035 128118 85601 -168850 -614601 -819306 -529559 -125143 -92152 -313595
45680c13595j0187K63640J89716j1343J6836J43771Q0603o7836m5200P5113R3762
45669D15280R1885J93864J92315j08192m02662k72414J02560J85098n3353j17350
45659B27031J39221K54263n0114l89357l35989m7874R7354J11849K01008K47785
45649D55177L346l62144m27681k06262j30269k78854j84904L32079O80284L22132
45639B02904l06094l47497J85963M24776P156l53820l5578M57897K83216l74721
45629A44202n50143K8792N45235L13389l18502o01962l75623j9398J82253K12466
45619d39291J13874k4602m6074M4142L3749q6463K8721N03417Q28975M69446l32539
45608A093355q19943o60968j84792K02519L61577K48525r3459l49722k03269J63890
$$ plain form
45680 -313595 -323782 -60142 129574 118231 135067 278838 359441 291605 246405 321518 415280
45669 415280 507165 701029 893344 785152 382490 110076 212636 397734 344381 227031
45659 227031 366252 620515 570401 181044 -154945 -202819 -105465 6384 207392 455177
45649 455177 458523 96379 -331302 -537564 -667833 -946687 -1131591 -799512 -119228 202904
45639 202904 -103190 -450687 -264724 160052 167208 -186612 -222190 235707 518923 144202
45629 144202 -405941 -377149 168086 481475 162973 -438989 -814612 -834010 -651757 -439291
45619 -439291 -325417 -350019 -396093 -351951 -318202 -404665 -375944 127473 956448 1425894 1093355
45608 1093355 273412 -387556 -572348 -369829 -8252 240273 146814 -202908 -406177 -242287
45598b42287K69854N7367o1966O0744R1456j14923j93529Q5056L55784K27956
45588E35512j04251k34365j69892j41185r2562J35894L37617J81381j77900k35367
45578C4882J16460M16966K84359j17393l58124k37469P6243K38565N2844k81327
45568B26006l41405l8896K02273N5231j84431o2802K67551K61079j41767m11777
45558a68938k43840O0917J47120N1649o7323j89812k24034J9543M04441M47973
45548B37696J3461l82881k89644M5993J57142R7265J94565L43216J40934l57881
45538A99866o05363l43026N5896J70536O8302M8381J41330J35539k5349j18653
45528b72541M7529L20552L20556p8886m91743m32684L0172L13388J03649k07218
$$ plain form
45598 -242287 27567 84934 22968 83712 175168 60245 -133284 -48228 307556 535512
45588 535512 431261 196896 27004 -114181 -206743 -70849 266768 448149 270249 34882
45578 34882 151342 568308 852667 735274 377150 139681 215924 454489 507333 226006
45568 226006 -115399 -154295 47978 103209 -81222 -144024 123527 384606 242839 -168938
45558 -168938 -412778 -351861 -204741 -153092 -220415 -410227 -634261 -614718 -210277 237696
45548 237696 251157 -131724 -421368 -375375 -218233 -120968 73597 416813 557747 199866
45538 199866 -405497 -748523 -692627 -522091 -453789 -405408 -264078 -128539 -153888 -272541
45528 -272541 -225012 95540 416096 337210 -154533 -587217 -557045 -243657 -140008 -347226
45518c47226r8804L41445N89068M09833N4475j77723k19692j19679L4309P6154
45508E42160p8684k54053k47511j76893k85397m65378l58192N9169L84600L79814
45498e00365K77976L45369M55948L21397o2411l94127l88323m0048L30224L23538
45488F69178q0172m03143k60506P0586O6966j84067j23989K72462L43216j67907
45478B02624n76270k86423K52157K60539j55084k61635R4547L43391J84199n3477
45468D568j30210k45007m27477k54760M14255R45577O93491p0722n26390m08695
45458e370j93977k25582k37815N2529L63324K66467p1744p4774L41905N61766
45448G76729J69756l67225l31349K10847N37114L33369K7050l0464q4536l69037
$$ plain form
45518 -347226 -446030 -104585 484483 894316 948791 771068 551376 431697 466006 542160
45508 542160 463476 209423 -38088 -214981 -500378 -965756 -1323948 -1264779 -880179 -500365
45498 -500365 -222389 122980 578928 900325 837914 443787 55464 15416 345640 669178
45488 669178 589006 185863 -74643 -4057 62909 -121158 -245147 27315 370531 202624
45478 202624 -373646 -660069 -407912 -147373 -302457 -564092 -469545 -126154 58045 4568
45468 4568 -125642 -370649 -798126 -1052886 -638631 306946 1000437 929715 403325 -5370
45458 -5370 -199347 -424929 -662744 -610215 -246891 19576 -52168 -126942 214963 776729
45448 776729 946485 579260 247911 458758 995872 1329241 1356291 1325827 1241291 872254
45438H72254n38322k19653K56942K87244o6953j95429P9021K73290P9900j57541
45428F70753l8724K77933L57670R1615k50260l70520j63305K32167M60599K37960
45418A505888k65417n47333l97218j47482j56637l16686k96265m6189J95664K51747
45408b19928J29797p6730k21177j60613M8747J50308L7360p3624k178Q0332m4707
45397c52413k19713j36043J30390J85640q2791l12950j56203K91826O39554O02635
45387E89932K06913k47999l88463q7875L60541N06013J97372l03458o18118n52376
45377c37518j93399J26479O3253l29819n35959j89228L57631M52300O8195j70174
45367f88239M9162K85477J20226j55601p8145J73193R5482k22824j85096L05600
$$ plain form
45438 872254 333932 114279 371221 658465 591512 396083 475104 748394 828294 670753
45428 670753 632029 909962 1267632 1359247 1108987 738467 575162 807329 1267928 1505888
45418 1505888 1240471 693138 295920 148438 -8199 -324885 -621150 -667339 -471675 -219928
45408 -219928 -90131 -166861 -388038 -548651 -499904 -349596 -312236 -385860 -388038 -307706 -352413
45397 -352413 -572126 -708169 -577779 -392139 -474930 -787880 -944083 -652257 -12703 589932
45387 589932 796845 548846 160383 72508 433049 939062 1136434 832976 214858 -337518
45377 -337518 -530917 -404438 -341185 -671004 -1206963 -1396191 -1038560 -586260 -518065 -688239
45367 -688239 -639077 -353600 -233374 -388975 -467120 -293927 -198445 -421269 -606365 -300765
45357c00765N79193J74998m42467n28134o5002L18069K53305j356r1266m2074
45347a45499n5876j15668l5759J99204L56875K36553q7843l47214l53094j60216
45337e08537L0946J00392J08074J65711K58384K57549J08627p0253j25621n9029
45327B66243q210m6714q1736R396J95585L11965K48650N5802j42475k68304k95758
45316B44444k14858p0262N569r3994k87641l52326j85672M5153R4450n5498j69761
45305a040396n6270J91592L04960J56596j04336k43020j92908o5959L1754Q6457
45295i31530Q9278O735r7815n3953J74894L56803K82280J03728J38334L64448
45285D33202M19901J59698j18350j64155j54824l07986m20479k01263J40011J40509
$$ plain form
45357 -300765 278428 453426 10959 -517175 -582177 -264108 -10803 -12159 -103425 -145499
45347 -145499 -201375 -317043 -352802 -153598 203277 439830 351987 4773 -348321 -508537
45337 -508537 -477591 -377199 -269125 -103414 154970 412519 521146 450893 325272 266243
45327 266243 258033 211319 129583 138979 334564 646529 895179 950981 808506 540202 244444
45316 244444 29586 -40676 -35107 -129101 -416742 -769068 -954740 -909587 -815137 -870635 -1040396
45305 -1040396 -1096666 -905074 -600114 -443518 -547854 -790874 -983782 -1049741 -1017987 -931530
45295 -931530 -842252 -835517 -933332 -987285 -812391 -455588 -173308 -69580 68754 433202
45285 433202 853103 1012801 894451 730296 575472 267486 -152993 -354256 -214245 -73736
45275g3736j43474j57957K59111N44545K32722l28063m69898j21673K00337J65184
45265A07098l3398r1443R905J05565J08010O9680R9945K48721M01426L42919K5960
45254A394388l05277l85071k32627n8628K1588K1529m5741j32708j04207O7906
45244B41152J68370K7344j79969j93032q9512j09294j70750Q254L36313L70523
45234D09399j178l46534l18137r2473J9041J9909M4414N8942K0477N0198J85526
45223D9584K25783P9586j5153J06863K12300O5043j41349j14923L7328M4307n1221
45212D98148q7321j90671m64052n14188M2282P33738O64401j54232o82038k96349
45202d50282L71246M38575l2537l89455m30554m31500m27137j57331L31949O12106
$$ plain form
45275 -73736 -217210 -375167 -116056 428489 661211 333148 -136750 -258423 -58086 107098
45265 107098 73700 -17743 -7838 97727 205737 275417 375362 624083 1025509 1368428 1394388
45254 1394388 1089111 704040 471413 412785 434373 455902 410161 277453 173246 241152
45244 241152 409522 436866 256897 63865 -25647 -134941 -305691 -297437 38876 409399
45234 409399 408221 61687 -256450 -348923 -329882 -309973 -265559 -206617 -186140 -135942 49584
45223 49584 275367 354953 339800 446663 658963 724006 582657 467734 505062 549369 498148
45212 498148 410827 220156 -243896 -758084 -715802 17936 682337 528105 -153933 -450282
45202 -450282 -79036 359539 327002 -62453 -493007 -924507 -1351644 -1508975 -1177026 -564920
45192e64920M70200J67526J9552M4102R7231Q1552m8240k58852l73492k40347
45182f05688J1170Q7976p5061k44854k28445p5033Q4162J90724K16169J60680
45172d78200J33736K43823L73292K72835o3894l34575l24018j66956j05722j58667
45162f08346j57692M328K59880M13965K91509k8124j70848Q8585L77591J14268
45152E85116n72404q10069j71200N87110N01091k19832m92061O8186O44358M74170
45142E94465j04521k99659l2328J44166J7676m5344J69896L33121J08733l07831
45132E78374m74783k90662k0936J20915J41756P6983q6869k53065k25385m735
45122d38407J19162m1514k37413r4372L08535M90808K47576n8605n5907R6514
$$ plain form
45192 -564920 -94720 72806 92358 136460 233691 315243 267003 8151 -365341 -605688
45182 -605688 -594518 -506542 -581603 -826457 -1054902 -1129935 -1045773 -855049 -638880 -478200
45172 -478200 -344464 -100641 272651 545486 481592 147017 -177001 -343957 -449679 -608346
45162 -608346 -766038 -761710 -501830 -87865 203644 175520 4672 93257 470848 585116
45152 585116 12712 -797357 -968557 -381447 119644 -100188 -592249 -524063 120295 594465
45142 594465 489944 190285 157957 302123 319799 274455 444351 777472 886205 578374
45132 578374 103591 -187071 -208007 -87092 54664 131647 44778 -208287 -433672 -438407
45122 -438407 -319245 -360759 -598172 -692544 -384009 106799 354375 295770 239863 336377
45112C36377L1239j92688j91791Q8504K63340J07846j33705j83712j22565j31798
45102a28953j47833m1158Q9119R0400N7102J61739L08589K56032J6553j48676
45092E12914j07341K2108J06748J19138L3303j57814l08407k34457J219J26264
45082A13675K3556j34821j66673j05720p6289r4711p9184L0121J94328K61845
45072c3873Q0365k81204n13330m10589j28816P1387J81618K99334L08728Q3682
45062c42698j18158O3296M48447M85729J26196m7743K31139M29596N1056n48471
45052G78389o93332l77202j49409k21875k65063m1280K66313M11805L82281K56861
45042C47488P1074j04990j76100j43706n6321J06000L15547L83574K07495L365
$$ plain form
45112 336377 367616 174928 -16863 71641 334981 442827 309122 125410 2845 -128953
45102 -128953 -276786 -317944 -228825 -138425 -81323 80416 389005 645037 661590 512914
45092 512914 405573 427681 534429 653567 686870 529056 220649 -13808 -12589 113675
45082 113675 137231 2410 -164263 -269983 -346272 -440983 -520167 -490046 -295718 -33873
45072 -33873 46492 -234712 -748042 -1158631 -1287447 -1216060 -1034442 -735108 -426380 -342698
45062 -342698 -460856 -397560 50887 536616 662812 615069 846208 1275804 1326860 778389
45052 778389 85057 -292145 -441554 -663429 -928492 -969772 -703459 -291654 90627 347488
45042 347488 418562 313572 137472 -6234 -62555 43445 358992 742566 950061 953426
45032I53426k268K6684j81039m32183k68030K45399M49410R564n38785m75975
45022b13797J61824O69688N52454J0340m18208m62045k99245k33946k90165k08837
45012g31937J36365M79664M82901J98538k3162k6052K6883M963j9320q122p2367
45001D48354k27393k83159j30924N2791M2243j36037k63183j87601N3266K79307
44991c52336L08857J53638M2604J13038J65190m4545l53921l68418o0975J78534
44981b18334J37829L2314O0368J11435P5419M9281M1404j32624m30061m75256
44971g48225j62881O6297p6779k00080J00075M40732J87228m51760o09797k0619
44961a475809O12434O39999K41208o6389j53445j64230q7078J31729K78090R1148
$$ plain form
45032 953426 951158 977842 796803 364620 96590 341989 791399 800963 262178 -213797
45022 -213797 -51973 617715 1170169 1180509 762301 300256 1011 -232935 -523100 -731937
45012 -731937 -595572 -115908 366993 565531 542369 516317 543200 548163 528843 520721 448354
45001 448354 220961 -62198 -193122 -140331 -98088 -234125 -497308 -684909 -631643 -352336
44991 -352336 -43479 110159 152763 265801 430991 386446 32525 -335893 -396868 -218334
44981 -218334 -80505 -48191 12177 123612 199031 248312 289716 157092 -272969 -748225
44971 -748225 -911106 -844809 -921588 -1121668 -1021593 -580861 -393633 -845393 -1455190 -1475809
44961 -1475809 -863375 -223376 17832 -48557 -202002 -366232 -453310 -321581 -43491 47657
44951D7657k84255m09287j35692J84311J67820r7418j90486N2851K91013J39267
44941b34219k62996m11220j46523J29309Q6115l7518J27915M26920L95303J001
44931G4087k93668k08992L5054J43707J00239j4923j86095k81537n6205M39972
44921b48361P39457M98891m5666m02331m12140k65508j09186M7758J20050k7198
44911a04234k90287l27306J8631M43235M83452N9582m09398m67842j14739K53608
44901d55298L32956J82485p69j53992k63912k19722J4383K18781J80179L7795
44891a27114P0748K09693J18024k29280m24686j97884K13191M13903L17292J09732
44881D73619k3678p966R0097N5776k30158n02435l63149J13736L88610J89126
$$ plain form
44951 47657 -236598 -645885 -781577 -597266 -429446 -526864 -717350 -664499 -373486 -234219
44941 -234219 -497215 -908435 -1054958 -925649 -839534 -877052 -749137 -322217 73086 74087
44931 74087 -219581 -428573 -393519 -249812 -149573 -164496 -350591 -632128 -688333 -248361
44921 -248361 491096 989987 944321 541990 129850 -135658 -244844 -197086 -77036 -104234
44911 -104234 -394521 -721827 -703196 -259961 223491 283073 -126325 -594167 -708906 -455298
44901 -455298 -122342 60143 59374 -94618 -358530 -578252 -563869 -345088 -164909 -127114
44891 -127114 -56366 153327 271351 42071 -382615 -580499 -367308 46595 363887 473619
44881 473619 449941 441975 532072 587848 357690 -144745 -507894 -394158 -5548 183578
44871A83578j46771k28607r9382O1462K69307M45931K53860l45396p69379n61161
44861i36558j06554l2449k09647m8912M20575N58050J70073k07512k03066p6106
44851f72106q5283n0944J50583K40111N1893r0278R6513L56383L17376O0858j14965
44840B60141j86655k74928k99106j51645R858R189j9866J06980K54739K07842
44830h3451O1327J4657k770j16458j47787Q9582L34856K11421j32432k26762k7434
44819b5251P3707n5053j29895k3353M4701k4437n7409l8512j78969m04502l03246
44808a122219J74212M63484J65719l35131l99661M5034N57460P78273O40223K30522
44798A197916k14607l66939j62552N2226l4300k95521m15225l04571n4575K53805
$$ plain form
44871 183578 36807 -191800 -291182 -229720 39587 485518 739378 393982 -375397 -936558
44861 -936558 -1043112 -1075561 -1285208 -1334120 -913545 -355495 -185422 -392934 -596000 -672106
44851 -672106 -757389 -808333 -657750 -417639 -365746 -456024 -359511 -3128 314248 375106 260141
44840 260141 73486 -201442 -500548 -652193 -642335 -633146 -653012 -546032 -291293 -83451
44830 -83451 -22124 -7467 -10237 -126695 -274482 -184900 149956 361377 228945 2183 -25251
44819 -25251 48456 -6597 -136492 -159845 -115144 -139581 -196990 -235502 -414471 -818973 -1122219
44808 -1122219 -948007 -484523 -318804 -653935 -1053596 -1008562 -451102 327171 967394 1197916
44798 1197916 983309 616370 453818 506044 471744 176223 -239002 -543573 -598148 -344343
44788c44343M56705L40492L6860J6004L52979M36860j12883o82224m79409K16078
44778B37119M28246m4986m10508j82674J58673Q1205j86237j80508L3096J08600
44768D2026K9455J9186J13248J89210K13986J82630K6355j97059k71452j78379
44758A69206j86273l72723m03139n7303L67281M95544L90014K81555J23246j71813
44748F35595l53530j79344R4838O6469j56046j67743O179l1493l19943m50116
44738h55134k49235n537J02831K71988N66806O40175K64535k21460l38714j05007
44728G1248O3106n8634k72005k55888P2051M59655N27995J62745k90659l73852
44718A05762o3186K30410K21665M7009o3961j08571j46708r8596O3519J46098
$$ plain form
44788 -344343 112362 452854 489714 505718 858697 1295557 1182674 500450 21041 237119
44778 237119 665365 620379 209871 27197 185870 267075 80838 -99670 -66574 42026
44768 42026 71481 90667 203915 393125 607111 789741 816096 619037 347585 169206
44758 169206 -17067 -389790 -792929 -850232 -482951 12593 402607 684162 807408 635595
44748 635595 282065 102721 197559 264028 107982 -59761 -53582 -85075 -405018 -855134
44738 -855134 -1104369 -1109906 -1007075 -735087 -168281 471894 736429 514969 176255 71248
44728 71248 134354 75720 -196285 -452173 -380122 79533 607528 770273 479614 105762
44718 105762 42576 272986 494651 541660 477699 369128 222420 123824 187343 333441
44708C33441K3211p9392J02964L79646K73856k84172p53175o34239j16792J73661
44698e80991K345j84862Q5483N98429O86759J42319m62174n19340j60156J4421
44688c77767k07979m30442k54833K19490N68578M87297J9232m69761n56941j97544
44678a200670J61864J40327k5890J41608N27127M97845r0310n43233k92125K77693
44668d05764M05044J7706k92970j78951J00875K05783J57829J52503K28752K76863
44658F67670K16803O2988j17714k63145l40751l06749j02432J83645K33622j40070
44648I3867n64293m31648K18670N95440K09014m08326m64497j4294K64479J51121
44638c50467O8024K44843L63833J70359j10530j73991l0627J74088L47719L07379
$$ plain form
44708 333441 356652 277260 380224 759870 1033726 749554 -3621 -637860 -754652 -580991
44698 -580991 -578646 -763508 -678025 -79596 607163 749482 287308 -232032 -392188 -377767
44688 -377767 -585746 -1016188 -1271021 -1051531 -482953 4344 23576 -446185 -1003126 -1200670
44678 -1200670 -1038806 -898479 -924369 -782761 -255634 242211 151901 -391332 -683457 -405764
44668 -405764 -720 16986 -275984 -454935 -354060 -148277 9552 162055 390807 667670
44658 667670 884473 947461 829747 566602 225851 -80898 -183330 315 233937 93867
44648 93867 -470426 -902074 -683404 -87964 121050 -287276 -751773 -766067 -501588 -350467
44638 -350467 -282443 -37600 326233 496592 386062 212071 181444 355532 703251 1010630
44628A010630j28213o99586p88531k24904L71590L91883L2901j09043N5090J09145
44618B0962j06360k60759j00851J72978K39264P2663j28612k38276k69544k49887
44608h48422j55618L7680K76664M17958L45829J22067o1655j10195r0492m3713
44598a09897P8208K01539J01565k21461l74577p7768L41665L30027j11041m23801
44588b65541k64504J27265L82901M24959L07310K4379l12334m28144k41220J901
44578b43028J26945K49664L88675K59153k11500n48687l68637k2298n0889k74897
44568f95499j07790L77688M92626Q1292j92740N4864L30486J74271m7148J49059
44558F17109M38422K04554l98557o61909m05806j23956j11338j26994L1599K15647
$$ plain form
44628 1010630 882417 182831 -605700 -830604 -459014 -67131 -34230 -143273 -88183 20962
44618 20962 -85398 -346157 -447008 -274030 -34766 37897 -90715 -328991 -598535 -848422
44608 -848422 -1004040 -966360 -689696 -271738 74091 196158 134503 24308 -66184 -109897
44598 -109897 -31689 169850 271415 49954 -324623 -402391 -60726 269301 158260 -265541
44588 -265541 -530045 -402780 -19879 405080 712390 736769 424435 -3709 -244929 -243028
44578 -243028 -116083 133581 522256 781409 569909 21222 -347415 -369713 -420602 -695499
44568 -695499 -803289 -425601 67025 148317 -44423 10441 340927 515198 468050 617109
44558 617109 1055531 1260085 861528 199619 -206187 -330143 -441481 -568475 -536876 -321229
44548c21229K86945K92295K01883n2996k42953n8238K87748K49645j56382k94852
44538A91866N2473K84541k5114m03785k75563R8143J36849m7177P5276M27846
44528E15355L98599j17137n02907l60879j2341J34677J38860J73653J26914q4737
44518D10057j90356L3220K97818J68284k60133m68957k58759J4838J1606j48340
44508c90722j86474j19723j26556j37631P5248M22491M85601J17412k66367k33227
44498c59948Q2479K48208J80429J31253J50908K7460k31214l17091j25863Q0693
44488a32686J46873K21404L09010J13858l63812n47470n3342O17838O76986J01387
44478A090046m25994m75414k35201J3977K43099M16150L49249J0795l30245m07331
$$ plain form
44548 -321229 -34284 258011 459894 406898 163945 105707 393455 643100 486718 191866
44538 191866 244339 528880 503766 99981 -175582 -77439 59410 12233 87509 515355
44528 515355 913954 796817 293910 -66969 -79310 55367 194227 367880 494794 410057
44518 410057 219701 252921 550739 719023 458890 -10067 -268826 -253988 -242382 -390722
44508 -390722 -577196 -696919 -823475 -961106 -885858 -463367 22234 139646 -126721 -359948
44498 -359948 -277469 -29261 151168 282421 433329 460789 229575 -87516 -213379 -132686
44488 -132686 14187 235591 544601 658459 294647 -252823 -306165 311673 988659 1090046
44478 1090046 664052 188638 -46563 -32586 210513 626663 975912 986707 656462 249131
44468B49131k25986L0728J98775K09982J17997M7791K9786l0243j36874j48307
44458C42780n7019o3579j87222j38218J48353K46935q6381l86870j78783J81850
44448a78154P1438k93482j78562L76794N52945R9992k81460j56280P38k03740
44438a89771l47989n6729J95958q9356m39838j24369N55856O44735K5692l91336
44428b17147m5627N27775N90550K00336p9752n7224m7005k84982n70416n42821
44418e26313j35961L44238N54423M34803J62848r9040k69055k49334p336K42020
44408D51293J90760j59275m67260m79692k59365L3723K98123L81598J60758j69428
44398a8765k37614m3507K0965j70213k57556m8670J11908m5245k22885j07915
$$ plain form
44468 249131 23145 53873 252648 462630 580627 628418 658204 627961 491087 342780
44458 342780 285761 222182 34960 -103258 45095 292030 205649 -181221 -360004 -178154
44448 -178154 -106716 -400198 -578760 -201966 350979 450971 169511 13231 13969 -189771
44438 -189771 -537760 -594489 -398531 -487887 -927725 -1052094 -496238 148497 174189 -217147
44428 -217147 -262774 265001 855551 1055887 976135 918911 871906 586924 16508 -526313
44418 -526313 -662274 -318036 236387 671190 834038 734998 465943 216609 209273 451293
44408 451293 642053 482778 15518 -464174 -723539 -689816 -391693 -10095 150663 -18765
44398 -18765 -256379 -299886 -278921 -449134 -706690 -755360 -643452 -688697 -911582 -1019497
44388a019497M3147j02114k70514j8570M42888N30660K14418j5539l011n4915
44378b53047k25622j79344J13194K02954q6997l23672j68363R8354J09524K1356
44368f91663J56738L73469K80458q2344k51291j4662L02514L20471R1335n7422
44358D27603j819O1806m2328k01036j97537n2510J5832m8189n6940P0082J32059
44347A07023p309j38279k6537J72453J42298p3839j49540k9942q956j79305j97245
44336c89178J83924O26885N67629m2434o30264o62859k12927K30761L64382K85875
44326C21794J61968l4036l05300m05446j40060K39345L13542J14226M1827J56807
44316D64667P0321l05324m53503m3314M53686M03769q1145l80578k60397k0950
$$ plain form
44388 -1019497 -976350 -1078464 -1348978 -1367548 -924660 -394000 -179582 -195121 -198132 -253047
44378 -253047 -478669 -658013 -544819 -341865 -428862 -752534 -920897 -822543 -713019 -691663
44368 -691663 -534925 -161456 119002 36658 -214633 -229295 73219 393690 485025 427603
44358 427603 425784 487590 445262 244226 46689 -5821 10011 -38178 -95118 -25036 107023
44347 107023 99714 -38565 -65102 107351 249649 175810 26270 -3672 -12628 -191933 -389178
44336 -389178 -205254 421631 989260 946826 316562 -346297 -559224 -328463 35919 321794
44326 321794 483762 449726 144426 -261020 -401080 -161735 151807 266033 307860 464667
44316 464667 534988 229664 -223839 -267153 186533 590302 509157 128579 -131818 -152768
44306a52768P6211L0757j35268l67129m05074o9328L41531L70264P3868n3519
44296b90455J86820M56972L92667N520m18844n33042j40818M80708O58205J33146
44286I30879m34714l13060J86959J57324m69984q06967m31600j4385j62045m48582
44276a806175j79898M72208P70836M90582O2483j66347k55573l10374k64737q9302
44266a276297Q7909J54699J47384J64073K28209K65279K11998J36926J46912J31464
44256C98556j67984o57424p69460k16569M15447L71436j61365l15523J39283N02797
44246d60806K89329j06658j85406p0817m3866K6953K72644L59654J5185l77919
44236b81707l00286P4372J49751j67317l60822q0327M14701O16438L07594k54945
$$ plain form
44306 -152768 -76557 -45800 -181068 -548197 -953271 -1022599 -681068 -310804 -236936 -290455
44296 -290455 -103635 353337 746004 751524 332680 -200362 -341180 139528 797733 930879
44286 930879 496165 183105 370064 527388 57404 -749563 -1181163 -1195548 -1357593 -1806175
44276 -1806175 -1986073 -1513865 -743029 -252447 -189964 -356311 -611884 -922258 -1186995 -1276297
44266 -1276297 -1188388 -1033689 -886305 -722232 -494023 -228744 -16746 120180 267092 398556
44256 398556 230572 -426852 -1196312 -1412881 -997434 -625998 -787363 -1102886 -963603 -460806
44246 -460806 -171477 -278135 -463541 -534358 -578224 -551271 -278627 81027 96212 -281707
44236 -281707 -581993 -507621 -357870 -525187 -886009 -966336 -551635 64803 372397 117452
44226A17452n56544l29432R2325J54719j33741k05235J39289L36304n2842n59040
44216i96745m44061K16908O73079N33232J21066j18608q8558P4887J99320J42548
44206C13068o5839j78937m0494J58157J36630q6424k66625k55746p7636J45151
44196b18695K01537l8374l42984l23228l9408K5043k20814k36689K33446N95840
44186c64326K87162k87765l53807P9925L65675K52824P0417L1170K0054j325L6633
44175A36637J5418j77578k90656p0906J92559P1553k39611k16098R8965K00342
44165b79375K7330K912J79736J31261k07760l42746m5885K88431L25305K21729
44155C00938J72777R5477k9659k9601P3981N4147l5686P5379K46889K4870m85108
$$ plain form
44226 117452 -439092 -768524 -676199 -521480 -655221 -860456 -721167 -384863 -437705 -996745
44216 -996745 -1440806 -1223898 -550819 -17587 103479 -15129 -103687 -28800 170520 313068
44206 313068 247229 68292 27798 185955 322585 236161 -30464 -286210 -363846 -218695
44196 -218695 -17158 -55532 -398516 -721744 -761152 -736109 -956923 -1193612 -960166 -364326
44186 -364326 -77164 -364929 -718736 -638811 -273136 -20312 50105 81275 101329 100004 136637
44175 136637 152055 -25523 -316179 -387085 -194526 -122973 -362584 -578682 -479717 -279375
44165 -279375 -252045 -249133 -69397 61864 -145896 -488642 -534527 -246096 79209 300938
44155 300938 473715 569192 539533 509932 583913 638060 602374 677753 924642 949512 464404
44144D64404n70223O074N87099O19128L63229K18929M6618l22204n44483l44035
44134E24536j00245k35422m74734l56421o2673m5287j56581R3216O01675P39141
44124E27205L07318k12032l96655l17615j79790l4782M5580n9852k51682k53275
44114h25580j8780K03432K71919L00180L34006K18743o7410k45944j18678R5327
44104A47215N3084j94602k44334Q8122M70014M61715Q1071k54345k97876k13100
44094I6964j84751j10211J11283K71489J62487l1286l7097J0479j47024k82731
44084a40398L0080N74307O33506R3156l25087j91747p079k73840o03281l76747
44074e87130J99681M25151J84231k1565L2771O0264r4579j90912o9124Q9923J05777
$$ plain form
44144 464404 -105819 -99745 487354 1106482 1469711 1688640 1735258 1413054 868571 524536
44134 524536 424291 188869 -285865 -642286 -704959 -750246 -906827 -813611 -211936 527205
44124 527205 834523 622491 225836 -91779 -271569 -306351 -260771 -320623 -572305 -825580
44114 -825580 -844360 -640928 -369009 -68829 265177 483920 416510 170566 51888 147215
44104 147215 200299 5697 -238637 -150515 319499 781214 862285 607940 310064 96964
44094 96964 -87787 -197998 -86715 184774 347261 315975 278878 289357 142333 -140398
44084 -140398 -110318 463989 1097495 1190651 865564 673817 666738 392898 -210383 -587130
44074 -587130 -387449 37702 221933 200368 233139 293403 198824 7912 -61212 28711 134488
44063A34488K0893j06969k90005m05739k41722J35883L45725J72698j26043j45423
44053e06214J68841M66253L85050n0176m25737l82755n3570J02994o5016j92554
44043e52884L4269L88073M52188K29310N0597L4444J3998p8533j28174j08870
44033C34418r6324l3323J64609K86425K1177m62277n72041j10537L69990L17889
44023B20006m7562j08466K26709M42339K19759j45832k64098j86299j61065j58704
44013C6787q145J72131J08988j16681j43445N7527J21822m2538p1463J32692J01637
44002C49312l39324n25973N3948P47060O06714q1430k21151K93398M25004j99281
43992A108277o02009r5455N39760L18062m21488o97583m21929k40008k91459j47284
$$ plain form
44063 134488 155381 48412 -241593 -647332 -889054 -753171 -407446 -234748 -360791 -506214
44053 -506214 -337373 128880 513930 463754 38017 -344738 -398308 -295314 -360330 -552884
44043 -552884 -518615 -130542 321646 550956 601553 635997 649995 571462 443288 334418
44033 334418 238094 204771 369380 655805 676982 214705 -357336 -467873 -97883 220006
44023 220006 172444 63978 290687 733026 952785 806953 542855 356556 195491 36787
44013 36787 28642 200773 309761 193080 49635 107162 228984 186446 114983 247675 349312
44002 349312 9988 -515985 -462037 285023 891737 810307 589156 882554 1307558 1108277
43992 1108277 506268 410813 950573 1268635 847147 149564 -272365 -512373 -803832 -951116
43982i51116K40275M36356K89109N8879j21677k67265j87140K14411M71049J15749
43972B98630m48258m11701K09302O08780M12348M1176j53587k68877k80047L1946
43962C9712M06508K28286m07642o20653r6048L52650P1507m06437k87745K23359
43952d96503L92143J74176J13664L16255L59441J25422l1343J3537n8316l63924
43942E44552n05762j71445L18012L73567j04756n89370n43663l8574L43945K15748
43932a57746j49195j94302J77427N03751L99879J255l02250k98204k1616L27828
43922B86827M27138Q5153m09991n14661j55459J28942k2842k79402k13955J852
43912f66398k1995j56008K220L26372K76106j78593l99180l5390M18209L51763
$$ plain form
43982 -951116 -710841 -274485 14624 73503 -48174 -315439 -502579 -288168 182881 298630
43972 298630 -149628 -561329 -352027 256753 669101 710277 556690 287813 7766 39712
43962 39712 446220 674506 266864 -353789 -449837 -97187 -25680 -432117 -719862 -496503
43952 -496503 -104360 69816 183480 499735 859176 984598 953255 966792 908476 544552
43942 544552 38790 -132655 185357 558924 454168 -135202 -678865 -717439 -373494 -157746
43932 -157746 -306941 -501243 -323816 179935 579814 581069 278819 -19385 -41001 286827
43922 286827 713965 799118 389127 -125534 -280993 -152051 -174893 -454295 -668250 -666398
43912 -666398 -688393 -844401 -842181 -515809 -239703 -418296 -817476 -852866 -434657 -82894
43902h2894r4791l12540j11395J19936O0597j41842j93349q0776m593l2897j5688
43891h90232J56326L38963K78268m5261l19187k34851J22853L54802K39708k876
43881a487l9204J29121K30223J61921J10073J85106K00164k1275l04697l30800
43871C19145r6748P3820k0476k13795k27824j0051K51889L49178K33771M2643
43861G01552n1052l9721o0816j32673q4542J20902K25666P8049n1709Q0793J76508
43850I62957j57490o15829n28180L6022K65111j22893m00450L155N93203O14027
43840F49633J51061k01249k68885k21623n811M00292N09340q6417q63118r18794
43830h55571k69949K17418J66279J08540M28494P01792M37702j32026m20959k55661
$$ plain form
43902 -82894 -177685 -490225 -601620 -481684 -421087 -562929 -756278 -837054 -841647 -874544 -890232
43891 -890232 -733906 -394943 -116675 -161936 -481123 -715974 -593121 -238319 1389 -1487
43881 -1487 -40691 88430 318653 480574 590647 775753 975917 954642 649945 319145
43871 319145 222397 296217 275741 61946 -165878 -175929 75960 425138 658909 701552
43861 701552 650500 610779 549963 417290 332748 453650 679316 757365 705656 786449 962957
43850 962957 805467 189638 -338542 -302520 -37409 -160302 -560752 -557597 35606 649633
43840 649633 800694 599445 330560 108937 103126 503418 1012758 926341 63223 -855571
43830 -855571 -1125520 -908102 -741823 -633283 -204789 497003 934705 802679 381720 126059
43820A26059N9972J87547L2146k27669k72138J7280L38743L10431k7067l12123
43810B33181l65346k77906j22808N7051J01221l8281p3813J90154M15214K24396
43800C43063r4318j5210K90482K03657k56879m27437j00268K16525K52334L15609
43790G27558M66829K48675l75731o51970j33718N32289N03706j16443o05811o44057
43780d8673m46585k18472j1709P5655k1483j78466k43697j98885n3268J57191
43770a188392K22172k0145k87491j47647K63284L79882J21701N153K12169K88894
43760a50420K0161j52930N5098K62320J36249m5064J8881J40666J42306K07947
43750F35214L28466J14769l81223m60644N2231K96018k53601p62652l21019N15735
$$ plain form
43820 126059 186031 373578 405724 178055 -94083 -76803 261940 572371 545304 233181
43810 233181 -132165 -410071 -532879 -475828 -374607 -412888 -486701 -296547 118667 343063
43800 343063 248745 233535 524017 727674 470795 43358 -56910 159615 411949 727558
43790 727558 1194387 1443062 1067331 415361 281643 813932 1317638 1201195 595384 -48673
43780 -48673 -495258 -713730 -725439 -649784 -671267 -849733 -1093430 -1292315 -1345583 -1188392
43770 -1188392 -966220 -986365 -1273856 -1421503 -1158219 -778337 -656636 -651483 -439314 -150420
43760 -150420 -130259 -283189 -228091 34229 170478 125414 144295 284961 427267 635214
43750 635214 963680 1078449 697226 236582 288813 584831 331230 -431422 -752441 -236706
43740b36706N78352q1644m08715o2072K80117K14797Q5287J04637J2377k21958
43730B64472k16960O9938J54574j43478l23450K2766N58202O65895K42655k63173
43720A031441m24488k32814J4783J06013J17216J73683J51366j04397l56383k13196
43710B63224K01955L46070J08193k7378J64998K86892O2815k12064k85274l28871
43700E80560l70677q6721M37575N37561M3481l09004r0448J05726j76923l55812
43690C15318P1720M57577J03601m16178k25179K89090J77626l72857m08781J22128
43680A14065M30037L55456M55433P47387O44231J43689q2534J43341K74308L2137
43670C257550k91070n24508p37214p24791k52068K68277J97687l17777n69185
$$ plain form
43740 -236706 341646 260002 -148713 -210785 69332 284129 369416 474053 486430 264472
43730 264472 47512 117450 272024 128546 -194904 -172138 386064 1051959 1294614 1031441
43720 1031441 606953 374139 388922 494935 612151 785834 937200 832803 476420 263224
43710 263224 465179 811249 919442 892064 1057062 1343954 1406769 1194705 909431 580560
43700 580560 209883 123162 560737 1098298 1141779 832775 742327 848053 671130 315318
43690 315318 387038 844615 948216 532038 306859 595949 773575 400718 -8063 114065
43680 114065 544102 899558 1354991 2102378 2746609 2890298 2807764 2951105 3225413 3257550
43670 3257550 2966480 2441972 1704758 979967 727899 996176 1193863 876086 306901
43661C06901l59443n4450J97637M47067M31810l214k83610J39765P37253O13631
43651B173347n5584l73270j88327q2293j63042l7028K15961J60844q6831j12146
43641A451631q3787l54237n52711j67432L92452M38809K07751K64903L29362n0999
43631A875742l70516r1819J21286l72254o77865J46592J083825P00011k62605
43622B152397j58432N84810L56036n25185m19146M65904N04038j47927R1120R35628
43612C839243O05092o10919o16947N80620Q20681j28120j94293Q65495R05449
43603F066301l64338o15815P11395J355903N98834M79178J521068J641236N49761
43594A1943523N95357J920107J806082K48288N62715K825982L089719J164318
$$ plain form
43661 306901 -52542 -106992 90645 537712 969522 966308 682698 822463 1559716 2173347
43651 2173347 2117763 1744493 1556166 1473873 1310831 1273803 1489764 1650608 1563777 1451631
43641 1451631 1367844 1013607 460896 293464 685916 1124725 1332476 1597379 1926741 1875742
43631 1875742 1505226 1413407 1534693 1162439 484574 631166 1714991 2415002 2152397
43622 2152397 1993965 2578775 2934811 2409626 1990480 2456384 2960422 2812495 2903615 3839243
43612 3839243 4444335 3833416 3216469 3797089 4617770 4489650 4295357 5160852 6066301
43603 6066301 5701963 5086148 5797543 7153446 7752280 8231458 9752526 11393762 11943523
43594 11943523 12538880 14458987 16265069 16513357 17076072 19902054 22991773 24156091
43586B4156091J870899N819127P358140N472735O966352J3517666J7271668J7615766
43578A00048444K8362170N3059117O5165960L5617583k3279443o4930883o2911979
43571A31130969l7481095k1092111j8642062j5465705p420957l223508n029599
43564B2775932n414435j935187j66781j963490k484793n9556R39728j219991k564788
43555G906639j039642J41212j013378j840971m91533P11530j25551j182501o40917
43546B424888K82628J81188j14573J59623P7723o56981o66279L82455P92256j03406
43536B759522o39408J01481O07611k19147j069096o33021K33431K97043o9492
43527A368924j25975k01442n68077n17537K29154P04951L37141q3544J3439j7150
$$ plain form
43586 24156091 26026990 31846117 39204257 44676992 51643344 65161010 82432678 100048444
43578 100048444 128410614 181469731 246635691 282253274 258973831 194042948 131130969
43571 131130969 93649874 72557763 53915701 38449996 31029039 27805531 22775932
43564 22775932 17361497 15426310 15259529 13296039 10811246 10751690 11691418 10471427 7906639
43555 7906639 6866997 7008209 5994831 4153860 3662327 4373857 4248306 3065805 2424888
43546 2424888 2707516 2888704 2774131 2933754 3011477 2354496 1688217 2070672 2862928 2759522
43536 2759522 2120114 2221595 2829206 2610059 1540963 907942 1141373 1438416 1368924
43527 1368924 1242949 1041507 473430 -44107 185047 889998 1227139 1143595 1157034 1139884
43517A139884n40379p37128j68976K75783j1055k65930J41360N26980K36641j62200
43507D34980n0276J28601q7827k14272J26783L17763j20998n67242l81888M4141
43497c70235J71062K30884M57356M18239o7627l48998o7134J54015r1725j91709
43487B94128K52101N17897N5090m03795r4957M14576K85467o4229K40995R02692
43477B399965R16869K07761m11432n94639o81735p67643n60931j19352R1759r7300
43467C83322l68310l87901p8946M15863P28519N00605r1400m01200j65834J43299
43457F78017R0990j10273q2858J28881K93016L42906K24796j12274l81585k02884
43447H68732J62239L6283n31544o94835j55102L51998L07711J80485M20385O32424
$$ plain form
43517 1139884 599505 -137623 -306599 -30816 -41871 -307801 -166441 360539 597180 434980
43507 434980 384704 513305 425478 211206 337989 655752 534754 -32488 -414376 -370235
43497 -370235 -199173 31711 489067 907306 839679 490681 423547 577562 485837 294128
43487 294128 546229 1064126 1119216 715421 620464 1035040 1320507 1256278 1497273 2399965
43477 2399965 3316834 3524595 3113163 2518524 1836789 1069146 508215 388863 480622 383322
43467 383322 15012 -372889 -451835 -35972 692547 1193152 1101752 700552 534718 678017
43457 678017 769007 658734 575876 704757 997773 1340679 1565475 1453201 1071616 868732
43447 868732 1030971 1067254 535710 -159125 -314227 37771 345482 525967 946352 1578776
43437A578776L99317O1823n970q3488l75859m20082L8845L73932O4075m01068
43427A230301l95444j68371j57028r0695K88217L95302k45087r09808o66903J19541
43417e99975M12330J17539q3155n4815j45630j76111K43087O47872K62055n49254
43407G3943o60503J8184M22548J00891k01330J1030K03975m1880k14855J51477
43397a36520N56642L18893l16597n50483j51843L61029M67529J63192j71880j89336
43387C50626Q0720K48667M5790k94661l58599j28703O9891Q4308L4521m410m8969
43376G9181k6239Q9091P7884j94618m04743j74510K86570M39017K10975J5207
43366C97815L1073J8659j40860k49448k10062j75797j96692j26847M3677J35275
$$ plain form
43437 1578776 1978093 2039916 2033946 1950458 1574599 1154517 1193362 1567294 1631369 1230301
43427 1230301 834857 666486 509458 418763 706980 1102282 857195 -52613 -719516 -599975
43417 -599975 -187645 -70106 -153261 -208076 -353706 -529817 -286730 361142 623197 73943
43407 73943 -586560 -568376 -145828 -44937 -246267 -235237 -31262 -73142 -287997 -136520
43397 -136520 420122 739015 422418 -128065 -279908 81121 548650 711842 539962 350626
43387 350626 431346 680013 725803 431142 72543 -56160 13731 98039 132560 128150 79181
43376 79181 52942 142033 219917 25299 -379444 -553954 -267384 171633 382608 397815
43366 397815 428888 447547 306687 57239 -152823 -328620 -525312 -652159 -608482 -473207
43356d73207J08854J09761J63841J56181R8040Q8292N6085j16642k87437k37434
43346c33666q6154j26128l06911k97077k4459K47716L60997L95970L90643K87542
43336E08473J38494M5773l2572j36452j30658J245n2685m23519o32484k25057
43326i39442M16590N49794J80917l0381J14321J34442j69270l33746n1352L02242
43316A74115K73552n2859l28426l98780k56423O6152L55508L35526Q1603m0315
43306B09653N4838O9810j04266j75597J7991K00227J02404j38231k40183j44348
43296a47702M5714K18121K27796o838k85352k80833k209J63196m4802m26395n45605
43285a084909j51083N52478R37567N11827l49723o25453L4589O96552M18725l74086
$$ plain form
43356 -473207 -364353 -254592 -90751 65430 163470 251762 307847 191205 -96232 -333666
43346 -333666 -419820 -545948 -852859 -1149936 -1174395 -926679 -565682 -169712 220931 508473
43336 508473 646967 692740 660168 523716 393058 394303 341618 -81901 -714385 -939442
43326 -939442 -522852 26942 207859 177478 291799 426241 256971 -76775 -128127 174115
43316 174115 447667 394808 66382 -332398 -588821 -522669 -167161 168365 249968 209653
43306 209653 264491 334301 230035 54438 72429 272656 375060 236829 -3354 -147702
43296 -147702 -101988 116133 343929 337091 51739 -229094 -231303 -68107 -112909 -539304 -1084909
43285 -1084909 -1235992 -683514 254053 765880 416157 -209296 -174707 521845 940570 566484
43275E66484o09555k21254k4414j92032q5766L72298M31297j00640l95936j683
43265b61201L96503J90720j68146r3926J30246M2594r4713Q5133K18906j23851
43255C22265n18297l29106J82472L00062L6051l0085J65510J48193j65787l41234
43245b29956j88117N1471K40603M25468M38970Q3918l13395j88650L77649O69231
43235A367192L17284k66825n52833m96231l47822k81061l52617m99576m77242
43226a589731r0488M59565P30673N63145K06901m0782p6119N6531J81666O3122
43216D64483k66718l96972q2348K86421J75162k79183m37672p5536L76484N08661
43206B72782L55026Q8869k15542m02074k62677R3721K85350K04843J38938K14401
$$ plain form
43275 566484 -43071 -264325 -288739 -480771 -566537 -194239 237058 136418 -259518 -261201
43265 -261201 135302 326022 157876 63950 194196 236790 142077 227210 446116 322265
43255 322265 -196032 -525138 -342666 -42604 -6553 -36638 128872 277065 111278 -229956
43245 -229956 -418073 -366602 -125999 299469 738439 822357 508962 320312 697961 1367192
43235 1367192 1684476 1417651 864818 368587 20765 -260296 -612913 -1112489 -1589731
43226 -1589731 -1680219 -1220654 -489981 73164 280065 239283 163164 219695 401361 464483
43216 464483 197765 -199207 -281555 4866 180028 -99155 -536827 -612363 -235879 272782
43206 272782 627808 716677 501135 99061 -163616 -69895 215455 420298 559236 773637
43196G73637J61709j55518m06776l05484q8867j00322j80242N5118M78920N20178
43186G52353J3008m82815m24481r173J65930m2335k16927q9666Q9760N2472k7453
43175b19327J00151K45636R3186j62774n5825L28163L86816k9226l17715o7224
43165C01861L00607K44174o9483j75092j12225j98759l23347j50186J52353R2965
43155F2868k78746l69591K5615M16961M02679J91651J10419R2307l1709j39137
43145D83317p0990Q022j35724l69788l49089k4831K75075K73565O2586m6265J08326
43134B14204L61161M02178J24087k50460m19460l14978j01371N9853J33002J48700
43124C56916J39980J25825R2737J8698o9951j41735k40011l71513l56521m8419
$$ plain form
43196 773637 935346 779828 373052 67568 -21299 -121621 -301863 -246745 232175 752353
43186 752353 765361 282546 -141935 -151108 14822 -27513 -244440 -334106 -244346 -191874 -219327
43175 -219327 -119176 126460 219646 56872 1047 329210 716026 686800 369085 301861
43165 301861 602468 846642 777159 602067 489842 291083 -32264 -182450 -30097 62868
43155 62868 -215878 -585469 -559854 -142893 259786 451437 561856 654163 622454 483317
43145 483317 412327 420349 284625 -85163 -434252 -459083 -184008 89557 152143 105878 214204
43134 214204 575365 977543 1101630 851170 431710 116732 15361 75214 208216 356916
43124 356916 496896 622721 715458 734156 664205 522470 282459 -89054 -445575 -493994
43114d93994L06495K94092j5073q8519K22739L87114O3247k84179j45206J61218
43104D07934M5442l15857l01037M7551J18495j51273j77020J67464K65565j43776
43094c6512m37472j22593L43087K99405j07380k59815j2998K69180L42743K34438
43084E12083k7205l66636n02112k44381J58307L10789J77823K797j07501j87137
43074b73173j61881M0505K31561J58082r6566k01479k4335K60924M48367M49477
43064H31482K50830m6280k31253k39999k74862m43847m76349j26606L19661L76157
43054f1066J02197K5680K97767M41852J15119l52269m77864l13675k31768k83014
43044g37041k08584K6706J56581Q7592N3509J79510K39886N6527j42914n1156
$$ plain form
43114 -493994 -187499 106593 91520 3001 225740 612854 676101 391922 246716 407934
43104 407934 453376 137519 -163518 -115967 2528 -148745 -325765 -158301 107264 -36512
43094 -36512 -473984 -596577 -253490 45915 -61465 -321280 -334278 -65098 277645 512083
43084 512083 484878 118242 -383870 -628251 -469944 -159155 18668 21465 -86036 -273173
43074 -273173 -435054 -394549 -162988 -4906 -101472 -302951 -327286 -66362 382005 831482
43064 831482 1082312 1036032 804779 564780 289918 -153929 -630278 -756884 -437223 -61066
43054 -61066 41131 66811 364578 806430 921549 569280 91416 -222259 -454027 -737041
43044 -737041 -945625 -918919 -762338 -674746 -621237 -441727 -201841 -145314 -288228 -339384
43034c39384K19826K92008Q4150j12391j09736m3768n8082q5977p0886j11701
43024c35941k19774k00514J7878J87202J06493m8055k4825J00461J27816J15543
43014a73716J99907K35065L6625j75925o5511J90040Q9426l71152o25258l83811
43004a044310j9076Q2611N2899J67692L74151M89742N13016M44940J42123l37370
42994H66418n61755k63628J94541K61151p3214l29369k03806J30286L20441J97871
42984E38936j10617k98519j98579k9465j11205l16391j89984K66652M40539L8449
42974B9816l51752j25949L65122L67613p3251k37489P8703L13374J38276q3409
42964D21054o7037j03616l97887n33670j33168M02045M08556n4459l33799j57420
$$ plain form
43034 -339384 -119558 172450 256600 144209 34473 -9295 -67377 -153354 -224240 -335941
43024 -335941 -555715 -756229 -738351 -551149 -444656 -492711 -517536 -417075 -289259 -173716
43014 -173716 26191 261256 297881 121956 56445 246485 335911 -35241 -660499 -1044310
43004 -1044310 -1063386 -980775 -927876 -760184 -386033 103709 616725 1061665 1203788 866418
42994 866418 304663 41035 235576 496727 423513 94144 -109662 20624 341065 538936
42984 538936 428319 129800 -68779 -98244 -209449 -525840 -715824 -449172 -8633 29816
42974 29816 -321936 -447885 -82763 284850 211599 -25890 52813 366187 504463 421054
42964 421054 354017 250401 -147486 -681156 -814324 -412279 -3723 -58182 -391981 -549401
42954e49401J03235J39468J11955K04593K47464N4579j95370k19297n2740P4230
42944h1284J19570J91800K43080J12672j62746l63429l88982k85939m2255L02315
42934c55198M05182l5744o38062o14770Q3815N30111J34860m14055j82432N45514
42924e40779P14674J46653k55132K2402L82470J53050m51825q01636o66420j90100
42914a486643M13762P92619O00400N1004j83442O9468K14855p8610k82398M6517
42904A57532M31810K87186n6612L2120L34695J84434l05991m04845p926K25918
42894H78321r331k87584k79267j65689q2326J21782L86261L65173M8130j45899
42884H29571o9722n4217k47016l43003j66951N7591K13083M63038P14645N44398
$$ plain form
42954 -549401 -446166 -306698 -194743 9850 257314 311893 116523 -102774 -155514 -81284
42944 -81284 38286 230086 473166 585838 423092 59663 -329319 -615258 -657513 -355198
42934 -355198 49984 14240 -623822 -1238592 -1154777 -624666 -489806 -903861 -1086293 -540779
42924 -540779 173895 320548 65416 87818 470288 623338 171513 -630123 -1296543 -1486643
42914 -1486643 -1072881 -280262 320138 371142 187700 257168 472023 393413 111015 157532
42904 157532 589342 876528 819916 852036 1186731 1371165 1065174 660329 652403 878321
42894 878321 868990 581406 302139 136450 54124 175906 562167 927340 975470 829571
42884 829571 759849 705632 458616 115613 -51338 6253 219336 682374 1397019 1941417
42874A941417n4142m67323l46664j09649j84411l42051k33224m6583r9771k14488
42864a56889n3353K49474L04589N6212k64905n02109n18303j28189N05544P77142
42854B69213L99637r8845j29232R9437N5609j68804j15161J19526M4471k58342
42844B17509j91096K79349M38248m4958n53174m68171n9254N2311j50299j98887
42834f78422O5312L42611M05444L26545J85634o5339l50914l92224p7845K54555
42824A5357J61359k95274n34969j99862L09178L42119o1954j93316K75554P41115
42814E59307N02294k40854o95668n43529j62713R4194K56452L34534J51382k18202
42804C7197l29882J370L30135J87247k26707l40575k5322K92307K66679J4198
$$ plain form
42874 1941417 1887275 1419952 1073288 963639 779228 437177 203953 157370 57599 -156889
42864 -156889 -210242 39232 343821 400033 135128 -366981 -885284 -1013473 -507929 269213
42854 269213 668850 570005 440773 540210 595819 427015 311854 431380 475851 217509
42844 217509 26413 305762 744010 699052 145878 -322293 -381547 -329236 -479535 -678422
42834 -678422 -613110 -270499 134945 461490 647124 581785 230871 -161353 -239198 15357
42824 15357 176716 -118558 -653527 -853389 -544211 -202092 -264046 -457362 -181808 559307
42814 559307 1061601 820747 125079 -418450 -581163 -486969 -230517 104017 255399 37197
42804 37197 -292685 -291315 38820 226067 -640 -341215 -366537 -74230 192449 206647
42794B06647j79815k19804j46911K9105K54987L27129P9342l28757m84134j61146
42784f23357L94072P01731N29815P4782k86080l31655j26291O9566K3403k32798
42774A93188m09049l05678q7343l1174q2834L8005K97851L07169m4981l07579
42764d32425r1847L44004M78269K41352l4401j79864k75205k92541j01672J89373
42754a54957K96369J71998J2706j20052l03748m00169j49648L03393M29020L1896
42744A16808m25453m32954n6185K68919L04563J54321L3554Q1240K59981L47628
42734F52422J85352n3096q0336L1296n3179l30473l95543j11255J25083J8399
42724a1330j70355j19040K7116K491p9244p575O7017o7531k02723l8065K30479
$$ plain form
42794 206647 26832 -192972 -339883 -310778 -55791 271338 350680 21923 -462211 -623357
42784 -623357 -229285 472446 1002261 1077043 790963 459308 333017 402583 425986 193188
42774 193188 -215861 -521539 -608882 -640056 -722890 -684885 -387034 -79865 -124846 -432425
42764 -432425 -524272 -180268 298001 539353 504952 325088 49883 -242658 -344330 -154957
42754 -154957 141412 313410 326116 206064 -97684 -497853 -647501 -344108 84912 116808
42744 116808 -308645 -741599 -797784 -528865 -224302 -69981 -36427 44813 304794 652422
42734 652422 837774 784678 704342 735638 682459 351986 -43557 -154812 -29729 -11330
42724 -11330 -181685 -300725 -273609 -271118 -350362 -357937 -290920 -358451 -561174 -599239 -368760
42713c68760J96579m2627l5833K41131L44417J15937q8001j6078J40418J68421
42703F55604J36084J17000K1462j37374j84312j24097j59248k50238j04377K29321
42693A99825K53884k01469n74735l34633K37547M80352K61319k8152j52121j79878
42683c8061q9982K26108N52307M36158j71242p27436p22787k47866K00746K89869
42673b92186R6407q6600p8491K6437K4182p1621k1055K24553L28843M7800l05196
42662a06927k53939J00168K03621p9719k50077N705K80700R4707l12202l25480
42652f43443R5404L43447N9878l60914l56563L8234L10832K07010J9870R7006
42642a89239L23523L07836k3420k91713j99285M1170J6187k81704m26885j37566
$$ plain form
42713 -368760 -172181 -214808 -250641 -9510 334907 450844 362843 346765 487183 655604
42703 655604 791688 908688 930150 792776 608464 484367 325119 74881 -29496 199825
42693 199825 453709 252240 -322495 -657128 -419581 60771 322090 293938 141817 -38061
42683 -38061 -128043 98065 650372 1086530 915288 187852 -534935 -782801 -582055 -292186
42673 -292186 -195779 -282379 -360870 -334433 -310251 -381872 -402927 -178374 150469 198269 -106927
42662 -106927 -360866 -260698 -57077 -136796 -386873 -381168 -100468 -5761 -317963 -643443
42652 -643443 -548039 -204592 -144714 -505628 -862191 -823957 -513125 -306115 -286245 -189239
42642 -189239 134284 442120 418700 126987 -72298 -31128 -14941 -296645 -723530 -861096
42632h61096L59078O12363M30019P09l29553l39791j08569N3283n0537k39528
42622d73622k01281M7780K10790K16152L08402N15017M35956j34641p13525o79720
42612d68692j25452K94946K71405J18651J30140J34148j07881m16778m00181K2615
42602e47079N25937P39310N72449K33569K468m6598q8936k54354l84071k65679
42592D87016k3920K0277j23165q7185K43230M66634K44254j71562l10629j53000
42582E91950m8963j23132j77182j41326j89995l29441k65893J25470N06568M97325
42572D45381J77029r2367j84369k56833l63583l37774j08600J29541J85548J26857
42562b79170J29914K09622K46810J94366J04045K940j12290j92456j84448j35608
$$ plain form
42632 -861096 -502018 110345 540364 541073 211520 -128271 -236840 -183557 -234094 -473622
42622 -473622 -674903 -627123 -416333 -200181 108221 623238 1059194 924553 211028 -468692
42612 -468692 -594144 -299198 -27793 90858 220998 355146 247265 -169513 -569694 -547079
42602 -547079 -21142 718168 1290617 1524186 1526654 1480056 1391120 1136766 752695 487016
42592 487016 463096 483373 360208 273023 516253 982887 1227141 1055579 744950 591950
42582 591950 542987 419855 242673 101347 -88648 -418089 -683982 -558512 -51944 445381
42572 445381 622410 530043 345674 88841 -274742 -612516 -721116 -591575 -406027 -279170
42562 -279170 -149256 60366 307176 501542 605587 608527 496237 303781 119333 -16275
42552a6275j16004p9839K8185P6954r9250l45580k78610J58746N24840M55158
42542C08325J50167K6008J07147J14404L840J471J31326J25555j06628k74847
42532E86768j30169J73307L03265J39772j79814m17965l47637P1045N09847N03455
42522A211874J4372m49209m42328r2909J76867K05381J28191O1064K9545P7321
42512I20169J72322J18319j74218m43230l89799j35142l6631j20583p9050J64671
42502c172K96132J30960p4885m1362J08187R7073m7234q5535O738J2099j50649
42491B48352k90683k47830j21418q3433j02331N20K71022N29379N67257L54676
42481A125511L4474k14679k85075j93109p7941p2515j19556j8586K51424L97716
$$ plain form
42552 -16275 -132279 -212118 -183933 -106979 -206229 -551809 -830419 -671673 -146833 308325
42542 308325 458492 484500 591647 706051 709891 711362 842688 968243 861615 586768
42532 586768 456599 629906 933171 1072943 893129 475164 127527 198572 708419 1211874
42522 1211874 1226246 777037 334709 241800 418667 624048 752239 813303 842848 920169
42512 920169 1092491 1210810 1036592 593362 203563 68421 31790 -88793 -167843 -3172
42502 -3172 292960 423920 349035 307673 415860 512933 465699 380164 386902 399001 248352
42491 248352 -42331 -290161 -411579 -495012 -597343 -596823 -325801 203578 770835 1125511
42481 1125511 1159985 945306 660231 467122 389181 316666 197110 178524 429948 827664
42471H27664J93110j26773j38242J31018J99600j36536m47671k87602J38635K70909
42461F24112k4453l37823l07077R504L35999M58586K90498p3535l38549k85955
42451C51307q7737r8244l22794l89323j08654K58409M25203M49609M62639L23632
42441A264047j13652n70752n85079j63275J77127J11255q2925k2439J56279K9391
42431A99977l77671n25312j37332L45060L64580K5008j21137Q8026K56553J10471
42421B28223j14011j12495M4752J31232J10354L2282j27644k89247k15195J00312
42411b11437K88962J49458Q543J77936L83240K02812k05881l61314k24929j30565
42401G6825j15057M0682K03520J7474l63383l83899r353J76952n4416k36752o1879
$$ plain form
42471 827664 1020774 894001 755759 886777 1086377 949841 502170 214568 353203 624112
42461 624112 599659 261836 -45241 -35737 300262 758848 1049346 975811 637262 351307
42451 351307 263570 165326 -157468 -546791 -655445 -397036 28167 477776 940415 1264047
42441 1264047 1150395 579643 -5436 -168711 8416 119671 36746 14307 170586 199977
42431 199977 -177694 -703006 -840338 -495278 -130698 -105690 -226827 -138801 117752 228223
42421 228223 114212 1717 46469 177701 288055 320337 192693 -96554 -311749 -211437
42411 -211437 77525 226983 235526 413462 796702 999514 793633 432319 207390 76825
42401 76825 -38232 2450 205970 223444 -139939 -523838 -533191 -356239 -410655 -647407 -709286
42390g09286J57072J82994K72914N01133M14794j11992m07007m0897L33255j5882
42380E77098o29056n44780J44669M73339J50732j38665j3100O6042k17800m24125
42370e55646j58179K34782K70873P7516M6218J49642R6667j10236k15065j33492
42360b96920J3174J54786K75837K84035J30831l0912k4643R3346J33122N2581
42350G85237k3310j9807j5099j22259l22108m31797k94706l0026N3023r4743j13460
42339f29055K18800N28827L53249p3679j01783L01824M56663M7248l79436l22145
42329D00513r7916k03241m26111k44170K32257M14665J73304m7998j6453J6735
42319B01585j08949j89541j06044m7633r2791j3499K69097M29393K12057j64107
$$ plain form
42390 -709286 -552214 -369220 -96306 404827 819621 707629 300622 259725 592980 577098
42380 577098 -51958 -596738 -452069 21270 172002 33337 20237 86279 -131521 -555646
42370 -555646 -713825 -479043 -208170 -130654 -84436 65206 161873 51637 -163428 -296920
42360 -296920 -283746 -128960 146877 430912 561743 530831 506188 599534 732656 785237
42350 785237 761927 742120 727021 604762 282654 -149143 -443849 -473875 -420852 -515595 -629055
42339 -629055 -410255 118572 471821 398142 296359 598183 1054846 1102094 722658 400513
42329 400513 302597 99356 -326755 -570925 -338668 75997 249301 201303 184850 201585
42319 201585 92636 -96905 -202949 -250582 -343373 -356872 -87775 341618 553675 389568
42309C89568l51677l32187k48847p2013K32595M45281L76939K23671K45850K66100
42299A175280m0941m62648m26089P3330L13980j17877o52990n28061J22947N00746
42289d2323K68187j24764k25005j33817j24402j62401r6016j2695p3697j65508
42279h92441l3355K99906N10421L79652M4899j85369j57805N72L2919j50098l19227
42268d69926j76556K24303M84868L72206J14227K7114O3939j2362j75725j88252
42258B63836l2223N3795j4791m4700P1203J53576L1493j88521k91882k21665n3669
42247b73548J29904K20961J01001j80058l66183k69800K0530L04001M87714N14471
42237F88993K64677k22971n55002l33596K71122N97933K80983k71411m01110n2206
$$ plain form
42309 389568 37891 -294296 -543143 -615156 -382561 62720 439659 663330 909180 1175280
42299 1175280 1134339 671691 245602 318932 632912 515035 -137955 -666016 -543069 -42323
42289 -42323 225864 101100 -123905 -257722 -382124 -544525 -640541 -653236 -726933 -892441
42279 -892441 -925796 -625890 -115469 264183 309082 123713 -34092 -33520 -601 -150699 -469926
42268 -469926 -646482 -422179 62689 434895 549122 576236 640175 627813 452088 263836
42258 263836 231613 285408 270617 225917 297120 450696 482189 293668 1786 -219879 -273548
42247 -273548 -143644 77317 178318 -1740 -367923 -637723 -617193 -313192 174522 688993
42237 688993 953670 730699 175697 -157899 113223 711156 992139 720728 319618 267412
42227B67412J97781n3180n07052o04771k53189J49351K91036K35880J41275J2694
42217a22763j37205j52094M3165K52906K46987O9049o7796q2744m5265J0519R8572
42206A13331J69673J53351O7428k7576j04430j14476k944J17116R436l15960n15203
42195d50254l89528j76797j05967J3076L69180O33500L91882j14238k70645j0207
42185a09998J58338J2655j19810k2056R6579O9961r92j15441l89020n83131k63450
42174a266365L82930N84017J25642k53237n264L93022K82742j49459l18677j72366
42164c97015l350J87505M41333M00368j22174n26865k06907L99050M33902K0994
42154F26841O913M43225M75779j26973m87008o2369M37719K04769m07060n20917
$$ plain form
42227 267412 465193 412013 -95039 -699810 -952999 -803648 -512612 -276732 -135457 -122763
42217 -122763 -259968 -412062 -368897 -115991 130996 200045 132249 49505 4240 14759 113331
42206 113331 283004 436355 503783 476207 371777 257301 254357 371473 380909 64949 -450254
42195 -450254 -839782 -1016579 -1122546 -1109470 -740290 -106790 285092 170854 -99791 -109998
42185 -109998 48340 60995 -58815 -80871 15708 85669 84677 -30764 -419784 -1002915 -1266365
42174 -1266365 -883435 -299418 -173776 -427013 -432277 -39255 243487 94028 -224649 -397015
42164 -397015 -400365 -212860 228473 628841 506667 -20198 -227105 171945 605847 626841
42154 626841 633754 1076979 1552758 1425785 938777 876408 1314127 1518896 1111836 590919
42144E90919q0638K31474J06735r6811p6695R814o9508k47951k92304r5537K20987
42133B00485L97063K58098p9902l10978k85203j21917M1521J99200L04101J93986
42123G96454j51922m65308m69127j95513R3186K01985J38063L7713J9661O3713
42113F8905N6562R87M0685J62846J05237k03831l80247j31341J93005J08122j68560
42102a47630n4818L40873L08876k48647n58216j99708K44775J99937k7578L5979
42092a06157J45930j04660m10712k52612J46236J99991n725O6645L49335K54368
42082B82639k19332l84359o584L07128J33785j27999l5542J56374L5266k14233
42072g2857j67520Q3878J12955j05650j90717k7826N1797j51125l46570j78459
$$ plain form
42144 590919 510281 741755 848490 751679 674984 684798 615290 367339 75035 -20502 200485
42133 200485 597548 855646 775744 464766 179563 57646 99167 298367 602468 796454
42123 796454 644532 179224 -289903 -485416 -392230 -190245 -52182 -14469 5192 68905
42113 68905 125467 126454 167139 329985 435222 231391 -148856 -280197 -87192 20930 -147630
42102 -147630 -202448 138425 447301 198654 -359562 -559270 -314495 -114558 -142136 -106157
42092 -106157 39773 -64887 -475599 -728211 -581975 -381984 -387709 -321064 28271 282639
42082 282639 63307 -321052 -327636 -20508 113277 -14722 -50264 106110 141376 -72857
42072 -72857 -240377 -156499 -43544 -149194 -339911 -367737 -315940 -467065 -813635 -992094
42062i92094K34229M32514K29172m1878K3321L42991M50463J39434k46254l04007
42052B67891j17704m4388j17902l8436K61629M32597K18055j58210l11994j80191
42042B11347K8818J84311K76239K14665j14714n55233o85348k81581L36998O11472
42032B26974L80816L5474l5108N4645n0125l21679l52264j6090K56719Q1418l11539
42021e0759m21623j87807J2036k5850r2919L6777K83215M15932L21546N2839k26871
42010A16516l21871j77368K2540P0724J2597L8456J60164K15876J67030J44617
42000D49281J82938J43692l8191k29920k85610k03341o2046O0993J00369O3412
41990A81577O2673J53739K00161O9185j15312j31776j2581M612j53929l12922
$$ plain form
42062 -992094 -757865 -325351 -96179 -138057 -114736 228255 678718 818152 571898 267891
42052 267891 150187 105799 -12103 -50539 211090 643687 861742 703532 391538 211347
42042 211347 240165 424476 700715 915380 800666 245433 -439915 -721496 -384498 226974
42032 226974 607790 643264 608156 662801 612676 290997 -61267 -77357 179362 260780 -50759
42021 -50759 -472382 -660189 -648153 -674003 -766922 -730145 -446930 -30998 290548 343387 116516
42010 116516 -205355 -382723 -360183 -289459 -276862 -238406 -78242 137634 304664 449281
42000 449281 632219 775911 737720 507800 222190 18849 -43197 17796 118165 181577
41990 181577 244250 397989 598150 667335 552023 420247 407666 412278 258349 -54573
41980e4573l13112j49068J12178L36206L26171O2428j70620j61313j12009k62635
41970c86347l75675q2673L97971M83814J35130r8114J0376Q3223o9767r4458J72557
41959A76037K93503k0457l54308k81509o4589r9135j51671J82504O36353O05245
41949I21973J02570k96736l31785k37197j39333Q8474L59964L51277K8550k71084
41939E76673l46582k97890j69508J16583M23594M40923J51998j23756k15090k42811
41929C14134k46145r3117J55211K12810K0516j50577j49926j15841j00636M1611
41919a11960K54312K14939j23362l56281k39915n6532p4754p2544J97473M37886
41909F9262K23307k36824l17675Q9325L96033J71594k72194l81555j24283P6104
$$ plain form
41980 -54573 -367685 -516753 -404575 -68369 257802 320230 149610 -11703 -123712 -386347
41970 -386347 -762022 -844695 -446724 37090 172220 74106 84482 167705 97938 3480 176037
41959 176037 469540 449083 94775 -186734 -251323 -350458 -502129 -319625 316728 921973
41949 921973 1024543 727807 396022 158825 19492 107966 467930 819207 847757 576673
41939 576673 230091 -67799 -237307 -120724 302870 743793 895791 772035 556945 314134
41929 314134 67989 -25128 130083 342893 363409 212832 62906 -52935 -153571 -111960
41919 -111960 142352 357291 233929 -122352 -362267 -418799 -493553 -566097 -368624 69262
41909 69262 292569 55745 -261930 -172605 223428 395022 122828 -258727 -383010 -306906
41899c06906J7915l8527J34663L17924J74181j74886k53933Q0922M27926M42978
41889H22257K89719K32652J42648j81728m83055l68001p965O4265j86289k53128
41879G1375L5964K35985O9171j17849J0101K25505K01519N0690j5501j22417l56670
41868B87873l72886N7684M48911K08265l74468m58924Q8754M89709K12867l17330
41858B70455m40709j55237Q2707Q1317K1566L6855O3768O3782J07348K00420K07452
41847E39724K0233k67046m02626k05846K31586N77065N32558J05077l96779o27233
41837A06713m74713j22137J36266J64076O9655R149j6755o9792q0123M6076J75358
41826e6227P7875j71371k29819j0708J58059N1609j12824q9123k9815j69781l39519
$$ plain form
41899 -306906 -288991 -327518 -192855 125069 299250 124364 -129569 -48647 379279 822257
41889 822257 1111976 1344628 1487276 1305548 822493 454492 446527 510792 324503 71375
41879 71375 107339 343324 412495 294646 304747 530252 731771 782461 766960 644543 287873
41868 287873 -85013 -27329 421582 629847 255379 -203545 -114791 374918 587785 270455
41858 270455 -170254 -325491 -242784 -161467 -139901 -103046 -39278 24504 131852 332272 539724
41847 539724 559957 292911 -109715 -315561 -83975 493090 1025648 1130725 733946 106713
41837 106713 -368000 -490137 -353871 -189795 -120140 -110991 -127746 -197538 -277661 -231585 -56227
41826 -56227 21648 -149723 -379542 -390250 -232191 -180582 -293406 -382529 -412344 -582125 -921644
41815i21644j91430K30596N28000M89556K72976Q9141l310j1243L9180P9565R6735
41804F98122J55264J75479q9151o02446q35665l97560L14798N48980J79996k00832
41794e3015j40751J90042L96083L17866K8519k74824l32063r1822R6239r1001
41784D5273l97994l01842J74688M79628L75775J97494J62452K6445l49541o35092
41774b22714n38318k30639J6153J89302K71197Q6234k73264l41599K1942K85743
41764g35963L5934l20678j69562L56747O23787M39022J52321k1945j88693l47033
41754a76063l33040j90567j23689p7495J70483M87731M49709K5647k64369p0357
41744a02010K92046L12402l2559l34743l14105o9444J47438J93218O7479j54473
$$ plain form
41815 -921644 -1113074 -882478 -354478 135078 408054 497195 493885 482642 521822 601387 698122
41804 698122 853386 1028865 939714 337268 -498397 -895957 -581159 -32179 147817 -53015
41794 -53015 -193766 -3724 392359 710225 738744 463920 131857 40035 136274 45273
41784 45273 -352721 -654563 -479875 -247 375528 573022 735474 761919 412378 -222714
41774 -222714 -761032 -991671 -975518 -786216 -515019 -428785 -702049 -1043648 -1021706 -735963
41764 -735963 -700029 -1020707 -1190269 -833522 -209735 229287 381608 359663 170970 -176063
41754 -176063 -509103 -699670 -823359 -900854 -730371 -242640 207069 232716 -31653 -102010
41744 -102010 190036 502438 469879 135136 -178969 -248413 -100975 92243 159722 5249
41734E249l44201l49560j26730J36028J64452l4632j09682J45473M12943K75427
41724A74767j26155k97899j72629j25136j97132M924M59876N42864O7391k49982
41714H0889O0153L50943o3129o17800l32644N01187O67182p8304o69437m25495
41704e26455O1881R0246j22921r9636M5494K9286K3842K27979L30556K0248l69788
41693b89268l18144Q6435L39946K72054J08955p139j01845j28229m3399J1310
41683f9324o4000j00521L2126J28283R541p3579J60872M47210L05754j60827l50113
41672B65422n8961K09049p018m62646n45407o5537N23825O55239K71733j32224
41662F53475j16323J43457R5856l79765p24632m38483K20851N84283M32882J53718
$$ plain form
41734 5249 -338952 -688512 -815242 -679214 -514762 -549394 -659076 -513603 -100660 174767
41724 174767 48612 -249287 -421916 -547052 -744184 -739260 -279384 263480 330871 80889
41714 80889 141042 491985 428856 -188944 -521588 -20401 646781 568477 -100960 -526455
41704 -526455 -464574 -374328 -497249 -596885 -551391 -522105 -498263 -270284 60272 80520 -289268
41693 -289268 -607412 -520977 -181031 91023 199978 192839 90994 -37235 -80634 -69324
41683 -69324 -133324 -233845 -201719 -73436 -63895 -137474 23398 470608 776362 615535 265422
41672 265422 206461 415510 408492 -54154 -599561 -665098 -141273 513966 785699 653475
41662 653475 537152 680609 776465 396700 -327932 -766415 -545564 38719 471601 625319
41652F25319J05703J88709J13600j52950l55616k74917M569J77214Q5134p3447
41642D43318m0806P8649l5301l59668m75546j87124J67566K22084O3657l2972
41632a56143l4472k2648O5864K45699K84261L4230k65803l47701l18646l63253
41622h78612l29418m1807K35645J58989p2693k570L06794L61386N5032j79254
41612c86508q1562J08566J40128Q2721L8942m7215j55568j39267k1215J3922o699
41601d53755J30667L57944L21632k5450k67011j34616J32037K27351J81112J05246
41591E75157n4760k55446k29346O9600K43468J1270l20535l16585o3137M9010
41581b91304l7028q0905p0170k07327l99564k67043K14953N22239K84783j43526
$$ plain form
41652 625319 731022 919731 1033331 880381 524765 249848 254417 431631 516765 443318
41642 443318 402512 481161 445860 86192 -389354 -576478 -408912 -186828 -123171 -156143
41632 -156143 -190615 -213263 -147399 98300 382561 416791 150988 -196713 -515359 -878612
41622 -878612 -1208030 -1249837 -1014192 -855203 -927896 -930466 -623672 -262286 -207254 -386508
41612 -386508 -468070 -359504 -219376 -136655 -97713 -144928 -300496 -439763 -460978 -447056 -453755
41601 -453755 -323088 34856 356488 331038 64027 -70589 61448 288799 469911 575157
41591 575157 520397 264951 35605 105205 348673 359943 39408 -277177 -340314 -291304
41581 -291304 -328332 -409237 -479407 -686734 -1086298 -1353341 -1138388 -616149 -331366 -474892
41571d74892j68350J84486L24650P606k78506p2878L04371K25693k24383l21728
41561d93931J60539N43493K70737k39781k71360J14520L00301J13545p3736q9144
41551C35183j14099j41398M3149K96741J96387k06713l39096J7989L93858L72779
41541H54780J14941p8629j76008j73798J063J35387j32693n90489n31513J34434
41531d42525N76574K75616j86267j41646Q8287j01287m36631k28280L99897O82920
41521D86658M10661Q2431l0282j54550l55931l60432j20423O2743N8049K2612
41511A01536l170j02663j29325J09132L68132K40569j44549l01560j97336k05821
41501b65055k99660o6235M02971M64975k1588l85212j92974J30765J24966K2000
$$ plain form
41571 -474892 -643242 -458756 -134106 -126500 -405006 -477884 -173513 52180 -172203 -493931
41561 -493931 -333392 210101 480838 241057 -30303 84217 384518 498063 424327 335183
41551 335183 221084 79686 122835 419576 615963 409250 70154 88143 482001 854780
41541 854780 969721 891092 715084 541286 542349 677736 545043 -45446 -576959 -442525
41531 -442525 134049 409665 223398 81752 170039 68752 -367879 -596159 -196262 486658
41521 486658 897319 979750 949468 794918 438987 78555 -41868 20875 78924 101536
41511 101536 98366 -4297 -133622 -24490 343642 584211 439662 138102 -59234 -265055
41501 -265055 -564715 -630950 -227979 236996 215408 -169804 -362778 -232013 -107047 -85047
41491h5047J63820L12545J23053j87380k28999j07954j38574k22800q7428J28600
41481c30164R4064j05323j25273J6300J2760j29177q9714J74371L23147J65205
41471F196j13926l09161m01900l45140k9764M00215N44823K63080p4225p8714
41461a38516J10660O3313k56647l74475K2754N55770N66836j0054n15512m07354
41451c83225O0605K57470M2007j75414j36090m6859j30507k73210k79362j46516
41441a211101Q0485M11257O77384N31559m9702n39040m50778L4807L45313K59092
41431H9276O1767N2865J92413K32728R754l85039o24924m36176M2018L41165K18263
41420b05890o6016j55711m6723O4894J30569J84528J43519l6974j69039p4511
$$ plain form
41491 -85047 78773 391318 514371 326991 97992 -9962 -148536 -371336 -458764 -330164
41481 -330164 -236100 -341423 -466696 -450396 -437636 -566813 -656527 -482156 -159009 6196
41471 6196 -107730 -416891 -818791 -1163931 -1193695 -793480 -248657 14423 -59802 -138516
41461 -138516 -27856 35457 -221190 -595665 -572911 -17141 549695 539641 24129 -383225
41451 -383225 -322620 -65150 -23143 -198557 -334647 -381506 -512013 -785223 -1064585 -1211101
41441 -1211101 -1130616 -719359 -41975 489584 439882 -99158 -549936 -515129 -169816 89276
41431 89276 151043 203908 396321 629049 638803 253764 -371160 -807336 -765318 -424153 -205890
41420 -205890 -271906 -427617 -474340 -409446 -278877 -94349 49170 12196 -156843 -231354
41410b31354J21350J88437J15008j5003k40194n04064m69440K9075N36739M65088
41400d358p4913m10054k21345J69788M12795M90489M07099O7653l47844l88941
41390A00369K1720L62533K16062j65016l03208j76614q9668j16176p4957O6044
41380a58911J26337K5605j05244j20365L896J78260K18800k6318m16900n44683
41370h19523k25290J88071K45963K5963j8883K24547L57038R7291k62967k50303
41360d38093J52419M91988L82696j09832n72625o15360j93467L28538M88394J98658
41350A13316j53890j76977O3389K08728J34084M7551Q3102J06773K5969j3617
41340D38428O6419N4778j83649l61896j71239J46735J02210k38449l01721O2997
$$ plain form
41410 -231354 -110004 78433 193441 178438 -61756 -565820 -1035260 -1006185 -469446 -4358
41400 -4358 -79271 -489325 -710670 -540882 -128087 362402 769501 837154 489310 100369
41390 100369 122089 484622 700684 535668 232460 55846 -33822 -149998 -224955 -158911
41380 -158911 -32574 -6969 -112213 -232578 -228682 -50422 168378 142060 -274840 -819523
41370 -819523 -1044813 -856742 -610779 -584816 -603699 -379152 -22114 75177 -187790 -438093
41360 -438093 -285674 206314 589010 479178 -93447 -708807 -902274 -573736 -85342 113316
41350 113316 -40574 -217551 -154162 54566 188650 236201 319303 426076 452045 438428
41340 438428 504847 559625 375976 14080 -157159 -10424 91786 -146663 -448384 -385387
41330c85387K92525J1747l25745j42918L46474M93855K07369l6888m4794j07712
41320C08526l17160l18242K8378K76995M5755l50692l31429J16944M48275L09068
41310B16418p8329k99315k26549k9122R7264P8322n8859k17086k50742o7585K27976
41299f07607L57751J48110k20193l66506j45366K09362M19990M58760M04748K33881
41289H92930l7853j90593o1898J46744J15783j26650k82626k47508j63307p2724
41279b7702J00028K43848J53144m5485o522K14569J49616l01396n96840l59497
41269d76237L3744Q2958m7546Q7016L61046K58655k18935m72206j93460K12163
41259c72802K66740L4394j33487j11461J8693K38280N23508O38962L17595l28494
$$ plain form
41330 -385387 -92862 -81115 -406860 -549778 -203304 290551 497920 461032 416238 308526
41320 308526 -8634 -326876 -298498 -21503 24252 -326440 -657869 -540925 -92650 216418
41310 216418 138089 -161226 -387775 -416897 -319633 -241311 -300170 -517256 -767998 -835583 -607607
41299 -607607 -249856 -101746 -321939 -688445 -833811 -624449 -204459 254301 659049 892930
41289 892930 855077 664484 602586 749330 865113 738463 455837 208329 45022 -27702
41279 -27702 72326 316174 469318 423833 417311 631880 781496 480100 -116740 -476237
41269 -476237 -442493 -359535 -407081 -320065 40981 299636 80701 -391505 -584965 -372802
41259 -372802 -106062 -71668 -205155 -316616 -297923 -59643 463865 1102827 1420422 1091928
41249A091928p95535o93450j74301K45958K66572Q0467K3891J02701P4700p3313
41239A49618o2781J74428K80616O060l32630k87602L4240J66659N9727J28403
41229C16738M57012M99835j29235r64765j196703o72107m706K38370J06461k947
41219a352047J16106L38087M43323L59169K02120J28856J43104R9297n0855j18509
41209C08651O2205L02517K26731j90200n04209l68168o055J10529q6194k35764
41199c79957j27607M1352N9980K0963O4588R1511k954l4436J93781M65719L89459
41188G82399J0708k03023k9224K35637K69611J31309R086j01236k43650l06501
41178E55116k27579j63481k16932k23065n3383J10197Q7316K9917R9521P4871
$$ plain form
41249 1091928 296393 -397057 -571358 -325400 -58828 21639 45530 148231 222931 149618
41239 149618 86837 261265 541881 547941 215311 -72291 -38051 128608 188335 316738
41229 316738 773750 1273585 1144350 179585 -1017118 -1689225 -1693931 -1455561 -1349100 -1352047
41219 -1352047 -1235941 -897854 -454531 -95362 106758 235614 378718 478015 427160 308651
41209 308651 370856 673373 900104 709904 205695 -162473 -168528 -57999 -144193 -379957
41199 -379957 -507564 -466212 -406232 -385269 -320681 -229170 -232124 -266560 -72779 392940 782399
41188 782399 793107 590084 560860 796497 1066108 1197417 1206503 1105267 861617 555116
41178 555116 327537 164056 -52876 -275941 -329324 -219127 -131811 -101894 -2373 72498
41168G2498k72187o15762m36645J42929M61451K73338J7476K4823P2657k3966
41158b83388K0016L78238N94934J98724m90146p40777m04872L1970K59636L91560
41148d4105M24291J25312l50656l67988K66457P76762L66639n96234r76727l88455
41138g64704L27444L15164j75007l06040P4115K86184r2596n80935n04381L7896
41128a382860L52729J52512r8353P0433M46741M90117J44074j03195M6680K92467
41118D11345K27737m9909j35279K2001L5532k88116n87174m23458J02226M84360
41108b00735M50452J93295P645l1030R695P1785R1394J3656r3245r9595m8669
41097C64648j35271l69047m83485l16165n8597N5654R6463K27744L37602J88695
$$ plain form
41168 72498 -199689 -815451 -1252096 -1109167 -647716 -374378 -356902 -332079 -259422 -283388
41158 -283388 -263372 114866 709800 908524 418378 -322399 -727271 -695301 -435665 -44105
41148 -44105 380186 505498 154842 -213146 53311 830073 1196712 600478 -376249 -764704
41138 -764704 -437260 -122096 -297103 -603143 -529028 -242844 -335440 -916375 -1420756 -1382860
41128 -1382860 -1030131 -877619 -975972 -905539 -458798 31319 175393 72198 118878 411345
41118 411345 639082 589173 453894 475895 511427 223311 -363863 -787321 -685095 -200735
41108 -200735 249717 443012 450657 419627 429322 501107 592501 606157 512912 413317 364648
41097 364648 229377 -139670 -623155 -939320 -997917 -942263 -845800 -618056 -280454 -91759
41087i1759j57925l77229l05650o6245J89782L83047L81979J16312j49454q469
41077h5611M95621P80147M18954l13695p94200p43468l66334J4170K11021J82433
41067b00962M3510K3448K05795L49311J61340k77660n63692m52423j06577J71339
41057f46571K66288K30590J07776o8886j86025j26439N7419J66275Q9209p0461
41047a80825j52025j33506q7435k1524R0642J52792J4974k51507l48480j46591
41037a063485R3406Q6443m3108L5016L02983L84620J36345q7169N4867L56128
41027B56046L17783j61288o19582n91822j36138L01492M26952L33875K17598P1424
41017D16340j68339l26375j54706J95688K40311j30233l73825n4498M42696M32375
$$ plain form
41087 -91759 -249684 -626913 -932563 -998808 -809026 -425979 -44000 72312 -77142 -85611
41077 -85611 410010 1190157 1609111 1295416 501216 -242252 -608586 -594416 -383395 -200962
41067 -200962 -157452 -134004 71791 421102 582442 304782 -258910 -711333 -817910 -646571
41057 -646571 -380283 -149693 -41917 -110803 -296828 -423267 -365848 -199573 -110364 -180825
41047 -180825 -332850 -466356 -553791 -575315 -484673 -331881 -316907 -568414 -916894 -1063485
41037 -1063485 -970079 -883636 -926744 -891728 -588745 -204125 -67780 -154949 -100082 256046
41027 256046 573829 412541 -207041 -798863 -935001 -633509 -206557 127318 344916 416340
41017 416340 248001 -78374 -233080 -37392 202919 72686 -301139 -355637 87059 519434
41007E19434m4598l04335p0263K06796J79450Q9009J45763N9095l52492o05362
40997a77503k12463M40111N39775J3448l93614j97904K43769L58138R0251j86862
40987E17146j90437J8376J27226j23692n74361o77403j60798M81176N52176R9295
40977F8704k14880j43119j08912l04141k62352K72095P02580M26289j48733j72009
40967A15522L37632N49906J25948l41711l34153j09945q5940j46461k4875J14649
40957B00572O889j54096m1377J66383N5709k71333l35364j04730k3871j67397
40947f68615p3271L60163N18908L6881n01582m03002P4498J91953q0457j28394
40937f72918K07585M14208K32730M6895J52210K95488K07698K1269j31030l84520
$$ plain form
41007 519434 474836 170501 100238 307034 486484 575493 721256 780351 427859 -177503
40997 -177503 -389966 50145 589920 603368 209754 11850 255619 613757 704008 517146
40987 517146 326709 345085 472311 348619 -225742 -903145 -1063943 -582767 -30591 68704
40977 68704 -146176 -289295 -398207 -702348 -964700 -692605 9975 436264 287531 115522
40967 115522 453154 1003060 1129008 787297 453144 343199 257259 110798 85923 200572
40957 200572 207461 53365 11988 178371 234080 -37253 -372617 -477347 -501218 -668615
40947 -668615 -741886 -381723 137185 174066 -327516 -730518 -656020 -464067 -544524 -672918
40937 -672918 -465333 -51125 181605 228500 380710 676198 883896 905165 774135 389615
40927C89615o79303n69536P8662O63859N97142R1322k59092l11266k79777j62847
40917d41221J41742L94027K86231l420q8454l8663j81855l95908k59783J51970
40907d35334L09328R1127o2524L7726L7470k42891m25340k04679J62739L10788
40897d21590K58540J71274N0624n9462L1129K76869L16367N7576p8615J73655
40887G76367M32349K38650k34419m69122l22521o0392R4467Q4863r2641k95554
40877A52047k54902K1416J32830j30230m04865l01624M984J30562R1160J09803
40867d48819J32171L1495J207K14395L77152J88293n2082N9713K19626j11970
40857F11181o34871n25723J92451N57068J21832m04909l20030R2510K10722K6158
$$ plain form
40927 389615 -289688 -859224 -780562 -116703 480439 571761 312669 1403 -278374 -441221
40917 -441221 -299479 94548 380779 377359 288905 250242 68387 -327521 -587304 -435334
40907 -435334 -126006 -34879 -97403 -59677 -22207 -265098 -690438 -895117 -732378 -421590
40897 -421590 -163050 8224 58848 -614 30515 307384 623751 681327 602712 776367
40887 776367 1208716 1447366 1212947 743825 421304 360912 455379 540242 447601 152047
40877 152047 -102855 -81439 51391 -78839 -483704 -785328 -780344 -649782 -558622 -448819
40867 -448819 -316648 -285153 -283946 -69551 307601 495894 443812 503525 723151 611181
40857 611181 -23690 -549413 -356962 200106 321938 -82971 -403001 -310491 -99769 -73611
40847g3611r5003q2982p2988m5973j1277j72796n07022n67413j24640L91477N17345
40836h44883M12151M17761L93468P2952k80371k38284K9141L4855j62085p7640
40826b42935L05998M84554K76555L8296m2897j92898m30032l70755O0741L20664
40816B07291J6463m82138n89043k70182J07655L41440M11457K50439q0875k33421
40806c20914o939K59428J54598j46744j69195P8168J54828k2680m6796K21222
40796A54976L43498K9602l24085k16798J85562L17897M6811k27901k16580m5473
40786D7509Q8962J64722J49942m9844l05853k70329J07961L75100J79632j63578
40776C24224j11022K65120L51992p7383n07809m41951r5089M749j81697k33120
$$ plain form
40847 -73611 -168614 -251596 -324584 -370557 -381834 -554630 -1061652 -1629065 -1753705 -1362228 -844883
40836 -844883 -432732 -14971 378497 451449 171078 -67206 -38065 -3210 -165295 -242935
40826 -242935 63063 547617 824172 862468 819571 626673 196641 -174114 -113373 207291
40816 207291 223754 -258384 -847427 -1117609 -1009954 -668514 -257057 -6618 -87493 -320914
40806 -320914 -327853 -68425 86173 -60571 -229766 -151598 3230 -19450 -66246 154976
40796 154976 498474 528076 203991 -12807 172755 490652 537463 309562 92982 47509
40786 47509 136471 301193 451135 401291 95438 -174891 -66930 308170 487802 324224
40776 324224 213202 478322 830314 752931 245122 -196829 -291918 -287169 -468866 -701986
40766g01986J9865K49771J58607j01001j87392j7853K17434L32355K75125R7558
40756C42483n5945k7816J31220J20827k29965o15690n56022o5546K82717J19337
40746e54400j79449k5195M82285O37072J47190l96611l40658J09973K33152j36942
40736b3583m18646j98610J89821K42944J3591j17450j01185j76777l01434j42300
40726a033629L03475N50326K96299j14038j97075k4037k0649k25041k09310K05809
40716d67870N84686M60670o144k78773j88903n8322j01034j06241J26532L62545
40706C27146K34430k01806n18888m63351j78040R5326K63706L04954K03189M6210
40696A12876j7086J2647P340k4148N3922J77427Q9228j95624k93264n4340J09009
$$ plain form
40766 -701986 -682121 -432350 -273743 -374744 -562136 -579989 -362555 -30200 244925 342483
40756 342483 286538 258722 389942 510769 280804 -334886 -890908 -956454 -673737 -554400
40746 -554400 -733849 -759044 -276759 360313 507503 110892 -229766 -119793 113359 -23583
40736 -23583 -442229 -640839 -451018 -208074 -194483 -311933 -413118 -589895 -891329 -1033629
40726 -1033629 -730154 -179828 116471 2433 -194642 -218679 -239328 -464369 -673679 -467870
40716 -467870 116816 577486 571342 292569 103666 45344 -55690 -161931 -35399 327146
40706 327146 561576 359770 -159118 -622469 -800509 -705183 -441477 -136523 66666 112876
40696 112876 95790 108437 115777 91629 145551 322978 412206 216582 -76682 -131022 -22013
40685b2013j33473l98144j26417M50930N32288o5200n82161m00453J08430K06455
40675d29758j37195k92338P9893N94114O97398L26064j23575k98386k16290j35944
40665F3983k02281k91454k16462J0121K22816L37041L73482L00873P4028j75756
40655D96391k38443j52771j63645k74852j65389K68335N98059L88096j74333m99684
40645H1764l31368M6193K71523K83167K27531K25357K71604K35836r851l60896
40635I40860n01582l17327j16434j91318l30258j25456L35861N27806K50241j10523
40625C61870k06143j78113k58075l08697j12898J52655J43416q3109j21111J68870
40615d41335M45472L71221M7474j73767j40939j0473J4291q9045j94552k00950
$$ plain form
40685 -22013 -155486 -553630 -680047 -229117 303171 237971 -344190 -744643 -636213 -429758
40675 -429758 -566953 -859291 -779398 -185284 512114 838178 714603 416217 199927 63983
40665 63983 -138298 -429752 -646214 -636093 -413277 -76236 297246 598119 672147 496391
40655 496391 257948 105177 -58468 -333320 -498709 -230374 367685 755781 581448 81764
40645 81764 -249604 -203411 68112 351279 578810 804167 1075771 1311607 1301756 940860
40635 940860 439278 121951 5517 -185801 -516059 -641515 -305654 222152 472393 361870
40625 361870 155727 -22386 -280461 -589158 -702056 -549401 -405985 -489094 -610205 -441335
40615 -441335 4137 375358 422832 249065 108126 97653 111944 22899 -171653 -372603
40605c72603j24824l8327L3071J05858J55089J11584l7062k01033k66425j73257
40595h07929P2371L72145N23809L73651K8662k21326k60635k65083l56631l45659
40585h86625m3950L18759L19931l6403k65537o2470K88663L55058J58181N9725
40575B05332J85118K77002J19409j59496k87424j68513Q1577K86409L18030J66930
40565A024374k8675j14890j17699j85639l11428k94570p0380J20410N1361j59851
$$ plain form
40605 -372603 -497427 -535754 -502683 -396825 -241736 -130152 -167214 -368247 -634672 -807929
40595 -807929 -735558 -363413 160396 534047 562709 341383 80748 -184335 -540966 -886625
40585 -886625 -930575 -611816 -291885 -328288 -593825 -656295 -367632 -12574 145607 205332
40575 205332 390450 667452 786861 627365 339941 171428 253005 539414 857444 1024374
40565 1024374 995699 880809 763110 577471 266043 -28527 -98907 21503 72864 -86987
$$ [...]
##END NTUPLES=NMR SPECTRUM
##END=
