##TITLE=31Pdec_PR166_rm
 D2O, 24 sc
 7.2.2019
##JCAMPDX= 6.0         $$ Bruker NMR JCAMP-DX V2.0
##DATA TYPE= NMR SPECTRUM
##DATA CLASS= NTUPLES
##ORIGIN= UXNMR, Bruker Analytische Messtechnik GmbH
##OWNER= root
$$ XWIN-NMR		Version 3.5
$$ Thu Feb  7 15:32:53 2019 Russian Standard Time (UT+4h)  she@DPX200
##.OBSERVE FREQUENCY= 81.013821
##.OBSERVE NUCLEUS= ^31P
##.ACQUISITION MODE= SIMULTANEOUS
##.ACQUISITION SCHEME= undefined
##.AVERAGES= 24
##.DIGITISER RES= 17
##SPECTROMETER/DATA SYSTEM= spect
##.PULSE SEQUENCE= zgpg30
##.SOLVENT NAME= CDCl3
##.SHIFT REFERENCE= (INTERNAL, CDCl3, 0, 182.463)
##AUDIT TRAIL= $$ (NUMBER, WHEN, WHO, WHERE, WHAT)
$$ ##TITLE= Audit trail, XWIN-NMR		Version 3.5
$$ ##JCAMPDX= 5.01
$$ ##ORIGIN= Bruker BioSpin GmbH
$$ ##OWNER= she
$$ F:/spectra/data/she/nmr/P31/1/pdata/1/auditp.txt
$$ ##AUDIT TRAIL=  $$ (NUMBER, WHEN, WHO, WHERE, WHAT)
(   1,<2019-02-07 15:31:49.29 +0400>,<she>,<DPX200>,
      <created by zg, POWCHK disabled, PULCHK disabled
       configuration hash MD5:
       00 E9 B6 7A A2 85 ED C7 34 08 36 98 17 FE 4E 26
       data hash MD5: 32K
       EF BA 43 C5 36 45 20 A6 37 79 14 AE A7 C2 6A 2E>)
(   2,<2019-02-07 15:31:51.45 +0400>,<she>,<DPX200>,
      <Start of raw data processing
       efp BC_mod = 2 LB = 1 FT_mod = 6 PKNL = 1 PHC0 = -1487.254 PHC1 = 99.79895 SI = 64K 
       data hash MD5: 64K
       ED E7 23 F1 AE DE BA 97 74 41 14 18 BF 6A 77 1A>)
(   3,<2019-02-07 15:32:09.60 +0400>,<she>,<DPX200>,
      <pk PHC0 = 6.858457 PHC1 = -18.6 
       data hash MD5: 64K
       30 9E ED AC 15 70 88 78 D8 8E AA 3B 54 1D 13 5F>)
(   4,<2019-02-07 15:32:12.84 +0400>,<she>,<DPX200>,
      <abs ABSG = 5 
       data hash MD5: 64K
       2B 9D 3E AF B5 24 6A 40 4E 70 28 23 DA 49 8A DA>)
$$ ##END=
$$ 
$$ hash MD5
$$ 90 21 DF 22 F2 90 02 48 C1 CB 26 27 8D CD 4D BA
##$RELAX= 
##$RELAX= 
##$RELAX= 
##$RELAX= 
##$RELAX= 
##$RELAX= 
##$RELAX= 
##$RELAX= 
$$ Bruker specific parameters
$$ --------------------------
##$DU= <F:/spectra>
##$EXPNO= 1
##$NAME= <P31>
##$PROCNO= 1
##$TYPE= <nmr>
##$USER= <she>
##$AMP= (0..31)
100 100 100 100 100 100 100 100 100 100 100 100 100 100 100 100 100 100 
100 100 100 100 100 100 100 100 100 100 100 100 100 100 
##$AQSEQ= 0
##$AQ_mod= 1
##$AUNM= <au_zg>
##$AUTOPOS= <>
##$BF1= 81.014009
##$BF2= 200.13
##$BF3= 200.13
##$BF4= 200.13
##$BF5= 200.13
##$BF6= 200.13
##$BF7= 200.13
##$BF8= 200.13
##$BYTORDA= 1
##$CFDGTYP= 0
##$CFRGTYP= 5
##$CHEMSTR= <none>
##$CNST= (0..31)
1 1 145 1 1 1 1 1 1 1 1 1 1 1 1 1 1 1 1 1 1 1 1 1 1 1 1 1 1 1 1 1 
##$CPDPRG= <waltz16>
##$CPDPRG1= <>
##$CPDPRG2= <waltz16>
##$CPDPRG3= <>
##$CPDPRG4= <mlev>
##$CPDPRG5= <mlev>
##$CPDPRG6= <mlev>
##$CPDPRG7= <mlev>
##$CPDPRG8= <mlev>
##$CPDPRGB= <>
##$CPDPRGT= <>
##$D= (0..31)
0 1 0 0 0 0 0 0 0 0 0 0.03 2e-05 3e-06 0 0 0 0 0 0 0 0 0 0 0 0 0 0 0 0 
0 0 
##$DATE= 1549539108
##$DBL= (0..7)
120 120 120 11 120 120 24 19 
##$DBP= (0..7)
150 150 150 150 150 150 150 150 
##$DBP07= 0
##$DBPNAM0= <>
##$DBPNAM1= <>
##$DBPNAM2= <>
$$ [...]
##$SUBNAM3= <"">
##$SUBNAM4= <"">
##$SUBNAM5= <"">
##$SUBNAM6= <"">
##$SUBNAM7= <"">
##$SUBNAM8= <"">
##$SUBNAM9= <"">
##$SW= 369.568048894756
##$SWIBOX= (0..15)
0 1 3 0 0 0 0 0 0 0 0 0 0 0 0 0 
##$SW_h= 29940.119760479
##$TD= 32768
##$TD0= 1
##$TE= 0
##$TE2= 300
##$TE3= 300
##$TEG= 300
##$TL= (0..7)
0 120 53 12 22 120 120 120 
##$TP= (0..7)
150 150 150 150 150 150 150 150 
##$TP07= 0
##$TPNAME0= <>
##$TPNAME1= <>
##$TPNAME2= <>
##$TPNAME3= <>
##$TPNAME4= <>
##$TPNAME5= <>
##$TPNAME6= <>
##$TPNAME7= <>
##$TPOAL= (0..7)
0.5 0.5 0.5 0.5 0.5 0.5 0.5 0.5 
##$TPOFFS= (0..7)
0 0 0 0 0 0 0 0 
##$TUNHIN= 0
##$TUNHOUT= 0
##$TUNXOUT= 0
##$USERA1= <user>
##$USERA2= <user>
##$USERA3= <user>
##$USERA4= <user>
##$USERA5= <user>
##$V9= 5
##$VALIST= <valist>
##$VCLIST= <CCCCCCCCCCCCCCC>
##$VD= 0
##$VDLIST= <DDDDDDDDDDDDDDD>
##$VPLIST= <PPPPPPPPPPPPPPP>
##$VTLIST= <TTTTTTTTTTTTTTT>
##$WBST= 1024
##$WBSW= 4
##$XGAIN= (0..3)
0 0 0 0 
##$XL= 0
##$YL= 0
##$YMAX_a= 34153
##$YMIN_a= -41465
##$ZGOPTNS= <>
##$ZL1= 120
##$ZL2= 120
##$ZL3= 120
##$ZL4= 120
##$ABSF1= 182.463
##$ABSF2= -187.1042
##$ABSG= 5
##$ABSL= 3
##$ALPHA= 0
##$AQORDER= 0
##$ASSFAC= 0
##$ASSFACI= 0
##$ASSFACX= 0
##$ASSWID= 0
##$AUNMP= <proc_1d>
##$AZFE= 0.1
##$AZFW= 0.5
##$BCFW= 0
##$BC_mod= 2
##$BYTORDP= 0
##$COROFFS= 0
##$CY= -3
##$DATMOD= 1
##$DC= 0
##$DFILT= <>
##$DTYPP= 0
##$F1P= 0
##$F2P= 0
##$FCOR= 1
##$FTSIZE= 65536
##$FT_mod= 6
##$GAMMA= 0
##$GB= 0
##$INTBC= 1
##$INTSCL= 5.30512e-09
##$ISEN= 30
##$LB= 1
##$LEV0= 0
##$LPBIN= 0
##$MAXI= 10000
##$MC2= 0
##$MEAN= 0
##$ME_mod= 0
##$MI= 50
##$NCOEF= 0
##$NC_proc= -3
##$NLEV= 6
##$NOISF1= 182.463
##$NOISF2= 159.3651
##$NSP= 0
##$NTH_PI= 0
##$NZP= 0
##$OFFSET= 182.463
##$PC= 4
##$PHC0= -1480.396
##$PHC1= 81.19895
##$PH_mod= 1
##$PKNL= yes
##$PPARMOD= 0
##$PSCAL= 0
##$PSIGN= 0
##$REVERSE= no
##$SF= 81.0140089999434
##$SI= 65536
##$SIGF1= 159.3651
##$SIGF2= -187.1042
##$SINO= 113.3802
##$SIOLD= 16384
##$SREGLST= <1H.CDCl3>
##$SSB= 0
##$STSI= 65536
##$STSR= 0
##$SW_p= 29940.119760479
##$SYMM= 0
##$S_DEV= 0
##$TDeff= 32768
##$TDoff= 0
##$TI= <>
##$TILT= no
##$TM1= 0
##$TM2= 0
##$TOPLEV= 0
##$USERP1= <user>
##$USERP2= <user>
##$USERP3= <user>
##$USERP4= <user>
##$USERP5= <user>
##$WDW= 1
##$XDIM= 65536
##$YMAX_p= 290821491
##$YMIN_p= -8509060
$$ End of Bruker specific parameters
$$ ---------------------------------
##NTUPLES= NMR SPECTRUM
##VAR_NAME=  FREQUENCY,     SPECTRUM/REAL,   SPECTRUM/IMAG
##SYMBOL=    X,             R,               I
##VAR_TYPE=  INDEPENDENT,   DEPENDENT,       DEPENDENT
##VAR_FORM=  AFFN,          ASDF,            ASDF
##VAR_DIM=   65536,         65536,           65536
##UNITS=     HZ,            ARBITRARY UNITS, ARBITRARY UNITS
##FACTOR=    0.456856943014862, 1,           1
##FIRST=     14782.0589164792, 0,            0
##LAST=      -15158.0608439998, 0,           0
##MIN=       -15158.0608439998, -8509060,    0
##MAX=       14782.0589164792, 290821491,    0
$$ Real data points
##PAGE= N=1
##DATA TABLE= (X++(R..R)), XYDATA
$$ [...]
45554A04425J00496M0542j8817m0499m2039j6486N6920J08891K0746j70233k39679
45543i5733o4090J63486J58740o5182k05298p8153J37987J53919m2943j85304
45533a22571r5624P6943P7579p4834r7718J31624L43282K20511j40748l41031
45523b2587k08193K4907R9918L5673m2048j23969k04805j57419O6075K61671K25317
45512d5460N4250k9549l2874r7831j56877j8811K21019K24007n5604k27068l1064
45501a95862K50709K10909q4086k27401q0993Q9656P8631R015L8096O5811o5123
45490H9362k47569k29128M104J88015J44091j5329j11943j41208j55470p7960
45480e53035J50344L40759K46329l1416j16932Q5445K10890j8945l41266l26524
$$ y = [104425, 204921, 245463, 226646, 186147, 144108, 127622, 184542, 293433, 314179, 143946, -95733, -159823, 3663, 162403, 97221, -108077, -186230, -48243, 105676, 62733, -122571, -218195, -141252, -63673, -138507, -236225, -104601, 238681, 459192, 318444, -22587, -230780, -205873, -105955, -70282, -112330, -236299, -441104, -598523, -532448, -270777, -45460, 8790, -20759, -53633, -151464, -308341, -327152, -106133, 117874, 62270, -164798, -195862, 54847, 265756, 181670, -45731, -126724, -37068, 41563, 50578, 88674, 154485, 89362, -158207, -387335, -383231, -195216, -51125, -66454, -178397, -319605, -475075, -553035, -402691, -61932, 184397, 152981, 36049, 121494, 332384, 313439, -27827, -354351]
45470c54351j6939J62455N1747o3526L9862J89952J44448l0232j15046q2826n9634
45459a34090n8952J8558J64730K41262J84098P9329J0895m3995j23906j82717
45449A55212j49171m6903P680o0066j75631j77991q198J94964K34612P8034j12429
45438e9887j62272m3913J29923J99892O6142k00573l58264k19974J04557L14443
45428b29926K83344J73894J49478J53965P7636l2614q2277j09526j81083k19777
45418a6886j28951j294N964n8178j8121J12378J37088Q447r2400n5804R377Q714
45406h9666J7858R0390J15427J4162r3093p5230r32j717n6374p5337p4899r3993
45394c23404n9040P5964J67446P4967q1530r1079O840J3563o1206k9290R3930
$$ y = [-354351, -371290, -208835, -157088, -220614, -180752, 9200, 153648, 123416, 8370, -74456, -134090, -193042, -174484, -9754, 231508, 415606, 494935, 505830, 461835, 337929, 155212, 6041, -40862, -33182, -93248, -268879, -446870, -455068, -260104, -25492, 52542, -59887, -222159, -266072, -136149, 63743, 129885, -70688, -428952, -648926, -544369, -229926, 53418, 227312, 376790, 530755, 608391, 575777, 493500, 383974, 202891, -16886, -145837, -147131, -141167, -199345, -217466, -105088, 32000, 40447, -51953, -107757, -98380, -89666, -71808, 18582, 134009, 148171, 55078, -20152, -21084, -22801, -79175, -154512, -229411, -323404, -382444, -306480, -139034, -64067, -145597, -236676, -229836, -216273, -277479, -306769, -212839]
45383b12839P2741j25922k20567m9096J78463K18578J21346M1229k6675j09837
45373a12579r0658P6816J81894N8046j03173l0995J74951J95089o974j65357j48319
45362B8741q4727o3276k3276L2031J3546k8418M9924J80365J36918n1262q6194
45351A04372R7249J78946k3718k31724j51560N7942P1203q6524j37911j2582J09763
45340b4544J13334K3536j41035l29322l54596r9664K36810L56674K64630J92502
45330B38325J86390P6750j50106k66601j51472M0287J31775J23622O9468l1351
45320B67087j34557j39839o3767m9409j30490j61551n9215O1904Q2511M6367M3502
45309b37457P1655R7976J20242R7958k4833j59247j10788J22429K66842J23114
$$ y = [-212839, -140098, -266020, -486587, -535683, -357220, -138642, -17296, 23933, -2742, -112579, -203237, -126421, 55473, 113519, 10346, -20649, 154302, 349391, 342417, 177060, 28741, -55986, -119262, -142538, -110507, -96961, -125379, -75455, 104910, 241828, 190566, 104372, 201621, 380567, 356849, 125125, -26435, 31507, 102710, 16186, -121725, -134307, -24544, 88790, 112326, -28709, -358031, -712627, -812291, -575481, -218807, 45823, 238325, 424715, 501465, 351359, 84758, -66714, -26427, 105348, 228970, 298438, 267087, 132530, -7309, -71076, -120485, -250975, -412526, -471741, -409837, -327326, -280959, -237457, -165802, -67826, 52416, 150374, 125541, -33706, -144494, -22065, 244777, 367891]
45299C67891j49180k44388r3398J08264J63098L6468j60303k43897j00006J54284
45289a61167K46454Q3675j02693o6487J15135J67241n47k02124k34100r3412N8814
45278a89211O8578n9867j49450n0382J28778J24703r2273k16763k6547K72924
45268a89510L20021Q5903j33905j38477o25J35275K05214J71070K2210j34536
45258C42640j56383o4572j0125l0722j7069N4229N1886p2879j62267q2285O0686
45247h6861O9684o3696j61521r8501O7872J90442J76196L9830j26273k18111j81929
45236c92868l8201J28931K07357J41138J8488Q797J39249K08626M5343k09417
45226B57443k54057n2429J04775K9467q9507M132K24398K76201J12145j3917L1474
$$ y = [367891, 218711, -25677, -119075, -10811, 152287, 188755, 28452, -215445, -315451, -161167, 85287, 168962, 66269, -218, 114917, 282158, 281611, 79487, -154613, -248025, -189211, -120633, -180500, -329950, -380332, -251554, -126851, -219124, -435887, -462434, -189510, 130511, 216414, 82509, -55968, -56593, 78682, 283896, 454966, 477176, 342640, 186257, 121685, 111560, 80838, 63769, 117998, 169884, 97005, -65262, -147547, -86861, -17177, -80873, -242394, -340895, -273023, -82581, 93615, 133445, 7172, -210939, -392868, -431069, -302138, -94781, 46357, 64845, 73642, 212891, 421517, 466860, 257443, 3386, -49043, 55732, 85199, -4308, -176, 224222, 500423, 612568, 598651, 630125]
45215F30125N1799j39704l80834l73067j18649R4271J08600N3416N0824K7307
45205D088o1835o0536J26556K85379J73742o9628j06409O7208J12817r6165k68361
45194A06856j63259N9314J47891J33804J56370J49068j4067k20071k50731j13630
45184h455Q850M8455N7214K7758n0390n9370O4880J29049m7620k64667j86885
45173b81181J04614J95229k6678k16830j32213M5041P7074J4133q206j1288k1859
45162b62164M8676J77716J44791j14530l11220j95585O7463J63073P2413j0203
45152b19570l8633j06050j87449j67626o1462K6997J01496K14900K85205J93071
45142D0879J1991p0068k1848K6261M881m3713q4618q9772J0917K00080K83780
$$ y = [630125, 681924, 542220, 161386, -211681, -330330, -236059, -127459, -74043, -23219, 4088, -57747, -118283, 8273, 293652, 467394, 397766, 291357, 358565, 471382, 375217, 106856, -56403, 2911, 150802, 284606, 440976, 590044, 575977, 355906, 105175, -8455, 395, 48850, 106064, 133822, 83432, 24062, 88942, 217991, 170371, -94296, -281181, -176567, 18662, -8016, -224846, -357059, -312018, -234944, -220811, -229017, -240305, -262164, -213488, -35772, 109019, -5511, -316731, -512316, -444853, -281780, -209367, -219570, -258203, -364253, -551702, -719328, -780790, -753793, -652297, -437397, -152192, 40879, 52870, -17198, -39046, -12785, -7904, -51617, -136235, -226007, -215090, -15010, 268770]
45131B68770J35269o6553p6846K9696o283j74287k05886m5058M0191r2978k14708
45120d08673q3815J86416L09793K05553K2606r3396j04914l8458L7174L9924l3932
45109C8278r1661o4475Q704M3715k363j07903j76118p4175K05924M48225M09359
45098F37510J08444k04825l43019k96853j17479J05879J85940J5430j84958q2189
45088a76120K52856L57749K6362l70059m01619j36193O9611R3241O3305L2290
45078a88577m3915r6119j5463J05533P3623q2480j34940k879J47270J64451Q0295
45067F799p321m5806o256R5569J53419Q9972J041K2725R3902M7248q9892j17461
45055B43939L858Q5973L0600l4526k7162o9765k27477l07281j27689J62393K59543
$$ y = [268770, 404039, 337486, 260640, 290336, 284053, 109766, -96120, -141178, -100987, -193965, -408673, -492488, -306072, 3721, 209274, 231880, 138484, 33570, -4888, 32286, 72210, 38278, -53383, -117858, -109154, -65439, -67802, -175705, -351823, -425998, -220074, 228151, 637510, 745954, 541129, 198110, -98743, -216222, -110343, 75597, 91027, -93931, -176120, 76736, 434485, 460847, 90788, -310831, -447024, -377413, -284172, -220867, -188577, -232492, -328611, -344074, -238541, -164918, -247398, -382338, -385217, -237947, -73496, 6799, -522, -46328, -52584, 42985, 196404, 286376, 287417, 310142, 404044, 451292, 361400, 243939, 247797, 333770, 364370, 329844, 302682, 232917, 5440, -301841, -429530, -267137, -7594]
45044g594J15655m0201m8792J2776K0063k0815m0604k5695L389N0591J06764J02839
45032B28376j7745j85489k37664j04562Q1028J26085J4283q4405n5485J5382K020
45021b18176o4231o7904j034N5316Q4516J18135J09692j891j25344j05933J8597
45010a98257N9926l765N887J22156J25471q0340k43444j27734J10855J65895L6063
44999b7287m1488J149K1906k3845l6479j9236p7787j53171n4390J77652K39645
44988F669K5093j65815o2590J66475J84822j280q3309O7859K30347J67174o9678
44977D65767k46093k33475j09429k5621l4404n2677O623R9809J14115N0531K9075
44966F4221Q1387P8799n0306j71384j41370l4754j0011m9840k7971L7893K5771
$$ y = [-7594, 108061, 67860, 19068, 31844, 51907, 31092, -9512, -35207, -31818, 18773, 125537, 228376, 210631, 25142, -212522, -317084, -236056, -109971, -95688, -180093, -235578, -220196, -218176, -282407, -350311, -351345, -296029, -211513, -93378, 16314, 14423, -110921, -216854, -198257, -138331, -142096, -136209, -14053, 111418, 31078, -212366, -340100, -229245, -63350, -27287, -68775, -67626, -45720, -69565, -106044, -125280, -203067, -356238, -410628, -232976, 6669, 31762, -134053, -196643, -30168, 154654, 153374, 70065, 137924, 368271, 535445, 465767, 219674, -13801, -123230, -148851, -183255, -235932, -229309, -129500, -15385, 35146, 64221, 145608, 224407, 174101, 2717, -138653, -173407, -183418, -233258, -261229, -223336, -197565]
44955a97565k9764L3208J90447K06893J4285j32046k7071J61274J47815m7417
44945C20059j74541j57773j53928k17727j78646N8030K96071K84882N1823j50796
44935b2546j65663n7423N1130J24291J64355J36735K6201r2340j26875q9585o2210
44924a13930m6469M5398K09168K67478Q2635k07539l09915j33066J12538K02851
44914A09149J46421O9915K509q8499j48970r9754m145J786n9957k6516J26814
44903B8753K07280Q8872q4803j10376j3115L3454q516k4351J4071r438j29277
44892g446j86748n2195J54709J99902L9435j37988j64513p2446Q609L0558L2073
44881a56050L1707J0291k0201k0507m341k8934p7113l9267J21390K61042K12078
$$ y = [-197565, -227329, -194121, -3674, 203219, 217504, 85458, 58387, 219661, 367476, 320059, 145518, -12255, -166183, -383910, -562556, -504526, -208455, 76427, 128250, -22546, -188209, -245632, -194502, -70211, 94144, 230879, 257080, 164740, 37865, -51720, -113930, -160399, -115001, 94167, 361645, 444280, 236741, -73174, -206240, -93702, 109149, 255570, 325485, 327994, 239495, 90525, -9229, -13374, -11588, -71545, -98061, 28753, 236033, 324905, 240102, 129726, 116611, 150065, 141549, 117198, 131269, 121831, -7446, -194194, -246389, -91680, 108222, 147657, 9669, -154844, -227290, -218681, -188123, -156050, -124343, -114052, -134253, -154760, -159101, -188035, -265148, -304415, -183025, 78017, 290095]
44870B90095P071j60569j81461j22302p4414m0059m570L552j0230K1100R8694
44859a73093J08880o49r7239m2609Q6558J06820J696p5619m8070L493R398K661
44847a17773J3267J4300R804M4571R3916P8618J8981K2035P8254M9668p3782j04233
44835A27626M4741J81141J12566o9812j67490j77499k03471k00696o6705J01450
44825c18149J10918q738n2549J8855N3220J4397K7052Q8308M2832q4583n5880
44814a64317J51890K14229l6279k74822j43553J88092K66364J4117k09806j59577
44804a53662K8225J36207J39801J03107M0008k0124o267O4669P6970N350k7638
44793C86646M0184Q3640k4534k02899k49608r4492J20069J94130O7861j20574
$$ y = [290095, 297166, 136597, -44864, -167166, -241580, -281639, -286209, -282657, -292887, -271787, -173093, -64213, -64862, -162101, -204710, -118152, -11332, -9636, -85255, -133325, -129832, -120434, -117773, -104506, -90206, -80402, -35831, 58085, 136703, 155684, 177719, 255973, 305641, 231859, 127626, 172367, 353508, 466074, 396262, 228772, 51273, -152198, -352894, -419599, -318149, -207231, -215969, -268518, -249663, -196443, -182046, -154994, -66686, -23854, -108437, -164317, -12427, 201802, 165523, -109299, -252852, -64760, 201604, 215721, 5915, -153662, -125437, 10770, 150571, 253678, 293686, 273562, 267295, 331964, 408934, 414284, 386646, 426830, 510470, 485936, 283037, 33429, -61063, 59006, 253136, 320997, 200423]
44783B00423j73709n8030M4626k9755j90711k02297j1760J67530J36162m2427
44773a59948j37378k7662J72712K42983R3269j20510j60174m563J10879K3785
44763C3393j15939q2182P4096J24252L6055j2595K9901K1219p3626r7697j20N3430
44751i813j7050n6358K8750Q3162k159o0166N6995J76546P4747j28307j45469
44740H78K7340J41613R8282K0038l2764j18862j92675j13178Q2657J68557N3507
44729A35393r7992j27916o5758J0501R6121J66912J43634L5253l1606j970K4608
44718B87180l5456j28081j69343j49419p9122M0904J53432J72870J13884O2704
44708B69553J0548j16361k44188j83378N8840K14789J17774p0275j27034p6456
$$ y = [200423, 26714, -31316, 13310, -16445, -207156, -409453, -421213, -253683, -117521, -159948, -297326, -324988, -152276, 90707, 183976, 63466, -96708, -101271, 9608, 33393, -82546, -164728, -90632, 33620, 69675, 57080, 86981, 108200, 34574, -63123, -63243, -9813, -26863, -83221, -54471, 28691, 26532, -33634, 23361, 199907, 274654, 146347, 878, 28218, 169831, 268113, 288151, 255387, 136525, -56150, -169328, -86671, 81886, 135393, 37401, -90515, -156273, -145772, -49651, 117261, 260895, 296148, 264542, 262572, 287180, 251724, 123643, -45700, -195119, -274241, -233337, -79905, 92965, 206849, 269553, 280101, 163740, -80448, -263826, -204986, 9803, 127577, 57302, -69732, -146188]
44698a46188n8384n8151K5535J49407J68406N8629o5661j17949r4203j7271N3243
44687a02587K4288r4833j41147j8943J19097Q0417n8185n6753J12077K19029J26341
44676B08801l4238r5346p7878p7042p3630M150J16962J49372P9758O926M373L0097
44664B42305Q437n2289p0428l927R2835J39326J19169O8323P638n6981r1331o7506
44652C35571l6383p5145j51037j41706k7021N3259L411p3560k9979R8908J48336
44641A04654O1062n7428j08053j00321o9079j896R4581J34068M2055j10229j43858
44630a54444J7174K23199K62761J33436L6749P0814P6545r2905k90462k67124
44620A5743o0253O2221J8521r969N0357L0207j30685k00833k3841J88501J72570
$$ y = [-146188, -204572, -262723, -237188, -87781, 80625, 139254, 73593, -44356, -138559, -155830, -102587, -78299, -173132, -314279, -333222, -214125, -133708, -191893, -248646, -136569, 82460, 208801, 174563, 79217, 1339, -75703, -149333, -145183, -28221, 121151, 200909, 207835, 212208, 242305, 250742, 198453, 128025, 124098, 216933, 356259, 475428, 543751, 551389, 494408, 403077, 335571, 299188, 224043, 73006, -68700, -95721, -42462, -39051, -112611, -142590, -43682, 104654, 165716, 108288, 235, -100086, -169165, -171061, -76480, 57588, 99643, -10586, -154444, -137270, 85929, 348690, 482126, 518875, 589689, 666234, 573329, 282867, 15743, -44510, 17711, 36232, 26263, 76620, 106827, -23858, -224691, -248532, -60031, 112539]
44609A12539J3385l7704K6956L5553j8935r541K8519n3547k00458j84633K3401
44598b64465J82984J31101k2791j03375p7555m243O0735O8337J3232k8759j1327
44587e6126j0423p0388o2809J02336K41271J36785q2015j14625K3185M7505q3139
44576G1557j11398K1032M4668j43337k62233j14823R3961J29784Q7326J26167
44566e7296J53125M7104o1472k1346N6376J7944m9677k4063q747j03341j43010
44555a94403J6826J79876J19490q779M8123J53786L2506j65963p7131J94322J76962
44544D75615j63823l16772n9516J68796j811k72546j91202J18687K01926P817
44534c2829r1892O3474K05103J00101j03162j35856j961O4549m6799j68843r2828
$$ y = [112539, 125924, 88220, 115176, 150729, 131794, 122253, 150772, 97225, -103233, -287866, -264465, -81481, 49620, 26829, -76546, -154101, -158344, -97609, -29272, -16040, -44799, -56126, -66549, -136937, -199746, -97410, 143861, 280646, 198631, 84006, 107191, 154696, 71557, -39841, -18809, 25859, -117478, -379711, -494534, -400573, -270789, -183463, -57296, 95829, 142933, 81461, 60115, 116491, 134435, 84758, 60695, 51948, -51393, -194403, -177577, 2299, 121789, 113010, 161133, 314919, 347425, 181462, 104331, 298653, 475615, 311792, -4980, -64496, 104300, 102489, -170057, -361259, -242572, -40646, -32829, -124721, -61247, 143856, 243957, 140795, 4939, 2978, 67527, 20728, -148115, -240943]
44523b40943J24001K00900J0918k10867j66025Q7329K14422Q5186o0216N669J69256
44512B19630J70933k9163k40537k97887j82905L6192K47906L20162K00515r080
44502D35766j45294j41983o6970l4877r7668j75847j14882J05152K52332Q9401
44492A05130k63457m10618j83900J38989K20402O7469q9744j30245o5369R5462
44482e15881K71249K42338p3691l71434k77798J12900L28853J64636p7375p8312
44472b74515O8443R7876j728m5723J6574P7031R7163J32788J61769R7692k3374
44461D03996o5256k2845l5908j24379j20242L2957J22332j4393j86417j17788
44451a27943R4035R8851j41941k51826n602L11585L18369O6560j09599r6686m6386
$$ y = [-240943, -116942, 83958, 94876, -115991, -282016, -194687, 19735, 104921, 44705, 50374, 219630, 390563, 361400, 120863, -177024, -359929, -323737, -75831, 244331, 444846, 435766, 290472, 148489, 81519, 46642, -51026, -226873, -341755, -236603, 15729, 105130, -158327, -568945, -752845, -613856, -393454, -325985, -415729, -545974, -611343, -515881, -244632, -2294, -75985, -447419, -725217, -612317, -283464, -118828, -196203, -274515, -206072, -108196, -109924, -155647, -139073, -62042, 35121, 167909, 329678, 427370, 403996, 338740, 315895, 279987, 155608, 35366, 68323, 190655, 176262, -10155, -127943, -33908, 64943, -76998, -328824, -334426, -22841, 295528, 362088, 252489, 155803, 109417]
44440A09417k2988N4770J41366O9231j24686j88679o5594q304j41339k07935J7138
44429c67603L13235L08004K0682k03830k09625j53910j38903m8587J67327L17259
44419D049K24185j4789j68473j57186p5157j3915J4885K4979K5232L3415N8524
44408d4251P5652N2277j2017q5610j21225p2456N9200J84240J89512P0055n3055
44397B42322q0559n3857p9516j70141k22739j53775m115J13711J43408J24584
44387a40677J10414R1463L4680l0308k6230N9421J32175R6033l1930j44821j57596
44376g376o8096O2743J55772J60460R2260J4313l1987n6173p4284q2023q9407
44365G6202j22908j57414j08712M8421K05650K34443J40786L9113k237j8923o4034
$$ y = [109417, 86429, 141199, 282565, 351796, 227110, 38431, -27163, -35467, -176806, -384741, -367603, -54368, 253636, 274318, 70488, -139137, -293047, -431950, -480537, -313210, 4049, 228234, 213445, 44972, -112214, -187371, -201286, -186401, -161422, -136190, -102775, -44251, 31401, 83678, 71661, -13949, -135174, -207630, -148430, 35810, 225322, 295377, 242322, 161763, 107906, 28390, -141751, -364490, -518265, -522380, -408669, -265261, -140677, -30263, 61200, 95880, 65572, 39342, 98763, 230938, 326971, 295041, 150220, -7376, -75472, -12729, 143043, 303503, 395763, 410076, 378089, 321916, 247632, 165609, 76202, -46706, -204120, -312832, -264411, -58761, 175682, 316468, 355581, 353344, 334421, 270387]
44354B70387j26162j41850o2554P9269J63801R7023m6748q0001M3763J33833K8614
44343C59375j39208j15836Q3989J76148K6462j48982j19794Q122k2937j94056
44333h6717k18040J3467K35243J82601k6187q4579L1239N0908j22517k16911o584
44322b48077L02565L40834R4079j18305j30065j00504j72883k42978j75073k1347
44312d71754J05507J92669K36515J74233L7656r837O4623O2419j11517k26949
44302E3565p7284J45605J23005q8688j61934k1449Q5923K6958n4637n1368n2483
44291g2787j04963r0141M5831J63015J42685M7798j9646n0907n4787k4406l0890
44280d9198j61114l13844k67154j1799J99370K10200J46991J55608J82172J35956
$$ y = [270387, 144225, 2375, -60179, 19090, 182891, 279914, 233166, 153165, 196928, 330761, 359375, 220167, 104331, 188320, 364468, 390930, 241948, 122154, 130276, 107339, -86717, -304757, -291290, -56047, 126554, 100367, 15788, 47027, 97935, -24582, -241493, -248077, 54488, 395322, 489401, 371096, 241031, 140527, -32356, -275334, -450407, -471754, -366247, -173578, 62937, 237170, 274826, 264989, 329612, 392031, 280514, 53565, -23719, 121886, 244891, 156203, -5731, -27180, 58743, 85701, 31064, -20304, -72787, -177750, -267891, -222060, -59045, 83640, 131438, 111792, 60885, 6098, -18308, -49198, -210312, -524156, -791310, -803109, -603739, -393539, -246548, -90940, 91232, 227188]
44270B27188O2483K6163L533k873O2066J30293L3636j96849l01239j75595j9270
44259a50464K7725Q1159J77295J01338j86882l12942l2948K91460J95160j60033
44249C0868k49488j5931J03742o8234k11125r2987Q4214Q5873r48q309K7075J6439
44237b98811J5500Q5739J46329J17750O1490N6813P0971M1744k7914j08748j62024
44226a161j11709N5622J81946J11089n2023o9070O4440J25094K6468r6517j75708
44215E8471k73416l20045j31064K16502L66887J90397j9493k4126J7413r3574
44205a2048k14429j33578K8831J6583j39800j98137p8238J00331K39897K91481
44195i9107J83305m9967j91101j12881J1149j0629o2914N2334K30023K17930M2306
$$ y = [227188, 289671, 315834, 319367, 316494, 378560, 508853, 542489, 345640, 44401, -131194, -150464, -122739, -41580, 135715, 237053, 50171, -262771, -295719, -4259, 190901, 30868, -218620, -234551, -130809, -199043, -410168, -503155, -418941, -333068, -334016, -342325, -315250, -298811, -283311, -197572, -51243, 66507, 127997, 184810, 255781, 297525, 269611, 160863, -1161, -112870, -57248, 124698, 235787, 183764, 114694, 179134, 304228, 330696, 234179, 58471, -214945, -534990, -666054, -449552, -82665, 107732, 88239, 64113, 81526, -12048, -226477, -360055, -331224, -314641, -454441, -652578, -730816, -630485, -390588, -99107, 84198, 34231, -156870, -269751, -258602, -269231, -332145, -279811, -49788, 168142, 210448]
44184B10448n3160j6844r148o3742n8441j347k2461q2793j2978J43859J53662
44173A87055m778q4287J0643O8135n9200k22727k47832j67704n6820J05219K58796
44162b13500K18250k0560j69879m6143J48909J62449Q5685J40093K43596J22578
44152F71478k09678m05905k49328P8508K63460K10733M8687q2927j42399j48490
44142C4139j30480j21763j52289k03709j77455K1497L18995M68762L23072M3617
44132D24386j04411j09709j57738k47618j57295J37137L13716J56460j02779j32710
44122A9439J9463Q4167L6661O6413J64141J08904j13656k27670j04919J5628q2732
44111a4161k28386j19776J95519L58708J86785r9398j87722n7043O2434K7627
$$ y = [210448, 157288, 140444, 131296, 67554, 9113, 7766, -14695, -97488, -110466, 33393, 187055, 182277, 97990, 108633, 176768, 117568, -105159, -352991, -520695, -577515, -472296, -213500, 4750, -15810, -185689, -231832, -82923, 79526, 165211, 305304, 548900, 671478, 461800, 55895, -193433, -114925, 148535, 359268, 407955, 325028, 182629, 34139, -96341, -218104, -370393, -574102, -751557, -730060, -411065, 57697, 380769, 424386, 319975, 210266, 52528, -195090, -352385, -215248, 98468, 254928, 152149, 19439, 38902, 123069, 159730, 226143, 390284, 499188, 385532, 157862, 52943, 68571, -14161, -242547, -362323, -166804, 191904, 378689, 279291, 91569, 34526, 96960, 124587]
44101A24587o2463o3915q004j9513q8360p9993K4013O5595l8874j41174p8636
44090c66737P1360J11210J8249m9866o166P3233J00777P8019L6473n162k0127
44079D1263j534J2267K1150R5164K06517J51980j54544m23543l11898N1365K07090
44068a04723M8009m1486J51094K89847N2462k95044k83845L5212J99356M4631
44058I5513j41734j59447j41822j80584j10811J44127L31981K12501p7275k22375
44048b49926j39180J3206J03820J22386R4338O6093R7117J42927N7118j62998
44038A44901k79931j35834Q1868J09940K283j3466M8017r235j40868q1200J76695
44027i6830K98006J26487o3965k5111Q0806L893j61096j71710o0344l1764q4474
$$ y = [124587, 62124, -1791, -9795, -29308, -117668, -197661, -173648, -108053, -146927, -288101, -366737, -295377, -184167, -165918, -215784, -221950, -148717, -47940, 30079, 66552, 61390, 41263, 39729, 51996, 73146, 168310, 374827, 526807, 372263, -51280, -363178, -311813, -104723, -56714, -98200, 52894, 342741, 395203, 100159, -183686, -148474, 50882, 95513, -46221, -205668, -347490, -528074, -638885, -494758, -162777, 49724, -27551, -249926, -389106, -375900, -272080, -149694, -55356, 10737, 107854, 250781, 307899, 144901, -135030, -270864, -188996, -79056, -76773, -90239, -42222, -51457, -192325, -273525, -96830, 201176, 327663, 263698, 238587, 319393, 323286, 162190, -9520, -69864, -101628, -186102]
44016a86102o5225K997j7060n8576N7850K47148K33464J3440j14661l4909M0924
44005A19290J449K1825J63912J77803n4395k27625p8694J55476J08813j23829
43995B64025j77474k7637L6500l7826j2092J36253J12665j68243l61310j96800
43985d31939J13723K10677P5430n8600q7346p0570k2126P3746J11337k5383k19862
43974c30913k10564M7163K83893K49058J7377j26019m1905J15162J11855o4258
43964E0849j90559j05516O9515R8342l4275j07199L649J43309J14740l9881j28620
43953a25646r3040m6701n9972n9273K3364J12386Q1196n7470j35287l1720J51479
43942b40684J93818M1274j09443p8312M7238O3030k5140k4983J01529J52767J7691
$$ y = [-186102, -251327, -248330, -265390, -323966, -266116, -18968, 214496, 227936, 113275, 78366, 119290, 120739, 142564, 306476, 484279, 429884, 202259, 123565, 279041, 387854, 264025, 86551, 58914, 95414, 57588, 45496, 181749, 294414, 126171, -235139, -431939, -318216, -107539, -32109, -90709, -178055, -248625, -270751, -197005, -85668, -111051, -330913, -541477, -494314, -210421, 38637, 56014, -70005, -111910, 3252, 115107, 50849, -139710, -245226, -175711, -77369, -111644, -218843, -215194, -71885, 42855, 2974, -125646, -218686, -265387, -325359, -384632, -361268, -248882, -167686, -225156, -360443, -392163, -240684, -46866, -5592, -115035, -193347, -146109, -83079, -108219, -133202, -31673, 121094, 138785]
43931A38785j26057q8367L3724K2181j14565j70368o2544P4722J11793O8135J5168
43920i7393k3338l6723n867L8942K0521q3259j93069k08795j02562O7573K00755
43909d23215K24229J60151J01704R0893O3119l9116j49404j46418j1674J41844
43899A2113J79514N4392j46030k42101j33058M8517P4528m4849m5920J64652K92817
43888B14575Q3387k30053k27725M8261J40331j14436l28456j69453J36908J77717
43878b68944k8912j17679M7308K13936J58222j9623r7306l2746N4516Q8277R5193
43867I2242R9911O7992k3717j19601j40769r5607p5542j18112j36657m4709J03799
43856c90770J85755J78093J42261O9225j03998l02801l12806o1132K30700K94806
$$ y = [138785, 12728, -75639, -41915, -19734, -134299, -304667, -367211, -292489, -180696, -112561, -97393, -120731, -157454, -163321, -124379, -103858, -187117, -380186, -588981, -691543, -623970, -423215, -198986, -38835, 62869, 153762, 216881, 177765, 28361, -118057, -129731, 12113, 191627, 246019, 99989, -142112, -275170, -226653, -152125, -196974, -242894, -78242, 214575, 297962, 67909, -159816, -111555, 28776, -85660, -414116, -583569, -446661, -268944, -297856, -415535, -368227, -154291, 3931, -15692, -112998, -145744, -91228, -2951, 92242, 192153, 260145, 236428, 116827, -23942, -119549, -195091, -313203, -449860, -494569, -390770, -205015, -26922, 115339, 184564, 80566, -222235, -535041, -596173, -365473, -70667]
43846g0667J31444m0854q1218m3463k9937n4471o3967j3450R5689J99034J94340
43835B22480M1409j58334k34325j19619P2626J59145O8857q5430j25464q223J17580
43824d9298R4415l4495p6438M9801J95838J68074l5978k29174k37468o5241J17226
43813a02738J34805j8232j66316j46420R283J37360J52637J05577N6648P433m1087
43802A28950o9804q9597j11939q8668L1L6142q4005k13794j06857J69787K46008
43791a83746k2128l01972k42201N0779K22331J70437P6196N8547O5317M6802P443
43780e2195p5415j90581k05200k7400K02241K69741J72514O0405j5288p9219o6257
43769f654N5288Q7381j51895m36357l44627J17707M70733M07697J37947k8998
$$ y = [-70667, 60777, 19923, -61295, -104758, -134695, -189166, -253133, -266583, -170894, 28140, 222480, 263889, 105555, -128770, -248389, -175763, -16618, 52239, -33191, -158655, -166878, -49298, 45117, 10622, -65816, -16015, 179823, 347897, 311919, 82745, -154723, -219964, -102738, 32067, 13835, -152481, -298901, -289618, -152258, 379, 105956, 162604, 170037, 128950, 59146, -30451, -142390, -231058, -231027, -194885, -278890, -492684, -599541, -429754, -183746, -205874, -507846, -750047, -699268, -476937, -306500, -230304, -171757, -106440, -59638, -52195, -127610, -318191, -523391, -550791, -348550, -78809, 93705, 154110, 138822, 59603, -6654, 48634, 136015, -15880, -452237, -796864, -679157, -208424, 199273, 337220, 308222]
43759C08222q4531j27283j00505L0803J02551J0548o7565L5845J62541P9168j26995
43748B22799k00458j32373j07146j24520j1468K09869K91277J39696n1665j24224
43738A11787j50476k11654k18742j03373N290k4912r1135n108J95205K81020J69496
43727d2602M2798P4727J81461J58468j1566j30312o4872P3319R3371k5718j43444
43716B05630j55179p9774J0281M5480j4609j04749o1182J50071K79152Q2365k62872
43705I4614l12241K4104L13636J92775j57441l33412k49583q7626P5990K57133
43695a82051L25255J44535j09688j27763O2451J46926M7838J4171J29514J36205
43685E87393q5486k44867j07637Q4962R69k12613j44855K04021L77633J29080
$$ y = [308222, 223691, 96408, -4097, 26706, 129257, 139805, 72240, 108085, 270626, 349794, 222799, 22341, -110032, -217178, -341698, -353166, -143297, 147980, 287676, 236011, 111787, -38689, -250343, -469085, -572458, -567168, -592080, -683215, -688323, -493118, -212098, -42602, 196, 74923, 256384, 414852, 403286, 272974, 208102, 281421, 374792, 349074, 205630, 50451, -29323, -19042, 26438, 11829, -92920, -154102, -4031, 275121, 357486, 94614, -217627, -193523, 120113, 312888, 155447, -177965, -427548, -515174, -439184, -182051, 143204, 287739, 178051, 50288, 112739, 259665, 307503, 321674, 451188, 587393, 501907, 257040, 149403, 234365, 235334, 22721, -122134, 81887, 459520, 588600]
43675E88600k22676k47117L4101K32705J11833j73710l24826k35525m0931Q7005
43665a90541J08134Q1930M7248M083j8217K5618R8971R2443k6360j52245j79886
43654a08822j20508k6079J06447K64615L37046K22938j0148j80951j87283p0349
43644B26906O9310J35519O9497p5776j38633l6354R7183Q3684m5606j21634j08930
43633A55166j04619r6556K0711J57817N8987k50042l42288L4159M97435M86356
43623F17126L5215k88028j85819K9809n804j89434k02782q042J81969K52898K35305
43612D72413J17071j14230k97748k39683k9554L0007j49325l06124j95791R7574
43602f15390L12406L19270J78790J6259o2598k8469K2545l0759j38759j13955
$$ y = [588600, 365924, 118807, 152908, 385613, 497446, 323736, -1090, -236615, -277546, -190541, -82407, -477, 46771, 50854, 32637, 58255, 157226, 249669, 223309, 71064, -108822, -229330, -255409, -148962, 115653, 452699, 675637, 665489, 484538, 297255, 226906, 296216, 431735, 501232, 425456, 286823, 250469, 347652, 431336, 385730, 264096, 155166, 50547, -46009, -25298, 132519, 191506, -58536, -400824, -366665, 130770, 617126, 652341, 364313, 178494, 208303, 202499, 13065, -189717, -197759, -15790, 237108, 472413, 589484, 475254, 177506, -62177, -91731, -61724, -211049, -517173, -712964, -615390, -302984, 16286, 195076, 211335, 148737, 120268, 142813, 112054, -26705, -140660]
43592a40660P8504K15920J07524j45270k94585k34350l5393J74769K49625R5562
43582G1646j44434j46242J62078L94627J95464k17286l28762o2521J52449O0074
43572A37093r1464k7162J24779J17731R006P10N0091m5786k64472l47725j74676
43561e11875P9559J95158J55376R2600R3078J10653M3392j14107k12217j14432
43551a82815P8276J11967o0970j81339n8837J29602J09937o1251r2467Q5715K31780
43540A09598J76460M5753K1728P8952P7554j0509q6269p1308O508M6478k3259
43529C71686j44179j63635m3777L4870q7373k71932k42877j165J65605J20688
43519b62089N3186J09895J36469r244j34403P19K35933K01742j06554l05449k01501
$$ y = [-140660, -62156, 153764, 261288, 116018, -178567, -412917, -448310, -273541, -23916, 71646, -72788, -219030, -56952, 337675, 533139, 315853, -12909, -75430, 77019, 137093, 45629, 18467, 143246, 260977, 269983, 270693, 320784, 274998, 10526, -337199, -511875, -432316, -237158, -81782, 10818, 103896, 214549, 257941, 143834, -68383, -182815, -104539, 7428, -53542, -234881, -293718, -164116, -54179, -115430, -207897, -122182, 109598, 286058, 331811, 353539, 432491, 510045, 499536, 413267, 341959, 348467, 394945, 371686, 227507, 63872, 20095, 54965, -32408, -304340, -547217, -548382, -382777, -262089, -208903, -99008, 37461, 28217, -106186, -105467, 130466, 332208, 225654, -79795, -281296]
43508b81296l9393n3236r9987L5877K28531K02152q173j02762K2899J60877J50689
43497B16178P7902L8653l2030j56596j66877L6586K38554J60547j28534k90052
43487e669j73692K4395P1950l4210j52979j69274l0628K16013L70642K42559o1830
43476B97277k02964n9099R1230j1521k11421j90132L4729J51431L6657r2329l7481
43465a93623J13259J65058Q3807j6426m0816R351N8914K7371o7163r6532o89Q4917
43453A27428K2415p6949o038J68607J62414o4175j94525l3634J79886J41832o5959
43442C61302j47281m9920L3201K5874L6210Q3597L7276j22790k13768j10113P2422
43431F010J51982J18321R7542J53776K09701J41145p8326l10825l55792j67013
$$ y = [-281296, -320689, -373925, -473912, -438035, -209504, -7352, -15525, -118287, -95388, 65489, 216178, 294080, 332733, 300703, 144107, -22770, 13816, 252370, 412917, 284383, -5669, -179361, -154966, -83016, -117226, -270205, -439479, -470107, -254094, 116548, 359107, 297277, 94313, 35214, 126444, 114923, -96498, -286630, -251901, -100470, -63813, -156142, -193623, -80364, 84694, 168501, 152075, 111259, 120610, 179524, 206895, 139732, 43200, 42511, 127428, 149843, 72894, 66856, 235463, 397877, 333702, 139177, 105543, 285429, 427261, 361302, 214021, 164101, 197302, 223176, 259386, 342983, 380259, 257469, 43701, -66412, 6010, 157992, 276313, 373855, 527631, 737332, 878477, 800151, 489326, 133534, -33479]
43421c3479O8900J39923M7668m8223o2363l0443K6619J17535J71458R2944n1430
43410D39109p8086L6007R7323j2306j63955k02072j66844j61025j46867m7814
43400d06530O3412P1569L8259J12877K60559K83950J25468m3470q0151m4781m1803
43389C39359m1259K5623J03170Q2158j9988p9383n1248k1244n7806j13742j18657
43378D6983r1507r3254j14739r1357j1029P4541J46065K28328K78243J76344q1674
43367D66944k80325k11719L4888J63264M5840j43820j95087r5953M6623J56540
43357a2805J71302L5089j66985k10992k1534J69339J23647n7357r9257K2545P3568
43346B6560n7295k17422k50589j66353j3869J82403L04590K01150l6183q9630
$$ y = [-33479, 35421, 175344, 223012, 174789, 112426, 81983, 108602, 226137, 397595, 490539, 439109, 361023, 397030, 494353, 482047, 318092, 116020, -50824, -211849, -358716, -406530, -343118, -271549, -233290, -120413, 140146, 424096, 549564, 506094, 425943, 381162, 339359, 298100, 323723, 426893, 509051, 489063, 409680, 358432, 337188, 279382, 165640, 46983, -44524, -137778, -252517, -343874, -354903, -280362, -134297, 94031, 372274, 548618, 466944, 186619, -25100, 9788, 173052, 218892, 75072, -120015, -215968, -169345, -12805, 158497, 193586, 26601, -184391, -205925, -36586, 87061, 29704, -69553, -47008, 26560, -30735, -248157, -498746, -665099, -678968, -496565, -191975, 9175, -27008, -116638]
43336a16638J49300L74340K70419n8118k67215k28826q2067N4599J72437K28389
43326D96620J52325J605q1526p7044r2867j67343k25902k35086k36886k14785
43316f80889q5322J39891L18470L41452K25809L7540j51027k27652j20635N7370
43306a44993R9606j3722p5579M1924J90348J53489n8594k31456j96461J5538K15125
43295d775K07396k3197k51026k25216K1787J95750J16557o0985q6461M9622J41541
43284H0993N5342j30638k40823j73632K3185J98221K37489J68542P9824k7954
43274B70549j90706l03571j88211J07259K77111J50346n7624m7088J51345K56041
43264D25451J38165n2581j30696p2160K9203P6197L5898k8436j8815N2931N8393
$$ y = [-116638, 32662, 407002, 677421, 619303, 352088, 123262, 41195, 95794, 268231, 496620, 648945, 650550, 569024, 491980, 399113, 231770, 5868, -229218, -466104, -680889, -766211, -626320, -307850, 33602, 259411, 296951, 145924, -81728, -202363, -144993, -45387, -59109, -134688, -92764, 97584, 251073, 192479, -38977, -235438, -219900, -4775, 202621, 179424, -71602, -296818, -275031, -79281, 37276, -23709, -110170, -60548, 80993, 136335, 5697, -235126, -408758, -385573, -187352, 50137, 218679, 298503, 270549, 79843, -223728, -411939, -304680, -27569, 122777, 65153, 18065, 169410, 425451, 563616, 511035, 380339, 308179, 337382, 413579, 449477, 421041, 402226, 455157, 513550]
43253E13550m8375j42765j34956j21987j95792k46657j48692j2585j8228q7231
43243f43718R112K50379L49118J59911j28290k58659j68502N4904K84859L68285
43233B77399K11589p3571k50209k26939j21756n0105r341J7088J7111L0599R7628
43222h0507J20983k0910k19363k28523m2558P5881K540q4357m0753K2115p113
43211e02565k7104O1517J62907J80516J75407J61108K693k69574l31409l3968
43201d20472K62837J78892q9380p8065J99649K95177N5574j77857j58597o4288
43191C470r1062j22401k1201P4740P308r7884m8411P2860M7176j12232j75521
43180d63158k4296K28136M03965L95906J91701q4275k10070j02279L9543j2037
$$ y = [513550, 465175, 322410, 187454, 65467, -130325, -376982, -525674, -538259, -556487, -643718, -634606, -384227, -35109, 124802, -3488, -262147, -430649, -375745, -90886, 277399, 488988, 415417, 165208, -61731, -183487, -233592, -242933, -225845, -208734, -178135, -80507, 40476, 19566, -199797, -428320, -470878, -394997, -392457, -476814, -517567, -495452, -502565, -529669, -468152, -305245, -124729, 50678, 211786, 214479, -55095, -386504, -420472, -157635, 21257, -68123, -146188, 53461, 348638, 404212, 226355, 67758, 3470, -87592, -209993, -231194, -156454, -149146, -247030, -295441, -222581, -175405, -287637, -463158, -487454, -259318, 144647, 540553, 732254, 647979, 437909, 335630, 375173, 363136]
43170C63136j71381j61870M5535J70413N8426q0908k9304O7710o2371l34990l72137
43159e07741n3731K87701L23296J28952k8791q6660j33363j33337j28J36703O3826
43148c273j17864o1712K80442N11786L50109L4518o3746J5924k1575k03503k76714
43137D44392j53553k7817k6472m7144j2455k1070j30656k06647j30411K349L6759
43126b72725p957q151M2937L5512o0964j32051p3575O6423J47222J10418M9612
43115a03299Q4348J91607K21080Q8401j11670k19217j75724l7970J02020J55324
43105A94900P3172p6444j36746m7577O2384M7291o8577j60127j66111q2755R8477
43094b62113L08120L55902J46169j32224k10186q1500L6185L5180J4252N8187
$$ y = [363136, 191755, 29885, 75420, 245833, 304259, 223351, 194047, 261757, 199386, -135604, -507741, -561472, -273771, 49525, 178477, 149686, 63026, -70337, -203674, -203802, -67099, -3273, -121137, -182849, 97593, 609379, 959488, 994006, 930260, 946184, 924609, 721106, 444392, 290839, 263022, 236550, 189406, 176951, 155881, 25225, -181422, -311833, -309484, -272725, -280682, -288833, -245896, -210384, -271348, -403399, -476974, -410551, -263329, -152911, -103299, -18951, 172656, 393736, 482137, 370467, 151250, -24474, -62444, 39576, 194900, 268072, 191628, 54882, 7305, 69689, 116980, 48403, -111724, -277835, -360590, -262113, 46007, 401909, 548078, 415854, 205668, 124168, 160353, 195533, 209785, 267972]
43084B67972J15457J13700M3865p7950k04271k34133j24501K0485R3073J25181
43074A38878J48669O1301j57088k64601q9208J14490J3494k23608j56514J73784
43064b40403K64328j4538j77586P8165L76338K84202l0026j58901r8287q9760
43054A93532j11584J0514J77146J42702m5809j24694m1393L6119M8857O0083K9007
43043C74480j07176k10500j18187M4057M0429p8739r1286j1295j4391m5550Q6087
43032a32071K74006K20768k7801j19832j0069l8627k81041l36982j177L31219
43022a21607K62910J899k6625J32302J13598j22452k57168j59949m8485p4886
43012c00463j07686k2807O9832L2003o5394o3238M1877J11501P1307m028o278
$$ y = [267972, 383429, 497129, 540994, 463044, 258773, 24640, -99861, -79376, 13697, 138878, 287547, 348848, 191760, -72841, -162049, -47559, -34065, -257673, -414187, -240403, 23925, 9387, -168199, -90034, 286304, 570506, 540480, 381579, 283292, 193532, 81948, 92462, 269608, 412310, 366501, 241807, 200414, 236533, 285390, 345473, 374480, 267304, 56804, -61383, -17326, 23103, -55636, -146922, -158217, -172608, -218158, -132071, 141935, 362703, 334902, 215070, 205001, 166374, -114667, -451649, -452826, -121607, 141303, 143202, 116577, 248879, 362477, 240025, -17143, -177092, -225577, -300463, -408149, -430956, -361124, -329121, -394515, -457753, -415876, -304375, -233068, -237096, -243374]
43001b43374P4255J53038J58889J06178N3831K1579j9093q3844j46589j69658
42991i4788j30921l4665O8253J00142N0872J9673Q8958J86143J65754J7684j07875
42980C29230r4514Q723O9876K4326o8076p7236N8787K13507J71749p3848k41656
42969C20868j17494J24177J61572o952j10418p6832j20228k97703l28787l7909
42959d89706L05206L37831J05342n3240L252J07205J04266L1094l9140j14294
42949B97816j85286j65587j4506J65301K27374J42929K0631j8467L8189R6992
42939F05386P0099l1223j21479j31920n7186M9190R5001K2548r1491q9271M4574
42928C64228J20849K1141r6664n1160L5154o8920k64436k22546P0449K40556R9964
$$ y = [-243374, -169119, -16081, 142808, 248986, 302817, 324396, 305303, 221459, 74870, -94788, -225709, -260374, -192121, -91979, -41107, -21434, 67524, 253667, 419421, 437105, 329230, 234716, 243439, 313315, 337641, 269565, 192329, 251116, 464623, 636372, 562524, 320868, 203374, 327551, 489123, 482171, 371753, 294921, 174693, -123010, -451797, -489706, -184500, 153331, 258673, 205433, 208685, 315890, 420156, 451250, 412110, 297816, 112530, -53057, -67563, 97738, 325112, 468041, 488672, 470205, 508394, 605386, 675485, 644262, 522783, 390863, 333677, 382867, 477868, 500416, 408925, 319654, 364228, 485077, 506218, 409554, 358394, 393548, 324628, 60192, -162354, -91905, 148651, 248615]
42917B48615o9249Q879J73604J33708o0122j52182j00150m7006r220J00211K19945
42906D47033K00454P3619O759J9269j5720j12470j50925j03144n7650k3775O4313
42895C47763J46878P9428r3865j43080K730J30339N9043j09239j77217j24793
42885A17987m8625L9799J76514K72061J68703j03273k76042j46049J50358K84471
42875F35904J45692l4541k2197J09981J55476J23623J82656L24077L76398L51332
42865B348401M36198N65496L84838j64965o06614n71475l45807l77040n32596
42856A136436l68641M6001J76412j20869l71671k37788K7289Q5394J4001K0367
42846D06931M6187j4662k0424J40624K29658N00l15884k81314P6608K66710L2367
$$ y = [248615, 179366, 188245, 361849, 495557, 435435, 283253, 183103, 136097, 126877, 227088, 447033, 647487, 721106, 727865, 747134, 731414, 618944, 468019, 364875, 307225, 283450, 347763, 494641, 574069, 480204, 337124, 339854, 470193, 529236, 419997, 242780, 117987, 69362, 109161, 285675, 557736, 726439, 623166, 347124, 201075, 351433, 635904, 781596, 747055, 724858, 834839, 990315, 1113938, 1296594, 1620671, 1997069, 2348401, 2784599, 3350095, 3734933, 3569968, 2963354, 2391879, 2046072, 1669032, 1136436, 767795, 813796, 990208, 869339, 497668, 259880, 287169, 372563, 386564, 406931, 453118, 438456, 418032, 558656, 788314, 788814, 472930, 191616, 268224, 534934, 567301]
42835E67301l11273l48278q7978J48231J76626R0701L4231J7696j9035p3601q1675
42824A12946k0894M8537O0889J5091n7827j39327j84460j09349Q5294K31536J64955
42813B07391m2458j54183p1568P0165J13741M7578n3672j16824q0765M1219J05003
42802F5627J81j36461p6488J24901J67410k3981j62360o4214M9919o0614k37431
42791c53511j82499N4427J77654J23930J05422K09494K66621J51871l2362j31979
42781C89068j06285K3104K12916L47142L02431J09643o8912j32982r6883K3366
42771A002608K10602L39703K53010j8450k55680l06744k15202r0891k129l899
42761I12928j08710k03823j53414k772P8792O0107N7201P3296k1769j94052k02163
$$ y = [567301, 256028, -92250, -180228, -31997, 144629, 235330, 269561, 287257, 268222, 194621, 112946, 92052, 140589, 201478, 216569, 158742, 19415, -165045, -274394, -189100, 42436, 207391, 164933, 10750, -60818, 9347, 123088, 170666, 116994, 170, -80595, -39376, 65627, 65808, -70653, -147141, -22240, 145170, 121189, -41171, -105385, -55466, -116080, -353511, -536010, -481583, -303929, -179999, -74577, 134917, 401538, 553409, 521047, 389068, 282783, 305887, 518803, 865945, 1168376, 1278019, 1209107, 1076125, 979242, 1002608, 1213210, 1552913, 1805923, 1787473, 1531793, 1225049, 1009847, 918956, 916827, 912928, 804218, 600395, 446981, 444209, 523001, 583108, 640309, 713605, 691836, 497784, 295621]
42750B95621J8757J88943Q4603j22973j52124l1664K8176J9084P8861J57683P6058
42739F41025j13406j52179P67P8504p2198k51821k21561k9891J21556J51051Q8407
42728B40254l7528j49516j14292N6376J45569M1309n3202O7769K43958J76229
42718F16926p7506j69915j5891P9707o2004j87177k1560K66535K90261m207k81530
42707D33639k74321p0623P4422M3555p4713j16220P11J87642K55336J24039o4255
42696E19212j13951j6797P0470N9970K5866N6205J20315J23826K7728j18210k14363
42685E40271j75957j2793J47317J65649L4374j22266j79742j10882J9982J05377
42675D11330O3072p8496j81551j47173l5526K8570K8212L6177N8239K2795p0278
$$ y = [295621, 314378, 503321, 587924, 464951, 312827, 281163, 309339, 328423, 407284, 564967, 641025, 527619, 375440, 376207, 454711, 382513, 130692, -90869, -120760, 796, 151847, 240254, 202726, 53210, -61082, -4706, 140863, 182172, 128970, 196739, 440697, 616926, 539420, 369505, 353614, 433321, 371317, 184140, 162580, 429115, 719376, 715169, 433639, 159318, 88695, 163117, 206672, 131959, 15739, 16450, 204092, 459428, 583467, 519212, 405261, 388464, 458934, 518904, 544770, 600975, 721290, 845116, 872844, 754634, 540271, 364314, 351521, 498838, 664487, 698861, 576595, 396853, 285971, 305953, 411330, 474402, 395906, 214355, 67182, 31656, 60226, 88438, 124615, 182854, 205649, 135371]
42664A35371j21613q9619n7425q2567q3749L3362K05217K66473J56868j0588r5234
42653B56496p7837l1428J1987R3200K09885K47380J12409r5497j64037l8470J06217
42642F30305J12475L6308J0349K9189K076o2227p4162l1161k9068j09983k02963
42631C11138k17712j28453J4392J04226O2226m6332o0126N4128J37074P6565k5753
42620B81373l9712n064K75K5543R8750Q6130p2695j60267Q593K25033J63901r4443
42608E17417j86402l3172J06197J14416J29699J61611K7087k41397l34413j47224
42598A13819M7688M9830r540o336m7427j62638j33116J36052L83497L69273K04912
42587I46014R0291J0413q0172o4721R2838J83573Q0266l5594j2415o918j57519
$$ y = [135371, 13758, -75861, -133286, -215853, -299602, -266240, -61023, 205450, 362318, 351730, 256496, 178659, 147231, 159218, 252418, 462303, 709683, 822092, 726595, 562558, 524088, 630305, 742780, 779088, 789437, 818626, 820702, 758475, 684313, 653152, 624084, 514101, 311138, 93426, -35027, -20635, 83591, 145817, 99485, 39359, 93487, 230561, 307126, 281373, 241661, 236597, 236872, 262415, 361165, 447295, 374600, 214333, 222926, 447959, 611860, 517417, 331015, 297843, 404040, 518456, 648155, 809766, 836853, 595456, 261043, 113819, 161507, 211337, 201797, 195461, 148034, -14604, -147720, -11668, 371829, 741102, 946014, 1036305, 1046718, 966546, 901825, 994663, 1178236, 1258502, 1222908, 1210493, 1203575, 1046056]
42576A046056k72276j53250L0248K1105j01682j03682P665Q0702J15575J58204
42566H28665J01191j02121k26330q5217J42810J96196J20158P7179J8121j21481
42556I49171j54136N2583K40987J34284q2957p0867R6827J11604j7348m8235J7981
42545A229894j859q1629q2566p9798j69264j47595J53823M28361L00671k3764
42535A526274o4344J59100K40896J28009J28490K84641L44502K78797K43933J40612
42525C410910j86591m52085k94638J0917o0737l38449k28952J65108J51934l08683
42515A868734m81697j31150R6630j48770l46367j12204J38597L5054p9535J29174
42505I68466L37391K04831J817M1933J02622n4151j70776k1800J19958M3757M2431
$$ y = [1046056, 773780, 620530, 650778, 671883, 570201, 466519, 474184, 554886, 670461, 828665, 929856, 827735, 601405, 516188, 658998, 855194, 975352, 1052531, 1070652, 949171, 795035, 847618, 1088605, 1222889, 1139932, 1069065, 1165892, 1277496, 1260148, 1211913, 1229894, 1228035, 1146406, 1063840, 984042, 814778, 667183, 821006, 1249367, 1550038, 1526274, 1461930, 1621030, 1861926, 1989935, 2118425, 2403066, 2747568, 3026365, 3270298, 3410910, 3224319, 2772234, 2477596, 2488513, 2427776, 2089327, 1860375, 2025483, 2177417, 1868734, 1387037, 1255887, 1352517, 1203747, 857380, 745176, 883773, 918827, 839292, 968466, 1305857, 1510688, 1512505, 1554438, 1657060, 1602909, 1432133, 1410333, 1530291, 1574048, 1616479]
42494A616479K89781L79646L2277l21549k31688M6252Q2606q538M8471J17396
42484B051133K4632o404J63935K10740l0347j39697J41855L73746K01813J4694
42474C006100J76601L02658J7938k54015m8183K63779J78320j0627J52531L70681
42464D155783K17582L0134K36353M39461J59940j55691R8548N57918N87484M47731
42454F775243O58955R10050P64218O89455J139039J437828R47587M33038P54645
42445A4510058J201508Q53070N22454J334320K475247K674473K790700M257598
42437C0619428O156936P026703Q359155J2427876J7910241K2694313K9786653
42430A34981305M2745510N3855153M6063079J3176444k7709379n1699097n1173888
$$ y = [1616479, 1906260, 2285906, 2318183, 1996634, 1764946, 1811198, 1893804, 1885266, 1933737, 2051133, 2075765, 2069361, 2233296, 2444036, 2413689, 2273992, 2415847, 2789593, 2991406, 3006100, 3182701, 3485359, 3503297, 3249282, 3201099, 3464878, 3643198, 3632571, 3785102, 4155783, 4373365, 4403499, 4639852, 5079313, 5239253, 5083562, 5182110, 5740028, 6327512, 6775243, 7434198, 8344248, 9108466, 9797921, 10936960, 12374788, 13322375, 13755413, 14510058, 15711566, 16564636, 17087090, 18421410, 20896657, 23571130, 26361830, 30619428, 36776364, 43803067, 52162222, 64590098, 82500339, 105194652, 134981305, 177726815, 231581968, 277645047, 290821491, 263112112, 211413015, 160239127]
42423A60239127l8737504k8225503k1798109j5928919j0602409p831031o673334
42416C0442318m909292k964415k420061k630344j953021p70383n27811r99743
42408A3267248r58151n46561p43906j275264j123574m89651l56117o22873m31598
42399F719553J01034J59751j17353J07218P23341Q76228O66850J061654K113715
42390A2411991K885246L344524M656214O886588P827947N283636j09940n286895
42382C7899311p703780p255159n533313l977196k964323k232967j614874j156625
42374E461074q04380m05757n1650j8011k46488k98289l0141J20065j73608n68750
42364B984065n85380l20218j75853j90895j36790l8514q1297j60060j9498K52064
$$ y = [160239127, 121501623, 93276120, 71478011, 55549092, 44946683, 37115652, 30442318, 25533026, 22568611, 20148550, 17518206, 15565185, 14794802, 14266991, 13267248, 12309097, 11762536, 11018630, 9743366, 8619792, 8130141, 7774024, 7151151, 6719553, 6820587, 6980338, 6862985, 6970203, 7693544, 8569772, 9236622, 10298276, 12411991, 15297237, 18641761, 23297975, 30184563, 38012510, 43296146, 43186206, 37899311, 30195531, 22940372, 17407059, 13429863, 10465540, 8232573, 6617699, 5461074, 4656694, 4250937, 4199287, 4181276, 3934788, 3636499, 3606358, 3726423, 3552815, 2984065, 2398685, 2078467, 1902614, 1711719, 1574929, 1536415, 1455118, 1295058, 1275560, 1527624]
42354A527624L21047J43553K688M9357J49477J51378K1008k19820m47589m51896
42344A246827k24521n4170r9098j16530R3094K73167J30850j10629n0001K16325
42334A305314K64218M6807p7285N6553K63439L99136M60008L46249k7514m19152
42324B617773m91649l28435k86891l83965l04178j3308J41879J4685j37366j36803
42314F91742j27008j92979j66343J6295J39199Q1572K9600J22223J91508O3320
42304H49129j41462k11053j44336p3385n0291m9700m8990j9796M0231N2574j8801
42293A84120l7714R9695K08804N9792j87556j66774R1388J73429l4232j49266
42283B41686M8851K28983O2390k27960k41071l1843L2944j18878j95156k1599
$$ y = [1527624, 1848671, 1992224, 1994912, 2044269, 2193746, 2345124, 2366132, 2146312, 1698723, 1246827, 1022306, 968136, 869038, 752508, 845602, 1118769, 1249619, 1138990, 1088989, 1305314, 1569532, 1616339, 1539054, 1595607, 1859046, 2258182, 2718190, 3064439, 3036925, 2617773, 2126124, 1797689, 1510798, 1126833, 822655, 809347, 951226, 965911, 828545, 691742, 564734, 371755, 205412, 221707, 360906, 442478, 472078, 594301, 785809, 849129, 707667, 496614, 352278, 278893, 228602, 178902, 129912, 110116, 150347, 202921, 184120, 146406, 246101, 454905, 514697, 327141, 160367, 251755, 425184, 390952, 241686, 290537, 519520, 581910, 353950, 112879, 81036, 113980, -4898, -200054, -221653]
42273b21653K27261K98509J46708p3769j66994n1924J50142K21902J01444n0800
42263E80826q5396m4949m1080q0367j06277j02041o7014L894N5727J2631o9212
42252E6742m2695P9149J00502l9998j32370j4013J58591J33972p4629k34297k06441
42241b15487n7585Q0338J32545J08627Q7173J22268J41761M4056r7474r9082K9716
42230B76856O2319q3738j93483r3828P8919J21963O9250N1651M0226m3574j13708
42219A72853n3951N1085M8644k0160j5900L4896L872q2553q2897R149O7470M8533
42207A81041Q341m8654j41021j79518o9059R7547J47891R2587P7715J18845J00556
42196C86271Q818o0322r8839j62096j71459l42K40951K79697P7790j10901j32763
$$ y = [-221653, 5608, 304117, 450825, 377056, 210062, 158138, 308280, 530182, 631626, 580826, 495430, 450481, 409401, 329034, 222757, 120716, 53702, 57596, 113323, 125954, 56742, 14047, 93196, 193698, 153700, 21330, 7317, 165908, 299880, 225251, -9046, -215487, -273072, -192734, -60189, 48438, 135611, 257879, 399640, 443696, 346222, 247140, 276856, 339175, 255437, 61954, -31874, 47045, 169008, 238258, 289909, 330135, 286561, 172853, 118902, 169987, 218631, 198471, 182571, 217467, 221339, 138786, 55889, 65038, 132508, 181041, 189382, 140728, -293, -179811, -248870, -151323, -3432, 89155, 166870, 285715, 386271, 395089, 334767, 235928, 73832, -97627, -97969, 142982, 422679, 500469, 389568, 256805]
42185B56805j09270j39377j14226L3027J48965J01817j1030o1454r2445j52926
42175a40114j40359n019Q8854K8794j3105J26697K61177J25970j41045j65338
42165B6512Q0951K55144K08615J54071J72675r07m54044p41481m41789J68664
42155e71589M32002J98313m1311O7989K71143J84974r7394j88803m668J52088
42145D02744O1873j36334j96263q4936N2638J15474J07778M3544q2252k17946
42135F6320k39998p5522J75970K99940J84024m2334j38105k4280J34317J44910
42125D85242J0147j25340j81316j86466j48095j7312J72778K48891Q0457k20079
42115A18907l79832k63798k0656J12019R5767R5546J96290K39761M9327k60572
$$ y = [256805, 147535, 8158, -106068, -73041, 75924, 177741, 166711, 105257, 12812, -140114, -280473, -285492, -196638, -167844, -180949, -54252, 206925, 332895, 191850, 26512, 107463, 362607, 571222, 725293, 897968, 897061, 443017, -298464, -740253, -571589, -139587, 58726, 17415, 85404, 356547, 541521, 444127, 255324, 250656, 402744, 464617, 328283, 132020, 47084, 99722, 215196, 322974, 366518, 284266, 66320, -173678, -249200, -73230, 226710, 410734, 368400, 230295, 206015, 340332, 485242, 495389, 370049, 188733, 2267, -145828, -163140, 9638, 258529, 338986, 118907, -260925, -524723, -545379, -433360, -337593, -242047, -45757, 194004, 243331, -17241]
42105a7241l74043j83024P3697J55117J22958J57653K23860J44739n9485j55522
42095H8709m2003J02422Q8450l4687r6145m5263K7877L6603k1862q5286q2949
42084f4134j9097l809j20755k67584k46008k9942J88435K57680K25919J77277
42074I7982P1842j28125k99373k83869j11458M0136P3558M7700N1753J04182J66643
42063a69029J84125J24140K6178k2022l549r037q8458j32658p446K23198L19560
42052D45002J37811j85991l63337k49738J0339J51128Q5465k4834k3602K2434
42042D677k8543j25641r6667M8614J12111K9695l0387L4940R4269K8434o2577
42031H925n1809k220k2354o5129m5218j2485l5732n8427m0400p4723j69606j13140
$$ y = [-17241, -391284, -574308, -500611, -345494, -222536, -64883, 158977, 303716, 244231, 88709, 46706, 149128, 237578, 202891, 106746, 61483, 89360, 125963, 104101, 18815, -64134, -83231, -87040, -207795, -475379, -721387, -751329, -562894, -305214, -79295, 97982, 169824, 41699, -257674, -541543, -653001, -612865, -539307, -491607, -439854, -335672, -169029, 15096, 139236, 165414, 143392, 139843, 130806, 42348, -90310, -97756, 125442, 445002, 582813, 396822, 33485, -216253, -205914, -54786, 30679, 5845, -17757, 4677, -23866, -149507, -246174, -197560, -85449, -55754, -86141, -51201, 43068, 71502, 8925, -42884, -45104, -67458, -132587, -177805, -190290, -226022, -284449, -324849, -399572, -569178, -682318]
42019f82318J83010L96938J95182k14087l16952k7154K26330J68691K1425N3072
42009D137J59990J07844p6292j82106j18237M1170J81331J92638L0078j68827
41999A71726j78117N804J19120Q686j34640p6466J01675J44443O623j12722o6281
41988a0149Q2299J76452J28419j5074j01725k4809J11096Q5179j19356k45504
41978F6828j23666O6231O8396o0730p2100O0250J16806J6428n1347M2807J39576
41967B69479M9065j21673j03924J24992K75872J41241j04931j37356O9736K08305
41957F70806P5271j47365j74519k4625N6984j0542p7265o9532r5091j83004j76456
41946a55338q735J38534J12594K7956M0136O1420o3087k30427j99734K6202J97542
$$ y = [-682318, -499308, -102370, 92812, -121275, -438227, -465381, -239051, -70360, -48935, 4137, 164127, 271971, 195679, 13573, -104664, -63494, 117837, 310475, 340553, 171726, -6391, -587, 118533, 127219, -7421, -83887, 17788, 162231, 168854, 56132, -10149, 72150, 248602, 377021, 361947, 260222, 235413, 346509, 431688, 312332, 66828, -56838, 9393, 77789, 17059, -55041, 5209, 122015, 138443, 87096, 129903, 269479, 318544, 196871, 92947, 217939, 493811, 635052, 530121, 392765, 462501, 670806, 746077, 598712, 424193, 399568, 456552, 446010, 368745, 299213, 204122, 21118, -155338, -164073, -25539, 87055, 115011, 155147, 216567, 153480, -76947, -276681, -250479, -52937]
41935e2937J81416R2450M4468J44p1025q2092K1645J35795J20902k1904j63504
41924B05358j82579o2769R2504J42026O1205j5048J6864N5910m6769k03071j62556
41913i8925R9236K77323J31872j75453k91655j17499J21794K05815J52057R1912
41903C96477M7139o7964k55826l52693k04417J03252K85539J75088p4917j82537
41893a30859p6865O3133Q2425K7659K3913R2815J58805J59118Q2272n1428j90835
41882B40153k67173k45475j44230k145J30050J75702R6281j4843m939J23432J74202
41871B61015K0340j84518j84988K8191J93952J20881p7726j54630m2285J02822
41861H3054J28254M8794l2531p2854r7725j14162r4795l9261J3251L7136L3745
$$ y = [-52937, 128479, 220929, 265397, 265541, 194516, 112424, 134069, 269864, 390766, 368862, 205358, 22779, -39990, 52514, 194540, 255745, 240697, 257561, 313471, 266702, 63631, -98925, 311, 277634, 409506, 234053, -57602, -175101, -53307, 152508, 304565, 396477, 443616, 375652, 119826, -232867, -437284, -334032, -48493, 126595, 51678, -130859, -207724, -144591, -62166, -34507, -10594, 82221, 241026, 400144, 482416, 430988, 240153, -27020, -272495, -416725, -418870, -288820, -113118, -16837, -31680, -36619, 86813, 261015, 281355, 96837, -88151, -59960, 133992, 254873, 177147, 22517, -19768, 83054, 211308, 260102, 227571, 154717, 56992, -57170, -151965, -191226, -177975, -140839, -107094]
41850a07094m143p4297j11159m0604Q4881J05856l0197j65659j24577O7686K41534
41839a57773K83065J83531j7806k09394k16660j0866J57918M7068k00530k22119
41829c63566J4052J35424m8998k14416j5322L41191L65218M89l05611k46727j7536
41818c55802P0702K5452L2337J03023J06345L2922n861K180m0028j29488j33883
41807b92101j6007P4858J8949q8057p0357Q2729K14192K04037Q0357n9169j48316
41796A115j65918j20561n1552p177k42j219K8081J12185K46676L62848L37870
41785G42106J15822j80744l34284k49436l5011J34423J69303P4636q7528k00320
41775A48967j55133J0819J14476M7952o7194m5929R4214J55669L3945j49970k11121
$$ y = [-107094, -111237, -185534, -296693, -337297, -252416, -146560, -176757, -342416, -466993, -399307, -157773, 125292, 308823, 291017, 81623, -135037, -145903, 12015, 59083, -141447, -363566, -349514, -214090, -263088, -477504, -492826, -151635, 213583, 214072, -91539, -338266, -355802, -285100, -259648, -227311, -124288, -17943, 14979, 9118, 11298, -28730, -158218, -292101, -308108, -233250, -214301, -302358, -372715, -289986, -75794, 128243, 208600, 149431, 1115, -164803, -285364, -336916, -344093, -344335, -345554, -317473, -205288, 41388, 404236, 742106, 857928, 677184, 342900, 93464, 58453, 192876, 362179, 436815, 349287, 148967, -6166, 4653, 119129, 167081, 99887, 53958, 148172, 303841, 337786, 187816, -23305]
41764b3305j08019M0194Q7295o292j35757j51815k7833J07650J44362J26227J35949
41753A88656J28958J9876j22749j41163l0284O8159J16867K18723L56760L31350
41743A135153P4204j83838k23337j39121j40757k06577j73810o2110l6028r2965
41733d9186o2644P5755J38108M5780n1148l7576P640J3892N3656J44910J40235
41722D19422j3154j07391J2808J47698K2531k55750l30513j32069L6568k4955
41712b24805j52862j24872K5726J31613J31588N9422m7559j13986m9565R1651
41702b73649J30856L8000J124J07343J70173M3374j12271j01575k9681q3477j57015
41691b66798l9000J49998J02153j39716j99416M2170K73173K63172J63621J43867
$$ y = [-23305, -131324, -91130, -3835, -10127, -145884, -297699, -325532, -217882, -73520, 52707, 188656, 317614, 337490, 214741, 73578, 43294, 111453, 228320, 447043, 803803, 1135153, 1209357, 1025519, 802182, 663061, 522304, 315727, 141917, 79807, 43779, -49186, -111830, -36075, 102033, 147813, 96665, 59089, 66729, 80621, 134277, 279187, 419422, 406268, 298877, 311685, 459383, 481914, 226164, -104349, -236418, -199850, -224805, -377667, -502539, -476813, -345200, -213612, -154190, -201749, -315735, -365300, -273649, -142793, -104793, -103669, 3674, 173847, 217221, 104950, 3375, -26306, -109783, -266798, -305798, -155800, -53647, -193363, -392779, -350609, -77436, 185736, 349357, 493224]
41681D93224R8690o0297j50206k6237J21526O8707o8520n5328N6335N4017n8763
41670D73148j25390j46708k11060k25026n0766J68177J69692J3598q046J11923
41660A69542O7034k10917l70558j72562J35046J90823R611j36853j34086p4908
41650e27828j8092O9982J75838K16836J58055M9421m5529r5635r3884m6228K8366
41639a28698Q0131K4702j52131k62092o1050L54889N14537J67912k84364l01893
41629d8057J3700J01817j59841k87269p393L09316K70540L1611p6342p0220r6379
41618a8517n2283J51623K50220J180l21138k76731N7592K20994O8451j25246j87696
41607b31551k06242j83152K832K47582K62340M3311q5519J4143J10659L5216o4121
$$ y = [493224, 591914, 531617, 381411, 355174, 476700, 545407, 476887, 421559, 477894, 531911, 473148, 347758, 201050, -10010, -235036, -285802, -117625, 52067, 65665, 57619, 169542, 236576, 25659, -344899, -517461, -382415, -191592, -181981, -318834, -452920, -527828, -545920, -475938, -300100, -83264, 74791, 124212, 78683, -16952, -110836, -157064, -128698, -48567, -23865, -175996, -438088, -499138, -144249, 370288, 538200, 253836, -48057, -34357, 67460, -92381, -379650, -387043, -77727, 192813, 224424, 148082, 77862, -18517, -70800, 80823, 331043, 332223, 11085, -265646, -208054, 12940, 81391, -43855, -231551, -437793, -620945, -618113, -370531, -108191, -64880, -150399, -136256, -25597, 9619, -54502]
41596e4502l6585L4607N7578R3253J49130J01067m0552p7449K1940J9140j75413
41585I2214k90100j12306J58970K17025O1822j18229k41316k71462j02179K26284
41575c79277M04097K34646m2135r7858n237n2588k21118k22350O978K05539J90942
41564B1639O7241P22K6595R6346J23216N562k07231k49680K5838L41860L12755
41553E64863l076k05712j66821j41339k33359j93252Q9612K96048J47048j44738
41543I274k00084k2235R9482P2198M7683O6320j5027k16354l22887j67944J35318
41532e14256L21882K44614j0460k07375j67239M0065J50203K6403j48452j20595
41522c85210P8527K03314J66889J13533J09367K0194j96092l11573j40675J31089
$$ y = [-54502, -91087, -56480, 1098, 94351, 243481, 344548, 303996, 226547, 248487, 267627, 92214, -197886, -310192, -151222, 65803, 127625, 9396, -231920, -503382, -605561, -379277, 24820, 259466, 217331, 119473, 114236, 61648, -159470, -381820, -374842, -169303, 21639, 88880, 89602, 116197, 212543, 335759, 341321, 134090, -115590, -89752, 252108, 564863, 561787, 356075, 189254, 47915, -185444, -378696, -289084, 6964, 154012, 9274, -190810, -213045, -113563, -41365, 6318, 72638, 57611, -158743, -481630, -649574, -514256, -192374, 52240, 41780, -165595, -332834, -292769, -142566, -116163, -264615, -385210, -306683, -103369, 63520, 177053, 286420, 306614, 110522, -201051, -341726, -210637]
41512b10637J75660k069q7145M5824J39859k4563k61895k48191k959J57176R0721
41501b28219j3091K0557J09671J22475J01343J16614P9586r0457k45157j90394
41491b17072j1024L6743p7846j30122j8045R2881O8144L330J9506P4364R9931
41480e9210J32032J71740J14595l1855o2163J09634K43278J10961j34854k01126
41470C93032j11268j09744k13621k05754l9190R4088J07880J07235J04716o008
41460A21366j41122o2188J75385J97887r3818l03293j56830M9809l1658j93767
41450d38229l9245L03134L61169R1927p5428L5566J12129n1685k05710r7488J18594
41439A14734J78909J08347O0812J9149p4491j00320L7880J48579j1780l25694
$$ y = [-210637, -34977, -37046, -124191, -78367, 61492, 36929, -224966, -473157, -476116, -318940, -228219, -241310, -220753, -111082, 11393, 112736, 229350, 308936, 218479, -26678, -217072, -228096, -191353, -269199, -399321, -417366, -324485, -256341, -253011, -233505, -159141, -59210, 72822, 244562, 359157, 327302, 265139, 374773, 618051, 729012, 594158, 393032, 281764, 172020, -41601, -247355, -286545, -192457, -84577, 22658, 127374, 121366, -19756, -81944, 93441, 291328, 197510, -105783, -262613, -212804, -244462, -438229, -477474, -174340, 186829, 278756, 203328, 238894, 351023, 299338, 93628, -3860, 114734, 293643, 401990, 462802, 481951, 407460, 307140, 345020, 493599, 481819, 156125]
41429A56125m21714j76061J33681K01983L4452j37415j47512l3714N6474N0499
41419b83202K3229O2001J08694M7599p4907r1125R282M9235k4486l5469R9210
41408a09939J89262R5831o833O0340J29589m3821l17850l24970k5458K41731K45500
41397A33382R0571m7915j24741j28312m8897J9278k3700p9124J1867J50652J00441
41386E3502q6791j14017N1566R6328j07140k72314j74344J2943P2350Q4968J52198
41375b30751J10448j45213l34317j66258J69256K76790J57019J24165K28947K00706
41365C90792m3421k39574k00881o3318l210J3021P5261J43704J37214N6904n2719
41354B13773j42699j42095m1209K5102m9769j24698P751K41228K43306l4941k45739
$$ y = [156125, -265589, -441650, -307969, -105986, -71534, -208949, -356461, -390175, -333701, -283202, -259973, -197972, -89278, -41679, -116586, -207711, -198429, -149194, -173680, -209149, -109939, 79323, 175154, 168321, 228661, 358250, 314429, -3421, -328391, -353849, -112118, 133382, 223953, 176038, 51297, -77015, -125912, -106634, -130334, -209458, -197591, -46939, 53502, -33289, -147306, -95740, 588, -106552, -378866, -553210, -540267, -467917, -382949, -230751, -120303, -265516, -599833, -766091, -596835, -320045, -163026, -38861, 190086, 390792, 347371, 107797, -93084, -156402, -159612, -146591, -71330, 72374, 209588, 266492, 213773, 71074, -71021, -112230, -87128, -136897, -261595, -253844, -12616, 230690, 195749, -49990]
41343d9990j58922R216k1794j41930n5675K13810L29421J17816k06336l33938
41333b98322k06635l985J02338J01671Q8971J16055J29700O6360l5430q3406o9587
41322i2270o5590q2906n3352K7416O3779K1709K334P3263J40987R8518M252j6103
41310A22037K0359j1870j23514j62973k3467J98316L00011J87418l6278j74492
41300B95547j27634O898M5315n5614j33356l5763J48883J82554l091j95535j69814
41289d1610K3021J39618O6486p4222j40723j40796j20406l4903J29007K16830
41279B2302Q7856j24466j56037l648P6640k387j9338J49654K78352J57948l5030
41268D31846k1965J21419J18621l6048j17338r7581j50649k47762j53770J12821
$$ y = [-49990, -208912, -199696, -221490, -363420, -419095, -205285, 124136, 241952, 35616, -298322, -504957, -508942, -406604, -304933, -215962, -99907, 29793, 96153, 60723, -22683, -92270, -157860, -240766, -294118, -266702, -202923, -181214, -178880, -105617, 35370, 133888, 138140, 122037, 142396, 130526, 7012, -155961, -179428, 18888, 318899, 506317, 470039, 295547, 167913, 174811, 220126, 164512, 31156, -4607, 144276, 326830, 323739, 128204, -41610, -18589, 121029, 187515, 113293, -27430, -168226, -288632, -323535, -194528, 22302, 110158, -14308, -170345, -173993, -97353, -99740, -119078, 30576, 308928, 466876, 431846, 409881, 531300, 649921, 613873, 496535, 398954, 248305, 543, -153227, -40406]
41258d0406K12945J7365j58156m7102J53028J10563j40758l02446k40824o4973
41248e00764J00224J95349J77437Q1658M5725J16086J40784J1982j19657o5218
41238A83606Q6811R2151q8772k58628k64394j33493K8302J21149Q3640k5009m5545
41227b20182N8460J13317J3892o4544N9306K34031J81570n8281j89818j18918
41217H833l7597n1742l9857N4768Q1001n4794k09332k13633q8836M7383J28415
41206c75391J14388q231j19893l9674J94937K96800J06672j57535j84953K0742
41196a52138J91709J71005N6211p842j6704m7134j11971j41811q7100P981N6723
41185h1071M0761K1551K9581J3905n1026q9267l6481M4481O3212M6591O5000Q5904
$$ y = [-40406, 172539, 189904, 31748, -15354, 137674, 248237, 107479, -194967, -435791, -500764, -400540, -205191, -27754, 53904, 99629, 215715, 356499, 368481, 248824, 183606, 270417, 362568, 273796, 15168, -249226, -382719, -354417, -233268, -149628, -174637, -220182, -161722, -48405, -34513, -99057, -39751, 194280, 375850, 317569, 127751, 8833, -28764, -80506, -120363, -65595, 15406, -39388, -248720, -462353, -551189, -503806, -375391, -261003, -269234, -389127, -428801, -233864, 62936, 169608, 12073, -172880, -152138, 39571, 210576, 266787, 258945, 242241, 195107, 83136, -58675, -145775, -137794, -81071, -40310, -18759, 10822, 24727, -26299, -115566, -152047, -107566, -44354, 2237, 67237, 153141]
41173A53141M6076M862N3731J19453M8389j33234k37863j94249j14858p6641k8326
41162c59519N7338J19690J27955J04248L3101q0448j02631N5848K03586Q7780
41152B46948j74692k24772l4245M6543j02268j56455O6775K52246J18336q6771
41142d8355j0041J99135J54374j12096k26382q4361O0661O9274N9557Q1400K7594
41131A70760r0711j10502j0522M8774J7200J3394N9199K8356r5162j63753j14044
41120b47011k9404O2648J99063K78601J42575j09014j89837p1000k8115j62037
41110a53531k23644o1996R9070M5375p0406j1306J52817K06719J41365P6559L703
41099B04725j22086j76282l3057J62951J67158Q598o9093N265O4548J8170k0428
$$ y = [153141, 199217, 204079, 257810, 377263, 425652, 292418, 54555, -139694, -254552, -331193, -359519, -302181, -182491, -54536, 49712, 82813, 2365, -100266, -44418, 159168, 246948, 72256, -152516, -186761, -140218, -242486, -398941, -332166, -79920, 38416, -48355, -58396, 140739, 295113, 183017, -43365, -127726, -67065, 2209, 61766, 143166, 170760, 80049, -30453, -40975, 7799, 24999, 38393, 97592, 125948, 30786, -132967, -247011, -276415, -213767, -14704, 263897, 406472, 297458, 107621, 36621, 8506, -153531, -377175, -439171, -340101, -294726, -365132, -376438, -223621, -16902, 124463, 201022, 204725, 82639, -93643, -126700, 36251, 203409, 212007, 142914, 148179, 212727, 230897, 210469]
41088B10469K9283O0118m6171k18475k69041j19091R7356J59054M472j69275j38139
41077c99440M1823J18839M0228K0316J32760J33011j10384k96953j26389J73966
41067b72223J56239j42836k51679K442K60711K17866K6878m2317P618N9239J24796
41056A46734K00743J38481q5067j93385Q902K63336J81710j76555l82861k48460
41046a46422k8638R640p5185r4125k0035N8716J12118J47292J19623J300j25488
41035d1204j57955j10401o3064j6607Q4173J96082J85277L6783o6232J9167J57865
41024B23884R5537j57763k91118j16861J46059J76036L167p6851J7043M9549r9960
41013c1278j97915k0677K64739L23012J18715q8647j42529j21506r1684L444J43253
$$ y = [210469, 239752, 299870, 253699, 35224, -233817, -352908, -255552, -96498, -92026, -261301, -399440, -357617, -238778, -198550, -178234, -45474, 87537, -22847, -319800, -446189, -272223, -115984, -258820, -510499, -508057, -247346, -29480, -2602, -44919, -37301, 21938, 146734, 347477, 485958, 400891, 207506, 216408, 479744, 661454, 484899, 102038, -146422, -175060, -165420, -240605, -334730, -354765, -296049, -183931, -36639, 82984, 84284, -41204, -199159, -309560, -372624, -389231, -305058, -108976, 76301, 113084, 46852, 66019, 223884, 319421, 161658, -129460, -246321, -100262, 75774, 78941, 2090, 19133, 68682, -31278, -229193, -249870, 14869, 337881, 456596, 367949, 225420, 103914, 12230, 15674, 158927]
41002A58927J56375k7803k25707k38991j20912n6541p5118n0758N5495J25307
40992b99726P1130l8352q6595n0747J2949N2603L8381m0316j31159j22180K7074
40981e66938J82565J66830P587n6214J14277L34987L12506L6918j93940j64569
40971A74009m89M9922l7159q1267m780N2938m1208k03541k27390l9505K03401
40960a55069K80462J46701k0531m2795K2719l5779k50766l68069j86514J15969
40950d93672J84395l6043k36059j67731P6010K70498L44212L31738K14378j3226
40940D74500k15468k36269j11846j9871l7155p3749l7422N2022J19157J15910
40930B9809M6653k5340k0966M1695L3300r7623j95375r6393J01273J51029J7826
$$ y = [158927, 315302, 287499, 61792, -177199, -298111, -354652, -429770, -480528, -425033, -299726, -228596, -266948, -353543, -404290, -391341, -338738, -300357, -340673, -471832, -594012, -566938, -384373, -217543, -209956, -266170, -151893, 183094, 495600, 532518, 338578, 174009, 173520, 223442, 186283, 105016, 100236, 153174, 111966, -91575, -318965, -358470, -155069, 125393, 272094, 251563, 208768, 231487, 195708, -55058, -423127, -609641, -493672, -309277, -345320, -581379, -749110, -673100, -402602, -58390, 273348, 487726, 474500, 259032, 22763, -89083, -108954, -146109, -219858, -257280, -205258, -86101, 29809, 76462, 51122, 30156, 71851, 105151, 7528, -187847, -284240, -182967, -31938, -14112]
40919a4112q9816p2518p8903j86972j92189P3677L84794L62283J2257k55640j74998
40908b32137O3829J41771L2086p3553j00110j24156j37660j8017K21863L52048
40898A25964K12405m5062j42617l5954O3714L340j31991j80836j07134K4496J53061
40887f0614K09245J10314j02199k04111l7241K21179K29130o1653l13425k46958
40877b56333M371J24805N3690m877O6061J56107J47129P6717J9501l6894j06019
40866B44258j18891l8987L1140j8680j29922j54864o8664K8580R0349J49285J65610
40855A79214L4813j87631k49296k7857K37247K23257m0921k21354j37318M6394
40845a43452J22928J14936J26299J13207j0999j60777j73779o6131M923J0138
$$ y = [-14112, -103928, -176446, -255349, -442321, -634510, -560833, -176039, 186244, 198501, -57139, -232137, -168308, -26537, 5549, -68004, -168114, -292270, -429930, -447947, -226084, 125964, 338369, 293307, 150690, 114736, 178450, 181790, 49799, -131037, -238171, -213675, -60614, 148631, 258945, 156746, -47365, -84606, 136573, 365703, 304050, -9375, -256333, -251962, -127157, -73467, -78344, -12283, 143824, 290953, 367670, 387171, 350277, 244258, 125367, 86380, 117520, 98840, -31082, -185946, -254610, -226030, -135681, 13604, 179214, 214027, 26396, -222900, -250757, -13510, 209747, 168826, -52528, -189846, -143452, -20524, 94412, 220711, 333918, 322919, 162142, -11637, -77768, -72845, -62707]
40835f2707P3990K13525K65087J49069J4618j533R541q0656j75562j03350N2469
40824C54491L4591j68202k47714k6156K47063K30669l1560j97491j15841J8161
40814I8011N777r3102j28761r6634o3447o353J03569J61762O7207o4896l9405
40803e6272R2103P4348j46265k99298j80290N0884J24479M1759N87O2597J17553
40792a17815J13666J04546Q9692Q974j03462j40036r8986p3863p0322j6511N2353
40781b51764L3093j5325P1929K39548K22553k0602j80300o6480Q1905k172j64267
40770e1882r8814J23434J70349p213j23505l3903Q9517R5680M5103n023j01901
40759A01842j89883j00586J21951J77526l8138k16138r1576J34702J14329j06711
$$ y = [-62707, 11283, 224808, 489895, 638964, 653582, 652049, 661590, 580934, 405372, 302022, 354491, 389082, 220880, -26834, -52990, 194073, 424742, 393182, 195691, 79850, 98011, 103788, 10686, -118075, -214709, -278156, -284509, -180940, -19178, 48029, -16867, -56272, 35831, 110179, -36086, -335384, -515674, -464790, -340311, -298552, -297965, -235368, -117815, -4149, 100397, 190089, 199063, 95601, -44435, -143421, -217284, -287606, -304117, -251764, -218671, -233996, -162067, 77481, 300034, 279432, 99132, 32652, 114557, 112385, -51882, -150696, -27262, 143087, 135874, 12369, -21534, 67983, 163663, 208766, 203743, 101842, -88041, -188627, -66676, 110850, 72712, -143426, -235002, -100300, 14029, -92682]
40749i2682j95552o3937N5030K7979j4123K9030O5940L8351N1145J49741J82103
40738B33025L7785j43433j67675o1603J6635L2709N8251P5766P025r1051o7774
40727g0340O0255Q8001o5475k02740j29635N2543J03863K768n3697J6768N9206
40716a38483m6653j70126j15233Q5372K13611J62256M7061J5132O0002P7200L0428
40705B20567l170O0235J90042K39221Q8233j92217l65210k66677P133K08291K02845
40694C89293N8140r6707j88528j87747j04222k3660l5580q9190l9966J15669J97808
40683d690J20093M8654J31807K13664M9402k63956l50644q6206J99598J75145
40673B32867n5653j60516o6624Q540m8136q8296J2752J40508J34779L9395L04
$$ y = [-92682, -288234, -352171, -297141, -269162, -283285, -254255, -188315, -149964, -98819, 50922, 233025, 270810, 127377, -40298, -101901, -85266, -52557, 5694, 81460, 88485, -2566, -70340, -10085, 77916, 12441, -190299, -319934, -267391, -163528, -160760, -214457, -197689, -138483, -185136, -355262, -470495, -385123, -171512, -9256, 37805, 52937, 112939, 190139, 220567, 217397, 277632, 467674, 706895, 795128, 602911, 237701, -28976, -21843, 186448, 389293, 447433, 350726, 162198, -25549, -129771, -153431, -189011, -278201, -318167, -202498, -4690, 115403, 164057, 295864, 509528, 558930, 294974, -55670, -141876, 57722, 232867, 177214, 16698, -49926, -41386, -89522, -177818, -165066, -24558, 110221, 149616, 149920]
40662A49920J6092k7649j15569r0202Q0676J96347Q6630j30210j86230q934K02820
40651A73691K43509J25476K771m2021o2898j29745k07757j92255n8958O7978N9856
40640b0353k1615J4501J90744K66281P0703j87526j66523J01146K19001J206k43541
40629B24024j67962J11170K19999P8541o1166o0139m8983j10400j16133N376J03494
40618A77821P0842M7800J56499K24864M0168k52662l11138j06561L6152o0111
40608B3674j86119j15832N6057J18778P1975L9062K1704k7455j7213J35053K54846
40597C74530J03374k04268k85720m6998J58049N1731j71765j83394j8996L5206
40587a88251q3436j53158m0986J26470J87064J30269K2151q7766j44911j13482
$$ y = [149920, 166012, 138363, 22794, -67408, 13268, 209615, 296245, 166035, -20195, -29129, 173691, 417200, 542676, 545447, 503426, 440528, 310783, 103026, -89229, -148187, -80209, -20353, -41968, -27467, 163277, 429558, 500261, 312735, 146212, 247358, 466359, 467565, 224024, 56062, 167232, 387231, 465772, 404606, 344467, 295484, 185084, 68951, 74327, 177821, 248663, 296463, 452962, 677826, 717994, 465332, 154194, 47633, 83785, 23674, -162445, -278277, -222220, -103442, -31467, 7595, 29299, 1844, -15369, 119684, 374530, 477904, 273636, -12084, -59082, 98967, 150698, -21067, -204461, -223457, -188251, -271687, -424845, -465831, -339361, -152297, -22028, 123, -87643, -232554, -346036]
40577c46036m7711j8862J6552J24641J96641N7542k03751k54987K8437L46504
40567a01030L53405Q0255j80297k58516j90905m4461J21876J83294N3816j39751
40557a22314j68414k034J51960J34863K0098l5832o724J0760m9993j41187j47967
40546c56784q106J93030K71558J42013n9313j20381j1212Q7411K4995j28789j81538
40535a47116o3329Q5721R1367k1686m3720J29301K97725J83652j68688l98368
40525e5141k87034l0303O6329l812k2839Q4767J72176J16324l7715j67837j73970
40514c39055k0622J88115K37494N9794j12477m0569J52321J51344o2737j93717
40504A9891j08621j2036n1837o9693Q0261K34143J72996j9590r7947j9609O0658
$$ y = [-346036, -393747, -412609, -396057, -271416, -74775, -17233, -220984, -475971, -447534, -101030, 252375, 332630, 152333, -106183, -297088, -341549, -219673, -36379, 17437, -122314, -290728, -292762, -140802, -5939, 14159, -21673, -28397, -17637, -67630, -208817, -356784, -364890, -171860, 99698, 241711, 182398, 62017, 50805, 138216, 163211, 34422, -147116, -210445, -124724, -33357, -55043, -98763, 30538, 328263, 511915, 343227, -55141, -342175, -372478, -306149, -309961, -332800, -248033, -75857, 40467, 2752, -165085, -339055, -359677, -171562, 65932, 125726, 13249, -27320, 125001, 276345, 213608, 19891, -88730, -100766, -152603, -222296, -142035, 92108, 265104, 245514, 147567, 127958, 188616]
40493A88616O7586N8128N8858M7676N6660J19003J50796N1439j09332j65390r3476
40482D30564k6295m2903r4181j27791j41605j12755j6107P4930M4277q1742j30412
40471b24020r567J59581J88808L8999j47466j94587o3406J04366J37694M7000
40461C7402J2262J21992K35431J94182N0889n0967j12538k09736k74654j72716
40451a68453L5842J38676P4583k1428p6773j47209k02071j09831Q8866J58769
40441b29029L4552n0287N2895J55936O9362n4484J6117J78413J59272k4813j01168
40430B06766J1727J07098N3595l2089l4988j6075n2342j04968j29452j44705j27909
40419b63342j3167J42882J72573M5177p2572p3474l7289k2919M6106J66600J56006
$$ y = [188616, 256202, 314330, 373188, 420864, 477524, 596527, 747323, 798762, 689430, 524040, 430564, 404269, 361366, 267185, 139394, -2211, -114966, -131073, -56143, -11866, -93608, -224020, -233587, -74006, 114802, 153801, 6335, -188252, -251658, -147292, -9598, 37402, 49664, 171656, 407087, 601269, 652158, 601191, 488653, 278917, 4263, -168453, -132611, 6065, 80648, 59220, -17553, -164762, -366833, -476664, -387798, -229029, -194477, -244764, -191869, -35933, 33429, -21055, -4938, 173475, 332747, 307934, 206766, 218493, 325591, 379186, 347097, 312109, 296034, 243692, 138724, 9272, -135433, -263342, -276509, -133627, 38946, 84123, 11551, -61923, -99212, -122131, -76025, 90575, 246581]
40408B46581n1650k15709j17369R5136J41621M2354K2063Q6340L3156j34042j53090
40397d609O2158K36838J26593j35674k48156j31570M5831J22011P7894j5056q0792
40386E5468j00416j17374j37502o6735J31975K80048J88161p311J3559K41714
40376D81587K90796j6447l45313l44469j33797j0229N0056K17131L50971J76904
40366G17190j77747k89834r0584L4905j19890k76954j66991M9298R4474J0821
40356b15312L674O2637L1800o8544o2871Q5855K17837K01663O8670o7011j17455
40345A40943p0806n272j8590j01944j49256j17979p7576o5345k5560N8786J19434
40334c13165J44183J96886K30547R0049j85153k91325p5158J90081J73477m3849
$$ y = [246581, 194931, -20778, -138147, -43011, 98610, 140964, 163027, 249367, 282523, 148481, -4609, 57549, 294387, 420980, 285306, 37150, -94420, -48589, 73422, 151316, 136260, 55468, -44948, -162322, -299824, -366559, -234584, 45464, 233625, 226314, 239873, 481587, 772383, 755936, 410623, 66154, -67643, -77872, -27816, 189315, 540286, 717190, 539443, 249609, 159025, 193930, 74040, -202914, -369905, -320607, -226133, -215312, -211638, -149001, -117201, -185745, -248616, -162761, 55076, 256739, 325409, 258398, 140943, 70137, 64865, 46275, -55669, -204925, -322904, -400480, -465825, -491385, -432599, -313165, -168982, 27904, 258451, 348500, 163347, -127978, -203136, -13055, 160422, 116573]
40324A16573j36490l6116M0537n834m1185J2861N7424L4427K7696P4440P5003
40313B19336k6313j31336j40546q8668n6380m7011j2569O3322J40490J41423J9621
40302H1369j41182j65102o893J50003J31776P606o1642q6422j54319j81020k3562
40291d49388K09425K49519P2375p0758n2010r517l2467m633J19366J61029J0747
40280B03688j54792j33908M768P0938M1841K1308L3460K9606R009j0457n9221
40269E6240j37295j58500p5006L7390J01946J35268J45602Q1411l2243o8291p299
40258G9223R578n0683j2692J74178K43603L210k88567k53744L4702J65014O664
40247A10486j47346q2952L9681J1993q5380n5001Q8203J51349M4165j21672j88818
$$ y = [116573, -19917, -56033, -15496, -21330, -62515, -49654, 7770, 42197, 69893, 144333, 219336, 193023, 61687, -78859, -167527, -223907, -270918, -283487, -220165, -79675, 61748, 81369, -59813, -224915, -231808, -81805, 49971, 57577, -4065, -90487, -244806, -425826, -449388, -239963, 9556, 81931, 11173, -40837, -50354, -82821, -87454, 31912, 192941, 203688, 48896, -85012, -80244, -9306, 32535, 53843, 87303, 116909, 125918, 115461, 56240, -81055, -239555, -314561, -277171, -175225, -39957, 105645, 187056, 154813, 86522, 79223, 88801, 38118, 25426, 199604, 443207, 446417, 157850, -95894, -61192, 103822, 110486, -36860, -119812, -80131, -68138, -153518, -208519, -120316, 31033, 75198, -46474, -235292]
40236b35292j20384q750M4298M0551N4506R3092P1648k2512n6167M8852J43796
40225E3638M6147j60137k09324k5389J78456J98532P4085k8564k8199L7311Q7322
40214B23878N6372m7286j14137m0416J25069K21378J67426L2343p8143j11989
40204D34495n9736L6375O4195n0535k07081k13904l0433J75633K26779R7431j17020
40193C56199k79172k62374o0250J40722J34645l2533j08219J3719J44866Q4691
40183A32294r7019j79222q7127O1522J49444J69472J48745P0268q1523k36811
40173E0043k65413j24349M8778P3341l4425p6499K1627P9117l6827j40143J0388
40162c94362K81729K98307n775k69741k14867O508J05060O1887N4736J39342K04024
$$ y = [-235292, -355676, -364426, -320128, -279577, -225071, -131979, -60331, -82843, -139010, -90158, 53638, 99785, -60352, -269676, -295065, -116609, 81923, 156008, 127444, 99245, 136556, 223878, 280250, 232964, 118827, 78411, 203480, 424858, 592284, 624627, 546484, 434495, 374759, 411134, 475329, 424794, 217713, 3809, -26624, 149009, 375788, 473219, 356199, 77027, -185347, -245597, -104875, 29770, -2763, -110982, -97263, 47603, 132294, 35275, -143947, -231074, -169552, -20108, 149364, 298109, 368377, 286854, 50043, -215370, -339719, -290941, -217600, -252025, -328524, -306897, -227780, -264607, -404750, -394362, -112633, 185674, 179899, -89842, -304709, -298201, -193141, -131254, -76518, 62824, 266848]
40151B66848J65463N8984l2143n6076l9541p3942j76024j91824J379K23810J67856
40140C14790j27588k75672j17938L0268q5331k09635J465L61936L80891o85l19621
40129d7120k46150L5201J78375J09493j2958n3099P585R0034O8807p8542j76897
40118a25271o7270J11246P3328j74788l09382j62330M7567Q0225K1750P9325K23845
40107b01755K60794J38816k1726j33307j86292j43722K2233K03787K33293J03105
40097B75226j7185n368P4214Q0893l5049k00126k91471k27459l7402J43672J86551
40086e3504Q3913n6682j10929j3055K04435L89150L50966O7456k24005k57061
40076C80684o0272P3818k4575j81624j36999Q7016K20228J07328j19727k50362
$$ y = [266848, 432311, 491295, 459152, 403076, 363535, 289593, 113569, -78255, -76876, 146934, 314790, 187202, -88470, -206408, -176140, -261471, -471106, -469641, -107705, 273186, 272501, -47120, -293270, -258069, -79694, 29799, 16841, -36258, -28673, 61361, 130168, 51626, -125271, -192541, -81295, -7967, -182755, -492137, -654467, -606900, -526675, -504925, -425600, -201755, 59039, 197855, 176129, 42822, -143470, -287192, -264959, -61172, 172121, 275226, 258041, 252673, 326887, 407780, 372731, 172605, -118866, -346325, -383727, -240055, -53504, 30409, -26273, -137202, -150257, 54178, 443328, 794294, 861750, 637745, 380684, 320412, 394230, 369655, 188031, 51032, 138048, 358276, 465604, 345877, 95515]
40066I5515k34867j53463o7986n397k8l1299J6451J94014L34554K30949m4430
40055C34013j92127r6232K6819j3460r0679r529J33246R2294j11649j96380l3518
40044a57202J89422K62732J86720M5335j32636k76321k34914N531K11434J73938
40034B74039j2390j04936n7440k3267o1984m7897R4736K28941J69521o7440k63472
40023A28411k32505j6084J65146J47938o303j05702o2230L4589O7769K0202o7135
40012G4096j56222j85879r4778O3938J38867Q4020K6660M6250L5293q6064j74629
40001b28448p8703Q5528J13390O1264J24465K28299R2699k64156m49180k48381
39991e63223O5538J60092Q3376M7107L9405m4178q7793P6467L00917K72345q001
$$ y = [95515, -139352, -292815, -360801, -366198, -366226, -397525, -381074, -187060, 147494, 378443, 334013, 141886, 45654, 72473, 59013, -31666, -41195, 92051, 184345, 72696, -123684, -157202, 32220, 294952, 481672, 527007, 394371, 118050, -116864, -111333, 100101, 274039, 261649, 156713, 99273, 76006, 14022, -33875, 60861, 289802, 459323, 391883, 128411, -104094, -120178, 44968, 192906, 186603, 80901, 18671, 53260, 121029, 141231, 74096, -82126, -268005, -362783, -298845, -159978, -75958, -49298, -3048, 32245, -53819, -228448, -307151, -221623, -108233, -46969, 77496, 305795, 398494, 134338, -314842, -563223, -497685, -337593, -254217, -207110, -167705, -211883, -299676, -223209, 77708, 350053, 342052]
39980C42052k14228j70060l8415l707m2666p6701j02815r0792K8260J89693K18467
39969C9088R7422N612K5843M2565J14N97M7491j6262j74506j63615O2943J37947
39957A05239j45416l84509j16524M17580N64063K01541j35261q9360Q1884M0655
39947E39892j24847j68670j07047r1032j03441m0201P4056J52817J83351J47074
39937D61952k0344k46718l02084j22456N3151M5625M447R6427J76123O6679m8384
39926A64418J06867L77886L45218k2763l00275k43318j06882j76929l19114k25979
39916d00871J03135L74649L89687K25562P0322J5593J3418l1139j33353k01866
39906D25137j72887j24702j60897k18958j40898O6280J99590J27760n0452j65454
$$ y = [342052, 127824, -42236, -80651, -84358, -127024, -203725, -306540, -397332, -369072, -179379, 39088, 136510, 142122, 167965, 210530, 210644, 211241, 258732, 242470, 67964, -95651, -32708, 105239, -40177, -424686, -541210, -123630, 440433, 641974, 506713, 417353, 499237, 539892, 415045, 246375, 139328, 48296, -55145, -95346, -21290, 131527, 314878, 461952, 441608, 194890, -107194, -229650, -176499, -130874, -126427, -30000, 146123, 212802, 164418, 271285, 649171, 994389, 971626, 671351, 428033, 321151, 144222, -174892, -400871, -297736, 76913, 466600, 692162, 762484, 778077, 791495, 760356, 627003, 425137, 252250, 127548, -33349, -252307, -393205, -326925, -127335, 425, -50027, -215481]
39896b15481j65943r4172N862Q8105J09341Q8792Q0371O4928k1777j39806j62778
39885c62558p5604r87J5438O9343J73503J69664L51j16624J6659K42997K46705
39874C78887J9962j18317J1234J91347J21853j60797l26979j70400J45983K91208
39864C83981J42094j08425k01642q9949P3576J45073J01704q233j12318j26012
39854A99849l6083K8771n9664k04745j60289J14840L37503K45201o3368k66933
39844A35082k19324o5598L434k5209l4785L3164R9158N9714m8378p0213M0858
39833i2097J17570J6757j30279j00705M1382J4630k08548k99888o5645K38429
39823d68394K78329R9629k3436j5659p929l3980O331J27662K25878K33334J40227
$$ y = [-215481, -381424, -475596, -469734, -381629, -272288, -183496, -103125, -38197, -59974, -199780, -362558, -438162, -439149, -423711, -354368, -180865, -11201, -10850, -127474, -110815, 132182, 378887, 398849, 280532, 291766, 483113, 604966, 444169, 117190, -53210, 92773, 383981, 526075, 417650, 216008, 126059, 199635, 344708, 446412, 438179, 325861, 199849, 163766, 192537, 132873, -71872, -232161, -117321, 220182, 465383, 402015, 135082, -84242, -149840, -146406, -171615, -206400, -173236, -74078, -14364, -62742, -132955, -92097, 25473, 42230, -88049, -188754, -147372, -132742, -341290, -641178, -706823, -468394, -190065, -90436, -113872, -129531, -137460, -171440, -165109, -37447, 188431, 421765, 561992]
39812E61992o1056k77406k78967N951K67572J66754j63376k83125q2951R5742
39802d8870J8754j20191p5717N9305N0189j04018k06777j50347M037J42470J71917
39791b59248O5885o7092n4754J19202K69506K49668J15557j6964j27043k06171
39781H8546j78218l6975O8676L6538j3596P3093K17450K04517O0k05651k57632
39770c192j87222r4042j2547O2699J14103J18209Q3364L8025j975m3163r0791
39759a6532j10898m2880J05574K05234J31291o3708j99274j91723j16732m2009
39749c41657N0114J28989P9300r5701j88105m9700J74675K42752J53718J05342
39739B59727J63905J81360N5940j07681j67314j39472j30963j51558j02174N5987
$$ y = [561992, 500936, 223530, -55437, -49486, 218086, 384840, 221464, -61661, -144612, -48870, -30116, -150307, -226024, -166719, -116530, -220548, -427325, -577672, -573635, -431165, -259248, -193363, -260455, -315209, -196007, 73499, 323167, 438724, 421760, 294717, 88546, -89672, -126647, -57971, -21433, -35029, 38064, 255514, 460031, 460091, 254440, -3192, -190414, -284456, -297003, -234304, -120201, -1992, 81372, 119397, 117422, 74259, -16532, -127430, -170310, -64736, 140498, 271789, 208081, 8807, -182916, -299648, -341657, -291543, -162554, -83254, -178955, -367060, -416760, -242085, 667, 154385, 259727, 423632, 604992, 660932, 553251, 385937, 246465, 115502, -36056, -138230, -82243]
39729h2243K00115J67754l2427j97286j64031j8866J9821r3910j68094m0098K08006
39718b01259L62020L10722J07963j10594k08536j33718R727N4913j1274l3459
39708A46505N1079Q5439n4541k21914j88912J2766J34859O1595o4783p6294J5177
39697i9024Q5796P0417J5664N046N0065O0192l2275j26288m7086J81175L13280
39686D76962K18715P1737O8792J22515L2771j71958k98108l02895l01114l07153
39676c89736k18310m3859Q0727J17490J54365K01818J68117N3083l3457o2699
39666B7539j02281j36467q0291J9775K3793m8094l7360N6779O4865k6380j8675
39655b56797J44907K55358J79781N3714J309n6937j57713j40957N1881J86507
$$ y = [-82243, 117872, 285626, 253199, 55913, -108118, -126984, -107163, -201073, -369167, -409265, -201259, 160761, 471483, 579446, 468852, 260316, 126598, 136325, 191238, 179964, 146505, 197584, 283023, 228482, 6568, -182344, -169578, -34719, 26876, -37907, -114201, -99024, -13228, 57189, 72853, 77899, 127964, 188156, 155881, 29593, -17493, 163682, 476962, 695677, 767414, 836206, 958721, 991492, 819534, 521426, 218531, -82583, -389736, -608046, -651905, -571178, -453688, -299323, -97505, 70612, 123695, 90238, 27539, -74742, -211209, -291500, -271725, -247932, -296026, -333386, -276607, -211742, -238122, -256797, -111890, 143468, 323249, 376963, 378272, 321335, 163622, 22665, 74546, 261053]
39645B61053P8787j00163j07118J56L2423O201K7590K5815q9902j70179m8226
39634h3563J17674P2494q0024l1886J84726K13314n3250k97091k49772j8881J49845
39623g6414J56951J5966k01942l16424j81450O1874J31084L2825M1585K00357
39613a35588K16464j1563j55674J3367K07094N5257k99351m10239j73251R6631
39603e96853J57653Q0912J1027k7607m6010k4722J6892K5454L498r665j6921j9728
39591d46070L8701J60680K05984P4814r0565o5066J42410L03165K65293P2939
39581F62285j66681l54416l70598j72776P6514J53861N0569n0102m7050L339N6070
39570a58985J14576J11733j9069j46660o2222J68772K38254N2156j18165o2767
$$ y = [261053, 339840, 239677, 132559, 132715, 165138, 171339, 198929, 224744, 134842, -35337, -83563, 34111, 106605, 26581, -5305, 179421, 392735, 339485, 42394, -207378, -226259, -76414, 80537, 96503, -105439, -421863, -603313, -541439, -410355, -377530, -335945, -135588, 80876, 69313, -86361, -72994, 134100, 189357, -109994, -520233, -693484, -596853, -439200, -358288, -347261, -374868, -420878, -445600, -428708, -403254, -399756, -409421, -426342, -446070, -407369, -246689, -40705, 34109, -56456, -121522, 20888, 324053, 589346, 662285, 495604, 141188, -229410, -402186, -325672, -171811, -121242, -171344, -218394, -215055, -158985, -44409, 67324, 48255, -98405, -160627, 8145, 246399, 298555, 180390, 117623]
39560A17623N8519J6566j13189j06511N1014J92125K30073J84019N7558j03728
39550E84069j48261k6902N0696q9645k49145j13331K18340L11723L6362k28961
39540C44945j58815O3320P1936j27405k12947m7598J51950J55769J6479n6563
39530B01071Q734Q8328N9435l6616o2972K6609J36524J63149J03164J595j13453
39519E75568j80604r9958J02194K00361L0125k42276l06552j28292M1716P2549
39509F4831J07059K57049M14612M83459N40574O02577M78103Q0077l18964m09070
39499B300307k65256j69645j44323J5486L13378M98845M46671K76476O1945k61944
39489C071940o18368p26485m79443j45132j8096o0965n5112O1447J78448K04322
$$ y = [117623, 176142, 192708, 79519, -26992, 24022, 216147, 446220, 630239, 687797, 584069, 435808, 408906, 459602, 369957, 120812, 7481, 225821, 537544, 573906, 344945, 186130, 249450, 321386, 193981, -18966, -66564, 85386, 241155, 257634, 201071, 209805, 298133, 357568, 320952, 257980, 284589, 421113, 584262, 687426, 689021, 575568, 394964, 295006, 397200, 597561, 627686, 385410, 78858, -49434, -7718, 64831, 171890, 428939, 843551, 1327010, 1867584, 2470161, 2948264, 3028341, 2709377, 2300307, 2035051, 1865406, 1721083, 1736569, 2049947, 2548792, 2995463, 3271939, 3333884, 3071940, 2453572, 1727087, 1247644, 1102512, 1084416, 1023451, 968339, 1029786, 1208234, 1412556]
39479A412556J19811m9294j93166j76142m1660r247j51990k57361j57485R68J5748
39468E12738l7306J6496J05724M9712q0407o8641N1016N5212m5985k2443J16105
39457F52221P6444j88123l00466k9660K97836K50515q8931k80905j52363O0244
39447B96812J22643O3274J8492M4867J16358J53214N3356j72371l28623k46337
39437A21685k9157P0631r783j04982r8990m3569J2692J06891K16533K20855R8315
39426E61121L172L8215Q9928J7028j10362j12522K1873J11928L1652j36562k17521
39415B97950j39621O680O8699j6012j48509j68726m3984Q7701R8482L3539J8463
39404I4662N6102L6387n4667p8074L8490J46126P1330j02235j21748O3645K08028
$$ y = [1412556, 1532367, 1483073, 1289907, 1113765, 1072105, 1062858, 910868, 653507, 496022, 496990, 512738, 475432, 491928, 597652, 647364, 566957, 498316, 549332, 604544, 558559, 536116, 652221, 728665, 540542, 240076, 210416, 508252, 758767, 669836, 388931, 236568, 296812, 419455, 482729, 501221, 546088, 662446, 815660, 869016, 696645, 368022, 121685, 92528, 163159, 153376, 48394, -50596, -94165, -81473, 25418, 241951, 462806, 561121, 564293, 602508, 692436, 709464, 599102, 486580, 508453, 620381, 652033, 515471, 297950, 158329, 165009, 233708, 217696, 69187, -99539, -143523, -55822, 42660, 76199, 94662, 150764, 187151, 132484, 54410, 92900, 239026, 310356, 208121, 86373, 150018, 358046]
39393C58046J23790m5001n8970M5452M3392r3168j62515r3219o0117j53959j98649
39382b94918n3285J33418J70702J26902J46650J47808r181j88298j50317K2795
39372E2276L8991r6219q0256J31894J94945n2080k75095j60304R2512J11364o6369
39361a08341j16372K8598J28868O6711j4058N6M4124N0169M0019J3310n7502j05381
39349b9799l7582O5872L0631j14136j36832M3405K18055J94126N1558j7379K3788
39338B91707P1186N6299n820p2886r9768o4076j2871j8572o7115p4519k4859J5270
39326f024K9330O8430J17722R3141Q275j3421N2943P8770O880m4906m438J1541
39314C98243q8272j81927j33473l5487n2162j32922j04006K6359Q2767J0535p2685
$$ y = [358046, 481836, 436835, 377865, 423317, 466709, 373541, 211026, 117807, 57690, -96269, -294918, -348203, -214785, -44083, 82819, 229469, 377277, 368096, 179798, 29481, 52276, 91267, -4952, -85208, 46686, 241631, 189551, -85544, -245848, -153336, -41972, -108341, -224713, -196115, -67247, -536, -14594, -14538, 29586, 79755, 119774, 133084, 75582, -29799, -67381, -1509, 29122, -85014, -221846, -178441, 39614, 233740, 285298, 267919, 291707, 362893, 419192, 413372, 340486, 240718, 176642, 163771, 145199, 78084, 3565, -21294, -6024, 23306, 91736, 209458, 302599, 310874, 297453, 350396, 429166, 436046, 391140, 386702, 398243, 309971, 128044, -5429, -40916, -93078, -226000, -330006, -303647, -220880, -210345, -283030]
39303b83030j07195j48330j66117k4583K44548L60800J54153j39272j48316J26133
39293a31209K97168J24534j44954j26124J43240K44082n312k57495j48658J28042
$$ y = [-283030, -390225, -538555, -704672, -729255, -484707, -123907, 30246, -109026, -257342, -131209, 165959, 290493, 145539, 19415, 162655, 406737, 401425, 143930, -4728, 123314]
$$ [...]
##END NTUPLES=NMR SPECTRUM
##END=
