##TITLE=31Pdec_PR166_k
 DMSO-d6, 24 sc
 15.2.2019
##JCAMPDX= 6.0         $$ Bruker NMR JCAMP-DX V2.0
##DATA TYPE= NMR SPECTRUM
##DATA CLASS= NTUPLES
##ORIGIN= UXNMR, Bruker Analytische Messtechnik GmbH
##OWNER= root
$$ XWIN-NMR		Version 3.5
$$ Fri Feb 15 14:09:27 2019 Russian Standard Time (UT+4h)  she@DPX200
##.OBSERVE FREQUENCY= 81.013821
##.OBSERVE NUCLEUS= ^31P
##.ACQUISITION MODE= SIMULTANEOUS
##.ACQUISITION SCHEME= undefined
##.AVERAGES= 24
##.DIGITISER RES= 17
##SPECTROMETER/DATA SYSTEM= spect
##.PULSE SEQUENCE= zgpg30
##.SOLVENT NAME= CDCl3
##.SHIFT REFERENCE= (INTERNAL, CDCl3, 0, 182.463)
##AUDIT TRAIL= $$ (NUMBER, WHEN, WHO, WHERE, WHAT)
$$ ##TITLE= Audit trail, XWIN-NMR		Version 3.5
$$ ##JCAMPDX= 5.01
$$ ##ORIGIN= Bruker BioSpin GmbH
$$ ##OWNER= she
$$ F:/spectra/data/she/nmr/P31/1/pdata/1/auditp.txt
$$ ##AUDIT TRAIL=  $$ (NUMBER, WHEN, WHO, WHERE, WHAT)
(   1,<2019-02-15 14:08:39.00 +0400>,<she>,<DPX200>,
      <created by zg, POWCHK disabled, PULCHK disabled
       configuration hash MD5:
       00 E9 B6 7A A2 85 ED C7 34 08 36 98 17 FE 4E 26
       data hash MD5: 32K
       B2 C0 D5 46 B7 EC 0C 51 49 32 B9 2A 43 4D 06 B1>)
(   2,<2019-02-15 14:08:42.54 +0400>,<she>,<DPX200>,
      <Start of raw data processing
       efp BC_mod = 2 LB = 1 FT_mod = 6 PKNL = 1 PHC0 = -1459.726 PHC1 = 22.79891 SI = 64K 
       data hash MD5: 64K
       FF 20 C8 47 98 8A 6C 31 1C 9F 06 83 C5 A7 FE B9>)
(   3,<2019-02-15 14:08:56.93 +0400>,<she>,<DPX200>,
      <pk PHC0 = 5.597598 PHC1 = 0 
       data hash MD5: 64K
       6E 12 58 3D A4 80 5E BE D3 5F 4D 48 C3 B5 0A 74>)
$$ ##END=
$$ 
$$ hash MD5
$$ 34 B2 46 CB F3 52 52 CC F3 3D 37 C7 90 72 57 B6
##$RELAX= 
##$RELAX= 
##$RELAX= 
##$RELAX= 
##$RELAX= 
##$RELAX= 
##$RELAX= 
##$RELAX= 
$$ Bruker specific parameters
$$ --------------------------
##$DU= <F:/spectra>
##$EXPNO= 1
##$NAME= <P31>
##$PROCNO= 1
##$TYPE= <nmr>
##$USER= <she>
##$AMP= (0..31)
100 100 100 100 100 100 100 100 100 100 100 100 100 100 100 100 100 100 
100 100 100 100 100 100 100 100 100 100 100 100 100 100 
##$AQSEQ= 0
##$AQ_mod= 1
##$AUNM= <au_zg>
##$AUTOPOS= <>
##$BF1= 81.014009
##$BF2= 200.13
##$BF3= 200.13
##$BF4= 200.13
##$BF5= 200.13
##$BF6= 200.13
##$BF7= 200.13
##$BF8= 200.13
##$BYTORDA= 1
##$CFDGTYP= 0
##$CFRGTYP= 5
##$CHEMSTR= <none>
##$CNST= (0..31)
1 1 145 1 1 1 1 1 1 1 1 1 1 1 1 1 1 1 1 1 1 1 1 1 1 1 1 1 1 1 1 1 
##$CPDPRG= <waltz16>
##$CPDPRG1= <>
##$CPDPRG2= <waltz16>
##$CPDPRG3= <>
##$CPDPRG4= <mlev>
##$CPDPRG5= <mlev>
##$CPDPRG6= <mlev>
##$CPDPRG7= <mlev>
##$CPDPRG8= <mlev>
##$CPDPRGB= <>
##$CPDPRGT= <>
##$D= (0..31)
0 1 0 0 0 0 0 0 0 0 0 0.03 2e-05 3e-06 0 0 0 0 0 0 0 0 0 0 0 0 0 0 0 0 
0 0 
##$DATE= 1550225318
##$DBL= (0..7)
120 120 120 11 120 120 24 19 
##$DBP= (0..7)
150 150 150 150 150 150 150 150 
##$DBP07= 0
##$DBPNAM0= <>
##$DBPNAM1= <>
##$DBPNAM2= <>
##$DBPNAM3= <>
##$DBPNAM4= <>
##$DBPNAM5= <>
##$DBPNAM6= <>
##$DBPNAM7= <>
##$DBPOAL= (0..7)
0.5 0.5 0.5 0.5 0.5 0.5 0.5 0.5 
##$DBPOFFS= (0..7)
0 0 0 0 0 0 0 0 
$$ [...]
##$SUBNAM2= <"">
##$SUBNAM3= <"">
##$SUBNAM4= <"">
##$SUBNAM5= <"">
##$SUBNAM6= <"">
##$SUBNAM7= <"">
##$SUBNAM8= <"">
##$SUBNAM9= <"">
##$SW= 369.568048894756
##$SWIBOX= (0..15)
0 1 3 0 0 0 0 0 0 0 0 0 0 0 0 0 
##$SW_h= 29940.119760479
##$TD= 32768
##$TD0= 1
##$TE= 0
##$TE2= 300
##$TE3= 300
##$TEG= 300
##$TL= (0..7)
0 120 53 12 22 120 120 120 
##$TP= (0..7)
150 150 150 150 150 150 150 150 
##$TP07= 0
##$TPNAME0= <>
##$TPNAME1= <>
##$TPNAME2= <>
##$TPNAME3= <>
##$TPNAME4= <>
##$TPNAME5= <>
##$TPNAME6= <>
##$TPNAME7= <>
##$TPOAL= (0..7)
0.5 0.5 0.5 0.5 0.5 0.5 0.5 0.5 
##$TPOFFS= (0..7)
0 0 0 0 0 0 0 0 
##$TUNHIN= 0
##$TUNHOUT= 0
##$TUNXOUT= 0
##$USERA1= <user>
##$USERA2= <user>
##$USERA3= <user>
##$USERA4= <user>
##$USERA5= <user>
##$V9= 5
##$VALIST= <valist>
##$VCLIST= <CCCCCCCCCCCCCCC>
##$VD= 0
##$VDLIST= <DDDDDDDDDDDDDDD>
##$VPLIST= <PPPPPPPPPPPPPPP>
##$VTLIST= <TTTTTTTTTTTTTTT>
##$WBST= 1024
##$WBSW= 4
##$XGAIN= (0..3)
0 0 0 0 
##$XL= 0
##$YL= 0
##$YMAX_a= 15745
##$YMIN_a= -9875
##$ZGOPTNS= <>
##$ZL1= 120
##$ZL2= 120
##$ZL3= 120
##$ZL4= 120
##$ABSF1= 0
##$ABSF2= 0
##$ABSG= 0
##$ABSL= 0
##$ALPHA= 0
##$AQORDER= 0
##$ASSFAC= 0
##$ASSFACI= 0
##$ASSFACX= 0
##$ASSWID= 0
##$AUNMP= <proc_1d>
##$AZFE= 0.1
##$AZFW= 0.5
##$BCFW= 0
##$BC_mod= 2
##$BYTORDP= 0
##$COROFFS= 0
##$CY= -3
##$DATMOD= 1
##$DC= 0
##$DFILT= <>
##$DTYPP= 0
##$F1P= 0
##$F2P= 0
##$FCOR= 1
##$FTSIZE= 65536
##$FT_mod= 6
##$GAMMA= 0
##$GB= 0
##$INTBC= 1
##$INTSCL= 5.30512e-09
##$ISEN= 30
##$LB= 1
##$LEV0= 0
##$LPBIN= 0
##$MAXI= 10000
##$MC2= 0
##$MEAN= 0
##$ME_mod= 0
##$MI= 50
##$NCOEF= 0
##$NC_proc= -6
##$NLEV= 6
##$NOISF1= 182.463
##$NOISF2= 159.3651
##$NSP= 0
##$NTH_PI= 0
##$NZP= 0
##$OFFSET= 182.463
##$PC= 4
##$PHC0= -1454.128
##$PHC1= 22.79891
##$PH_mod= 1
##$PKNL= yes
##$PPARMOD= 0
##$PSCAL= 0
##$PSIGN= 0
##$REVERSE= no
##$SF= 81.0140089999434
##$SI= 65536
##$SIGF1= 159.3651
##$SIGF2= -187.1042
##$SINO= 113.3802
##$SIOLD= 16384
##$SREGLST= <1H.CDCl3>
##$SSB= 0
##$STSI= 65536
##$STSR= 0
##$SW_p= 29940.119760479
##$SYMM= 0
##$S_DEV= 0
##$TDeff= 32768
##$TDoff= 0
##$TI= <>
##$TILT= no
##$TM1= 0
##$TM2= 0
##$TOPLEV= 0
##$USERP1= <user>
##$USERP2= <user>
##$USERP3= <user>
##$USERP4= <user>
##$USERP5= <user>
##$WDW= 1
##$XDIM= 65536
##$YMAX_p= 524636893
##$YMIN_p= -35362954
$$ End of Bruker specific parameters
$$ ---------------------------------
##NTUPLES= NMR SPECTRUM
##VAR_NAME=  FREQUENCY,     SPECTRUM/REAL,   SPECTRUM/IMAG
##SYMBOL=    X,             R,               I
##VAR_TYPE=  INDEPENDENT,   DEPENDENT,       DEPENDENT
##VAR_FORM=  AFFN,          ASDF,            ASDF
##VAR_DIM=   65536,         65536,           65536
##UNITS=     HZ,            ARBITRARY UNITS, ARBITRARY UNITS
##FACTOR=    0.456856943014862, 1,           1
##FIRST=     14782.0589164792, 0,            0
##LAST=      -15158.0608439998, 0,           0
##MIN=       -15158.0608439998, -35362954,   0
##MAX=       14782.0589164792, 524636893,    0
$$ Real data points
##PAGE= N=1
##DATA TABLE= (X++(R..R)), XYDATA
$$ [...]
39895A51774j379001L4421J436376J368392P2694o78998M4242J138691J132616
39886C321207Q3624r11535j278013j180861q23305l87040k14208l49835l43805
39877b083771k1855J50266o1098j91273L7312K72418M30252Q77968J208455L47753
39867I66427j327961j772417l57779P56292p372r26886J12874J869750J756453
39858A069381J58426m93146K7387q0688p39154j6701J823333K051912J679j607942
39848B194487j002355J95256K11198k15721q6401k52174j293339j689948k35117
39839b174114J653259K011073J073426K25318j73703l36171n8964L30463k64038
39830B286549j663308k071572j082051o45856j446231j117751J602326L780794
$$ plain form
39895 151774 -1227227 -1192806 243570 1611962 1684656 1005658 1049900 2188591 3321207
39886 3321207 3404831 2493296 1215283 34422 -788883 -1175923 -1390131 -1739966 -2083771
39877 -2083771 -2105626 -1955360 -2016458 -2207731 -2170419 -1898001 -1467749 -589781 618674 966427
39867 966427 -361534 -2133951 -2491730 -1735438 -1742810 -2669696 -2556822 -687072 1069381
39858 1069381 1227807 734661 762048 681360 -57794 -74495 1748838 3800750 3802429 2194487
39848 2194487 1192132 1387388 1598586 1382865 1296464 1044290 -249049 -1938997 -2174114
39839 -2174114 -520855 1490218 2563644 2788962 2615259 2279088 2220124 2550587 2286549
39830 2286549 623241 -1448331 -2530382 -3176238 -4622469 -5740220 -4137894 -357100
39822c57100K455375n01226j270072P1122N22474m20506n81341L31409K76158
39813E26293r14751r26648P85985J813096Q82749j78148Q5898L03503r97316k593101
39803a212440k385220m28053J422785J826005R18847j30491o8447R99490J232104
39794B174580m88087k192396j098850J973967L219520J249896j049816j074884
39786B713930k1910k03505j332842j618221p75082J70659Q23897J294917J132561
39777B184404M7612j067893j198320n72411L2133M28137N51620j0523j022507
39768f27748j302773m48055L66389L03328J66728O55937R04508K27196k19508
39759B6002O99346J908107J731852N67905o9763j71111p09520j295074p23481
$$ plain form
39822 -357100 2098275 1597049 326977 398099 920573 500067 -81274 250135 526293
39813 526293 -388458 -1315106 -529121 1283975 2166724 1988576 2074474 2377977 1380661 -1212440
39803 -1212440 -3597660 -4025713 -2602928 -776923 141924 11433 -57014 942476 2174580
39794 2174580 1686493 -505903 -1604753 369214 3588734 4838630 3788814 2713930
39786 2713930 2692020 2488515 1155673 -462548 -1237630 -1066971 -243074 1051843 2184404
39777 2184404 2232016 1164123 -34197 -606608 -574475 -146338 405282 394759 -627748
39768 -627748 -1930521 -2378576 -2012187 -1708859 -1542131 -886194 18314 245510 26002
39759 26002 725348 2633455 4365307 4933212 4863449 4692338 3982818 2687744 1964263
39750A964263N19517O45999n70933j475719j224719p59302p43237m86146M33360
39741a696917J164550J036337O66680P72735R52530M97046l96021r84916r73923
39732A038101n38351J27971P16306O43413l82615j677463j926970n38848J396554
39723a141902J951741N63675j061329j052518M8035K03827p79774q74814O40016
39714a503043J605087M42629r76058k67817J345712Q81855j332081j819134O78648
39705i44202L181383K775575K96463j642286k133533j852540j100073J78212J315503
39696G4502J431964O05507m47889j332290j809366j377293J2842J300003J309719
39687b32301J85810q45867r43621l68514O6514j26647o48227o74938J67925J124461
$$ plain form
39750 1964263 2483780 3129779 2558846 1083127 -141592 -900894 -1644131 -2130277 -1696917
39741 -1696917 -532367 503970 1170650 1943385 2895915 3392961 2996940 2012024 1038101
39732 1038101 499750 627721 1344027 1987440 1604825 -72638 -1999608 -2538456 -1141902
39723 -1141902 809839 1373514 312185 -740333 -692298 -488471 -1268245 -2143059 -1503043
39714 -1503043 102044 544673 -431385 -699202 646510 1528365 196284 -1622850 -944202
39705 -944202 2237181 5012756 5309219 3666933 1533400 -319140 -1419213 -1241001 74502
39696 74502 1506466 2111973 1664084 331794 -1477572 -2854865 -2842023 -1542020 -232301
39687 -232301 -46491 -892358 -1835979 -2204493 -2137979 -2264626 -2912853 -3587791 -3419866 -2295405
39677b295405J064181p3187j137431j116296j02997J035223J391301N92360o72697
39668a314948r62345K31481J452691J033477m76317j048183j47361P09877M56247
39659f5381k51102o00495o85883n02946K73948Q95971n8151j996796k213892J94540
39649e010187K472251K042065J74982m09476K08743R1955o65796k18985J309628
39640d820J599228k9846j370533p80227M89635O16297j8392J43742J212828J717135
39630C575047O93429j037449j726856o18279J016570J176879k97600j381034p73182
39621F27525J83703o7672m10205J014445K987350K480959l87640k088059j071148
39612C269258p868j100947k402217j268433J088328J567026M5538q56673j5144
$$ plain form
39677 -2295405 -1231224 -1304411 -2441842 -3558138 -3661135 -2625912 -1234611 -642251 -1314948
39668 -1314948 -2277293 -2045812 -593121 440356 -35961 -1084144 -1231505 -521628 -65381
39659 -65381 -316483 -916978 -1602861 -2105807 -1831859 -935888 -994039 -2990835 -5204727 -5010187
39649 -5010187 -2537936 -495871 -320889 -730365 -521622 -429667 -1095463 -1314448 -4820
39640 -4820 1594408 1564562 194029 -586198 -96563 519734 501342 645084 1857912 3575047
39630 3575047 4268476 3231027 1504171 885892 1902462 3079341 2781741 1400707 627525
39621 627525 811228 743556 333351 1347796 4335146 6816105 6428465 4340406 3269258
39612 3269258 3261390 2160443 -241774 -1510207 -421879 1145147 1190685 334012 318868
39603C18868J132098J407876J119519M55003r00629k205922j863964J94130J984769
39594A641748J906189L91497j173759j870184j365866K06R83331N89310l61140
39585G41332k17258Q80135J111702M0490m78464O36565J666093O53604j455660
39576C578539k098573p28503O66879M89053o05172j056094n16320j3974m16233
39567g00398j219287j070181M88094K183273K420517J210086q8406o87699r43096
39558A592903j092564q08663k60952k01672n16786j32127J021398J505817O90488
39549A797842o4035L16598Q15531K85979m07860j26841J13971j168701k832286
39540a269802k385776N7602J754782J286886M0991n45064p49217r22956m08974
$$ plain form
39603 318868 1450966 2858842 3978361 4433364 3532735 1326813 -537151 -343021 1641748
39594 1641748 3547937 3939434 2765675 895491 -470375 -470169 513162 1102472 741332
39585 741332 524074 1404209 2515911 2556401 2077937 2714502 4380595 5034199 3578539
39576 3578539 1479966 751463 1418342 1907395 1302223 246129 -270191 -284165 -700398
39567 -700398 -1919685 -2989866 -2501772 -318499 2102018 3312104 3223698 2535999 1592903
39558 1592903 500339 -308324 -569276 -770948 -1287734 -1419861 -398463 1107354 1797842
39549 1797842 1733807 2050405 2865936 3151915 2744055 2617214 2731185 1562484 -1269802
39540 -1269802 -3655578 -3597976 -1843194 -556308 -515317 -1060381 -1809598 -2732554 -3141528
39531c141528Q44332J516124R34787K72416N85318J090752N67217p33616j670317
39522B65485j676582p70998P71464J933772J423320m06341j388289l63217J164662
39513I53276J404849Q71614R82408J359256O09060r46219j509504o39141J02542
39504C188141m11497j353544j329202j61087J158790J553112O68580q24128j703366
39495G85799j416777o23026j34051R4550L05685J16830n89629p30638N65982K081945
39485D56670J711476m97640k146566j648395j02161O07755L10646K00904P94660
39476c12651J318512J005122K29220Q743N54602P80764l09573j999213k460563
39467a185037j091225P42640J615026J515526Q95943k51022j337779q45519J293234
$$ plain form
39531 -3141528 -2297196 -781072 153715 426131 1011449 2102201 2669418 1935802 265485
39522 265485 -1411097 -2182095 -1410631 523141 1946461 1540120 151831 -211386 953276
39513 953276 2358125 3229739 4212147 5571403 6180463 5234244 3724740 3085599 3188141
39504 3188141 2776644 1423100 93898 -67189 1091601 2644713 3313293 2489165 785799
39495 785799 -630978 -1254004 -1388055 -1293505 -987820 -870990 -1460619 -2191257 -1625275 456670
39485 456670 2168146 1670506 -476060 -2124455 -2226616 -1618861 -1308215 -1107311 -312651
39476 -312651 1005861 2010983 2240203 2248946 2803548 3584312 3274739 1275526 -1185037
39467 -1185037 -2276262 -1533622 81404 1596930 2492873 2241851 904072 58553 1351787
39458A351787K427265M94240k512553k974518q32064O15167j03725r24247l09198
39449b767846L17657k87299n39269J200247L326485L075206O39947j273846j314511
39440B376771o05615k75313m5237M20071N50117J975m04340K48362J516525J933662
39430E716978P43188j150331k181558j877149j132999o77393o6946J161545K169358
39421B704693J828036N23165m54230r29612j588414j956560p58147J460833K330898
39412C160662J055350l23116j10690O68054M59439k77218m56116m92850j049516
39403B633999j237209k86557L82800p36442k176856j342747J197387K214123N90049
39394A238547j246751j135597J71731J042511J299572J268471M40923j294626
$$ plain form
39458 1351787 3779052 4273292 1760739 -1213779 -2045843 -1430676 -1534401 -2458648 -2767846
39449 -2767846 -2450189 -2737488 -3276757 -2076510 1249975 4325181 4965128 3691282 2376771
39440 2376771 1771156 1495843 1450606 1870677 2420794 2422769 2018429 2266791 3783316 5716978
39430 5716978 6460166 5309835 3128277 1251128 118129 -559264 -626210 535335 2704693
39421 2704693 4532729 5055894 4601664 3672052 2083638 127078 -631069 829764 3160662
39412 3160662 4216012 3892896 3782206 4450260 4909699 4632481 4176365 3683515 2633999
39403 2633999 1396790 1110233 1493033 756591 -1420265 -2763012 -1565625 648498 1238547
39394 1238547 -8204 -1143801 -972070 70441 1370013 2638484 3079407 1784781
39386A784781k426878j528956N06219J437246O17728l23274J04614J207477J171737
39377B550694k76705j324037o05876O58425L37472j291903j808996m68330N39111
39368a690145k29966q71928O63378K702782K108626o83633k118244p61403J041782
39359A61249J118917J83780k36951n8602K89983R43885J622551J355327J52987
39350E533126p01682p52357r30202j393294j000708J85361L12016j071859j733009
39341a552608l56572J036605M15860q58711n89983L79572k3374j026304k95581
39332b871096J617098J832511j999j014735K13611J569787J080677j70779k84731
39323A970344N28992Q78376M38615j50724m52585k51656M96495J018202K86673
$$ plain form
39386 1784781 -642097 -2171053 -1664834 -227588 390140 66866 171480 1378957 2550694
39377 2550694 2273989 949952 344076 1002501 1339973 48070 -1760926 -2229256 -1690145
39368 -1690145 -1920111 -2792039 -2128661 574121 2682747 1999114 -119130 -880533 161249
39359 161249 1280166 1463946 1226995 1168393 1458376 2402261 4024812 5380139 5533126
39350 5533126 4831444 4079087 3148885 1755591 754883 940244 1252260 180401 -1552608
39341 -1552608 -1909180 -872575 -456715 -1315426 -1905409 -1525837 -1549211 -2575515 -2871096
39332 -2871096 -1253998 578513 576514 -438221 -224610 1345177 2425854 2255075 1970344
39323 1970344 2499336 3377712 3816327 3665603 3213018 2961362 3457857 4476059 4762732
39314D762732j168681j516558l34848O69792M81168L07231J033264J252331k60057
39305E226374j933134j648149k38862r4100j162113j214890K42516J249768Q08096
39296A235506K30791L92543K63274o76736r72131K64120J365982N82010j038311
39287A647048j278094j01742P58378P31848P07523Q33274K47266r64156j541048
39278A040297j052094l75934O4320P46653J376961P57550r12564j558571k39132
39269a52514J107693M58376j231674j617885n44957O4656o25425j404267j206773
39260e152770m07223M00958J324139K311734K641647J901961O02591o06492j490139
39251A526406j756113j055363J53357P61444N14480L23872N33226J22732j365374
$$ plain form
39314 4762732 3594051 2077493 1742645 2412437 2893605 3200836 4234100 5486431 5226374
39305 5226374 3293240 1645091 1406229 1312129 150016 -1064874 -822358 427410 1235506
39296 1235506 1466297 1858840 2122114 1445378 473247 737367 2103349 2685359 1647048
39287 1647048 368954 267212 1025590 1757438 2464961 3298235 3545501 2581345 1040297
39278 1040297 -11797 -387731 -323411 423242 1800203 2557753 1645189 86618 -152514
39269 -152514 955179 1413555 181881 -1436004 -1980961 -1916305 -2541730 -3945997 -5152770
39260 -5152770 -5559993 -5159035 -3834896 -1523162 1118485 3020446 3623037 3016545 1526406
39251 1526406 -229707 -1285070 -1131713 -370269 144211 468083 1001309 1124041 -241333
39242b41333k291230r08085J703708K536874O35298j517954j322985O08218J698802
39233I01313J078301K90188M57096O22732k34921j079173l40005J260154J438739
39224D394424j26164j132130k16166Q40241o2191j914687k080665l13851J002877
39215C91688M78179o15536p02891m4324K97216J54918m7081k41728m60064m07792
39205a197415l2240J66374n1173k64451k69254m55527p65154l41735R20256J514545
39195g75774K71392j525392j468676O70566K404300J683111n02714j483857l36858
39186a063902J063745O36810j082231j664140j77380J436102J069526n86257j138083
39177a505810R7641J442565J483684O46411j27896o58087r18417o01182L4826
$$ plain form
39242 -241333 -2532563 -3440648 -1736940 799934 1435232 -82722 -1405707 -797489 901313
39233 901313 1979614 2269802 2726898 3349630 3114709 2035536 1695531 2955685 4394424
39224 4394424 4268260 3136130 2919964 3760205 3698014 1783327 -297338 -611189 391688
39215 391688 869867 254331 -448560 -492884 -195668 -40750 -87831 -329559 -789623 -1197415
39205 -1197415 -1229655 -1063281 -1114454 -1378905 -1648159 -2103686 -2868840 -3210575 -2290319 -775774
39195 -775774 -504382 -2029774 -3498450 -2827884 -423584 1259527 756813 -727044 -1063902
39186 -1063902 -157 636653 -445578 -2109718 -2287098 -850996 218530 -367727 -1505810
39177 -1505810 -1408169 34396 1518080 2164491 2036595 1378508 460091 -141091 -106265
39168a06265J72470q2045L68017J473985J461693m58878k323588j912757J28584
39159a278784J368568R83396L33705N69453J279931J501524Q83214j71761p90841
39150D678405l45116N65319N19500o96865j496463q31889J02269j83292j080238
39141A231630j162053p29948r41977j212818J7384K162349K694676Q38082j187155
39132A710170j303675q8901O66879L54746l63042o66879j13595R65753J291430
39123B452886k0510j804670j945947l47159Q20871K36219r70583j384430j193639
39114d156962q45919L15662K413864L479258J645867j724334l135598j229606
39106c237768J642373K521392J258205M0261K16838P14045j11725j826005k222326
$$ plain form
39168 -106265 66205 -15840 352177 1826162 3287855 2828977 505389 -1407368 -1278784
39159 -1278784 89784 1073180 1406885 1976338 3256269 4757793 5641007 5469246 4678405
39150 4678405 4333289 4898608 5418108 4721243 3224780 2392891 2495160 2311868 1231630
39141 1231630 69577 -660371 -1602348 -2815166 -2797782 -635433 2059243 2897325 1710170
39132 1710170 406495 317594 984473 1339219 976177 309298 195703 1161456 2452886
39123 2452886 2432376 627706 -1318241 -1665400 -844529 -608310 -1578893 -2963323 -4156962
39114 -4156962 -5002881 -4687219 -2273355 1205903 2851770 1127436 -2008162 -3237768
39106 -3237768 -1595395 925997 2184202 2224463 2441301 3155346 3043621 1217616 -1004710
39097a004710m13806J615843J541493j30922r44086j02565O43226q5674j322311
39088b03512j468132n37332L28886N68746M33628K51139L00506Q39514J564576
39079B078019J570165M20725j189868k198383k064190p95086J042183K130878
39071I94443J332536o92880j815398r68694O02048J201573P52824K60584J83332
39062A850368K45963J58412k71434j121864j841822j479072l8965J144465J028981
39053c24968J27334m13051k14536L79447R26800R47666K17821n91988n52459l0476
39043D71590k98549j247098j182538L95002J673027J268949K49542M2878J62475
39034A535278l03061o75943j41528L78098l1153k10159R13968J605057k14508
$$ plain form
39097 -1004710 -1418516 197327 1738820 1607898 663812 561247 1204473 1118799 -203512
39088 -203512 -1671644 -2208976 -1880090 -1311344 -877716 -626577 -326071 513443 2078019
39079 2078019 3648184 4068909 2879041 680658 -1383532 -2178618 -1136435 994443
39071 994443 2326979 1634099 -181299 -1149993 -547945 653628 1406452 1667036 1850368
39062 1850368 2096331 2254743 1983309 861445 -980377 -2459449 -2498414 -1353949 -324968
39053 -324968 -197634 -610685 -825221 -445774 481026 1428692 1646513 1054525 502066 471590
39043 471590 173041 -1074057 -2256595 -1861593 -188566 1080383 1329925 1372803 1535278
39034 1535278 1232217 556274 414746 792844 761691 551532 1465500 3070557 2856049
39025B856049k875514k823394j29858J491738L98236r10035l50889O00539N3468
39016a689660r50204m95781R07571J429210Q73406L78751K22489n8751j31018
39007D86013O09377J424707R59991n85227j611331j442119r82336q37166k73019
38998b251110J223221K477474J875466l06105j900451j397766K67813J005724
38990I94266J61077r72127j086067l37654L94190P92070R84624Q75494M19890
38981B225763O8400J13751L7965o45596j349750j180169l78912M7446j15393k03525
38971a380020p501n7436n13893p80098m05903L72378J072722J354988J099991
38962G55228O59379O67160J000806N79421r61188k229306j913635q20809n49835
$$ plain form
39025 2856049 -19465 -2842859 -2972717 -1480979 -1082743 -1992778 -2343667 -1743128 -1689660
39016 -1689660 -2639864 -3135645 -2228074 -798864 74542 453293 675782 617031 486013
39007 486013 1095390 2520097 3480088 2894861 1283530 -158589 -1140925 -1978091 -2251110
38998 -2251110 -1027889 1449585 3325051 3018946 1118495 -279271 -11458 994266
38990 994266 1155343 183216 -902851 -1240505 -846315 -54245 930379 1805873 2225763
38981 2225763 2294163 2407914 2445879 1800283 450533 -729636 -1108548 -1061102 -1176495 -1380020
38971 -1380020 -1387521 -1444957 -1958850 -2738948 -3144851 -2772473 -1699751 -344763 755228
38962 755228 1414607 2081767 3082573 3661994 2700806 471500 -1442135 -2262944 -2812779
38953b812779q86569l89133R40463J657591J341487R40540O91503q6709r67827
38944D28567n54903Q53404J069932o71230k360077k171861q01374K61485Q99255
38935c046802J535988J795470J329385O76194K34414l50294j007211r62676l35406
38926a30938k53203o88345k71861R12322Q83649o22945r35024J212950K928431
38917C035036J452103j255039j512534L63531J037402k83544j084307n2882J170007
38908B869773J093874K81937m06550j029506j465626j162475l86595L1684K45213
38899G1729Q91319J311607L91613j060274j153739n5646K42277o42382j002948
38890a006444l01021k759m86535j02804J520142K119511M04696j515261j275738
$$ plain form
38953 -2812779 -3699348 -4088481 -3148018 -1490427 -148940 791600 1483103 1396394 428567
38944 428567 -126336 727068 1797000 1125770 -1234307 -3406168 -4207542 -3946057 -3046802
38935 -3046802 -1510814 284656 1614041 2290235 2524649 2174355 1167144 204468 -130938
38926 -130938 -384141 -1072486 -1344347 -432025 451624 -171321 -1106345 106605 3035036
38917 3035036 4487139 3232100 1719566 2083097 3120499 2836955 1752648 1699766 2869773
38908 2869773 3963647 4245584 3839034 2809528 1343902 181427 -205168 -173484 71729
38899 71729 963048 2274655 2666268 1605994 452255 396609 638886 -3496 -1006444
38890 -1006444 -1307465 -1310224 -1796759 -1899563 -379421 1740090 2144786 629525 -646213
38881f46213K85011Q80248K01836n41685j024950j548383j510707k63071J301706
38872b866208J849408J519612J081756K01526j475681k464175j072472J539783
38864a686451K413224R18836n65294m76090j10715q69553j709956j048204M07490
38855b726713P89701J30652Q8835Q68701P10201r62983j985842m75533K078560
38846a484421K700083J106428k02094J26759O71726J23618n70303k93354M3177
38837B221619p00578j472709o82064Q22955R10935l19906p44786K69523J083596
38828A388585O81345p3431m51658p77865q13571L63162K052786J912560n69273
38819C712640k729271k238361q5349J312061J212246L86271m42867n93323M86762
$$ plain form
38881 -646213 -361202 519046 720882 179197 -845753 -2394136 -3904843 -4167914 -2866208
38872 -2866208 -1016800 502812 1584568 1786094 310413 -2153762 -3226234 -1686451
38864 -1686451 726773 1645609 1080315 604225 493510 -376043 -2085999 -3134203 -2726713
38855 -2726713 -1937012 -1806360 -1717525 -848824 -138623 -1101606 -3087448 -3562981 -1484421
38846 -1484421 1215662 2322090 2119996 2246755 2918481 3042099 2471796 2178442 2221619
38837 2221619 1521041 48332 -633732 189223 1100158 780252 35466 304989 1388585
38828 1388585 2069930 1996499 1544841 766976 -46595 316567 2369353 4281913 3712640
38819 3712640 983369 -1254992 -1340341 -28280 1183966 1570237 1127370 534047 1020809
38810A020809J784584J185255j224760k407102p04137J305380O39814j458841
38802A41002j662343K61892J670606J447886Q34787L27968r03339k400620k330625
38793b612786n80233P23141M66473l6824L91535J029573R32616M69858K59421
38784A042774J15374j83313l77073m41698n76881l64628O25723J482107R50631
38775B273016l13578n36967J85984Q4131r68408j066326K16994Q52460l1024m72131
38765B24151P85113J822429O97210j290877j802240r42462j68048M67147J395970
38756A188393J495847j64954j763024r23395J311550J794709J57355p77390L76545
38747B695636J591069Q96991p70579j459665r83432m52111l51124l04706K5285
$$ plain form
38810 1020809 2805393 3990648 2765888 358786 -345351 960029 1599843 141002
38802 141002 -1521341 -1259449 411157 1859043 2693830 3021798 2118459 -282161 -2612786
38793 -2612786 -3193019 -2469878 -2003405 -2040229 -1648694 -619121 313495 783353 1042774
38784 1042774 1158148 974835 597762 156064 -420817 -785445 -159722 1322385 2273016
38775 2273016 1959438 1422471 1608455 1692586 724178 -342148 -125154 727306 696282 224151
38765 224151 1009264 2831693 3528903 2238026 435786 -506676 -674724 -207577 1188393
38756 1188393 2684240 2519286 756262 -167133 1144417 2939126 3096481 2319091 2695636
38747 2695636 4286705 5183696 4413117 2953452 1970020 1517909 1166785 862079 887364
38738H87364O00394J050731Q18150j02770o90113j16755P91130N81307n45697
38729C273741j033082m92268j46117n18135n94342R6490M16783m12479j377492
38720g86901j302744n67234j13150J7629J00096r1480m34994n2283J099279J581278
38710e50504P56715K38614J315660K382380J263663r64678j284745N34043J514078
38701E205226J42150j443178j036114M04005P81335J28527j91980j53333p09332
38692C127306j526045j249927J04989R27329L71505o16250r79775q58365o94940
38683a394173l03923M05797P55483K32560n47147o29197J7499P72897J407808
38674G17604J968439J988219R15860o59992j294291n67519J96025l15206j598819
$$ plain form
38738 887364 1487758 2538489 3356639 3253869 2563756 2447001 3238131 3819438 3273741
38729 3273741 2240659 1748391 1602274 1084139 489797 586287 1003070 590591 -786901
38720 -786901 -2089645 -2656879 -2770029 -2752400 -2652304 -2743784 -3178778 -3231061 -2131782 -550504
38710 -550504 206211 444825 1760485 4142865 5406528 4441850 3157105 3691148 5205226
38701 5205226 5347376 3904198 2868084 3272089 4053424 4181951 3989971 3836638 3127306
38692 3127306 1601261 351334 456323 1383652 1755157 1138907 159132 -699233 -1394173
38683 -1394173 -1698096 -1292299 -536816 -304256 -851403 -1480600 -1463101 -690204 717604
38674 717604 2686043 4674262 5590122 4930130 3635839 3068320 3264345 2949139 1350320
38665A350320k060140j112938K94399J065695R73807K82197o44284j007862J14863
38656g43943K322518L511440K100681o97402k061996j032157M57641L46652r85915
38647C217519j682108r56883L21867J017349P44349j01073n75232N3341J058277
38638C097406N65258j834150l707581k647717J96349J571186P89209L57618J554219
38629e8203K230232M49298k143330k715035j227415K99829J139286J908750K188870
38620B072282Q87643j222195j924088p49344M87243O19499L99197M24248O1563
38611A056048q05698j048885k60860M38368M88026Q02105J526450J051704j159867
38602B087391k806286j856403K52408Q49076R3957J61246J250522J353752r4125
$$ plain form
38665 1350320 -709820 -1822758 -1528359 -462664 511143 793340 149056 -858806 -743943
38656 -743943 1578575 5090015 7190696 6493294 4431298 3399141 3856782 4203434 3217519
38647 3217519 1535411 578528 900395 1917744 2662093 2561020 1985788 2039129 3097406
38638 3097406 3662664 1828514 -1879067 -4526784 -4330435 -2759249 -1970040 -1612422 -58203
38629 -58203 2172029 2621327 477997 -2237038 -3464453 -3164624 -2025338 -116588 2072282
38620 2072282 2959925 1737730 -186358 -935702 -448459 171040 570237 994485 1056048
38611 1056048 250350 -798535 -1059395 -621027 -133001 669104 2195554 3247258 2087391
38602 2087391 -718895 -2575298 -2322890 -1473814 -1379857 -1218611 31911 1385663 1291538
38593A291538j115623l38289J025301J272077N35198k1965n2981m5890l22913
38584B226453q13768j285762j347568p24043K46919Q91873R93433P71493L25283
38575A284313j52735k1331Q56306J194818k34525k375686k801355r94675R95143
38566b249727J537661J252987J184356R89700J26430o81045n62169J8108K00510
38557A816811J77749M36776N12385j33073q30865p39987l91990o71830r75007
38548g99031j65292J103684J016106n13031j549651j049006j60188j66N7586P96923
38538a262066J390512P08067n66704p34222L80472J155457N40427m92911l58326
38529G60706R97517J983086J245315p29718k058505j461378L73413J624107J347448
$$ plain form
38593 1291538 175915 -162374 862927 2135004 2670202 2648237 2595256 2549366 2226453
38584 2226453 1412685 126923 -1220645 -1944688 -1697769 -805896 187537 959030 1284313
38575 1284313 1131578 1110247 1966553 3161371 2926846 551160 -2250195 -3244870 -2249727
38566 -2249727 -712066 540921 1725277 2714977 2841407 2160362 1598193 1616301 1816811
38557 1816811 1994560 2431336 2943721 2810648 1979783 1239796 847806 175976 -799031
38548 -799031 -964323 139361 1155467 642436 -907215 -1956221 -2116409 -2116575 -2058989 -1262066
38538 -1262066 128446 836513 269809 -464413 -83941 1071516 1611943 1119032 760706
38529 760706 1758223 3741309 4986624 4256906 2198401 737023 1110436 2734543 4081991
38520D081991K17889o48605q94569p25741l06063P6408j02470p54679p65815N22623
38510G00969J783416J037717j392892k769205j406078J077146K012396J056545
38502B100014r8694n33678p85631j020758n24797N99415J008298J73864o34955
38493B83078l65916K42028K87117N14908J809069K900085J688627j454316l718566
38484B186114l375974j576308k73426O3530P4062K16510O47032J375976J863902
38475A201418J343390R7169n38652n3327L67593l63424j524988j692736q40716
38466b004273j77714k50295l50362J54769Q17265Q02592J29916k62416K22784
38457i17734Q48315M06377q58618j158722L27148J901043J608929J44172l86266
$$ plain form
38520 4081991 4299880 3651275 2756706 2030965 1724902 1801310 1698840 944161 178346 700969
38510 700969 2484385 3522102 2129210 -639995 -2046073 -968927 1043469 2100014
38502 2100014 2001320 1467642 682011 -338747 -863544 -264129 744169 918033 283078
38493 283078 -82838 159190 446307 961215 2770284 5670369 7358996 5904680 2186114
38484 2186114 -1189860 -2766168 -3039594 -2976064 -2902002 -2685492 -2038460 -662484 1201418
38475 1201418 2544808 2641977 2103325 2049998 2417591 2054167 529179 -1163557 -2004273
38466 -2004273 -2181987 -2432282 -2782644 -2627875 -1810610 -1008018 -878102 -1140518 -917734
38457 -917734 -69419 336958 -521660 -1680382 -1353234 547809 2156738 2300910 1914644
38448A914644L8463m46586j958442k283696o30546Q82350P83011N34436J460655
38439B94289K059382Q03119p51098n64036J75280p48092k277156j713190M34222
38430b287280J227532M05719N00830J811282J702636k50469r03613R85777K155171
38421E347585J91985k298242k059559n03098q37780k322747j725878Q20104J849278
38412a538352K38667j175726k80499J443623J873023J242802P09735J26094j026360
38403A613007j982288j674042n32769P5748k22844n03032K6197J013423J430730
38394g55870P67957k82665n10450K55714P58305N0303r75207q15156L38246Q97457
38384b71366L40444j95423P408K21847n6907k8482P79420J190733J41050j237615
$$ plain form
38448 1914644 1953107 1506521 -451921 -2735617 -3366163 -2483813 -1700802 -1166366 294289
38439 294289 2353671 3156790 2405692 1841656 2016936 1268844 -1008312 -2721502 -2287280
38430 -2287280 -1059748 -654029 -153199 1658083 3360719 3110250 2206637 3192414 5347585
38421 5347585 5539570 3241328 1181769 678671 -159109 -2481856 -4207734 -3387630 -1538352
38412 -1538352 -1299685 -2475411 -2755910 -1312287 560736 1803538 2513273 2639367 1613007
38403 1613007 -369281 -2043323 -2576092 -2500344 -2723188 -3226220 -3200023 -2186600 -755870
38394 -755870 12087 -270578 -781028 -525314 232991 283294 -691913 -1507069 -1168823 -271366
38384 -271366 69078 -126345 -118937 102910 46003 17521 796941 1987674 2128724 891109
38374H91109r84969P17860J659288O64741j026731j799377j631616j281755o84120
38365c475570O40585K119799K334293Q13731j198984k080115j420831m8966J055648
38356a260410J441727J101945L11221l86207m85607p5356J81865r0745l54939
38347C83494J69978J249626J647367P10832n92381q99911l97319n20654j595042
38338A55990j993858m81632J584214J791053Q600j389283p83561P38835J261489
38329H91847M93139n35374j069830q70175J56404J371408J335205l46793j881520
38320d55689j457242J66765R20578N86203N83266R75299K60247j526081k117157
38311b063811m67133J386998J356744K38084j04072K18936j4695m86094O8172
$$ plain form
38374 891109 -93860 624000 2283288 2948029 1921298 121921 -1509695 -2791450 -3475570
38365 -3475570 -2834985 -715186 1619107 2432838 1233854 -846261 -2267092 -2316058 -1260410
38356 -1260410 181317 1283262 1594483 1208276 722669 647313 829178 738433 383494
38347 383494 553472 1803098 3450465 4161297 3568916 2669005 2271686 1751032 155990
38338 155990 -1837868 -2319500 -735286 1055767 1064367 -324916 -1108477 -369642 891847
38329 891847 1384986 849612 -220218 -1090393 -933989 437419 1772624 1425831 -455689
38320 -455689 -1912931 -1746166 -825588 -239385 343881 1319180 1579427 53346 -2063811
38311 -2063811 -2530944 -1143946 212798 450882 346810 565746 551051 64957 133129
38302A33129J202109J041084p31720k132878j549459L22393J692885J695290P29559
38293B402392l08192o81268k85588K59688L71789K77298N30566R90580R82658
38284D539923L52512l55022p03161p01551m45409p1746L8994l18035o60508l91932
38274A284065K22095L46895j98362o92780n39608K7381L55011R5358n16035q90357
38264e06337p02928l34489l23870m08064J31887J060642J225202M07773j50407
38255C99409K04374M16993k40281n54151N47213J683486R75675o79448q24784
38246A928486N43767R02567p26670k273705j878107l30582P40043J116907J228189
38237A250895Q19972k12298q83313l24860Q66958J456829J030580l0810j165240
$$ plain form
38302 133129 1335238 2376322 1644602 -488276 -2037735 -1715342 -22457 1672833 2402392
38293 2402392 2094200 1412932 1127344 1387032 1758821 2036119 2566685 3557265 4539923
38284 4539923 4892435 4537413 3834252 3132701 2687292 2615546 2654540 2336505 1675997 1284065
38274 1284065 1506160 1853055 1654693 961913 422305 449686 804697 900055 384020 -506337
38264 -506337 -1209265 -1543754 -1867624 -2275688 -2143801 -1083159 142043 549816 399409
38255 399409 603783 1020776 780495 226344 773557 2457043 3432718 2753270 1928486
38246 1928486 2472253 3374820 2648150 374445 -1503662 -1834244 -1094201 22706 1250895
38237 1250895 2070867 1858569 975256 650396 1517354 2974183 4004763 3973953 2808713
38228B808713j595959o65157J060131J886965R15353q85162k017717j998224j109433
38219a600490K91078J541677J747564Q44743j59577n12436m28278j54418M90207
38210B060070J147090Q18774n22833j493318j271057p35730p58386p57009q6412
38201a598811N18309L02452P1021P79247J550169R28405n35569q52091M49296
38192A612428J626373J147035m96399j648281j262397K98570J565868J156989
38184D000186p43660k320003k045970k84624J444101K066619J263172p81511k878838
38175b80528l025989n50595K431672L121670J350991m94786o68839J87626N76868
38166B648090J39861l82337l99280j08347o2387l35629l18874L53064R47644N32883
$$ plain form
38228 2808713 1212754 547597 1607728 3494693 4410046 3524884 1507167 -491057 -1600490
38219 -1600490 -1309412 232265 1979829 2824572 2664995 2152559 1724281 1569863 2060070
38210 2060070 3207160 4025934 3503101 2009783 738726 2996 -755390 -1512399 -1598811
38201 -1598811 -1080502 -778050 -707029 72218 1622387 2550792 2015223 1163132 1612428
38192 1612428 3238801 4385836 3889437 2241156 978759 1277329 2843197 4000186
38184 4000186 3256526 936523 -1109447 -1394071 50030 2116649 3379821 2598310 -280528
38175 -280528 -3306517 -3857112 -1425440 1696230 3047221 2552435 1883596 2071222 2648090
38166 2648090 2787951 2405614 2006334 1897987 1835600 1499971 1181097 1534161 2481805 3014688
38156C014688m19911o05902j56185o23111k125824k506275n84451J644746J853825
38147e08400P77003N89454J251224J030044j97828q99346p73378j007700j635472
38138a374399j246629K70090J137839N38050j51197J69196O49033M07562K83258
38129F82803J206176K187979J582392l45174j576247r47107M39914O79946n46829
38120C363853j555631q53606P05873R80246k77766r30623J24939R79977k05494
38111B331768j911309j473050O76051J851946J449459J234426J516658M83557
38103F159506k044620l458096k212274j31609N46583Q7628j93391j48800j03681
38094a498754J50301L58989l30227j395237r64005J001293J994135R33588J18865
$$ plain form
38156 3014688 2594777 1988875 1832690 1209579 -916245 -3422520 -4006971 -2362225 -508400
38147 -508400 268603 858057 2109281 3139325 2941497 2042151 1268773 261073 -1374399
38138 -1374399 -2621028 -2350938 -1213099 -675049 -826246 -657050 -8017 399545 682803
38129 682803 1888979 4076958 5659350 5314176 3737929 2790822 3230736 3910682 3363853
38120 3363853 1808222 954616 1660489 2640735 2362969 1432346 1557285 2537262 2331768
38111 2331768 420459 -1052591 -376540 1475406 2924865 4159291 5675949 6159506
38103 6159506 4114886 656790 -1555484 -1687093 -1140510 -1052882 -1246273 -1395073 -1498754
38094 -1498754 -1348453 -989464 -1319691 -2714928 -3678933 -2677640 -683505 250083 368948
38085C68948J151278J758921l28247k768476j691195K040554L715462J548726
38077E795971j241327j558929k44249L55327q9317l95511j61435P606k57137o22279
38067A588720n07219K56925R44248N19446p12047r26655O09862J840097O60012
38058D273389j533438j562199N87043J521047k81583j991861q48000J500179J551297
38049C215874p29122k032017p00081J140417J010057n41633j243841l84732P76917
38040E11839J191159R83518L40970r21596k140709j672358P77369K747103J666871
38031C484166j490201l048939j299294J462281K199640Q00411o27711q05783j73563
38022E01007N04449R39217R19067K48168p97489j531129j386629k63227J244020
$$ plain form
38085 368948 1520226 3279147 2950900 182424 -1508771 531783 4247245 5795971
38077 5795971 4554644 2995715 2751466 3106793 3017476 2621965 2460530 2468136 2210999 1588720
38067 1588720 1081501 1338426 2282674 2802120 2090073 1163418 1773280 3613377 4273389
38058 4273389 2739951 1177752 1764795 3285842 3004259 1012398 164398 1664577 3215874
38049 3215874 2486752 454735 -245346 895071 1905128 1363495 119654 -265078 511839
38040 511839 1702998 2686516 3027486 2105890 -34819 -1707177 -929808 1817295 3484166
38031 3484166 1993965 -1054974 -2354268 -891987 1307653 2108064 1480353 674570 501007
38022 501007 1005456 1944673 2863740 3111908 2314419 783290 -603339 -866566 377454
38013C77454J927683J110502j39947n7127J228620J544184j86598k195826k407338
38004A201607j296058p09033r94748j048771m37477K46006O55162Q20969M95102
37995a067241k64099m66380M15225J145694M42239p58843o40996N08275Q19140
37986A33014R504l17169L86572P36203j8902p36994n23313k24300p32166j373418
37976b660969j157606m07993J5470J96990P63725J622255K046982J677996P51464
37967B848314l93604j507638k260310k242132j264925K40727J225144R32731n4772
37958b476465m02668J30123M63248K06712M27836J515431J963271P93886m20950
37949B200424J6968R32914J93104j527260j780245m43365L17096j16610k33092
$$ plain form
38013 377454 2305137 3415639 3275692 3218565 4447185 5991369 5804771 3608945 1201607
38004 1201607 -94451 -803484 -1798232 -2847003 -3284480 -3038474 -2383312 -1562343 -1067241
37995 -1067241 -1331340 -1797720 -1382495 -236801 205438 -553405 -1194401 -686126 133014
37986 133014 142518 -174651 211921 948124 929222 192228 -331085 -555385 -1287551 -2660969
37976 -2660969 -3818575 -4226568 -4211098 -4014108 -3250383 -1628128 418854 2096850 2848314
37967 2848314 2454710 947072 -1313238 -3555370 -4820295 -4579568 -3354424 -2421693 -2476465
37958 -2476465 -2879133 -2749010 -2285762 -2079050 -1651214 -135783 1827488 2621374 2200424
37949 2200424 2217392 3150306 3343410 1816150 35905 -407460 -90364 -206974 -440066
37940d40066K87138K6060q92453m01568J600779K272042L09165j636475j012028
37931A12594Q08693J027470l75946j321030r35510P230P90165J056561M39507
37922A609734o37192q91442j20633J65220p77452j456823n37178R80408J486522
37913a78836J025394L14732p09721j727174j343895N20046J520175L17967q94639
37904a155951J86022K037838J830824J59042k57328O08073L90643j075139j361549
37895A362475J31257R68381k76040j830800j687248k45440J084812J796822J783184
37886C087403P77639p28489j509709j217467o31301p3165Q15075J574997J110890
37877C205873l19206j188456j093522j078422j287795o00152Q26610J114036k37108
$$ plain form
37940 -440066 -152928 -126868 -1019321 -1420889 179890 2451932 2761097 1124622 112594
37931 112594 921287 1948757 1572811 251781 -683729 -676499 113666 1170227 1609734
37922 1609734 972542 81100 -39533 125687 -651765 -2108588 -2645766 -1665358 -178836
37913 -178836 846558 1161290 451569 -1275605 -2619500 -2099454 -579279 -261312 -1155951
37904 -1155951 -969929 1067909 2898733 3057775 2800447 3408520 3799163 2724024 1362475
37895 1362475 1493732 2462113 2186073 355273 -1331975 -1577415 -492603 1304219 3087403
37886 3087403 3865042 3136553 1626844 409377 -221924 -295089 519986 2094983 3205873
37877 3205873 2886667 1698211 604689 -473733 -1761528 -2361680 -1535070 -421034 -658142
37868f58142j189995m22073N51008J40341n60911J44178J452714J398256J20794
37859I76170n99231l94403n20989j170531q31770J120904K909534K412346j05440
37850C796590k198577j971394o7784J232060P07820n08755o55358K79010Q53450
37841A467062M91231J01652K75692L68036q2125m45743l48822n85891j569117
37832c28025k029843p08977J410954K085362P18109j024572j444380n55297M66642
37823a410027O80546O5593n70629k84322R56229J980653J612992N1416j362623
37814A719828j632185r78983l44992l45477o55393l42142R49241K192209J973188
37805B535294M18423p21654l68974L98006j0351j302106j752294p65800K70280
$$ plain form
37868 -658142 -1848137 -2270210 -1719202 -1578861 -2139772 -1995594 -542880 855376 976170
37859 976170 376939 -17464 -538453 -1708984 -2540754 -1419850 1489684 3902030 3796590
37850 3796590 1598013 -373381 -441165 790895 1498715 989960 334602 613612 1467062
37841 1467062 1958293 2059945 2335637 2703673 2621548 2175805 1826983 1241092 -328025
37832 -328025 -2357868 -3066845 -1655891 429471 1147580 123008 -1321372 -1876669 -1410027
37823 -1410027 -729481 -663888 -1234517 -1518839 -562610 1418043 3031035 3082451 1719828
37814 1719828 87643 -891340 -1236332 -1581809 -2237202 -2579344 -1630103 562106 2535294
37805 2535294 2953717 2232063 1863089 2261095 2250744 948638 -803656 -1569456 -1299176
37796a299176n3223j316760j921281j057846N17449J482996J295458M85152j34446
37787b001677l01667k90891k91115j47378K42109O10597O23379L17235L0671j9630
37777a228367Q8150K23095M37222P71751Q59653J34398j182663j697267l21008
37768a915036J889511K507928P98857j152587j212284J9097M76515k22108o09589
37759E80304O1918R07202J139226J052557R07735K77151r44814k011045k287414
37750c17180j842539q83299L51827J066840N80506l08421r1748J033517J193722
37741G83225j68881j143674k04639J412735J543503N8510j418362j820536j301722
37732b259841k99613P67604J302339J051548N27494K86823K77320K70779J52994
$$ plain form
37796 -1299176 -1352399 -2669159 -4590440 -5648286 -5130837 -3647841 -2352383 -1867231 -2001677
37787 -2001677 -2303344 -2594235 -2885350 -3032728 -2790619 -2180022 -1556643 -1239408 -1208737 -1228367
37777 -1228367 -1140217 -917122 -479900 291851 1151504 1285902 103239 -1594028 -1915036
37768 -1915036 -25525 2482403 3281260 2128673 916389 935486 1412001 1189893 580304
37759 580304 642222 1549424 2688650 3741207 4648942 4926093 3981279 1970234 -317180
37750 -317180 -2159719 -3043018 -2691191 -1624351 -1043845 -1352266 -1444014 -410497 783225
37741 783225 614344 -529330 -733969 678766 2222269 2280779 862417 -958119 -2259841
37732 -2259841 -2559454 -1791850 -489511 562037 1089531 1376354 1653674 1924453 2077447
37723B077447m69273j765976k516217j139894J474063K229212J07252j966775
37715a970161j316687N71568Q07291r3613N71842K686952L182591R93578j211733
37706D221628j127559J47666M46057l17113q55178p75704n93232m69798k18289
37697D58478K7664L3189q1203j20421j00098L626K41871L41093J8607l69354k53138
37686B00314J86014L50099L23939N87553Q48297M21003l62073n21913j58540k76393
37676A598300q58015q14980m8152K93633j2131J54249Q48719M46458j417385k456873
37666b266177j011497J110533J189983l77737j013026o5322N77389j29382q06162
37657b791398k9242J547655K336395J862577Q24051j08827q01839j342054j676096
$$ plain form
37723 2077447 1608174 -157802 -2674019 -3813913 -2339850 -110638 -3386 -1970161
37715 -1970161 -3286848 -2715280 -1907989 -2001602 -1429760 1257192 4439783 5433361 4221628
37706 4221628 3094069 3241735 3687792 3370679 2515501 1739797 1146565 676767 458478
37697 458478 486142 519331 438128 317707 217609 221235 463106 804199 822806 453452 200314
37686 200314 386328 736427 1060366 1647919 2496216 2917219 2555146 2033233 1874693 1598300
37676 1598300 740285 -74695 -122847 170786 158655 312904 1161623 1608081 190696 -2266177
37666 -2266177 -3277674 -2167141 -977158 -1354895 -2367921 -2433243 -1855854 -1985236 -2791398
37657 -2791398 -2820640 -1272985 1063410 2925987 3750038 3641211 2839372 1497318 -178778
37648a78778j473416m17015J094065J863419J141597k76086r30397n26999q0621
37639B15769l11772q00446q44150l22435M77140J133553J057767L9979r82496
37630c37091p04472O41367J281212M34494l82198L02952J416572R08963q49417
37621B712382j421418j17912Q70305L3750r65581q9780J503611J103047j222651
37612B405753k605709j650469j27709K07871P8759P52979J683516J708661J097107
37603C550759O82537J59044r97916j901686j392321n2593P15714R17633J370193
37594C051364J619055O96554n42860l95523N27633r4745k197006k814207o75741
37585h25476J567265J368037k6168j29441O46306J60456j480429k047094q37280
$$ plain form
37648 -178778 -1652194 -2069209 -975144 888275 2029872 1753786 823389 296390 215769
37639 215769 -96003 -896449 -1740599 -2063034 -1585894 -452341 605426 645405 -337091
37630 -337091 -1041563 -400196 881016 1315510 933312 1236264 2652836 3561799 2712382
37621 2712382 1290964 1173052 2043357 2077107 1111526 1021746 2525357 3628404 2405753
37612 2405753 -199956 -1850425 -1978134 -1770263 -1691504 -938525 744991 2453652 3550759
37603 3550759 4233296 4392340 3394424 1492738 100417 47824 763538 1681171 3051364
37594 3051364 4670419 5366973 4824113 4428590 4956223 4861478 2664472 -149735 -825476
37585 -825476 741789 2109826 2083658 1954217 2600523 2760979 1280550 -766544 -1603824
37576a603824M35446N17531J52041K99065O68025P01014O01436O36077M36671
37567B843482l10310j163401j438085r83765k11998K73264R1104m14863k96598
37558a611170P34869J465162N55291j354164k084568p08622J217478J750243R15384
37549H79903J45035O7459l2688p06433j356128j145556k26939N42085P85375Q25877
37539b22010P93600L61549l21647l39835N62544J013757k87400k299880k575090
37530c314412n13579J864220K747724K482573J979454R40312r73753k596600k575977
37521C9962j368249l51564K56119R62802J296669N09694n20903k53737Q32414
37512A403207P90634m17641n67960J098902K249376R61986j198511j527660j43917
$$ plain form
37576 -1603824 -1168378 -650847 -498806 -199741 468284 1169298 1770734 2406811 2843482
37567 2843482 2533172 1369771 -68314 -1052079 -1264077 -990813 -899709 -1314572 -1611170
37558 -1611170 -876301 588861 1144152 -210012 -2294580 -3003202 -1785724 -35481 879903
37549 879903 1024938 1092397 1059709 353276 -1002852 -2148408 -2375347 -1833262 -1047887 -222010
37539 -222010 571590 933139 611492 271657 834201 1847958 1560558 -739322 -3314412
37530 -3314412 -3827991 -1963771 783953 3266526 5245980 6186292 5212539 2615939 39962
37521 39962 -1328287 -1679851 -1423732 -460930 835739 1345433 824530 570793 1403207
37512 1403207 2193841 1776200 1208240 2307142 4556518 5518504 4319993 2792333 2648416
37503B648416N77512k44273j028447m77510O08869P92108m5565r21228j169679
37494G40203r61354p19169n23443j53711M17156P56486M38074k95205p48162o60913
37484a710038l29493J93299J182356K230573K143535N41661j262428j836944j321922
37475a69401o05114K79680J506139J965542M38649j846020k033762L37939K184271
37466B057923R79101j697342k476622q50760O58438M64503k47359M2912R26129
37457a43077J172867O82535J75711j48133n16674p12655l45869K82694M57807
37448I05206N0618m22191n64493l51376J12309M67590R3825r78864j466052j72196
37438b325624K113920L163965J996026K4421q95798o46572l94174o81691r02338
$$ plain form
37503 2648416 3225928 2981655 1953208 1475698 2084567 2876675 2831110 1909882 740203
37494 740203 -221151 -940320 -1463763 -1617474 -1200318 -443832 -5758 -300963 -1049125 -1710038
37484 -1710038 -2039531 -1846232 -663876 1566697 3710232 4251893 2989465 1152521 -169401
37475 -169401 -774515 -494835 1011304 2976846 3415495 1569475 -464287 -126348 2057923
37466 2057923 3037024 1339682 -1136940 -1987700 -1329262 -864759 -1112118 -1069206 -143077
37457 -143077 1029790 1712325 1888036 1739903 1223229 510574 164705 447399 905206
37448 905206 955824 533633 -30860 -382236 -269927 197663 291488 -687376 -2153428 -2325624
37438 -2325624 -211704 2952261 4948287 4972708 4076910 3430338 3036164 2354473 1452135
37429A452135m46859M19533R61781Q25824K84255k27543o39120j154049j654736
37420a78779j597185q06673L0988K36243J55539N58200J271136J398265Q50905
37411A918639N35557P95371Q08453L7978p52615o50211L6787L13249j62704q99674
37401A980830j249267q08427K98125J179322R13986j34284n80225M6629O75995
37392B322684M90318Q6047Q2228q8703r05657j525022j133635m02918j70464J75876
37382a069246J325250K177972J389017r0543k80671O12068O75005l54408q51930
37373C532514m48890n99856j491249j240369O90523J929565P19847j202844j265950
37364F23291J51645Q18478K87723L6097N54657O10995m59032j537471j334804
$$ plain form
37429 1452135 1005276 1424809 2386590 3212414 3496669 3269126 2630006 1475957 -178779
37420 -178779 -1775964 -2582637 -2551649 -2315406 -2159867 -1601667 -330531 1067734 1918639
37411 1918639 2454196 3249567 4058020 4095998 3343383 2693172 2729959 3043208 2880504 1980830
37401 1980830 731563 -76864 221261 1400583 2314569 2180285 1600060 1646689 2322684
37392 2322684 2813002 2899049 2981277 2892574 1986917 461895 -671740 -1074658 -1245122 -1069246
37382 -1069246 256004 2433976 3822993 3732450 3451779 4063847 4738852 4384444 3532514
37373 3532514 3083624 2483768 992519 -247850 442673 2372238 3092085 1889241 623291
37364 623291 774936 1593414 1881137 1917234 2471891 3082886 2623854 1086383 -248421
37355b48421p1989R75658R83057K67997k40283q0835K34727K7135m43682l75847
37345A027517J64578K90716j00280o1092O25608Q35670O5028m61681J78052Q17970
37335C382086j443j519300j831806p82462R9384J66919K36877O10241L90181p71522
37325b0845j773990j575863n09588M53829Q20183N25806k51359p13215J72837
37316b872205K160489L325581K089951o95166k505903j920890J0465J249000J009451
37307A850773J63764j76527J90518Q22630J291739J155335m3881j930969k905516
37298D17866j692085Q11222K322448J859376N24470m32742r27030j060640l95577
37289A427308R51922J760933J223668L0017q05931j080187p02153O45555K196773
$$ plain form
37355 -248421 -320410 655248 1638305 1906302 1666019 1585184 1819911 1847046 1403364 1027517
37345 1027517 1192095 1482811 1382531 1321439 1947047 2782717 2847745 2386064 2564116 3382086
37335 3382086 3380643 1861343 29537 -752925 -653541 -486622 -249745 360496 750677 -20845
37325 -20845 -1794835 -3370698 -3880286 -3426457 -2606274 -2080468 -2331827 -3045042 -2872205
37316 -2872205 -711716 2613865 4703816 4008650 1502747 -418143 -407678 841322 1850773
37307 1850773 2014537 1838010 2028528 2851158 4142897 5298232 5254351 3323382 417866
37298 417866 -1274219 -462997 1859451 3718827 4243297 3810555 2883525 1822885 1427308
37289 1427308 2379230 4140163 5363831 5393848 4587917 3507730 2805577 3451132 5647905
37280E647905K113265J56246j271890l83169J288444J337856O1197p06859q45295
37271G397700j317317j510250l11371R89302K50529j488660j143483J194936J988289
37262F049675r9063k071631j470068J82195O53121M85830R02072J017525k10152
37253E439504j450521j049443J49821M62242J98122M87649Q98647O63124O62619
37244F461764J574735J665625n47449k838445j961703J075953K173595L23726
37236G927801j218985m53379N16436l80468j495020k67466K458500L525229J862819
37227A2475467m02707j021091j37499N82938L21056j53866L6187M36544P3807
37218A2210836o39357k09066J457719K549955K161236J791097K702375L679862
$$ plain form
37280 5647905 7761170 7917416 6645526 6262357 7550801 8888657 8949854 8242995 7397700
37271 7397700 6080383 4570133 4258762 5248064 5498593 4009933 2866450 4061386 6049675
37262 6049675 5950612 3878981 2408913 2591108 3244229 3730059 4632131 5649656 5439504
37253 5439504 3988983 2939540 3089361 3551603 3749725 4237374 5136021 5799145 6461764
37244 6461764 8036499 9702124 9154675 6316230 4354527 5430480 7604075 7927801
37236 7927801 6708816 6255437 6771873 6391405 4896385 4628919 7087419 10612648 12475467
37227 12475467 12072760 11051669 10914170 11497108 11818164 11664298 11700485 12137029 12210836
37218 12210836 11571479 11362413 12820132 15370087 17531323 19322420 22024795 25704657
37210B5704657L321545K701880L318947M137322L645395L296422N353991Q512751
37202E9992910R700013R491829J1343798J5763413J9981903K3460000K8600299
37195A78334165L5740029M3297307N3083879O6990305P5445195N9341299J2404714
37188E24636893m4006554p8424095p9903515o3578002m8355995l9248784l2233655
37181A38886293k5576911k0447556j6485511j2716084j0035962r052217p980243
37174C6591809n537945l346346k927092k968410k043225j317532j917680k281943
37166A4251636j035408J0055j071530k490690j521544O78086Q42301r47175j492120
37157G223611J91735J473167M56623j356613j671571m12789Q11855P80581m15291
$$ plain form
37210 25704657 29026202 31728082 35047029 39184351 42829746 46126168 51480159 59992910
37202 59992910 69692923 79184752 90528550 106291963 126273866 149733866 178334165
37195 178334165 214074194 257371501 310455380 377445685 452890880 512232179 524636893
37188 524636893 480630339 402206244 322302729 258724727 210368732 171119948 138886293
37181 138886293 113309382 92861826 76376315 63660231 53624269 44572052 36591809
37174 36591809 31053864 27707518 24780426 21812016 19768791 18451259 16533579 14251636
37166 14251636 13216228 13226283 12154753 9664063 8142519 8820605 9662906 8715731 7223611
37157 7223611 7415346 8888513 9345136 7988523 6316952 5904163 6716018 7496599 7081308
37148G081308j553757j339004l2147N56599l73894j174962k86241J072089P35704
37139D685695r65918j922858j554379r31129k84278Q97885J736314Q35635q20633
37130A676334q16987P10477J108729l39647j229351k27284P63317J32397p17921
37121A060064j80941N96724m1766j069470m42757J349354J937214O04584r73755
37112B839251j230313k54867R84606J659058J411540N65516j45672m42770n46469
37103D839880k50507Q81462K088172J737797k38529j855456j862370j280931j153265
37094B906253p94027K14652L76379j264138k778008j928167K59760J108570M20171
37085a478555K08545R78448J203091L87194j51799J21484R0076p12012j116622
$$ plain form
37148 7081308 5527551 4188547 4156400 4712999 4339105 3164143 2877902 3949991 4685695
37139 4685695 3719777 1796919 242540 -688589 -972867 -74982 1661332 2496967 1676334
37130 1676334 859347 1569824 2678553 2338906 1109555 882271 1645588 1777985 1060064
37121 1060064 879123 1475847 1434081 364611 -78146 1271208 3208422 3813006 2839251
37112 2839251 1608938 1354071 2338677 3997735 5409275 5974791 5829119 5386349 4839880
37103 4839880 4589373 5470835 7559007 9296804 9058275 7202819 5340449 4059518 2906253
37094 2906253 2112226 2326878 2703257 1439119 -1338889 -3267056 -3007296 -1898726 -1478555
37085 -1478555 -1270010 -291562 911529 1298723 1146924 1268408 1358484 646472 -470150
37076d70150l91768N15149N35720j99467j117267j883930j963016r01207O06583
37067e269353J267262R87058P68181Q50662N80884Q2031J48195M03947k72585
37058d53718j247384n38657J607760K237882Q6041k108814j570352M50857R54655
37049e81730j75476n78245M86316J252978N67206n09102o46739j7958M85928N44117
37039H27295L53603J37496Q5398K00065Q8467n62195j353272j563866j033894
37030b820903j42139P96972J475268J316812J65089r49777p37249N68603J261265
37021I33941L04677j314224j850228r25374K08554M04771K7994K75900J355678
37012e78311K013571J205724l45243j016136m16185K96376K33443j25370J6388
$$ plain form
37076 -470150 -861918 -346769 188951 -10516 -1127783 -3011713 -4974729 -5875936 -5269353
37067 -5269353 -4002091 -3015033 -2246852 -1396190 -815306 -733275 -585080 -181133 -453718
37058 -453718 -1701102 -2239759 -631999 1605883 1691924 -416890 -1987242 -1536385 -581730
37049 -581730 -757206 -1335451 -849135 403843 971049 461947 -184792 -202750 283178 827295
37039 827295 1180898 1318394 1403792 1603857 1692324 1130129 -223143 -1787009 -2820903
37030 -2820903 -2963042 -2166070 -690802 626010 791099 -158678 -895927 -327324 933941
37021 933941 1238618 -75606 -1925834 -2851208 -2642654 -2237883 -2209889 -1933989 -578311
37012 -578311 1435260 2640984 2295741 1279605 863420 1159796 1393239 1267869 1284257
37003A284257N55819Q65313O70335L9198q50207j438020r66874M46123J501547
36994B107491J124777k52767j329094j375222n73339N31043J323336J295394M92205
36985C343824m62403j043136j149764p42236R8713O65196K07764p14274o77533
36976d73849L74453P59244l38891j421572j003716O0172J38758m96811m15438
36967b817650M04345P34310L39968J14458K08296p3784n45188j69833R89046J581197
36957G65165J046654K79798j18862o16868j284169j206285j43389O85314M19135
36948a73507r8089J71749O97642L32159p49865j311389q41197J4317O27352J039354
36938b91474J371734J321647N55151o80323j571823j431887m18288N38483O74849
$$ plain form
37003 1284257 1840076 2705389 3375724 3414922 2564715 1126695 159821 605944 2107491
36994 2107491 3232268 2979501 1650407 275185 -298154 232889 1556225 2851619 3343824
36985 3343824 2881421 1838285 688521 -53715 44998 710194 917958 203684 -473849
36976 -473849 -99396 659848 320957 -1100615 -2104331 -2044159 -1905401 -2402212 -2817650
36967 -2817650 -2413305 -1678995 -1339027 -1224569 -1016273 -1090057 -1635245 -1805078 -816032 765165
36957 765165 1811819 2091617 1972755 1355887 71718 -1134567 -1277956 -592642 -173507
36948 -173507 -271596 -99847 597795 929954 180089 -1131300 -1972497 -1958180 -1330828 -291474
36938 -291474 1080260 2401907 2957058 2276735 704912 -726975 -1145263 -606780 68069
36929F8069J14371n20778q94617r94065p52990j99645K90694M66033O36437J052407
36919g34084J249278P73339J44511J53773N39991M07279l15545r33445j223240
36910F1857j396129j103244R7965J436412J635104Q91529N11907N82193o3105
36901B654489j329867j532145k48855P06091K33312k94685L55421J009858L13476
36892A867095o23060j07917J006560O53894q72232j336534k27680N59751j04979
36883H14898j008353p43027L77599J205238J141441J40814j384778k261481j417649
36874c135298N13064J613361J078548L1221l92044m71418q65913j341610j277828
36865d247917n75238M96025J548697J840766Q07769p57100j186865j41729Q43486
$$ plain form
36929 68069 182440 -338338 -1232955 -2227020 -2980010 -3179655 -2888961 -2422928 -1786491 -734084
36919 -734084 515194 1288533 1433044 1586817 2126808 2534087 2218542 1285097 61857
36910 61857 -1334272 -2437516 -2339551 -903139 731965 1623494 2135401 2717594 2654489
36901 2654489 1324622 -207523 -456378 249713 483025 188340 543761 1553619 1867095
36892 1867095 1244035 1136118 2142678 2796572 1924340 587806 360126 919877 814898
36883 814898 -193455 -936482 -558883 646355 1787796 1928610 543832 -1717649 -3135298
36874 -3135298 -2622234 -1008873 69675 100896 -291148 -762566 -1628479 -2970089 -4247917
36865 -4247917 -4823155 -4327130 -2778433 -937667 -129898 -886998 -2073863 -2215592 -1372106
36856a372106O35338K0726P1575L44568q695m82764j48848M59686J08843r24211
36846a295888j115960o9434R71348J083983O72984K89066j27781m44577j49025
36837a85284M93014L97199n47253r23701R9014J321800J301641M71210Q4436o008
36827B506068p69175j766135j507762l1139Q62117L74230j85119J11332R9220
36818c06363j237886k365988j128779J678106K919715J360625p38730q72699N72894
36809a19105J480459J011244R6968l52860l31131m4734M03333N36579k18030j426756
36799A035967j720948n38034Q96455J059670J28856m14722L3164N07282J87769
36790A175459l14485j39784K55211q4612p34891l58585R03449J168762l50200
$$ plain form
36856 -1372106 -736768 -716042 -644467 -299899 -308594 -791358 -940206 -480520 -371677 -1295888
36846 -1295888 -2411848 -2481282 -1509934 -425951 247033 536099 408318 -36259 -185284
36837 -185284 307730 704929 157676 -766025 -667011 654789 1956430 2427640 2512076 2506068
36827 2506068 1736893 -29242 -1537004 -1568143 -706026 -331796 -516915 -405583 -306363
36818 -306363 -1544249 -3910237 -5039016 -3360910 -441195 919430 180700 -691999 -119105
36809 -119105 1361354 2372598 2469566 2116706 1785575 1740841 2144174 2680753 2462723 1035967
36799 1035967 -684981 -1223015 -326560 733110 861966 447244 480408 987690 1175459
36790 1175459 860974 721190 976401 891789 156898 -201687 701762 1870524 1520324
36781A520324j729521q58657J436321K432908J208041m41071q22587l93681l65689
36772A986388o90788n54426n2883j20351r38600j423793o03146J020512J914805
36763E37718J256692j24478p97174n01581k83809p82355j223035p03366K88797
36754b332591O27709L18358L12242P75561Q52293K36741l14395l61704m45102
36745c30888q53093q77130k2460R85430J235211R32155Q18247Q56132L78280p12920
36735B408964j613131j480800l33099Q55092R79435K8065p51369m46879J89220
36726a64502j8132n87444j38120R34226O54677j133299j834454R7664K382563
36717A93179J900313q38832k397033j014784J466543K269182P76236j250430j682009
$$ plain form
36781 1520324 -209197 -1067854 368467 2801375 4009416 3568345 2745758 2352077 1986388
36772 1986388 1295600 741174 688291 567940 -370660 -1794453 -2397599 -1377087 537718
36763 537718 1794410 1669932 872758 371177 87368 -694987 -1918022 -2621388 -2332591
36754 -2332591 -1704882 -1386524 -1074282 -298721 553572 790313 475918 114214 -330888
36745 -330888 -1183981 -2061111 -2083571 -1098141 137070 1069225 1887472 2743604 3121884 2408964
36735 2408964 795833 -684967 -1018066 -162974 816461 844526 93157 -353722 -164502
36726 -164502 -182634 -770078 -908198 26028 680705 -452594 -2287048 -2189384 193179
36717 193179 2093492 1254660 -1142373 -2157157 -690614 1578568 2354804 1104374 -577635
36708e77635k00512J214724M95122j682819k526044j022790O37237O09852J81696
36699b871169J035552J785739J71295k594871l037205n71050J801430K082494
36691b197785J453734J271535Q67471m62560j698218j721797r06375J4427R87108
36682b392460J640061J029466n72009j299115k00917J362887J781823J124050
36674B473786J20811j085498k126244k027808q33014r858j21257J40871J337891
36665b130320J747561K38412j253228m53725J522906J799686J44485r49461k17854
36656D48462R26905J071134O54194N29068M11588l57560j528385k147434j648262
36647a640290n11911M6215o05994j416030p63571J006777J569087l4777j634412
$$ plain form
36708 -577635 -778147 436577 931699 -751120 -3277164 -4299954 -3662717 -3052865 -2871169
36699 -2871169 -1835617 -49878 121417 -2473454 -5510659 -6081709 -4280279 -2197785
36691 -2197785 -744051 527484 1394955 932395 -765823 -2487620 -3393995 -3379568 -2392460
36682 -2392460 -752399 277067 -294942 -1594057 -1794974 -432087 1349736 2473786
36674 2473786 2594597 1509099 -617145 -2644953 -3477967 -3487825 -3609082 -3468211 -2130320
36665 -2130320 -382759 -144347 -1397575 -1851300 -328394 1471292 1615777 666316 448462
36656 448462 1375367 2446501 3100695 3629763 4041351 3683791 2155406 7972 -1640290
36647 -1640290 -2152201 -2105986 -2711980 -4128010 -4891581 -3884804 -2315717 -2350494 -3984906
36638c984906r58365J064974J945040J327366P46167N31932m07501j918537k257814
36629c911644p95224R95687J730510J596119J272721R53728P69160P64113L21417
36620C696587r50717j852227q57786J290289K231526J333235K18674l13834j388174
36611C407573l251378l900789j986756R13729K518818K650947K246070J224731
36603C822945o90216k265832j983572l60792P23612O19437K96972M73657P68704
36594A404915O40899R7525m76418n52140R5543O93640O5725j411972j644179K45139
36584h41323K029372J134713j571920k753288j038423J503740K446533J702973
36576B612377O08318j17548n65659p79427o45318k73050L9795O4189k46208o70118
$$ plain form
36638 -3984906 -4943271 -3878297 -1933257 -605891 140276 672208 264707 -1653830 -3911644
36629 -3911644 -4706868 -3711181 -1980671 -384552 888169 1841897 2611057 3375170 3696587
36620 3696587 2745870 893643 35857 1326146 3557672 4890907 5109581 4795747 3407573
36611 3407573 156195 -3744594 -5731350 -4817621 -2298803 352144 2598214 3822945
36603 3822945 3132729 866897 -1116675 -1477467 -753855 -134418 162554 636211 1404915
36594 1404915 2045814 2143339 1666921 1114781 1210324 1903964 1969689 557717 -1086462 -841323
36584 -841323 1188049 2322762 750842 -2002446 -3040869 -1537129 909404 2612377
36576 2612377 3220695 3103147 2537488 1758061 1112743 839693 879488 943677 697469 27351
36566B7351q49426p60377p20858n97486L26182J980968K782853J489259o94624
36557B983842j330167M3874J400203J072126l79889j564272k028488j844815p45636
36548b393222J137440K503627K125537N25871o26876o44252m07145p96890j409247
36539A4843j231454j04082J025299J257555P55642L63316M08572L58380k14251
36530B633820q58328r11326n54724n27857r32376j037563l54702O85483J259924
36521e97649Q95494l16366j671620k004140o30936J577589K712108J827188Q619
36512A800287r02146k94885P91369R30792k60613j746151k037750p87890P10367
36503a796620J053542M92835L47195Q28760P43156l20817r59286p6612J171964
$$ plain form
36566 27351 -822075 -1582452 -2303310 -2900796 -2574614 -593646 2189207 3678466 2983842
36557 2983842 1653675 1697549 3097752 4169878 3789989 2225717 197229 -1647586 -2393222
36548 -2393222 -1255782 1247845 3373382 3899253 3272377 2628125 2220980 1424090 14843
36539 14843 -1216611 -1320693 -295394 962161 1717803 2081119 2489691 2848071 2633820
36530 2633820 1775492 864166 309442 -218415 -1150791 -2188354 -2543056 -1857573 -597649
36521 -597649 297845 -18521 -1690141 -3694281 -4325217 -2747628 -35520 1791668 1800287
36512 1800287 898141 603256 1394625 2325417 2064804 318653 -1719097 -2506987 -1796620
36503 -1796620 -743078 -250243 96952 925712 1668868 1348051 388765 312153 1484117
36494A484117R93124k85270p82134o4282L24158l97445q89071m5113R00783K31628
36484A470495j273941j185025R51079K764475K325453N33472p17840j237198j854757
36475A776213k164418j053605Q40081J418771K54650o09762J73215J216612Q29008
36466B680765k56760l69957K87982M51303L35080R13380J362093O0306k006227
36457C457965j945239L87257J584364j80490k255052j764648k1855J27597p92564
36448a402665j56889J770434J949504l17992j945289p06638J574890J992657N06448
36439C264460q31992j057411q54742q06046p08051l36808K39304R35812J494434
36430A338960J343744K90486r01851j189234l18866J101066K234068K362848J085727
$$ plain form
36494 1484117 2477241 2191971 1409837 1345555 1669713 1272268 383197 338084 1238867 1470495
36484 1470495 196554 -988471 -37392 2727083 5052536 5586008 4868168 3630970 1776213
36475 1776213 -388205 -1441810 -601729 817042 1071692 461930 635145 1851757 2680765
36466 2680765 2424005 2054048 2342030 2793333 3128413 4041793 5403886 5464192 3457965
36457 3457965 1512726 1899983 3484347 3303857 1048805 -715843 -737698 -610101 -1402665
36448 -1402665 -1559554 210880 2160384 1842392 -102897 -809535 765355 2758012 3264460
36439 3264460 2432468 1375057 520315 -285731 -993782 -1330590 -1091286 -155474 1338960
36430 1338960 2682704 2973190 2071339 882105 563239 1664305 3898373 6261221 7346948
36421G346948j215305l243633l625957k061153L69837K035626K082305J098542
36413B787210K54666k06483r15248j646039j005748J134281K342612O82171j979386
36404A448036k234692j63118R58797O8921j31727J781544L012127J069462j795039
36395D014311j983620k14017J1655j661749k120209j92020J545870J124607o9709
36386D55119k67276j61722r41970j666297p39557J301694K413127J750200K72827
36377B416145q43522j169310p45635J00481P57247P95498L68938j11154m16811
36368A151877m92385m13093l89508l67011J70439J317652K032880J335058r4494
36359D251415p83107o71118q77337j417781j099421R7681O40328M6135k37063
$$ plain form
36421 7346948 6131643 2888010 -737947 -2799100 -2429263 -393637 1688668 2787210
36413 2787210 3041876 2835393 1920145 274106 -731642 402639 2745251 3427422 1448036
36404 1448036 -786656 -949774 9023 77944 -53783 1727761 4739888 5809350 4014311
36395 4014311 2030691 1816674 1828329 166580 -1953629 -2145649 -599779 524828 455119
36386 455119 187843 26121 -915849 -2582146 -3321703 -2020009 393118 2143318 2416145
36377 2416145 1572623 403313 -342322 -241841 515406 1310904 1679842 1568688 1151877
36368 1151877 659492 246399 -143109 -510120 -339681 977971 3010851 4345909 4251415
36359 4251415 3468308 2797190 1919853 502072 -597349 -499668 140660 186795 -50268
36350e0268N56267J125441N10199k05952p3271r7423j049095j421974J15105J852995
36340A262024J280016r30551j888886p54230O25132R46137P27189M60136m2191
36331A684776l50797K48786J009563N13334p43420r18080o3840j24151j307351
36322e1180j444143R1551Q84059m66141j657416l86833J672135J496001m00188
36313b62155r81014K76115P97893n21103j403338L2728K118285K085888J14498
36304B257797j119491l11036R83244R15654j58934o16752l5129M82987J74082
36295B572422m34641o93592q39904j193440j259681n59685L10209M91697K51793
36286a354822M56006J025938J089871M39789k82285o19097m49826M43056J678862
$$ plain form
36350 -50268 505999 1631440 2141639 1935687 1862416 1764993 715898 -706076 -590971 1262024
36340 1262024 2542040 1611489 -277397 -1031627 -406495 539642 1266831 1726967 1684776
36331 1684776 1333979 1582765 2592328 3105662 2362242 1444162 1380322 1256171 -51180
36322 -51180 -1495323 -1403772 -519713 -985854 -2643270 -3030103 -1357968 138033 -262155
36313 -262155 -1243169 -967054 -169161 -690264 -2093602 -2060874 57411 2143299 2257797
36304 2257797 1138306 827270 1810514 2726168 2567234 1950482 1915353 2398340 2572422
36295 2572422 2137781 1444189 604285 -589155 -1848836 -2408521 -2098312 -1606615 -1354822
36286 -1354822 -898816 127122 1216993 1656782 1374497 755400 305574 748630 2427492
36277B427492J767221o170j752381j180070P74325J137028l55561q71243N51501
36268B492142J187619o24412k331245j297622Q13360R72360j95902J1726J350275
36259B378301J167554p03021j550309m32025M25651l95011j368980j024894k57858
36250a760592j80318l9621R95911J816606R77581q69472j768357r80826M39815
36241a369273J053558K87874j093651j383433L21232K494927K564492L44279j423183
36232A796822p61673Q81162R75134m15065j076753j25664Q29361J76816j411457
36223H68683j864552l10932J853999K568600J424565j05558p63362r51968j496258
36214A223217j948448j427861m75778l54693p55730j29735J540678K299358J128081
$$ plain form
36277 2427492 4194713 4188543 2436162 1256092 2030417 3167445 2811884 1940641 2492142
36268 2492142 3679761 3055349 724104 -573518 239842 1212202 1016300 1028026 2378301
36259 2378301 3545855 2842834 1292525 860500 1286151 891140 -477840 -1502734 -1760592
36250 -1760592 -1940910 -1980531 -984620 831986 1809567 940095 -828262 -1809088 -1369273
36241 -1369273 -315715 -27841 -1121492 -2504925 -2183693 311234 2875726 3220005 1796822
36232 1796822 1035149 1916311 2891445 2476380 1399627 1273963 2103324 2280140 868683
36223 868683 -995869 -1306801 547198 3115798 4540363 4434805 3671443 2719475 1223217
36214 1223217 -725231 -2153092 -2628870 -2983563 -3739293 -3869028 -2328350 -28992 1099089
36205A099089n53586j120551p66855l61509M1527M07311J0492j134765j501335
36196c880182j11152J804818K528621K050920J237907J52837j197007j716311
36188H70451p12162M56872J49693r55409j000347L827L81916l46048q98783m34581
36178b484571N29250J364890J846860J548730L59383o07385k94775M12492o9865
36169B605009j251899j216921J02666P40541J8579m83181Q1194L72037n02665
36160D65360j190684m07347Q24687Q65714n4569n89616l63597R3799N17501P75947
36150I37195M80785j96192k59551N83657J182629O85050j55933m38600n52478
36141B266562r52316r11854j9143M51677m90740j391399l01689J931440K648871
$$ plain form
36205 1099089 545503 -575048 -1341903 -1703412 -1661885 -1254574 -1244082 -2378847 -3880182
36196 -3880182 -3991334 -2186516 342105 2393025 3630932 3783769 2586762 870451
36188 870451 158289 615161 764854 -190555 -1190902 -1187075 -805159 -1151207 -2049990 -2484571
36178 -2484571 -1955321 -590431 1256429 2805159 3164542 2557157 2262382 2674874 2605009
36169 2605009 1353110 136189 238855 979396 997975 514794 595988 968025 465360
36160 465360 -725324 -1132671 -307984 557730 503161 -86455 -450052 -356253 161248 937195
36150 937195 1417980 1221788 962237 1545894 2728523 3413573 3257640 2819040 2266562
36141 2266562 1314246 402392 383249 834926 344186 -1047213 -1348902 582538 3231409
36132C231409J254871k13954l96280k26162p83751j499624j366144n42660J08831
36123d33464J81530j60135n23657m60113O7022L81067o233m22108M0123R00128
36113d35840R02282J24513n5484P21882J114825K55091q49858r09242j80290K06685
36103H94564j19494o82142j030119r16142j30469J119214J993533J748343N31879
36094C409167p49980j160119m27677O23822N72764r77647k535369k388539q43082
36085d476660L81920O88598R25946J249392O88977o09903q12536P68849K065209
36076H69792J054856j182870j943069m68970J628821K792451K660659J298493
36068F710163r45649k844859l014697j466117M54787J605423J742082J040593
$$ plain form
36132 3231409 4486280 4272326 3876046 3649884 2866133 1366509 365 -542295 -433464
36123 -433464 -251934 -412069 -935726 -1395839 -1328817 -947750 -953983 -1376091 -1335968 -435840
36113 -435840 466442 590955 535471 1257353 2372178 2627269 1777411 868169 687879 894564
36103 894564 775070 92928 -937191 -1853333 -1983802 -864588 1128945 2877288 3409167
36094 3409167 2659187 1499068 1071391 1695213 2267977 1290330 -1245039 -3633578 -4476660
36085 -4476660 -4094740 -3406142 -2480196 -1230804 -541827 -1151730 -1964266 -1195417 869792
36076 869792 1924648 741778 -1201291 -1670261 -41440 2751011 5411670 6710163
36068 6710163 5764514 2919655 -95042 -1561159 -1106372 499051 2241133 3281726
36060C281726n7771p44669n57118l8391Q7129L9433M38936J085763J243215P41188
36050E519441j10774j185656k144807k070854p01188O29701O09576j74870m40341
36041f9772m46811j153265j881692j186055K94441M73469o00349n76377J191863
36032c954548K305900J199761k65190J32305J457843J309835m91464k039358k175192
36023b520108j296312o3630J030469J380485R63834P40775J201954J357552L95084
36014C190103o97585o56860o7727k29566q07660n85961J32085M1308o25558l29996
36004f37417J000608J628060P90032j59821j7699N75505M77640k73339q59836
35995B523733p51235O4108R54236O63454j276233l099611k399912M84081K398003
$$ plain form
36060 3281726 3223955 2479286 1922168 1883777 1970906 2010339 2449275 3535038 4778253 5519441
36050 5519441 5408667 4223011 2078204 7350 -693838 -64137 545439 370569 -69772
36041 -69772 -516583 -1669848 -3551540 -4737595 -4443154 -3969685 -4570034 -5146411 -3954548
36032 -3954548 -1648648 -448887 -714077 -581772 876071 2185906 1694442 -344916 -2520108
36023 -2520108 -3816420 -3880050 -2849581 -1469096 -505262 235513 1437467 2795019 3190103
36014 3190103 2492518 1835658 1767931 1538365 730705 144744 276829 318137 -307421 -637417
36004 -637417 363191 1991251 2781283 2621462 2603763 3179268 3656908 3383569 2523733
35995 2523733 1772498 1836606 2790842 3454296 2178063 -921548 -3321460 -2837379 -439376
35986d39376J347197j114328k307466j588755J187J633545K741632K448663O54654
35977C376953j075417j220782k93834K06672Q9892J84691M03360p4394r18663
35968F78478q26069K33681O82312k37238j219124q81461K29485O02773j29508
35959h66671j042447j312453q44823J08279J086502J400223P91809M0476J46091
35950d93014Q92534J006274n3834j236220j287611l84841K99276K68604J10545
35941h78287L13327N37070L19341j90222o18693r37009j131477q02381K06651
35932c181680J067335P00609o69510j427398m07556J590657K573770J534358m86280
35923A294305j612803j152901l6032O98269J114854J551363J353379k20559k045555
$$ plain form
35986 -439376 907821 -206507 -2513973 -4102728 -4101541 -2467996 273636 2722299 3376953
35977 3376953 2301536 1080754 786920 993592 1083484 1268175 1671535 1597141 678478
35968 678478 -147591 86090 768402 531164 -687960 -1569421 -1339936 -737163 -866671
35959 -866671 -1909118 -3221571 -4066394 -3958115 -2871613 -1471390 -679581 -639105 -493014
35950 -493014 399520 1405794 1351960 115740 -1171871 -1556712 -1257436 -988832 -878287
35941 -878287 -564960 -27890 291451 101229 -517464 -1454473 -2585950 -3388331 -3181680
35932 -3181680 -2114345 -1413736 -2083246 -3510644 -3918200 -2327543 246227 1780585 1294305
35923 1294305 -318498 -1471399 -1507431 -809162 305692 1857055 3210434 2989875 944320
35914I44320j841159N96000K550394J884938j36783j049879p92124r73744j563944
35905c81981j026409M38253O42337r53832j933933n08499J709637K137601Q26975
35896I50149j70482L1397M36390J02862p19915j245290r46257P7677Q88898M18587
35886a75984r69915j435095n4693J584479J368656m16754j479525n51965J214558
35877i16238J918136J039995k48166l96010R24736K345679K224210N58802j182723
35868F268421k075063k372373k035056m25359J776491K327392N17504j276061
35860B705896r50613J15765m44489j811858j345789O98153J268728n28908j914617
35851b207732q28656J030717J098791l55146j208582o29491M73995J154980J149051
$$ plain form
35914 944320 -896839 -300839 2249555 4134493 3997710 2947831 2155707 1181963 -381981
35905 -381981 -1408390 -970137 -327800 -1281632 -3215565 -3724064 -2014427 123174 950149
35896 950149 779667 811064 1247454 1350316 630401 -614889 -1561146 -1483469 -594571 -175984
35886 -175984 -1145899 -2580994 -2635687 -1051208 317448 -99306 -1578831 -2130796 -916238
35877 -916238 1001898 2041893 1793727 1397717 2322453 4668132 6892342 7451144 6268421
35868 6268421 4193358 1820985 -214071 -639430 1137061 3464453 3981957 2705896
35860 2705896 1755283 1871048 1426559 -385299 -1731088 -1032935 235793 -293115 -2207732
35851 -2207732 -3036388 -2005671 -906880 -1262026 -2470608 -3100099 -2626104 -1471124 -322073
35842c22073N61227r4173r8985M70431N80102l37987j502563j807645r81249N93623
35832b939292K243807K871757J661592n30645j642930q54419N47374J206210J206058
35823C769512R21738J9735j324891j783661q42421n7438p83090j861587j362177
35814c304280L73030J399136J182331Q40085P25131l2263j411409j936524q07572
35805b972335R24695J867305J679231N56689j235057k687590k355904l53965J115435
35796c461496M43833j051849r04463R30869J957414P18781j103880j029451Q87249
35787b612993K320204J806227K57234p41222q38330n43319l3187O81683J097825
35778A394122Q07508L19484K55869J55958p18693j757807j654594n39187J83766
$$ plain form
35842 -322073 239154 144981 45996 516427 1096529 758542 -744021 -2551666 -3532915 -2939292
35832 -2939292 -695485 2176272 3837864 3307219 1664289 809870 1357244 2563454 3769512
35823 3769512 4691250 4710985 3386094 1602433 760012 702574 -80516 -1942103 -3304280
35814 -3304280 -2931250 -1532114 -349783 490302 1215433 1183170 -228239 -2164763 -2972335
35805 -2972335 -2047640 -180335 1498896 2055585 820528 -1867062 -4222966 -4576931 -3461496
35796 -3461496 -3017663 -4069512 -4973975 -4043106 -2085692 -1366911 -2470791 -3500242 -2612993
35787 -2612993 -292789 1513438 1770672 1029450 191120 -352199 -385386 296297 1394122
35778 1394122 2201630 2521114 2776983 2932941 2214248 456441 -1198153 -1737340 -1553574
35769a553574J88629N36113J243602P12534j371737k641498j238765J222966J909510
35760i92220P76776P8249O04960Q64488m5493j013740q81381o4032M91444O35301
35750D54352O15064L92057o609k24162j21923L3316J52051M16023O77524N27612
35740B915305O5006j89907j87501k74500k42857M29220J254008R77580l71572
35731D374782j008891J45938J649561J384586m99333j858442j482358l69347J04256
35722B440752P772J08626J92688o34291k080039k372307n33228J846649K216474
35713A193096K33680j797590j789375p0739J643946K326252J933117O88691q30679
35704C530399j585499j174644n68828p20157j005878k92911R28193J018123k50878
$$ plain form
35769 -1553574 -1364945 -828832 414770 1127304 -244433 -2885931 -4124696 -2901730 -992220
35760 -992220 -215444 -137195 467765 1332253 1286760 273020 -608361 -672393 -180949 454352
35750 454352 1069416 1461473 1454864 1230702 1108779 1142095 1294146 1710169 2387693 2915305
35740 2915305 2980311 2790404 2602903 2328403 2085546 2514766 3768774 4746354 4374782
35731 4374782 3365891 3511829 5161390 6545976 6046643 4188201 2705843 2336496 2440752
35722 2440752 2448524 2557150 2749838 2115547 35508 -2336799 -2870027 -1023378 1193096
35713 1193096 1426776 -370814 -2160189 -2230928 -586982 1739270 3672387 4361078 3530399
35704 3530399 1944900 770256 201428 -518729 -1524607 -1817518 -889325 128798 -122080
35695a22080j131894k85086J465939K307049J555784J26745o30501k74484L15673
35686C327145j1525j058895j383164m91251J65765n23841j254490k85663J436445
35677g9474J487903j19831r06236Q122N78636n68308j843651j414156K4654Q96268
35667a936073J254109J736217J636456J86075j401064j367751j66345K80371m18573
35658a96578q16938q9245R95923J513034J257357K52152j183174j939418j115328
35649a322215M61615J026702K29517n63534l56076L59725P19676N56112J36533
35640A248055k08256j16461L03085K13010p33438j379707o31457M62735N8228
35631g84206j272008r72420J437851L132314J898812p80292k058204j399869k03501
$$ plain form
35695 -122080 -1253974 -1539060 -73121 2233928 3789712 3916457 3285956 3011472 3327145
35686 3327145 3315620 2256725 873561 382310 548075 24234 -1230256 -1515919 -79474
35677 -79474 1408429 1288598 382362 390484 969120 400812 -1442839 -2856995 -2832341 -1936073
35667 -1936073 -681964 1054253 2690709 2876784 1475720 107969 -58376 221995 -196578
35658 -196578 -1013516 -1102761 -106838 1406196 2663553 2915705 1732531 -206887 -1322215
35649 -1322215 -860600 166102 395619 -167915 -523991 -164266 555410 1111522 1248055
35640 1248055 1039799 923338 1226423 1439433 705995 -673712 -1305169 -842434 -784206
35631 -784206 -2056214 -3028634 -1590783 1541531 3440343 2660051 601847 -798022 -1001523
35622a001523P71471J547069J537803K50107j124407r39231K44024K56132j316398
35613B25047k388145j464276L93690J457302J502259J081080J71179j075797j436777
35604a534438j11804J575212J569713j63728j744890j996695j426249o24363N87460
35595c869782J920646K128591P51734p73910q67389J40324Q15888Q02233Q41491
35586A889826R91049L86629r61972j546941l51120J444267J799299M85676o83975
35577C452738m19039L10897j56462j555320j918506m75741J075283R84146q6616
35568A211380m10776r6441o06849j693830j290845R27247K323373J038840j136247
35559B65852j537435n14466j90208o90402m15381O56365R36998M12229Q62333
$$ plain form
35622 -1001523 -230052 1317017 2854820 3104927 1980520 1041289 1285313 1541445 225047
35613 225047 -2163098 -3627374 -3233684 -1776382 -274123 806957 978136 -97661 -1534438
35604 -1534438 -1646242 -71030 1498683 1334955 -409935 -2406630 -3832879 -4457242 -3869782
35595 -3869782 -1949136 179455 931189 157279 -710110 -569786 246102 1048335 1889826
35586 1889826 2880875 3267504 2305532 758591 407471 1851738 3651037 4136713 3452738
35577 3452738 3033699 3344596 3188134 1632814 -285692 -761433 313850 1297996 1211380
35568 1211380 800604 704163 97314 -1596516 -2887361 -1960114 363259 1402099 265852
35559 265852 -1271583 -1786049 -1976257 -2666659 -3082040 -2425675 -1488677 -1076448 -214115
35550b14115K392742K600634L26131k207031k489971j037709l1460k12920p39018
35541a612717r43572p11082O4639J128212J650857J294108P09836K99933m32648
35532A447566j536960j916221r93549J46748L88269J90892M43737Q83546Q72039
35523g3933O45336N76833K91495l07493l28989N41369J039779K39298q37485r31341
35513H54869m71086k80116P1349Q90508J044536O3817k38762J279716K342173
35504E557004N14204k354797k579345m56671L91936r34373j523526o857J201383
35495a91042K74570j104056r49449p7340p5010n73185l73067N47104J533224K116387
35485A128136J571066m32400k203057j499329P98489J392973k49284q57410J096351
$$ plain form
35550 -214115 2178627 4779261 5105392 2898361 408390 -629319 -660779 -873699 -1612717
35541 -1612717 -2556289 -3267371 -3202732 -2074520 -423663 870445 1580281 1880214 1447566
35532 1447566 -89394 -2005615 -2999164 -2852416 -2464147 -2273255 -1829518 -945972 -73933
35523 -73933 571403 1148236 1439731 1132238 803249 1344618 2384397 2623695 1786210 854869
35513 854869 383783 103667 175016 1065524 2110060 2173877 1935115 3214831 5557004
35504 5557004 6071208 3716411 1137066 680395 1072331 137958 -1385568 -1392425 -191042
35495 -191042 83528 -1020528 -1969977 -2047317 -2122327 -2695512 -3068579 -2521475 -988251 1128136
35485 1128136 2699202 2266802 63745 -1435584 -637095 755878 506594 -350816 745535
35476G45535K560452R32881j612940j885717o92881n64207j033441j48078J228946
35467d69450P79309q35375r48958M50762R58674K03322J26331Q69995L70701j423333
35457H1978j760350L86681K415454K164000Q63733L59685J45200p71417j355286
35448B529678l30057J106803Q32729p88436j339396J2577J284481N28309j440342
35439B396346k075784m35605J436989R72450j513980l008217j716252N63843J094945
35430b285265j1143m86594L61472R13428K60214l01146M72885J790146K098176
35421B812173J125280k01627r52217p03399K77973R29603L44513q84670j233487
35412A514142l58607M77381L44284k14960l54054m0287M02733P14140L42840j024664
$$ plain form
35476 745535 3305987 4238868 2625928 740211 47330 -516877 -1550318 -1698396 -469450
35467 -469450 309859 -525516 -1474474 -1023712 -65038 138284 264615 1134610 1505311 81978
35457 81978 -1678372 -1291691 1123763 3287763 4151496 4511181 4656381 3884964 2529678
35448 2529678 2199621 3306424 4139153 3350717 2011321 2023898 3308379 3836688 2396346
35439 2396346 320562 -115043 1321946 2294396 780416 -2227801 -3944053 -3380210 -2285265
35430 -2285265 -2296408 -2783002 -2421530 -1508102 -1247888 -1549034 -1076149 713997 2812173
35421 2812173 3937453 3735826 2783609 2080210 2358183 3287786 3632299 2747629 1514142
35412 1514142 1155535 1632916 1977200 1762240 1408186 1367899 1770632 2484772 2827612 1802948
35402A802948k245616j554440P92300K269928J344778n00000j057654l35187J19690
35393F36747k86965q52788j026724q26477k14987P80287J543606J365570L54931
35384A473200o77426j026188n32787L00318M92275l98111j347579r58938M21644
35375b253592J025560L78567o997O53747R25848l08252j574140r46707P97914
35366a308052J299669J63950p34857k72517N54621M82711l51255j001019q90050
35357b056799p6496R09043J348631R84592K89840k51462o45907p76691j66163
35348d41412R23429J166300J450j203210j074372l02504k38266m42187L29484
35339a281288J396556Q48187j114213j983053o13771J102885J159687J63412j06300
$$ plain form
35402 1802948 -442668 -1997108 -1204808 1065120 2409898 1909898 852244 517057 636747
35393 636747 349782 -503006 -1529730 -2356207 -2571194 -1790907 -247301 1118269 1473200
35384 1473200 795774 -230414 -763201 -462883 29392 -368719 -1716298 -2675236 -2253592
35375 -2253592 -1228032 -849465 -856462 -202715 723133 414881 -1159259 -2105966 -1308052
35366 -1308052 -8383 155567 -579290 -851807 -297186 185525 -165730 -1166749 -2056799
35357 -2056799 -2133295 -1224252 124379 1108971 1398811 1147349 501442 -275249 -441412
35348 -441412 482017 1648317 1649767 446557 -627815 -930319 -1168585 -1610772 -1281288
35339 -1281288 115268 963455 -150758 -2133811 -2747582 -1644697 -485010 -321598 -427898
35330d27898N24229P40821r0583j148260j373686o78477J29199L50287K29898
35321a744470N25985J144766R66771l56384j381912q24102L33688K88512o79861
35312a727007p65329K25767N99397j96801o49793P9319P74792N22582L20259J021942
35302B05128J571370Q34053l90213p75118n03587l30862L2944R04976J254575
35293B803266K18670j064126j068600l99012o43674j518191j398754j93342O45982
35284b617781P45875J093512J675315J247014j51474p94251r8009L49125m36812
35275A012514j137692n34000L13639j1328p47957l76004N29924J20673j507963
35266b338194k143381p03566J236545J775622J020120K21336j93725n29120n17853
$$ plain form
35330 -427898 96331 837152 746569 -401691 -1775377 -2453854 -2324655 -1974368 -1744470
35321 -1744470 -1218485 -73719 893052 536668 -845244 -1669346 -1335658 -1047146 -1727007
35312 -1727007 -2492336 -2266569 -1667172 -1863973 -2513766 -2434447 -1659655 -1137073 -816814 205128
35302 205128 1776498 2610551 2220338 1445220 941633 610771 643715 1548691 2803266
35293 2803266 3021936 1957810 889210 490198 -153476 -1671667 -3070421 -3263763 -2617781
35284 -2617781 -1871906 -778394 896921 2143935 1992461 1198210 1100201 1449326 1012514
35275 1012514 -125178 -659178 -345539 -356867 -1104824 -1480828 -950904 -830231 -2338194
35266 -2338194 -4481575 -5185141 -3948596 -2172974 -1152854 -931518 -1125243 -1654363 -2172216
35257b172216M36294J779151J917805L75116j150580q52609O26054J006717k84581
35248A681151j138506J00059J890074J480172j032133k582278j277241J156211
35240B77509J918667P19537m86771m89426n7988l55193j320684j906504j278194
35231b979047L68813J812598J748320J84050j311960j313733k56900K58583k70940
35222a760216o33203K47224J716755K231586J280061j61983r10358p74258m03676
35213H31932k62309o0858O41498J444245J270536j49324j513815j428682l23230
35204D49993J53608l88266n22669O01891J684470J192250j81543n24084L82096
35195B847746R13200L42806j24178L85115Q42204J42045q76214p86834o3220l78299
$$ plain form
35257 -2172216 -1735922 43229 1961034 2336150 1185570 332961 959015 1965732 1681151
35248 1681151 542645 642704 2532778 4012950 2980817 398539 -878702 277509
35240 277509 2196176 2915713 2428942 1939516 1881528 1526335 205651 -1700853 -2979047
35231 -2979047 -2610234 -797636 950684 1134734 -177226 -1490959 -1747859 -1489276 -1760216
35222 -1760216 -2393419 -2146195 -429440 1802146 3082207 2920224 2009866 1235608 831932
35213 831932 569623 508765 1150263 2594508 3865044 3715720 2201905 773223 449993
35204 449993 603601 215335 -307334 294557 1979027 3171277 2989734 2465650 2847746
35195 2847746 3760946 4103752 3979574 4364689 5206893 5348938 4472724 3685890 3622670 3244371
35185C244371j724851k145427p02777R60819R31136l51738r78407l39138L32253
35176g73759L683p90191r44186k84501M81182Q40693Q86336P95739N14580J36317
35166H65893J08073O05309R91688N50513l20353m80852J73972L31032o70489j430605
35156G24181m28203J358322J525181k21887j554885r86760Q6438j51024j128553
35147g77190j127881j26718M42534J38403j10393J39167K91528J07777J64313
35138h58460O19673P85972L19297k19002l62737l56896m21116k92297J06654L32620
35128c46292J36767j64482l08186l97945l88121K3175P56730J284032J357116
35119A952794J149799O72715j39714q11109p81405m51865o43701j071363p60024
$$ plain form
35185 3244371 1519520 -625907 -1328684 -367865 563271 211533 -766874 -1106012 -773759
35176 -773759 -770076 -1560267 -2504453 -2788954 -2307772 -1467079 -580743 214996 729576 865893
35166 865893 973966 1579275 2570963 3121476 2801123 2320271 2494243 2825275 2154786 724181
35156 724181 295978 1654300 3179481 2957594 1402709 415949 502387 351363 -777190
35147 -777190 -1905071 -2031789 -1589255 -1450852 -1561245 -1422078 -1130550 -1022773 -858460
35138 -858460 -238787 547185 866482 647480 284743 -72153 -493269 -785566 -678912 -346292
35128 -346292 -209525 -374007 -682193 -1080138 -1468259 -1445084 -688354 595678 1952794
35119 1952794 3102593 3775308 3635594 2824485 2043080 1591215 947514 -123849 -883873
35110h83873j8634k28463j282563j240585N52200J975807J191869n09132p09099
35101a152473N89629J404969R26714K47502L03056P44147P53855j32162j637332
35092B047905k346721p12078K392577L519129Q52613k754066l290995j039813
35084a331449L50077m46242j059233P8620J345831J136074M10332M21136M17297
35075A322443m69359j126733l58960P24245L77616q86466j198708l45903J61654
35066a800171l32465q13824l66375O51394J366624J381422R10491N09240N52732
35057B059068O90830K90346l79851l02884N52093Q03281l21929j703774j981519
35048b94339j330305n20550N76109K119014K949454J800023o59401k440798k561150
$$ plain form
35110 -883873 -902507 -1130970 -2413533 -3654118 -3101918 -1126111 65758 -443374 -1152473
35101 -1152473 -562844 842125 1768839 2016341 2319397 3063544 3817399 3685237 2047905
35092 2047905 -298816 -1010894 1381683 4900812 5753425 2999359 -291636 -1331449
35084 -1331449 -981372 -1427614 -2486847 -2408227 -1062396 73678 484010 905146 1322443
35075 1322443 853084 -273649 -632609 91636 469252 -417214 -1615922 -1961825 -1800171
35066 -1800171 -2132636 -2946460 -3312835 -2661441 -1294817 86605 997096 1506336 2059068
35057 2059068 2749898 3040244 2660393 2357509 2909602 3712883 3390954 1687180 -294339
35048 -294339 -1624644 -2145194 -1569085 549929 3499383 5299406 4640005 2199207 -361943
35039c61943j597311m34007L73697N08353K81487N69155J392569J426369M2359
35030B200728j262875r64349P7049J06099o19666n30672L93775P62700L32068
35021D94857J26221K54956j02595o79723m07222L50938K33140m76431k21667P08251
35011B80725L09416j437778k053357o51476N37255J13637r4790J416460K689051
35002A109143J363337j221155j894006l14749R80035M71896p98984j293816o91266
34993b289565L32327P85027J69938o37118k52445Q74819O90372r32336j235719
34984b494700J031060K797368J092653j875551j780694J061201K246963K50358
34976B328658j557800o03393J202378J121104l35888j083245p43235j28547O52275
$$ plain form
35039 -361943 -1959254 -2393261 -2019564 -1511211 -1229724 -660569 732000 2158369 2200728
35030 2200728 937853 -26496 50553 156652 -463014 -993686 -599911 162789 494857
35021 494857 621078 876034 773439 93716 -313506 37432 270572 -205859 -427526 280725
35011 280725 590141 -847637 -2900994 -3552470 -3015215 -2901578 -2996368 -1579908 1109143
35002 1109143 2472480 1251325 -642681 -957430 22605 494501 -304483 -1598299 -2289565
34993 -2289565 -1957238 -1172211 -1002273 -1639391 -1891836 -1017017 -326645 -1258981 -2494700
34984 -2494700 -1463640 1333728 2426381 550830 -1229864 -168663 2078300 2328658
34976 2328658 770858 167465 1369843 2490947 2155059 1071814 328579 200032 852307
34967H52307J551347J563715K42366j030402j019867o69393j343836k176793j314389
34958c344945Q21654J741436M06743j337075j351490J51361J276212Q97368l39895
34949a078631j159615j132149p64247l85824L77178J590512K144635J010780q74822
34940b72183j409026k23028P60912L08062k50195O13014J798425J051435j433211
34931I44205k934821j808859N53643J827419J432336M05637l50528p32198q33200
34922a496366n69492L7310O20723P04181J91991l94757l67084L04334Q55821O56313
34912E42974l0608n11074m97041n2500P83024J604067J372707l60096k181759
34903F69694k091621k16176J129298N97330m16015j08748J000581J221233N42375
$$ plain form
34967 852307 2403654 3967369 4209735 3179333 2159466 1490073 146237 -2030556 -3344945
34958 -3344945 -2523291 -781855 -375112 -1712187 -3063677 -2912316 -1636104 -738736 -1078631
34949 -1078631 -2238246 -3370395 -4134642 -4520466 -4143288 -2552776 -408141 602639 -272183
34940 -272183 -1681209 -1904237 -1143325 -835263 -1085458 -472444 1325981 2377416 944205
34931 944205 -1990616 -3799475 -3245832 -1418413 13923 419560 69032 -663166 -1496366
34922 -1496366 -2065858 -2028548 -1407825 -703644 -511653 -906410 -1273494 -969160 -113339 542974
34912 542974 512366 1292 -495749 -548249 234775 1838842 3211549 2851453 669694
34903 669694 -1421927 -1638103 -508805 88525 -327490 -436238 564343 1785576 2327951
34894B327951L44300P13370K70387j135695j786398r02334k1263l57056p05730
34885a252468K98348J483001Q96330q81199j604720q44090r4778J55237P57253
34876a087086J383937O19853j017406j149867N23638J419794M38151j06338J216208
34867B240884K051949M02352j421028n67583J184157L48679k016604j936260M79614
34858G66160J022278j298775k330460K15968K792844J788554q56433j304363N4831
34849H50604J10350j348127j591641K64084K015222J921145O78020m33883j096515
34840A369259j249116o85702J66693M40811J00992j00532l340k05808p48449p81003
34830a696195J43097J290116J581675O94694p59526j745594j566338m90910M91088
$$ plain form
34894 2327951 2672251 3385621 3656008 2520313 733915 -168419 -189682 -546738 -1252468
34885 -1252468 -954120 528881 1425211 544012 -1060708 -1904798 -1999576 -1844339 -1087086
34876 -1087086 296851 916704 -100702 -1250569 -726931 692863 1131014 1024676 2240884
34867 2240884 4292833 4695185 3274157 2706574 3890731 4239410 2222806 286546 766160
34858 766160 1788438 489663 -1840797 -1624829 1168015 2956569 2100136 795773 850604
34849 850604 960954 -387173 -1978814 -1714730 300492 2221637 2899657 2465774 1369259
34840 1369259 120143 -565559 -398866 41945 142937 42405 39065 -166743 -915192 -1696195
34830 -1696195 -1553098 -262982 1318693 2013387 1253861 -491733 -2058071 -2548981 -2057893
34821b057893P45772N29468L48764L45163M95902P62923Q33297M21040o6104k9498
34811B328834J63319l06171j058459r13996l8577J76143l52262k13839O25797
34802D10789M59716o86986l64120J781520K212339r49283l818773k141379J785839
34793a310338K409777m57571j758410L92049K039704L01348k171095j967458o1486
34784b583480P27203L38278M62169J064284Q64998j3682l46287Q7921N52865P22830
34774A877099N67393j78525j162888j150035J41865J159146P61348L726J94879
34765B214008N83978j48793j237374q12124J059086K323668J737713M4293j497893
34756D266562k257901j982845q35687J99450J25500o88868q71300J13524J294906
$$ plain form
34821 -2057893 -1312121 -782653 -433889 -88726 407176 1170099 2003396 2424436 2358332 2328834
34811 2328834 2492153 2185982 1127523 213527 174950 351093 -1169 -215008 410789
34802 410789 870505 183519 -180601 1600919 3813258 2863975 -954798 -3096177 -1310338
34793 -1310338 1099439 641868 -1116542 -724493 1315211 1616559 -554536 -2521994 -2583480
34784 -2583480 -1856277 -1517999 -1055830 8454 873452 859770 513483 601404 1154269 1877099
34774 1877099 2444492 2265967 1103079 -46956 94909 1254055 2015403 2019129 2214008
34765 2214008 2797986 2649193 1411819 599695 1658781 3982449 5720162 5764455 4266562
34756 4266562 2008661 25816 -809871 -610421 -484921 -1173789 -2045089 -1931565 -636659
34747f36659J471633N20460o42573r82271k80932N90896N90129j92957p04123
34738b66397n33384m23629p49815o09853O84059K136457K227160R50740l89214
34729C026124j013049j254559j541623j698708j280458j35266J221718J695023
34721i80798P01280o77241o66401O83992J279549L5987j339097r19906M59801
34712a422834O33737m50365q57399J44016J179005J196400Q15844O95916K93315
34703B227635q13900j693488j335161l40807q6619n22049q3641J851473L442272
34694B645715K381515q08977k806212j477939J255831J866064k10921k254628
34686E90448k279777j170663l32399M69322J625170J992320N52029j492092k093448
$$ plain form
34747 -636659 834974 1355434 712861 -269410 -550342 40554 630683 437726 -266397
34738 -266397 -799781 -1223410 -1973225 -2583078 -1899019 237438 2464598 3415338 3026124
34729 3026124 2013075 758516 -783107 -2481815 -3762273 -3897539 -2675821 -980798
34721 -980798 -279518 -956759 -1623160 -939168 340381 376368 -962729 -1882635 -1422834
34712 -1422834 -789097 -1239462 -2096861 -1952845 -773840 422560 1238404 1934320 2227635
34703 2227635 1413735 -279753 -1614914 -1955721 -2042340 -2564389 -2648030 -796557 2645715
34694 2645715 5027230 4218253 1412041 -65898 1189933 3055997 2845076 590448
34686 590448 -1689329 -2859992 -3192391 -2723069 -1097899 894421 1446450 -45642 -2139090
34677b139090r97750N48620J814796K676571K573102J216862k48421n69144l49789
34668D525757r65894k077963k192034j314558r02726j210675q55827O07868J673083
34659b712969J145896j38681o55697q7429P69555J117089P30715P6037m9039M24921
34649F20398M81791m48499j250480o86601M63335N11180l69374m73254N09427
34640f42077J072521O17873M14637J207407J849419J246796M2012o07980o09360
34631D591248m42140k64324k16810n37158q26626l31736O13651O90216l94785
34622B881536j302922r89868L9904Q70098J222372R14827k56285j510778j442891
34613D25993p2742Q79476M49347k99287j93093L50731M18827L3145l80271p20323
$$ plain form
34677 -2139090 -3136840 -2588220 -773424 1903147 4476249 5693111 5444690 4875546 4525757
34668 4525757 3559863 1481900 -710134 -2024692 -2927418 -4138093 -4993920 -4386052 -2712969
34659 -2712969 -1567073 -1705754 -2361451 -2448880 -1679325 -562236 168479 244516 195477 620398
34649 620398 1102189 653690 -596790 -1283391 -820056 -308876 -678250 -1151504 -642077
34640 -642077 430444 1048317 1462954 2670361 4519780 5766576 5808588 5200608 4591248
34631 4591248 4149108 3884784 3667974 3130816 2304190 1972454 2586105 3276321 2881536
34622 2881536 1578614 588746 628650 1498748 2721120 3635947 3379662 1868884 425993
34613 425993 353251 1232727 1682074 1382787 1189694 1540425 1959252 1992397 1612126 891803
34603H91803p34501j34794L12849n56430k030431j888632J34250J468878N32032
34594b004976q38683m63245Q18353J017696M16593O19081J471936J464556M09770
34585B911081n54688j018336j264775q48073O22560J801286R99468r57283j515746
34576A75494j08283J094807N61994m85650k32006R82047J295764K1877j401495
34567A904549j251450K38955J085030K00714r45283l81064J246488J414092m17837
34558C094194j881685j289560P8412M08142l8653k03801j58670j46154M04560
34549B66785J258133Q26456r25770j347840Q32359K732656J493226j061486j400510
34540B674009N6800K42799j092679j560095q71591r16309j454687k75849K159383
$$ plain form
34603 891803 157302 22508 335357 -221073 -2251504 -4140136 -4005886 -2537008 -2004976
34594 -2004976 -2843659 -3306904 -2488551 -1470855 -1054262 -435181 1036755 2501311 2911081
34585 2911081 2356393 1338057 73282 -774791 -152231 1649055 2648523 1691240 175494
34576 175494 67211 1162018 1724012 1238362 1006356 1988403 3284167 3306044 1904549
34567 1904549 653099 892054 1977084 2177798 1232515 851451 2097939 3512031 3094194
34558 3094194 1212509 -77051 1361 409503 370850 167049 8379 -137775 266785
34549 266785 1524918 2351374 1425604 77764 910123 3642779 5136005 4074519 2674009
34540 2674009 2730809 2973608 1880929 320834 -550757 -1467066 -2921753 -3197602 -1038219
34531a038219K674366O15653j063960p96145l32737o71640l03809J012138R44688
34522A040335r95408j740447K94090K197354J276736o52052o85253N19541P50296
34513B005192K57729L82054L70592r65931k158967j092135J142903J645639J07271
34504A694347j111609o96471L83316Q67664L24331j117274k404141j904818K41034
34495c723621J509318N10631o55531K39170J811962J507252J0682q6976J235150
34486B358037J747012R12644J26352l29172j146206j385406L45545K393955J625028
34477F647789j333439k390245k72344J460340J14892k095382j867622K76704J410546
34468A951239N14607r82172j655243j156561K19089J565533J718211N80578o56298
$$ plain form
34531 -1038219 1636147 2251800 1187840 391695 58958 -612682 -916491 95647 1040335
34522 1040335 44927 -1695520 -1401430 795924 2072660 1420608 735355 1254896 2005192
34513 2005192 2262921 2644975 3015567 2049636 -109331 -1201466 -58563 1587076 1694347
34504 1694347 582738 -113733 269583 1137247 1461578 344304 -2059837 -3964655 -3723621
34495 -3723621 -2214303 -1703672 -2359203 -2120033 -308071 1199181 1209863 1122887 2358037
34486 2358037 4105049 5017693 5144045 4814873 3668667 2283261 2628806 5022761 6647789
34477 6647789 5314350 2924105 2651761 4112101 4226993 2131611 263989 540693 1951239
34468 1951239 2465846 1483674 -171569 -1328130 -1109041 456492 2174703 2755281 2098983
$$ [...]
##END NTUPLES=NMR SPECTRUM
##END=
