##TITLE=31Pdec_PR166_13
 D2O, 24 sc
 13.2.2019
##JCAMPDX= 6.0         $$ Bruker NMR JCAMP-DX V2.0
##DATA TYPE= NMR SPECTRUM
##DATA CLASS= NTUPLES
##ORIGIN= UXNMR, Bruker Analytische Messtechnik GmbH
##OWNER= root
$$ XWIN-NMR		Version 3.5
$$ Wed Feb 13 15:00:07 2019 Russian Standard Time (UT+4h)  she@DPX200
##.OBSERVE FREQUENCY= 81.013821
##.OBSERVE NUCLEUS= ^31P
##.ACQUISITION MODE= SIMULTANEOUS
##.ACQUISITION SCHEME= undefined
##.AVERAGES= 24
##.DIGITISER RES= 17
##SPECTROMETER/DATA SYSTEM= spect
##.PULSE SEQUENCE= zgpg30
##.SOLVENT NAME= DMSO
##.SHIFT REFERENCE= (INTERNAL, DMSO, 0, 182.463)
##AUDIT TRAIL= $$ (NUMBER, WHEN, WHO, WHERE, WHAT)
$$ ##TITLE= Audit trail, XWIN-NMR		Version 3.5
$$ ##JCAMPDX= 5.01
$$ ##ORIGIN= Bruker BioSpin GmbH
$$ ##OWNER= she
$$ F:/spectra/data/she/nmr/P31/1/pdata/1/auditp.txt
$$ ##AUDIT TRAIL=  $$ (NUMBER, WHEN, WHO, WHERE, WHAT)
(   1,<2019-02-13 14:59:26.35 +0400>,<she>,<DPX200>,
      <created by zg, POWCHK disabled, PULCHK disabled
       configuration hash MD5:
       00 E9 B6 7A A2 85 ED C7 34 08 36 98 17 FE 4E 26
       data hash MD5: 32K
       E0 4D 9A 15 05 64 45 41 E5 31 4F 5D 62 91 0A A8>)
(   2,<2019-02-13 14:59:28.79 +0400>,<she>,<DPX200>,
      <Start of raw data processing
       efp BC_mod = 2 LB = 1 FT_mod = 6 PKNL = 1 PHC0 = -1431.71 PHC1 = 22.79891 SI = 64K 
       data hash MD5: 64K
       44 41 50 AB A2 46 7F 86 A7 B0 FE 48 9D B0 CB 5A>)
(   3,<2019-02-13 14:59:40.70 +0400>,<she>,<DPX200>,
      <pk PHC0 = -28.01593 PHC1 = 0 
       data hash MD5: 64K
       67 2D D5 CB FC D4 C5 B5 CA A3 9D 45 C1 02 6D E7>)
$$ ##END=
$$ 
$$ hash MD5
$$ 85 88 CE B8 B3 AE AF 94 4E 25 EF 68 E4 60 AE 0C
##$RELAX= 
##$RELAX= 
##$RELAX= 
##$RELAX= 
##$RELAX= 
##$RELAX= 
##$RELAX= 
##$RELAX= 
$$ Bruker specific parameters
$$ --------------------------
##$DU= <F:/spectra>
##$EXPNO= 1
##$NAME= <P31>
##$PROCNO= 1
##$TYPE= <nmr>
##$USER= <she>
##$AMP= (0..31)
100 100 100 100 100 100 100 100 100 100 100 100 100 100 100 100 100 100 
100 100 100 100 100 100 100 100 100 100 100 100 100 100 
##$AQSEQ= 0
##$AQ_mod= 1
##$AUNM= <au_zg>
##$AUTOPOS= <>
##$BF1= 81.014009
##$BF2= 200.13
##$BF3= 200.13
##$BF4= 200.13
##$BF5= 200.13
##$BF6= 200.13
##$BF7= 200.13
##$BF8= 200.13
##$BYTORDA= 1
##$CFDGTYP= 0
##$CFRGTYP= 5
##$CHEMSTR= <none>
##$CNST= (0..31)
1 1 145 1 1 1 1 1 1 1 1 1 1 1 1 1 1 1 1 1 1 1 1 1 1 1 1 1 1 1 1 1 
##$CPDPRG= <waltz16>
##$CPDPRG1= <>
##$CPDPRG2= <waltz16>
##$CPDPRG3= <>
##$CPDPRG4= <mlev>
##$CPDPRG5= <mlev>
##$CPDPRG6= <mlev>
##$CPDPRG7= <mlev>
##$CPDPRG8= <mlev>
##$CPDPRGB= <>
##$CPDPRGT= <>
##$D= (0..31)
0 1 0 0 0 0 0 0 0 0 0 0.03 2e-05 3e-06 0 0 0 0 0 0 0 0 0 0 0 0 0 0 0 0 
0 0 
##$DATE= 1550055565
##$DBL= (0..7)
120 120 120 11 120 120 24 19 
##$DBP= (0..7)
150 150 150 150 150 150 150 150 
##$DBP07= 0
##$DBPNAM0= <>
##$DBPNAM1= <>
##$DBPNAM2= <>
##$DBPNAM3= <>
##$DBPNAM4= <>
##$DBPNAM5= <>
##$DBPNAM6= <>
##$DBPNAM7= <>
##$DBPOAL= (0..7)
0.5 0.5 0.5 0.5 0.5 0.5 0.5 0.5 
##$DBPOFFS= (0..7)
0 0 0 0 0 0 0 0 
$$ [...]
##$SUBNAM2= <"">
##$SUBNAM3= <"">
##$SUBNAM4= <"">
##$SUBNAM5= <"">
##$SUBNAM6= <"">
##$SUBNAM7= <"">
##$SUBNAM8= <"">
##$SUBNAM9= <"">
##$SW= 369.568048894756
##$SWIBOX= (0..15)
0 1 3 0 0 0 0 0 0 0 0 0 0 0 0 0 
##$SW_h= 29940.119760479
##$TD= 32768
##$TD0= 1
##$TE= 0
##$TE2= 300
##$TE3= 300
##$TEG= 300
##$TL= (0..7)
0 120 53 12 22 120 120 120 
##$TP= (0..7)
150 150 150 150 150 150 150 150 
##$TP07= 0
##$TPNAME0= <>
##$TPNAME1= <>
##$TPNAME2= <>
##$TPNAME3= <>
##$TPNAME4= <>
##$TPNAME5= <>
##$TPNAME6= <>
##$TPNAME7= <>
##$TPOAL= (0..7)
0.5 0.5 0.5 0.5 0.5 0.5 0.5 0.5 
##$TPOFFS= (0..7)
0 0 0 0 0 0 0 0 
##$TUNHIN= 0
##$TUNHOUT= 0
##$TUNXOUT= 0
##$USERA1= <user>
##$USERA2= <user>
##$USERA3= <user>
##$USERA4= <user>
##$USERA5= <user>
##$V9= 5
##$VALIST= <valist>
##$VCLIST= <CCCCCCCCCCCCCCC>
##$VD= 0
##$VDLIST= <DDDDDDDDDDDDDDD>
##$VPLIST= <PPPPPPPPPPPPPPP>
##$VTLIST= <TTTTTTTTTTTTTTT>
##$WBST= 1024
##$WBSW= 4
##$XGAIN= (0..3)
0 0 0 0 
##$XL= 0
##$YL= 0
##$YMAX_a= 7441
##$YMIN_a= -6950
##$ZGOPTNS= <>
##$ZL1= 120
##$ZL2= 120
##$ZL3= 120
##$ZL4= 120
##$ABSF1= 0
##$ABSF2= 0
##$ABSG= 0
##$ABSL= 0
##$ALPHA= 0
##$AQORDER= 0
##$ASSFAC= 0
##$ASSFACI= 0
##$ASSFACX= 0
##$ASSWID= 0
##$AUNMP= <proc_1d>
##$AZFE= 0.1
##$AZFW= 0.5
##$BCFW= 0
##$BC_mod= 2
##$BYTORDP= 0
##$COROFFS= 0
##$CY= -3
##$DATMOD= 1
##$DC= 0
##$DFILT= <>
##$DTYPP= 0
##$F1P= 0
##$F2P= 0
##$FCOR= 1
##$FTSIZE= 65536
##$FT_mod= 6
##$GAMMA= 0
##$GB= 0
##$INTBC= 1
##$INTSCL= 5.30512e-09
##$ISEN= 30
##$LB= 1
##$LEV0= 0
##$LPBIN= 0
##$MAXI= 10000
##$MC2= 0
##$MEAN= 0
##$ME_mod= 0
##$MI= 50
##$NCOEF= 0
##$NC_proc= -6
##$NLEV= 6
##$NOISF1= 182.463
##$NOISF2= 159.3651
##$NSP= 0
##$NTH_PI= 0
##$NZP= 0
##$OFFSET= 182.463
##$PC= 4
##$PHC0= -1459.726
##$PHC1= 22.79891
##$PH_mod= 1
##$PKNL= yes
##$PPARMOD= 0
##$PSCAL= 0
##$PSIGN= 0
##$REVERSE= no
##$SF= 81.0140089999434
##$SI= 65536
##$SIGF1= 159.3651
##$SIGF2= -187.1042
##$SINO= 113.3802
##$SIOLD= 16384
##$SREGLST= <1H.CDCl3>
##$SSB= 0
##$STSI= 65536
##$STSR= 0
##$SW_p= 29940.119760479
##$SYMM= 0
##$S_DEV= 0
##$TDeff= 32768
##$TDoff= 0
##$TI= <>
##$TILT= no
##$TM1= 0
##$TM2= 0
##$TOPLEV= 0
##$USERP1= <user>
##$USERP2= <user>
##$USERP3= <user>
##$USERP4= <user>
##$USERP5= <user>
##$WDW= 1
##$XDIM= 65536
##$YMAX_p= 372694863
##$YMIN_p= -39266754
$$ End of Bruker specific parameters
$$ ---------------------------------
##NTUPLES= NMR SPECTRUM
##VAR_NAME=  FREQUENCY,     SPECTRUM/REAL,   SPECTRUM/IMAG
##SYMBOL=    X,             R,               I
##VAR_TYPE=  INDEPENDENT,   DEPENDENT,       DEPENDENT
##VAR_FORM=  AFFN,          ASDF,            ASDF
##VAR_DIM=   65536,         65536,           65536
##UNITS=     HZ,            ARBITRARY UNITS, ARBITRARY UNITS
##FACTOR=    0.456856943014862, 1,           1
##FIRST=     14782.0589164792, 0,            0
##LAST=      -15158.0608439998, 0,           0
##MIN=       -15158.0608439998, -39266754,   0
##MAX=       14782.0589164792, 372694863,    0
$$ Real data points
##PAGE= N=1
##DATA TABLE= (X++(R..R)), XYDATA
$$ [...]
47448 2643582 1091542 -1134651 -2891126 -3804692 -3801843 -2829769 -1080652 744813 1625882
47439 1625882 1091856 31470 -26352 1104764 1785495 843160 -516570 -409355 751339
47430 751339 782738 -826450 -1980063 -1099992 567437 888345 -274724 -1501713 -2153276
47421 -2153276 -2679448 -3140544 -3107520 -2966499 -3678550 -4864523 -4649876 -2261869 440431
47412 440431 1221739 377561 -116269 107176 -747051 -3536741 -6306728 -6666155 -4880788
47403 -4880788 -3214004 -2911761 -3308411 -3490088 -3242272 -2426593 -1034619 -67817 -760404
47394 -760404 -2481663 -3019346 -1631023 -160681 -128385 -424408 577013 2111861 2270396
47385 2270396 1152733 513780 735721 524443 -320542 -207571 1467503 2854063 2109375
47376 2109375 -131902 -1959501 -2710887 -2974912 -2910001 -2087986 -827000 -338750 -1143012
47367 -1143012 -2091523 -1534101 762118 3310897 4611625 4730145 4681819 4539513 3238433
47358 3238433 608109 -1608922 -1778348 -525511 378886 517487 653959 678283 -244888
47349 -244888 -1539965 -1398369 369530 1582957 633651 -1457734 -2796898 -2816503 -1750942
47340 -1750942 353399 2691246 3278768 1258740 -1359877 -1923199 -340647 1381219
47332 1381219 1940599 1460496 246120 -1257152 -1736494 -199980 2192551 3180164 2256114
47323 2256114 954320 456423 580862 1024741 1720980 1827372 333283 -1863254 -2356988
47314 -2356988 -421233 1861402 2370588 1218621 -481217 -2254209 -3528077 -3094755
47306 -3094755 -994172 465784 -512580 -2369418 -2068367 772124 3590152 4477598 4112565
47297 4112565 3891343 3913939 3563526 2901829 2647773 3306753 4725581 6093062 6327365
47288 6327365 5073587 3361838 2605014 2894043 3011213 2214159 1186226 936630 1460236
47279 1460236 1880670 1472020 305273 -723634 -464221 1344065 3444393 4196968 3397954
47270 3397954 2276803 1676179 1205752 434745 -232288 -519539 -1065215 -2262992 -3142747
47261 -3142747 -2628811 -1387332 -1027409 -1625054 -1531846 38803 1630512 1557421 282102
47252 282102 -314797 504670 1657583 1980925 1545522 999661 548745 132614 -57802
47243 -57802 54202 -38109 -784025 -1709512 -1993510 -1793094 -2043718 -2809918 -2911633 -1717477
47233 -1717477 -307197 32459 -326185 -103652 864184 1687896 2139235 2722141 3049693
47224 3049693 1940192 -348448 -1716877 -1047192 96273 -112674 -1043397 -1033390 -366056
47215 -366056 -569560 -1330084 -696367 1413148 2428580 791350 -1755872 -2895617 -2876597
47206 -2876597 -3134980 -3310092 -1991472 311305 1437947 846828 364147 1130752 1819427
47197 1819427 922022 -833526 -1751493 -1694775 -1756826 -2074459 -1640223 -219913 992757
47188 992757 957625 -45066 -1209874 -2243473 -3081831 -3324908 -2668540 -1532559 -685747
47179 -685747 -439891 -582310 -837029 -1009402 -924715 -610656 -336545 -182098 87732 374009
47169 374009 12684 -1131859 -1818157 -692983 1721167 3375817 3171432 2057809 1404973
47160 1404973 1399158 1592862 1912495 2228063 1884404 803387 304145 1474166 3184199
47151 3184199 3196462 1130336 -1087573 -1806762 -1317263 -729787 -607468 -1146150 -2333439
47142 -2333439 -3269904 -2615741 -510058 1178984 1405169 1421137 2523765 3699120 3263174
47133 3263174 1826790 1461266 2339053 2474592 964143 -659856 -915219 -309191 108470
47124 108470 434562 957416 949331 -103009 -1085207 -629882 770286 1521757 1264566 839240
47114 839240 288009 -1170426 -2929135 -2723835 368887 4026059 5147473 3510610 1633182
47105 1633182 1343402 1867728 1488272 -125029 -1894580 -2872611 -2945495 -2307820 -1077863
47096 -1077863 418515 1535632 1797061 1288120 427931 -419885 -1009332 -1196334 -1068087
47087 -1068087 -823206 -323938 860433 2599004 3789726 3457507 2089409 1124325 1080205
47078 1080205 1005897 82337 -1042464 -1131041 -2151 1426573 2365658 2630752 2133404
47069 2133404 867138 -466541 -726345 308930 1490342 1758181 1532838 1953154 3095371
47060 3095371 3861998 3619319 2982781 2635755 2275260 1462040 820661 1288912 2420289
47051 2420289 2643651 1385908 -213936 -1146129 -1882718 -3010436 -3608035 -2435223 -177248
47042 -177248 1133013 875172 420779 696877 863116 195209 -296864 510721 1747948
47033 1747948 1716946 511829 -324107 -533872 -1542325 -3632431 -4601341 -2547243 1145548
47024 1145548 3190934 2363244 608634 123405 685913 564744 -829332 -2224042 -2206651
47015 -2206651 -844869 562547 847013 -120792 -1510846 -2261855 -1958749 -1228642 -1138504
47006 -1138504 -2048676 -3205153 -3554856 -2724591 -1098088 669170 1910034 2114317 1325068
46997 1325068 178347 -796803 -1598460 -2113614 -1682087 -118973 1331383 1259694 159198
46988 159198 -84045 1094983 2136696 1754334 769641 701161 1654486 2646883 3106559
46979 3106559 2946057 1948921 296017 -935737 -1035448 -878126 -1662599 -3049522 -3994673
46970 -3994673 -4803533 -6450001 -8102453 -7560179 -4579369 -1673265 -736157 -801861 -412969
46961 -412969 -367084 -2100838 -4495404 -4711932 -2131981 591069 959036 -455970 -1393888
46952 -1393888 -1032440 -454991 -481044 -447483 441336 1541063 1524868 404042 -330715 132787
46942 132787 703404 118776 -983915 -1015132 28107 551439 -87614 -684892 -342056
46933 -342056 106071 -213841 -508175 312951 1606751 1954208 1480923 1477265 1991782 1672631
46923 1672631 244892 -626014 296807 1999371 2804804 2722087 2932062 3569521 3472074
46914 3472074 2119018 549556 -97376 -64548 -352991 -1190531 -1881284 -1926245 -1519870
46905 -1519870 -919914 -56918 999386 1844555 2396263 3132939 4125297 4420968 3236256
46896 3236256 1407608 672858 1553418 2825072 3104406 2088621 218961 -1815650 -3000686
46887 -3000686 -2533460 -961461 118593 5892 -353636 -69517 290632 -196354 -1214525
46878 -1214525 -1673000 -1096551 271435 2031306 3445735 3510369 2230551 1104550 1283221
46869 1283221 1995252 1925539 1310198 1286854 1948050 2602637 3239406 3944843 3542253 975737
46859 975737 -2294139 -3622659 -2893025 -2469384 -3236888 -3411830 -2059174 -970781 -1518108
46850 -1518108 -2102514 -790046 1432315 2296610 1719609 1298710 1353746 831312 -373921
46841 -373921 -1184750 -1231035 -1108577 -892562 -129135 758062 695719 -380644 -1550002 -2468051
46831 -2468051 -3346413 -3498545 -1757949 1327073 3381544 2874197 669222 -1397994 -2170644
46822 -2170644 -1154098 1518819 4398760 5365848 3856370 1515294 83384 -319711
46814 -319711 -362338 -286258 -276633 -805895 -1709193 -2014627 -1568255 -1641557 -2863410 -3756497
46804 -3756497 -2727201 -547251 723851 615409 397772 766869 1091136 955477 868447
46795 868447 1090451 1021867 239574 -784379 -1435623 -1736785 -2053697 -2557659 -3135116 -3372325
46785 -3372325 -2711515 -1219505 -20269 -158122 -1126766 -1421932 -532222 582001 1007145
46776 1007145 741802 -142882 -1900998 -4040871 -4987920 -3782373 -1424848 337365 1006920
46767 1006920 1272661 1477644 1221312 356372 -588446 -1159165 -1465102 -1662062 -1449331
46758 -1449331 -463798 994827 1952740 1641002 385123 -607400 -594552 -222492 -607960
46749 -607960 -1608168 -1769436 -237732 2020898 3379050 3287253 2255290 716369 -1172250
46740 -1172250 -2869339 -3582569 -3235772 -2660584 -2609371 -2993445 -3207891 -2812657 -1762390
46731 -1762390 -299791 1186149 2320978 2813749 2376980 869741 -1234873 -2836305
46723 -2836305 -3116335 -2348164 -1434083 -807953 -237665 435209 945442 1090564 1133335 1509522
46713 1509522 2279306 2907957 2593386 1090820 -655600 -1165596 -80378 1280778 1522045
46704 1522045 856756 512065 891795 1257830 1038974 477822 -76123 -701525 -1627443
46695 -1627443 -3008887 -4813935 -6261253 -5847827 -3141816 -268056 -33167 -2397011
46687 -2397011 -4380231 -3893615 -2020062 -795176 -467959 -191812 82765 42493 239985
46678 239985 1100751 1431140 -188815 -2817085 -3811029 -2260185 -227378 -142735 -2104577
46669 -2104577 -4176331 -4459911 -2548389 300562 2133027 2016261 913153 398760 778525
46660 778525 1228154 1401290 1659409 1732705 563558 -1969384 -4205425 -4328119 -2313474
46651 -2313474 233165 1776643 2026420 1726023 1600108 1568164 1164234 622274 714463
46642 714463 1159104 396302 -1984958 -3734924 -2530156 690619 2913509 3039809 2452526
46633 2452526 1899390 560154 -1373582 -2040887 -958637 -154799 -762206 -935484 847934
46624 847934 2646931 1820200 -675871 -1648697 -458294 415003 -619270 -2265875 -2689455
46615 -2689455 -1828108 -822806 -522416 -885996 -946877 400059 2639732 3447590 1669133
46606 1669133 -473096 -151033 1877742 2343823 338056 -1754694 -2390489 -2888497 -4329747
46597 -4329747 -5246266 -4125577 -2112321 -1290610 -1748052 -2145884 -2098910 -2297106 -3010760
46588 -3010760 -3879448 -4596448 -4739024 -3654381 -1529069 208971 547813 175126 223897
46579 223897 684700 1037658 1391792 1796088 1443843 -36757 -1357134 -1092990 292632
46570 292632 1398871 2100329 3142504 4124499 3814532 2375777 1492292 2007112 2839473
46561 2839473 2593381 1179963 -377556 -906579 134456 2036139 3208363 2966047 2450775
46552 2450775 2790784 3130493 2026734 170453 -291321 979733 1990713 1429184 220495
46543 220495 -488050 -1012752 -1881775 -2481044 -2102675 -1258638 -939788 -1322388 -1881319 -2086447
46533 -2086447 -1641203 -871060 -945728 -2511792 -4099399 -3557065 -1302143 -114304 -1073190
46524 -1073190 -1988010 -1068574 158695 -507374 -2321138 -2956561 -2146270 -1514212 -1632128
46515 -1632128 -1573781 -865293 216588 1744855 3463351 3659673 1113339 -2258576 -3323113
46506 -3323113 -2172688 -1840131 -3336250 -4051640 -2132832 428332 825478 -678761 -1889240
46497 -1889240 -2006550 -1747146 -1345308 -506467 319590 402418 64921 100945 249721 -410861
46487 -410861 -1863567 -3158828 -3750296 -3729667 -3035454 -1557832 122546 1103028 1221843
46478 1221843 1055026 1109720 1662358 2912223 4467849 5145337 4196681 2390244 1071581
46469 1071581 599446 486859 444147 307255 -406546 -1738370 -2677311 -2452210 -1764894
46460 -1764894 -1530413 -1281516 -373203 224808 -565005 -1430909 -309364 1797152 1648287
46451 1648287 -1164441 -2996403 -1161059 2479590 4487821 4133621 2928007 1875783
46443 1875783 1227471 1410902 2199290 2229933 1178550 1006500 3018830 5133942 4574261
46434 4574261 2141495 965692 1623462 1565305 -504443 -2601651 -2596572 -1027731 264116
46425 264116 554133 292483 81262 383937 1225395 1783282 1322939 585452 884541 1837833
46415 1837833 1692570 57053 -1584965 -2409024 -3195060 -4111975 -3832697 -2033676 -688455
46406 -688455 -1272734 -2366073 -1777463 271952 1822139 1967599 1352688 791922 902490
46397 902490 2209095 4131551 4786937 3319380 1455192 1065261 1184831 -486660 -3796006
46388 -3796006 -6093477 -5812680 -4047325 -2454975 -1431428 -682986 -60191 596010 1323626
46379 1323626 1633968 1201974 682630 674232 365128 -1263623 -3352198 -4117695 -3614655
46370 -3614655 -3482405 -3971866 -3470647 -1358893 845558 1839153 2011103 1880915 1155264
46361 1155264 255698 623016 2193282 2598843 553859 -1724843 -1448810 748801 1879857
46352 1879857 765340 -1014113 -1927615 -2247050 -2856084 -3816539 -4511849 -4386477 -3405259
46343 -3405259 -2251756 -1845216 -2276749 -2710956 -2655649 -2493724 -2332296 -1480642 166634
46334 166634 1406648 1340329 560223 -224258 -1332148 -2626504 -2503534 -238202 1982045
46325 1982045 1556985 -948941 -2922980 -3451011 -3439063 -2793154 -531543 2374879 3337202
46316 3337202 1869049 329392 354190 1155510 2036218 3678709 5686764 5719395 2989294
46307 2989294 253124 157814 1585610 1895763 984566 495552 410903 -605758 -2164493
46298 -2164493 -2324712 -734894 883367 1529494 1950663 2586776 2655563 1886130 1272113
46289 1272113 1345980 1336925 817906 626829 1192557 1354388 59393 -1793950 -2447571 -1544806
46279 -1544806 -210618 604963 813948 563274 -46769 -644582 -770070 -505382 -462484
46270 -462484 -1056355 -2025597 -2642768 -2328535 -1297625 -637156 -1280817 -2742285 -3450774
46261 -3450774 -2664998 -1406370 -973656 -1186564 -899874 208771 1320380 1719329 1400043
46252 1400043 518417 -743894 -1692849 -1624755 -1175875 -2014799 -4447000 -6362375 -5722245
46243 -5722245 -3397307 -2115658 -2875956 -3981226 -3824671 -2991899 -2775355 -2991303 -2643504
46234 -2643504 -1918045 -1914050 -2625028 -2726526 -1617607 -383544 -205032 -824414 -1231203
46225 -1231203 -1056290 -563060 111698 907364 1409478 1185259 362069 -594789 -1388309
46216 -1388309 -1771726 -1392078 -325062 652939 957655 967468 1260455 1582824 1415289 1060473
46206 1060473 1060299 913182 -240401 -1752562 -1880280 -397275 782278 303518 -783203
46197 -783203 -922144 -416148 -382118 -407378 782899 2716295 3295975 1841311 230546
46188 230546 262105 1310366 1657054 1080158 802045 1397077 2061757 1953547 1237763 559392
46178 559392 196887 104973 338525 994411 1857755 2430732 2423409 2105511 1988190 2150042
46168 2150042 2205486 2147883 2697283 4093963 4926010 3389839 -108355 -2944101 -3504056
46159 -3504056 -3100325 -3567760 -4230455 -3038255 2949 2617273 3365464 2944341 2162563
46150 2162563 753968 -1037698 -1739173 -824509 42037 -509475 -1207119 -72460 2362801
46141 2362801 3818356 3642334 3330228 3809736 4218741 3704324 2721265 1922992 1035375
46132 1035375 -520685 -2727791 -5039811 -6634491 -6583183 -4659935 -1954107 209968
46124 209968 1703936 2890721 3095378 1549670 -432587 -471299 1357470 2241220 580704
46115 580704 -1961219 -3343203 -3830407 -4353051 -4322453 -3069713 -1800165 -1956506 -2864104
46106 -2864104 -3043461 -2696747 -2765713 -2678379 -1482475 -309648 -988904 -2713411 -2910839
46097 -2910839 -1292369 -143426 -354242 -161294 1362885 2452026 1657821 240784 -172791
46088 -172791 -244757 -1249602 -2416402 -2210920 -1209982 -1358108 -2728911 -3159492 -1384599
46079 -1384599 1080318 1846478 515497 -1048413 -991747 473943 1481543 869969 -421899
46070 -421899 -839944 -524099 -982525 -2600179 -3877156 -3523593 -2079629 -890943 -519548
46061 -519548 -681826 -719406 304425 2750092 5134958 5169393 2828218 855841 1163494
46052 1163494 2311895 2000630 523006 -188709 165821 129476 -944662 -2282695 -3396662
46043 -3396662 -4468594 -5079834 -4388487 -2755200 -1599815 -1422149 -1395211 -1056536 -907866
46034 -907866 -1105381 -1045178 -607520 -415347 -486366 -53414 813093 886537 -211342 -1050822
46024 -1050822 -342732 1259244 2206568 1937226 825662 -792852 -2483466 -3318480 -2750183
46015 -2750183 -1505454 -740820 -660002 -717730 -732249 -877158 -865192 -139279 1102470 1894688
46005 1894688 1718391 1153422 1090728 1696454 2399220 2641305 2358483 1771612 962514 -139847
45995 -139847 -1395274 -2343721 -2583485 -2030000 -693392 1396679 3742103 5301700 5406197
45986 5406197 4467896 3287726 2044991 630634 -443144 -440222 400854 981716 719357
45977 719357 105920 -15525 957075 3172120 5690327 6411715 4051976 194151 -2110265
45968 -2110265 -1994035 -1479703 -2177508 -3110212 -2801162 -1872801 -2006655 -3280624 -4073312
45959 -4073312 -3190671 -957799 1439170 2792067 2469064 1011696 -219406 -576547 -717743
45950 -717743 -1145896 -1118730 66039 1607461 2215411 1911284 1586592 1337505 587152
45941 587152 -466599 -855765 -242314 701957 1202793 857070 -423920 -2010441 -2547625
45932 -2547625 -1424428 163884 693716 316977 167583 352086 280924 482701 2013751
45923 2013751 4065934 4333041 2322923 384593 529637 1806028 1904235 163102 -2082349
45914 -2082349 -3237724 -2629361 -709881 1163031 1786232 1413314 1265167 1567786 1298415
45905 1298415 256709 -188428 685321 1496781 819857 -552919 -954949 -487289 -566993
45896 -566993 -1405962 -1746449 -1003330 -49204 355851 586521 1189607 1865149 1866930 896322
45886 896322 -555388 -1393749 -708424 1036602 1982579 884123 -1188816 -2136834 -1504058
45877 -1504058 -607258 -112415 909050 2946412 4476137 3570165 416404 -2809123 -4352704
45868 -4352704 -4359716 -3992656 -3797347 -3307342 -2044659 -490432 290215 -2784 -403467
45859 -403467 100638 1224252 1824513 1406213 470053 -466209 -1282530 -1625973 -899177
45850 -899177 618506 1429728 337358 -2072266 -4047818 -4523418 -3891037 -3203887 -3150947
45841 -3150947 -3694013 -4179937 -3724053 -1865165 923508 3444061 4591172 4029451 2204479
45832 2204479 -143613 -2371927 -3897264 -4138441 -3014347 -1494146 -952394 -1596099 -2164535
45823 -2164535 -1729090 -1037170 -1166279 -1618921 -1201584 -319319 -492639 -1548382 -1486409
45814 -1486409 125640 876372 -864012 -3031616 -2810321 -1031944 -831115 -2575991 -3305425
45805 -3305425 -1606207 -25568 -1226201 -4105552 -5712131 -5411154 -4914958 -5035845 -4694214
45796 -4694214 -3125000 -1175977 96685 814692 1593671 2295658 2159952 901966 -699431
45787 -699431 -1333103 -392509 1204482 1798956 906514 -122645 145092 1361089 2037059
45778 2037059 1576821 675687 -16575 -490192 -668747 -261528 469875 800804 635698
45769 635698 553562 594518 183177 -367685 340511 2608460 4424077 3667351 820498
45760 820498 -1721038 -2531152 -2128295 -1433639 -647453 223694 905375 1356156 1948183
45751 1948183 2711213 2921318 1861532 -226706 -2149785 -2667670 -1551434 61549 637216
45742 637216 -140932 -1080846 -1119816 -634609 -484163 -463846 154136 966623 750872 -542643
45732 -542643 -1533631 -1540691 -1640918 -2874541 -4491679 -4971457 -4027367 -2542024 -993780
45723 -993780 899676 3019835 4342445 4006668 2447524 1108862 1092875 2171279 3105316
45714 3105316 2935070 1886899 954955 818959 1427398 2351209 3049443 2993374 2154365
45705 2154365 1247687 841828 446823 -614088 -1643959 -1201870 556548 1669807 1099515
45696 1099515 190475 409147 999671 350644 -1303407 -2258263 -1901962 -1247401 -1122512
45687 -1122512 -1385636 -1902569 -2775424 -3448340 -3065476 -2031293 -1756117 -2369544 -2213242
45678 -2213242 -473681 1091835 401406 -1910579 -3239806 -2423091 -920252 -495353 -1033933
45669 -1033933 -1240594 -614914 106322 147716 -396646 -882194 -826534 -131920 1007562 2106869
45659 2106869 2552543 2156988 1420490 856818 251559 -803536 -1762300 -1443634 229348
45650 229348 1763965 1966002 1406704 1203694 1162674 316200 -1209446 -2213299 -2137615
45641 -2137615 -1517348 -782042 100321 728809 405861 -555921 -1053033 -1148590 -2296596
45632 -2296596 -4806338 -6572601 -5654750 -3039412 -1296848 -1181520 -1247769 -594568 -229641
45623 -229641 -1261113 -3059376 -4027430 -3487517 -2080277 -670822 497409 1628951 2821838
45614 2821838 3862773 4425994 4279824 3258065 1288165 -1195267 -2969498 -2761309 -595778
45605 -595778 1942486 3158463 2779128 1846641 1409523 1654584 2094045 2206193 1906501
45596 1906501 1561524 1493640 1502179 1135605 402598 -220499 -523889 -743165 -849322 -306112
45586 -306112 1105278 2758511 3869824 4247752 4048656 3370881 2492611 1890411 1513816
45577 1513816 639984 -981064 -2411581 -2563105 -1419828 292110 1947515 2911357 2490112
45568 2490112 971211 -68383 381924 1320785 1392266 1174607 2101410 3640509 3674112
45559 3674112 1788309 103290 227167 1220775 1495533 1125250 1084147 1452840 1709115
45550 1709115 1907219 2262277 2176717 935141 -953688 -2167082 -2153486 -1488066 -841811
45541 -841811 -365699 -4447 204267 135059 -421288 -1496979 -2464238 -2368874 -1160973 24888
45531 24888 344451 298366 618464 888367 351913 -452750 -186716 1271901 2515031 2475446
45521 2475446 1608388 934883 771326 807549 797964 720126 570475 241093 -560305 -2107666
45511 -2107666 -3967228 -4801086 -3623543 -1192699 667411 1179991 1159803 1311621 1128565
45502 1128565 107488 -951100 -929599 -133498 135402 -373995 -399983 925364 2646665
45493 2646665 3135600 2136963 910590 548039 906337 1265593 1306526 1088842 645415
45484 645415 135872 9280 405641 672803 155754 -728238 -984528 -524410 -257343 -633265
45474 -633265 -1090524 -1227316 -1454433 -1940399 -1933370 -932231 317931 881269 916458 968441
45464 968441 765599 -116690 -1060048 -1200713 -935147 -1224199 -1770436 -1434998 -291733
45455 -291733 356245 30750 -477382 -831927 -1548175 -2319142 -1838892 -42094 1264277
45446 1264277 1028177 563458 1288434 2384891 2262896 1108864 234220 -182360 -859652
45437 -859652 -1506196 -1001973 642803 2021919 2024625 672653 -1423982 -3228190 -3320275
45428 -3320275 -1279206 1171230 1870156 957107 423642 1079978 1728003 1522112 1289040
45419 1289040 1846090 2575329 2541546 1857417 1183907 862808 1087787 1869460 2356782 1427160
45409 1427160 -468958 -1384478 -535430 501033 199920 -708705 -735079 -94299 -92043 -877141
45399 -877141 -1403523 -1151956 -492087 292576 1081094 1378598 867856 117257 -290735 -698473
45389 -698473 -1265241 -821562 1465837 3988623 4333315 2683206 1337220 907958 -380838
45380 -380838 -3013044 -4509909 -2954788 -77507 1112636 306174 -504355 -381767 -277304
45371 -277304 -899985 -1662185 -1855984 -1484934 -787061 -28167 181009 -633611 -1950537
45362 -1950537 -2721582 -2650841 -2225557 -1719890 -1122540 -768284 -864088 -599747 845915 2435972
45352 2435972 2124074 13948 -1098515 647966 3512069 4494922 3186750 1602314
45344 1602314 971101 656135 98093 -130929 309492 705466 620132 820683 1937459
45335 1937459 3116537 3013644 1503526 -495273 -2282237 -3467440 -3397430 -1802214 187964
45326 187964 992233 617536 489163 1058322 1033532 -363720 -1811739 -1771553 -914911 -1076004
45316 -1076004 -2252693 -2403127 -461051 1940921 2480187 854010 -1379627 -2952778
45308 -2952778 -3809852 -4120571 -3506633 -1735447 387683 1509986 1135346 102347 -525379
45299 -525379 -696910 -1150094 -2227515 -3481575 -4358061 -4583140 -3847355 -2023925 -47198
45290 -47198 444011 -877442 -2184073 -1647563 226342 1506136 1412916 595991 -611932
45281 -611932 -2343325 -3630440 -2750711 182709 2679680 2861392 1572109 542434 -72422
45272 -72422 -962072 -1740756 -1517299 -698775 -532632 -1143462 -1489869 -1114492 -605895 -410146
45262 -410146 -428715 -731950 -1444119 -1969651 -1629902 -1089435 -1708379 -3217332 -3545051 -1597807
45252 -1597807 1116008 2514157 2491139 2390651 2807096 3189448 3180019 3038936 2751293 1873998
45242 1873998 617140 140034 1069186 2250651 1893377 -29868 -1398627 -498527 1649956
45233 1649956 2459607 1091088 -576103 -622879 478828 1037939 768223 798374 1464201
45224 1464201 1699873 875606 -133828 -361416 -198067 -556531 -1213242 -969467 609523
45215 609523 2339861 2586015 1039655 -930285 -1751530 -1255452 -520925 -307364 -329550
45206 -329550 -197381 -124430 -108699 672170 2615898 4465391 4508801 2683907 423427
45197 423427 -1191211 -1908058 -1402392 450240 2405964 2600806 824230 -1262909 -2367618
45188 -2367618 -2613302 -2235668 -1015977 456272 731577 -415033 -1372114 -1030614 -197453
45179 -197453 257195 961728 2453996 3623231 3355757 2446841 2198773 2272985 1727696
45170 1727696 1138376 1642387 2585928 2233110 501014 -922371 -1026104 -326701 534106
45161 534106 1347261 1683448 1413133 1689871 3531664 5500187 4908935 1651773 -1253688
45152 -1253688 -1575077 -378238 228514 3112 -69790 107001 -186043 -1028050 -1704701
45143 -1704701 -1666222 -910183 192615 1003618 1081301 834198 1020463 1434716 1120732 220787
45133 220787 332836 2229251 4300568 4342042 2228133 -142427 -1082169 -470118 711903
45124 711903 1388561 1107870 282597 -380969 -804697 -1439907 -2189675 -2215616 -1145091 268246
45114 268246 1055989 900160 -158562 -1909465 -3410406 -3274304 -1282811 1030099 2052714
45105 2052714 1652184 605891 -507897 -1170119 -777287 357542 763751 -348957 -1783518
45096 -1783518 -1962117 -1086280 -533432 -796961 -1289198 -1602190 -1638825 -983266 472850
45087 472850 1649493 1422867 366757 -40332 360440 548490 488051 1303503 3058358
45078 3058358 4186973 3795414 2946323 2774294 2697348 1633348 -19243 -853301 -350036
45069 -350036 725114 1491160 1703044 1578404 1529713 1907141 2579680 3009402 3001942 2909674
45059 2909674 2757631 1818492 -327323 -2819106 -4302135 -4318537 -3288986 -1617775 251699
45050 251699 1236565 337346 -1791385 -3048347 -2247677 -561872 39580 -753699 -1470404
45041 -1470404 -855896 908601 2960316 4772033 6006149 6115144 4885451 3148108
45033 3148108 2236841 2631785 3538793 3868355 3296062 2307017 1517767 1107111 816399
45024 816399 509057 665288 1890913 3714730 4514275 3328086 1273666 235019 436818
45015 436818 440518 -540954 -1606461 -1649118 -621483 1045389 2999344 4412939 4248938
45006 4248938 2920002 2389249 3549822 4696326 3852753 1506766 -422977 -1288943 -1615377
44997 -1615377 -1145800 845361 3507279 4737122 3801857 2015935 634250 -331524 -984220
44988 -984220 -900729 -81563 901562 2071178 3838218 5272041 4417650 1212990 -1589938
44979 -1589938 -1662014 34977 903249 126651 -1031344 -1597462 -1981227 -2811924 -3834796
44970 -3834796 -4197272 -3398292 -1983620 -1341909 -2334031 -4121848 -5129348 -5111667 -5062250
44961 -5062250 -4986422 -3538561 -629648 1414812 722599 -1464087 -2578022 -2070939 -1276027
44952 -1276027 -870884 -400466 215839 585390 984935 1902988 2692897 2393632 1666247
44943 1666247 2050983 3358394 3804042 2940514 2329639 2672366 2359403 59591 -2896420
44934 -2896420 -4150847 -3245474 -1623679 -528574 -79101 151640 646511 1598688 2365751
44925 2365751 1892840 341022 -513907 625541 2813022 4102056 3854301 2837369 1784604
44916 1784604 1081174 1247540 2265668 2759963 1410307 -840855 -1556761 -80446 1453274
44907 1453274 1039211 -548034 -1023555 354885 2132149 2662250 1760971 392038 -519995
44898 -519995 -739777 -576969 -334721 81058 891391 1804961 2031344 1186830 -96737
44889 -96737 -805967 -641899 -196404 -140049 -522205 -903271 -1020186 -1198556 -1951377 -3083776
44879 -3083776 -3533528 -2583266 -1018471 -313634 -645798 -705135 144498 651412 -436089
44870 -436089 -2187908 -2626769 -1622854 -1014014 -1698872 -2268588 -1316082 221644 311424
44861 311424 -1245595 -2453067 -1657254 517391 2009853 1529007 -346565 -1991906 -2416238
44852 -2416238 -2047786 -1809963 -1719993 -983864 562362 1973346 2524475 2678766 3059851
44843 3059851 3211788 2346448 831044 -184096 -429229 -704503 -1386239 -1852421 -1726216
44834 -1726216 -1729450 -2650850 -4003115 -4376745 -3045212 -866435 491734 207715 -856368
44825 -856368 -1173544 -369528 492843 567739 326583 471359 668606 354213 40484 511775
44815 511775 1220725 985861 61531 -75621 954211 1907569 1943480 1620027 1472634 1138485
44805 1138485 487204 199546 545885 882399 943295 1247440 1649388 1092197 -420179
44796 -420179 -1289542 -714370 134336 412616 1104358 2754783 3776601 2997384 1936181
44787 1936181 2116951 1960698 -596670 -3805101 -4004156 -1182871 1004743 680245 -478431
44778 -478431 -1219474 -2536869 -4313633 -3963577 -604483 2488978 2206940 3561 -717423
44769 -717423 376310 1126209 1039016 1571370 2787077 2822412 968288 -1185926 -2257975
44760 -2257975 -2719140 -3328283 -3612370 -2887861 -1659553 -1025398 -1293724 -1893071 -2307602
44751 -2307602 -2601940 -3096887 -3697814 -3628010 -2147822 306420 2194556 2446390 1466695
44742 1466695 208835 -1011259 -2149526 -2729368 -2536984 -2408965 -3123108 -3875876 -3135863
44733 -3135863 -890715 1177801 1827580 1480710 1198350 1466783 2221464 3142439 3619797
44724 3619797 3156951 2021956 922803 138093 -270949 279324 2112684 3786145 2980985
44715 2980985 -500444 -4003950 -5132171 -4394132 -3770124 -3813578 -3613587 -2872028 -2328014
44706 -2328014 -2235434 -1891416 -954717 -124744 -126879 -847475 -1795347 -2670217 -3146636 -2843176
44696 -2843176 -1970974 -1392725 -1523277 -1700750 -1212861 -473231 -467378 -1287466 -1935913 -1553267
44686 -1553267 -295630 982436 1455514 848968 -227442 -570418 369393 1587759 1562010
44677 1562010 128674 -1519383 -2670354 -3704134 -4539795 -3955356 -1506110 1038227
44669 1038227 1626189 607575 -3928 530728 1130307 1096754 1032179 1233869 882753 -408833
44659 -408833 -1570153 -1476727 -415028 573291 894464 330306 -1188787 -2952544 -3602686
44650 -3602686 -2786277 -1796361 -1713322 -1901082 -1383165 -682734 -920769 -1845825 -2252738 -1881673
44640 -1881673 -1468499 -1275953 -1029295 -1065640 -2021410 -3362372 -3627382 -2297178 -232937
44631 -232937 1768039 3532221 4522285 3797518 1524447 -634154 -1286179 -665028 162223
44622 162223 596229 663538 702339 1236656 2436054 3525223 3541156 2734907 2226465 2241743
44612 2241743 1960955 1285524 1219091 1940909 2038081 566059 -1441573 -2530950 -2668649
44603 -2668649 -2404652 -1420265 634330 2760914 3628822 3407013 3191132 3143498 2655097
44594 2655097 1916693 1762968 2153538 2309392 2240172 2572552 2830503 1578034 -1302060
44585 -1302060 -3960191 -4801241 -4080045 -2730044 -990595 946805 2211645 2353052 2240711
44576 2240711 2684183 2944301 1932766 254865 -503683 -252158 -459649 -1541129 -1889007
44567 -1889007 -388768 1393197 879186 -2207247 -5418401 -6343888 -4782018 -2137452
44559 -2137452 267192 1811069 2346082 2192696 2100837 2514148 2887589 2301351 864260
44550 864260 -3592 987047 3523195 5939199 6764573 5763692 3649944 1294762 -614040
44541 -614040 -1555451 -1323700 -248520 994950 1898369 2328782 2282555 1744977 919363
44532 919363 305839 290841 774734 1318300 1431524 661917 -1070717 -2872820 -3223550
44523 -3223550 -1665030 248475 560045 -810854 -2369230 -3318180 -4170800 -5090866 -5248598
44514 -5248598 -4339688 -3213422 -2238092 -605756 1690253 2823579 1632835 -248391
44506 -248391 -624906 78376 13193 -721720 -500564 573903 680076 -426862 -976618
44497 -976618 -474604 -540891 -1602046 -1715922 -181694 509461 -1526995 -4220627 -4584232
44488 -4584232 -3187017 -2663754 -3148581 -2479292 -370625 917020 336928 -418047 36536
44479 36536 606721 -198686 -1793729 -2459697 -1686376 -523573 -276741 -1455805 -3352618
44470 -3352618 -4330762 -3350417 -1482961 -976815 -2467127 -4072196 -3732726 -1584293 520772
44461 520772 1122725 289646 -738170 -619423 852408 2325399 2235817 661585 -888953
44452 -888953 -1585704 -2162627 -3353885 -4478470 -4312871 -2748640 -896873 143295 213067
44443 213067 43331 422853 1131340 888462 -1012757 -3293427 -3933242 -2761499 -1563040
44434 -1563040 -1418543 -1348571 -174318 1628019 2857008 3290214 3412673 3282008 2752217
44425 2752217 2235812 2244411 2588645 2793839 2783996 2480455 1495167 105805 -330588 833577
44415 833577 2030093 1234026 -1161155 -2793348 -2556386 -1767123 -1877538 -2596756 -2932219
44406 -2932219 -2748645 -2318755 -1313005 586368 2584330 3435082 3097966 2792803 3307718
44397 3307718 4064475 4152838 3557489 2763955 1667244 -190217 -2316488 -3212746 -2158348
44388 -2158348 -356364 451616 3902 -760251 -1559334 -3015920 -4998787 -6163338 -5755460
44379 -5755460 -4718150 -4202267 -3966338 -3201747 -2051804 -1133487 -245611 1058057 1992131
44370 1992131 1165013 -1209764 -3064081 -2890623 -1436469 -461671 -544848 -758476 -157014
44361 -157014 1009272 1666776 1317652 741565 905370 1386102 850956 -613912 -928928
44352 -928928 1237298 4246088 5476951 4764803 4092509 4318158 4256213 3044341 1355859
44343 1355859 -154283 -1629771 -2642337 -2120671 -602912 -446154 -2362659 -3733142
44335 -3733142 -2267652 377106 969151 -610021 -1679684 -975516 220429 886512 1418997
44326 1418997 1805766 1332031 628170 1378887 3175875 3351149 1201548 -349409 803182
44317 803182 2397288 1330804 -1302203 -1966118 -283992 670672 -547696 -1844806 -1392993
44308 -1392993 -290884 -104646 -183922 875236 2765765 4067547 4113333 2957947 646931
44299 646931 -2129169 -3608883 -2575847 140812 2686192 3974253 3776268 2202552
44291 2202552 160408 -827555 -531538 -676152 -2372736 -4055710 -3585758 -1325459 711296
44282 711296 1782506 2431201 2484809 1462582 430232 906419 2191555 2353462 1648237
44273 1648237 2054242 3358245 3042132 759263 -529918 723006 2105486 1383977 138944
44264 138944 729328 2238427 2369692 1288109 504919 -293603 -2011117 -3152884 -1634099
44255 -1634099 1263894 2284111 1098219 316560 785123 590975 -856299 -1489525 -389969
44246 -389969 491426 -78352 -414020 798409 1776853 562234 -1486124 -1641460 239201
44237 239201 2095737 2874875 3033691 2563537 820104 -1717785 -3285512 -2758358 -833617
44228 -833617 730841 622322 -813392 -1564809 -84450 2270968 2411440 -223596 -2492913
44219 -2492913 -1960219 -430617 -920654 -2792835 -2857749 -520718 1358343 908813 -345783
44210 -345783 -395272 320448 196885 -1012331 -2334726 -3080717 -2987951 -1774409 242384
44201 242384 1672543 1362832 -28859 -686980 133452 1275188 1316542 497357 380286
44192 380286 1568425 2516062 1402430 -1170789 -2613626 -1696931 -59465 379733 78132
44183 78132 591908 1826042 2386706 1980691 1490051 999981 -152616 -1356234 -965782
44174 -965782 918032 1985740 948048 -617298 -853274 -419698 -1089613 -2683851 -3211847
44165 -3211847 -1640061 970495 2981016 3647972 3053432 1583625 -175304 -1538561
44157 -1538561 -2059259 -1772535 -1185766 -933503 -1094669 -947739 76065 1355436 1800972
44148 1800972 1522682 1657202 2368650 2355685 928959 -708940 -1184482 -882004 -1046965
44139 -1046965 -1818326 -2393896 -2578783 -2900498 -3426640 -3546620 -2898282 -1798170 -882703
44130 -882703 -769935 -1602559 -2413004 -1679188 692699 2667086 2332995 207685 -1754341
44121 -1754341 -2755150 -3469513 -4326484 -4945607 -5032613 -4490899 -2889831 -210092 2114573
44112 2114573 2425753 1029872 -338359 -1072937 -1916933 -2653397 -1822199 600469 2363877
44103 2363877 1935291 559107 13624 -44315 -861934 -2090174 -2429795 -1882359 -1410261
44094 -1410261 -927577 351077 1739762 1308777 -1298485 -3906057 -4342353 -2778098 -928316
44085 -928316 81648 374469 587671 1155317 1914868 2077749 1045913 -547725 -1274988
44076 -1274988 -726210 -197192 -1016110 -2725482 -3620029 -2835654 -1264480 -407448 -770583
44067 -770583 -1520052 -1525203 -614440 286643 328842 -196281 -349158 88837 423418 305492
44057 305492 359629 1092189 1868036 1721780 786904 128824 342672 1048596 1664040 1907179
44047 1907179 1543835 465903 -795733 -1399155 -1277383 -1114853 -945679 213750 2620082
44038 2620082 4639696 4497578 2631984 1000643 341507 -375216 -1720289 -2740782 -2785074
44029 -2785074 -2839419 -3843924 -4849624 -4412778 -3126227 -2981255 -4291955 -4960064 -3299676
44020 -3299676 -307299 1605576 1273323 -484808 -2058974 -2283658 -1031575 680318
44012 680318 1440994 846868 -47623 -54483 693755 1069504 463377 -550989 -999025 -559969
44002 -559969 210089 546441 336412 211320 591776 897330 277394 -984941 -1630390
43993 -1630390 -1165763 -578824 -883363 -1750016 -2180685 -1855536 -1130840 -293196 465017
43984 465017 834399 827875 909913 1067944 478370 -1079460 -2289363 -1932394 -799416 -631268
43974 -631268 -1631490 -2490333 -2532165 -2225793 -1737019 -759915 119879 -212091 -1264244
43965 -1264244 -1082556 728439 1998555 1091702 -737555 -1505309 -1424046 -1829429 -2394337
43956 -2394337 -1609995 472654 2081957 2315028 2128391 2504120 3131729 3347256 3210503
43947 3210503 3172671 3465726 4026313 4329778 3428777 1106280 -1195824 -1811236 -1112560
43938 -1112560 -894807 -1474401 -1261802 233044 1058099 -128015 -1437649 -336512 2175837
43929 2175837 2525824 -291282 -2951160 -2120214 1269022 3508937 2794530 782694 -102365
43920 -102365 701145 2222017 3602126 4596881 5076188 4859682 3941844 2465429 655031
43911 655031 -908354 -1328703 -292764 1302941 2287550 2660281 3351815 4550204 5169406
43902 5169406 4293076 2347287 398342 -968697 -1544475 -1083761 169900 1159590 1171840
43893 1171840 904067 1409810 2350379 2452158 1542586 831059 979854 1178385 689274
43884 689274 202225 715150 1720519 1559199 -474422 -3087416 -4254043 -3256104 -1303419
43875 -1303419 -146813 -213002 -418852 117624 816217 631279 -262051 -747871 -482911
43866 -482911 -210160 -333679 -357281 -44070 17359 -433900 -635900 -17595 705546 468850
43856 468850 -729850 -2112093 -3212402 -3874401 -3703090 -2499903 -992211 -264012 -534625
43847 -534625 -1126477 -1476607 -1557556 -1432574 -999508 -181739 955290 2122240 2668582
43838 2668582 2028367 654874 -133276 190436 516809 -337822 -1883525 -2742338 -2631131
43829 -2631131 -2381492 -2321800 -1955303 -1208754 -703924 -565424 -143758 661265 850907 -291823
43819 -291823 -2048685 -3131840 -3176906 -2820864 -2669698 -2678258 -2387168 -1536904 -608251 -734181
43809 -734181 -2640832 -5553684 -7569675 -7328600 -5121890 -2402769 -544126 17111 -108187
43800 -108187 54991 754552 1252341 967523 438355 495068 928579 957510 713424 1010968
43790 1010968 1651798 1367174 -134165 -1366455 -1066654 34586 334720 -513969 -1532286
43781 -1532286 -1929511 -1754868 -1319089 -802899 -400378 -271888 -328958 -379919 -395031 -400757
43771 -400757 -287672 44851 458942 597371 97421 -999993 -1844512 -1258057 788467
43762 788467 2681882 3047674 2621903 2976785 3820346 3405869 1681681 867925 2125886
43753 2125886 3689735 3601129 2528582 2205393 2519880 2119634 902126 -124649 -841721
43744 -841721 -1930280 -3145247 -3498942 -2967643 -2351704 -1684080 -526591 355726 -407786
43735 -407786 -2394220 -3525958 -2991032 -2176812 -2131250 -1953356 -662560 917695 1365902
43726 1365902 642673 -271677 -914136 -1526936 -2280556 -3044292 -3490524 -3109862 -1829352
43717 -1829352 -771036 -1289346 -2917020 -3577738 -2398433 -845850 -216843 375846 2082798
43708 2082798 3792489 3526903 1653503 653179 1757626 3559963 4194207 3415211 2086380
43699 2086380 832066 -177090 -924387 -1597929 -2427878 -3147110 -3071250 -1912984 -80444
43690 -80444 1892202 3638785 4593178 4065731 2150371 126164 -581997 195233 1246911
43681 1246911 1237458 -37213 -1660281 -2763007 -3430717 -4177493 -4748778 -4161549 -2178824
43672 -2178824 -47535 829902 509150 101061 45962 -404592 -1941600 -4078153 -5523562
43663 -5523562 -5398673 -4009463 -2617923 -2399711 -3398227 -4512585 -4586637 -3378833 -1521026
43654 -1521026 49438 566796 -20428 -711439 -300371 1056896 1796009 930723 -667836
43645 -667836 -1583736 -1599818 -1290771 -772251 -71557 -40505 -1386764 -3110871 -3419762 -2133889
43635 -2133889 -764132 -220450 -17064 53535 -791071 -2636606 -3961776 -3481032 -1894652
43626 -1894652 -800373 -643347 -721269 -611349 -550259 -617551 -345784 773218 2648659
43617 2648659 4377876 4786125 3638133 2141664 1534826 1433650 678157 -405059 -220947
43608 -220947 1384614 2497990 1974832 1062483 1036535 1054273 45376 -872560 -59741
43599 -59741 1672675 2159361 1338393 1163589 2244972 2993416 2346548 1098599 28830
43590 28830 -1159354 -2302511 -2221745 -758662 384457 35229 -723361 -443632 483714
43581 483714 892327 841266 1000379 1056334 408355 -244213 339326 2017864 3574496 4538063
43571 4538063 5204633 5202401 3727118 1199452 -901728 -2046271 -3034997 -4153555 -4499689
43562 -4499689 -3663481 -2598858 -2041005 -1376938 -89905 842795 315879 -916295 -1091976
43553 -1091976 -14845 594764 -508555 -2421759 -3242305 -2218465 -315538 955029
43545 955029 865004 -194163 -1374414 -2262741 -3069266 -3943043 -4386078 -3691146 -1908148
43536 -1908148 -27792 908262 681390 -187760 -1148713 -1992765 -2574832 -2526080 -1618209
43527 -1618209 -408043 -34530 -939874 -2024957 -1693825 187022 1962473 2104743 945113
43518 945113 34289 162243 661607 589627 -52923 -539882 -476270 -243239 -390186 -829603
43508 -829603 -879784 -156228 854268 1413226 1509683 1656488 1730900 821869 -1332171 -3417557
43498 -3417557 -3794964 -2352235 -422140 893915 1528569 1689116 1262706 338313 -357340
43489 -357340 -131440 762079 1245557 469911 -1298363 -2786591 -2826358 -1510326 -64199
43480 -64199 606293 883467 1617313 2809037 3714542 3845843 3120392 1456328 -751689
43471 -751689 -2106362 -1516613 6865 347069 -725840 -1202690 -21164 1181957 609837
43462 609837 -985981 -1660757 -1129172 -561362 -426296 -325565 -344001 -757083 -851840 108561
43452 108561 1077931 352134 -1651267 -2805361 -2483802 -2121748 -2312619 -1862552 -557954
43443 -557954 -327342 -2150474 -3985223 -3652376 -2023535 -1282702 -1513387 -1342822 -859803
43434 -859803 -1307561 -2397821 -2451651 -1184014 -91804 119376 368960 1057051 1123215
43425 1123215 801 -1210901 -1441029 -1125604 -1107456 -1271278 -1170242 -961153 -813145
43416 -813145 -265970 956970 2207555 2719818 2525049 2006148 1284688 616670 595089
43407 595089 1310914 2037337 2305833 2456884 2539061 1725998 -206153 -1727140 -1128669
43398 -1128669 1188104 3076630 3073898 1650987 254908 -228229 -194167 -813427 -2447276
43389 -2447276 -3625931 -2633497 -206717 1010402 363090 476598 3126510 5855367 5241533
43380 5241533 2170170 732020 2358918 4286460 4114887 2712655 1600989 438881
43372 438881 -1140172 -1614506 233376 2822077 3765050 3346245 3806491 5706920 7098207
43363 7098207 6319899 3950928 1690241 506623 233847 194036 -67769 -343315 -166754
43354 -166754 233284 92505 -444551 -152606 1196700 1827233 380349 -1716550 -2064458
43345 -2064458 -735306 127499 -234852 -405710 389830 930341 155497 -1253279 -2347305
43336 -2347305 -3225702 -3848509 -3262675 -1410024 -209479 -1119451 -2741967 -2703058 -1082493
43327 -1082493 50426 4251 97531 859938 926222 -432862 -1594488 -780528 1296498
43318 1296498 2495316 2185339 1585842 1520696 1416465 731502 -6813 -246007 -477500
43309 -477500 -1356603 -2377894 -2469343 -1681373 -1227638 -1696135 -2183706 -1674238 -488930
43300 -488930 318971 402573 98786 -567695 -1744132 -2750194 -2470490 -1041260 -10136
43291 -10136 -273970 -915956 -838534 -457534 -602774 -670696 441343 1969140 1795291 -385715
43281 -385715 -2217879 -1780618 8574 1168393 1412956 1607043 1599578 671193 -304021
43272 -304021 597933 3319020 5354463 5124447 4023887 3928270 4290118 3466717 1766510
43263 1766510 974756 1269863 870251 -963323 -2592764 -2458000 -1236178 -501034 -530698
43254 -530698 -672290 -887010 -1571544 -2463429 -3001858 -3364939 -3985666 -4418813 -3904444 -2781432
43244 -2781432 -2088599 -1953621 -1702539 -1424455 -1841730 -2473958 -1717303 556923 2152878
43235 2152878 1481724 22611 327243 2397469 3731778 2729101 522022 -752190
43227 -752190 -286839 1187807 2618787 3471420 3783886 3795355 3462984 2448463 827041
43218 827041 -508082 -726313 -167720 104016 -209951 -353870 193081 916062 1072744
43209 1072744 668504 193416 -153278 -518014 -963607 -1374193 -1594822 -1391746 -526906
43200 -526906 781671 1654451 1223508 -421885 -2172131 -2877942 -2370587 -1504117 -1167711
43191 -1167711 -1272030 -907041 352339 1583252 1377785 -540656 -3035630 -4844283 -5563888
43182 -5563888 -5313394 -4232976 -2815409 -2087470 -2644407 -3710565 -3867751 -2683625 -1027089
43173 -1027089 183849 831619 1068339 747112 -80880 -650578 -196387 1011031 1990123
43164 1990123 2334792 2492221 2692302 2416058 1386388 407127 407490 966717 721304 -685182
43154 -685182 -1930238 -1696695 -372450 535491 284469 -489918 -893220 -805865 -640131
43145 -640131 -587024 -469100 -154591 161530 82354 -673519 -1994912 -3276700 -3629787 -2445888
43135 -2445888 -33790 2311186 3239226 2647054 1845461 2058703 2910741 2903388 1360977
43126 1360977 -688252 -1688416 -1055443 630341 2247139 2652976 1336188 -879378
43118 -879378 -2327317 -2265267 -1654197 -1685349 -2251288 -2623378 -2838699 -3245673 -3263825 -2079322
43108 -2079322 -392165 74221 -1011703 -2124499 -2247288 -2259914 -3178087 -4232591 -3837964
43099 -3837964 -1790331 504102 1608472 1148413 -242652 -1392629 -1385209 -493493 18946
43090 18946 -528257 -1384257 -1587076 -1331454 -1358115 -1615845 -1523982 -1163601 -1156149 -1516387
43080 -1516387 -1573881 -991860 -67487 859951 1473539 1148077 -386002 -2053358 -2295207
43071 -2295207 -1216620 -698365 -1750228 -2838839 -1895717 712173 2527366 2179611 935497
43062 935497 676652 1420234 1787034 1307200 936243 1188433 1089231 -213514 -1760569
43053 -1760569 -1924640 -736466 306996 559245 760942 1065164 319131 -1815705 -3584790
43044 -3584790 -3289907 -1564013 -120512 701428 1496155 1819188 735288 -1029617 -1596143
43035 -1596143 -666794 185975 174809 211620 669451 380312 -1050725 -1821095 -370339
43026 -370339 2083951 3033192 1760412 -497030 -2567694 -3942741 -4049723 -2723077 -1198405
43017 -1198405 -1021059 -1899807 -2064045 -913146 113622 -231472 -1173632 -1126616 95203
43008 95203 1173429 1010868 -212797 -1649527 -2842054 -3894329 -4797528 -5015788 -4094029
42999 -4094029 -2602040 -1978934 -3141396 -5460393 -7287947 -7306619 -5415327 -2784383 -1070048
42990 -1070048 -889926 -933255 567814 3241863 4586927 3157955 472816 -1279115 -2140724
42981 -2140724 -3437943 -4974690 -5300470 -4429420 -4103804 -5054700 -5873618 -5184334 -3364909
42972 -3364909 -1473777 100180 1195900 1404212 840918 297061 -42891 -879854 -2189887
42963 -2189887 -2710747 -1891758 -955557 -911175 -859467 352986 1994894 2568139 2133050
42954 2133050 1857032 1986161 1959619 1916590 2309823 2525406 1784936 1045318 1890229 3617398
42944 3617398 3702862 1521742 -621936 -919180 -397681 -712757 -1489419 -1416270 -588713
42935 -588713 -73938 -45440 71600 184090 -306322 -1269885 -1999214 -2375115 -2881921 -3669088
42925 -3669088 -4429086 -4930927 -4957563 -4167172 -2803427 -1982366 -2333860 -2939310 -2719982
42916 -2719982 -2262846 -2808616 -3820498 -3385440 -1249341 340205 -317659 -1809937 -1307842
42907 -1307842 1817705 5224658 6323450 4904319 2815242 1573545 920094 -120373
42899 -120373 -1364075 -1593595 -583355 213691 -244600 -840853 140215 2395913 4018136
42890 4018136 4157190 3693793 3336937 2727782 1709880 903451 517388 32075 -433384
42881 -433384 -11334 971103 692352 -1363733 -2978288 -2217448 -526650 -737813 -2803677
42872 -2803677 -3818205 -2192829 325987 1310574 632697 -18381 577155 2211107 3812597
42863 3812597 4224806 2884783 348525 -2020269 -3160593 -3000381 -2091396 -940125 248141
42854 248141 1477300 2660629 3287571 2670346 834145 -1183404 -2328497 -2442560 -1794249
42845 -1794249 -404462 1378007 2320382 1520261 -172840 -1161449 -1270856 -1586722 -2300294
42836 -2300294 -2352291 -1468763 -869075 -1238712 -1461001 -381253 1303552 2061276 1641037
42827 1641037 1093340 1236941 2060652 3199915 4149546 4372727 3900564 3392201 3024601
42818 3024601 2049461 269539 -901316 -125180 1699340 2478098 1873522 1552306 2336914
42809 2336914 2893766 2051002 880713 1093945 2316138 2599221 1327126 -43598 -377596
42800 -377596 -386201 -871148 -796005 1229809 4092259 4781656 2290480 -813570 -1763693
42791 -1763693 -1158837 -1574443 -3532199 -4905255 -4210769 -2432747 -1003045 238849 1993961
42782 1993961 3736779 4311714 3525393 2024636 224001 -1551314 -2417399 -1691755 -139150
42773 -139150 592873 -192662 -1694637 -2761385 -2886847 -2263158 -1592841 -1720024 -2780999
42764 -2780999 -3885059 -4215970 -4070350 -4058089 -3769579 -2358523 -222855 1125731 952699
42755 952699 -8293 -849363 -1353347 -1368328 -570931 567919 639789 -1028098 -3192760
42746 -3192760 -3962798 -2888006 -1224097 -398644 -638533 -916575 -55157 1864088 3237976
42737 3237976 2638435 703594 -535723 -302940 133507 -209778 -267030 1348988 3815815
42728 3815815 4837731 3585294 1498256 198644 -76644 217286 885461 1693906 2105258
42719 2105258 1965774 1744317 1586849 959463 -130304 -489823 638822 2025789 1854508
42710 1854508 321868 -626035 -128396 607775 537915 347776 874532 1424746 1069396
42701 1069396 524222 1021759 1983853 1738269 332450 -384567 252385 644133 -416651
42692 -416651 -1788864 -1840850 -827377 -19352 433287 1201470 2051118 2028425 1107571 266562
42682 266562 -32823 -264458 -686485 -798916 -154468 1002787 2034787 2373786 1806294
42673 1806294 754749 48572 26422 287113 662915 1617275 3051099 3745587 3037643
42664 3037643 2078929 2121247 2507743 2023818 1379597 2210176 4022450 4501655 2997330
42655 2997330 1438813 1279442 1667607 1467028 1125871 1422605 1992522 2305033 2736703
42646 2736703 3495497 3728895 2946592 2245673 2810238 4050047 4544858 4225519 4331794
42637 4331794 5471914 6787217 7102964 6342918 5704385 6460449 8433762 9999492 10112660
42628 10112660 9736709 10328575 11667280 12629298 13355461 14710953 16267519 17222577 18741994
42619 18741994 22422669 26791066 28931917 29675283 33112761 40621596 50162898 62217503
42611 62217503 80517956 105633629 135767907 176808745 239765467 317485464 372694863
42604 372694863 366567552 300529261 216782565 154641065 118393761 91691268 67758600
42597 67758600 52501277 46948483 42824117 35223920 28022487 24687556 22460408 18488737
42589 18488737 14893553 14288762 15183963 15007408 13913566 12829205 10978189 8051739
42581 8051739 6110091 6610761 7618027 6443243 3444973 1048812 416649 1083861 2587907
42572 2587907 4413092 5305283 4570461 3379538 3185921 3590261 3369046 2865747 3490743
42563 3490743 5139819 5890681 4490465 1941223 403825 1265867 4101874 6765671
42555 6765671 6904526 4341702 1583118 963545 1809395 1726151 197358 -886358 -270848
42546 -270848 1037220 1753392 2120389 2692817 2818735 1729848 108272 -869287 -1264183
42537 -1264183 -1692925 -1638460 -230875 1650110 2053944 873233 89859 605802 900422
42528 900422 -91089 -794550 474596 2314764 1948102 -563060 -2247950 -1395337 424305
42519 424305 996710 206641 -659472 -776214 -21963 1334517 2286297 1642587 -131401
42510 -131401 -825198 716834 2888446 3636363 3300977 3574579 4576233 4857772 3874976
42501 3874976 2601050 1772829 1192251 791573 759270 444581 -1208969 -3716909 -5062333
42492 -5062333 -4244692 -2494247 -1361406 -948730 -763746 -930991 -1485260 -1602256 -772044
42483 -772044 90566 -87069 -833060 -909917 -256046 120229 -155612 -505899 -664408 -1022046
42473 -1022046 -1576464 -1611175 -780401 218940 390253 -575170 -2109691 -3151218 -2844554
42464 -2844554 -1383780 23144 556590 775475 1484049 2155792 1678262 327029 -515951
42455 -515951 -591522 -980768 -1731027 -1192365 1254533 3539499 3523493 1991052 1244753
42446 1244753 1647773 1568032 292734 -1038960 -1379823 -827782 334395 1842535 2544951
42437 2544951 1287609 -852770 -1324417 127946 681168 -1275226 -3335565 -2648930 -434623
42428 -434623 -180813 -2401867 -4188540 -3710077 -2200243 -1048830 247316 2053733 2875262
42419 2875262 1437184 -1002299 -2180912 -1786454 -1360416 -1862180 -2764538 -3300808 -3354049
42410 -3354049 -3050899 -2362648 -1302291 -75944 984661 1461129 1100147 240760 -387206
42401 -387206 -496775 -441641 -477564 -479570 -569602 -1207957 -2311261 -3084777 -3112122 -2774325
42391 -2774325 -2273902 -1353723 -464780 -825229 -2375895 -3001912 -1118365 2016457 4013942
42382 4013942 4469673 4765283 5518831 6063906 6068545 5842026 5161839 3560646 1850282
42373 1850282 1674755 3283819 5249708 6652651 8036351 9808248 11167819 11227003 10009472
42364 10009472 7850975 4947314 1933075 -234913 -1414571 -2231782 -2645357 -1886258
42356 -1886258 -223485 677468 -144815 -1765508 -2953951 -3625677 -4000288 -3718941 -2772173
42347 -2772173 -2070047 -2088618 -2083181 -1545994 -1167989 -1375460 -1351605 -706214 -568956 -1513801
42337 -1513801 -1981845 -697057 831598 623681 -154285 1218849 4398091 6070433 4777076
42328 4777076 2562158 1145017 -490096 -3230278 -5229813 -4369280 -1616372 265517
42320 265517 317175 -258611 -543622 -751294 -995729 -977862 -857603 -1031282 -1108325 -426617
42310 -426617 505373 497609 -332872 -554030 297417 948187 532445 18863 445010 988645
42300 988645 259975 -1301626 -1976848 -1351933 -676577 -653013 -626089 -405590 -1120758 -3232208
42290 -3232208 -5132545 -5102422 -3609995 -2204468 -1073562 501706 1951104 1861991 498830
42281 498830 -341307 -256617 -755450 -2226945 -2840601 -1718974 -840259 -1865397 -3126407
42272 -3126407 -2264964 -278492 46856 -1211075 -1333741 327241 1258562 111923 -1023853
42263 -1023853 -150409 1443434 1464870 119648 -834820 -1105508 -1632253 -2197949 -1574983
42254 -1574983 155172 1418145 1459975 1239262 1653883 2200914 1955227 957526 49316
42245 49316 -163670 189228 499956 325680 -32518 245023 1430643 2740322 3275591
42236 3275591 3061446 2656623 2226635 1659977 1109431 621525 -285138 -1717393 -2556637
42227 -2556637 -1737834 -144731 120992 -1585608 -3785422 -5005626 -5203157 -4773744 -3703091
42218 -3703091 -2456287 -2266204 -3354010 -3934465 -2346826 536616 2382796 2372534 1696507
42209 1696507 1374245 1122324 523255 -130205 -654101 -1441984 -2436332 -2617840 -1378368
42200 -1378368 294831 888318 120709 -1200908 -2573246 -3948197 -4730280 -3933604 -1682307
42191 -1682307 467340 1282011 1216873 1487276 2461242 3633617 4554529 4924350 4276982
42182 4276982 2618692 1092464 861205 1416942 1195440 -102059 -1180635 -1385605 -1631798
42173 -1631798 -2397920 -2551768 -1542340 -1173593 -3112336 -5630798 -5348093 -2030465 823735
42164 823735 616261 -1396873 -2574093 -2137468 -687181 1546765 4099174 5291835 3963109
42155 3963109 1508759 381054 1013374 1913710 2339677 2922598 3689664 3478005 1856491
42146 1856491 74839 -578802 -202027 451714 1007268 1263131 1031147 717903 1048135
42137 1048135 1724330 1511884 293222 -213681 1218050 3323792 3885098 2536421 794249
42128 794249 -203441 -671760 -1060695 -1186657 -723197 183467 984879 1018147 -156550 -2243200
42118 -2243200 -4198718 -5174472 -5267294 -5004604 -4551182 -3946953 -3563120 -3512056 -3040731 -1502270
42108 -1502270 276830 658526 -680982 -2196948 -2332095 -1242621 -315830 -424203 -1057191
42099 -1057191 -1093471 -240448 514529 182020 -707410 -660513 558335 1343705 503449 -987799
42089 -987799 -1517541 -1178931 -1230845 -1895725 -2253239 -1964173 -1503249 -820005 583127 2103210
42079 2103210 2150581 234112 -2299776 -3893143 -3976490 -2506728 144632 2505402 2818883
42070 2818883 1253372 8088 585866 2180655 3296191 3580619 3393229 2958469 2738431
42061 2738431 3293838 3999441 3352805 1415407 327406 1289435 2697261 2648461 1629902
42052 1629902 1014123 500595 -794798 -1980471 -1573428 -277417 -141136 -1338201 -2123825
42043 -2123825 -1829233 -1567820 -1823792 -1583928 -363827 831028 1179559 1042100 731521
42034 731521 -165348 -1625485 -2726026 -2936000 -2662569 -2090380 -791090 1022360 2167926
42025 2167926 2028408 1279306 614044 -42812 -554436 -134257 1341417 2653656 2621285
42016 2621285 1328827 -459073 -2097333 -2896840 -2409861 -1463959 -1665773 -3154920 -4046815
42007 -4046815 -2903129 -588907 1176538 1915180 2054699 1732033 1220853 1556835 3263586
41998 3263586 5064540 5246140 3947931 2884515 3019829 3597844 3381986 1965456 -118254
41989 -118254 -1927573 -2799482 -2890503 -2825894 -2698321 -2084357 -1264225 -1336702 -2457314 -3061441
41979 -3061441 -1865848 269924 1657331 2136251 2709023 3407640 3178104 1826517 583828
41970 583828 410225 854145 1016163 839456 1000143 1952920 3312223 3967392 2968244
41961 2968244 650089 -1398980 -1959456 -1470683 -1212479 -1615510 -2066457 -2037529 -1581552
41952 -1581552 -878041 -122760 131544 -691097 -2272377 -3310369 -2670573 -570022 1416074
41943 1416074 1652512 72366 -1569087 -1590152 -433355 6106 -915764 -1801518 -1540215
41934 -1540215 -1043566 -1689348 -3140845 -3967130 -3721942 -3187096 -2991661 -3025939 -2897010
41925 -2897010 -2203568 -833477 408523 260755 -1202560 -2246955 -1816847 -972156 -825348
41916 -825348 -484256 1165747 2836097 2286759 -164321 -1827892 -1189051 699455 2242659
41907 2242659 2781538 2094482 386951 -1075011 -1102276 -417965 -583902 -1225570 -514469
41898 -514469 1448479 2208760 636776 -1261890 -1337078 -174410 288710 -544190 -1911182
41889 -1911182 -3106357 -3693714 -3271228 -2036492 -881318 -365924 -417512 -1215637 -3069684
41880 -3069684 -5128565 -5756677 -4693856 -3314398 -2301001 -872335 1027499 1819097
41872 1819097 733093 -601375 -343922 1239450 2817178 3843340 4156001 3268342 1441349
41863 1441349 112982 -16205 36489 -391765 -214822 1334721 2954259 3238457 2807163
41854 2807163 2743956 2519151 1359221 79947 -553066 -1730551 -4477165 -6987362 -6689966
41845 -6689966 -3969888 -1334414 159804 1098941 1352620 405725 -625253 -206606 827334
41836 827334 496971 -816775 -1075741 -356780 -600620 -1701973 -1418009 408186 1092371
41827 1092371 -513166 -2198779 -2132403 -1316853 -981093 -514005 444974 694932 -51384
41818 -51384 -121096 894361 690908 -1818759 -3921757 -3135570 -1344306 -1762034 -3733705
41809 -3733705 -4060088 -2243740 -821492 -942625 -965883 333057 1958434 2648614 2460267
41800 2460267 1858183 966547 173614 65680 481159 773593 917765 1144567 850312
41791 850312 -574883 -2103362 -2037204 -642779 -27307 -1066813 -2141124 -1565867 91372
41782 91372 965386 304299 -780862 -579424 1449553 3863541 4373712 2253635 -796652
41773 -796652 -2753371 -3502197 -4049141 -4375650 -3573921 -1667453 246170 1500674 2179021
41764 2179021 2206476 1512210 783213 609361 268976 -1063803 -2460110 -2529899 -2035783
41755 -2035783 -2805096 -4317201 -4208503 -2329768 -1151879 -1442484 -954502 1147806 2064453
41746 2064453 -43783 -2382705 -1704232 316336 -197314 -2793808 -3248823 -264501 2665065
41737 2665065 2786394 1646379 1558030 1728142 272401 -2060428 -2802134 -1405288 233895
41728 233895 537059 -188705 -913607 -1277593 -1554000 -2020845 -2632602 -2990687 -2672749 -1804378
41718 -1804378 -1077608 -987195 -1356539 -1804851 -2247409 -2676084 -2935699 -3070597 -3412714 -3904525
41708 -3904525 -3812526 -2680636 -1239450 -740689 -1476884 -2432254 -2392770 -1104045 606050
41699 606050 1617930 1531576 1063069 1259371 2172992 2641045 1699545 -55800 -961003
41690 -961003 -44582 2066454 3935203 4610940 4087865 2897601 1603042 601003 45274
41681 45274 -279626 -866567 -1952874 -3089768 -3606369 -3545590 -3602216 -3901600 -3555395 -2069929
41671 -2069929 -576451 -668042 -2317336 -4002196 -4720918 -4689821 -4112590 -2792868 -1381139
41662 -1381139 -1421889 -3196110 -4778593 -4428026 -2896008 -2034205 -2010353 -1585655 -657303
41653 -657303 -606165 -1918436 -3114897 -2720973 -1175500 -37595 -39347 -631513 -1053933
41644 -1053933 -1271408 -1864797 -3108283 -4174232 -3669511 -1385752 956308 1466520 261570
41635 261570 -969844 -1220255 -846494 -205796 956737 2499065 3568130 3772355 3544232
41626 3544232 2903508 1161057 -1410518 -2908735 -1981461 202702 1404263 1159595 955379
41617 955379 1879985 3310365 3998481 3541295 2501064 1578322 921680 184624 -693679
41608 -693679 -994961 -117903 1135136 1225901 120118 -382096 752935 2138129 2029281
41599 2029281 901937 476858 1032676 1433255 1320077 1393919 1644016 1193347 146709
41590 146709 -185511 589757 1241737 1026611 941329 1875876 2871821 2513088 1099635 81111
41580 81111 -85878 -222395 -875439 -1653445 -2050327 -1979852 -1473261 -657175 -72086 -239624
41570 -239624 -774420 -634922 476341 1544306 1425680 180208 -1147738 -1743473 -1589215
41561 -1589215 -1053246 -473371 -170837 -333798 -642347 -475428 113399 86758 -1235502
41552 -1235502 -2844974 -3013594 -1559878 456 846738 1996679 4139409 5642844
41544 5642844 4420467 1187975 -1030976 -718224 558837 854852 475200 837166 1911955
41535 1911955 2276898 1310852 38342 -360155 4535 168511 -267756 -664919 -297390
41526 -297390 568884 886526 40051 -1583681 -3280816 -4650152 -5286424 -4769791 -3714587
41517 -3714587 -3949842 -6368613 -9087661 -9261729 -6650998 -3874983 -2965463 -3273446 -3332081
41508 -3332081 -3199170 -3840880 -5265116 -6536309 -7167990 -7501586 -7851534 -7889181 -6876070
41499 -6876070 -4434492 -1331038 786524 1120272 826814 1310620 1839781 582128 -2060914
41490 -2060914 -3401447 -2384035 -1249005 -2013410 -3479998 -3596919 -2864567 -2965219 -3390675
41481 -3390675 -2242527 231416 1640050 957158 -385993 -1120011 -1582406 -2090624 -2028904
41472 -2028904 -1380011 -1347090 -2450809 -3464180 -3213160 -2179792 -1378894 -840422 -281824
41463 -281824 -258034 -1375812 -2964521 -3671965 -3106314 -2077200 -1512930 -1828784 -2966986
41454 -2966986 -4229160 -4324063 -2529402 93351 1445342 720326 -577413 -494659 857819
41445 857819 1522938 544117 -468616 458376 2606479 3258460 1468333 -546372 -468491
41436 -468491 1206195 2511442 2964093 3520187 4389969 4730439 4253141 3497899 2549753
41427 2549753 984944 -825578 -1770691 -1574737 -1116108 -1028518 -1138071 -1350766 -1858116
41418 -1858116 -2359510 -2333715 -2155291 -2597365 -3184959 -2632714 -1131780 -408501 -962263
41409 -962263 -1092846 369372 2079773 2264068 1405517 1250016 2035642 2390843 1651691
41400 1651691 824049 1107060 2413650 3634440 3890576 3290113 2544664 2026007 1607634
41391 1607634 1528524 2469536 3989960 3993175 1330140 -1898443 -2766736 -1733680 -1769694
41382 -1769694 -3342280 -3566673 -1258776 658758 -145899 -1416379 -9838 2758126
41374 2758126 3139598 1006910 -36330 1569553 3097868 1901165 -890962 -2427018
41366 -2427018 -1860589 -549746 186789 196159 7497 75581 240719 -233336 -1623881 -2936638
41356 -2936638 -2991098 -2202556 -2187680 -3455571 -4587603 -4138750 -2493965 -1242891 -1161037
41347 -1161037 -1336525 -317725 1989482 3830927 3471613 1393548 -285935 -611659 -591918
41338 -591918 -748648 275735 3314320 6499584 7426317 6358314 5208949 4291881 2513943
41329 2513943 221328 -857496 -557099 -598006 -1537832 -1784366 -368769 1465275 2347737
41320 2347737 2512910 2487624 1933959 954533 820304 2035912 3122170 2711231 1579421
41311 1579421 1150237 1134219 347844 -882361 -937659 589846 2059235 1777918 27833
41302 27833 -1280350 -750201 868900 1433979 55197 -1512317 -970585 1425475 3160142
41293 3160142 2736812 1152567 -96936 -832967 -1437729 -1836601 -2074742 -2607940 -3218988
41284 -3218988 -2920543 -1726834 -1142526 -1937875 -2817906 -2420718 -1306003 -674198 -354825
41275 -354825 446159 1386514 1482311 651030 -498566 -1684189 -2668558 -2908032 -2616270
41266 -2616270 -3019586 -4217530 -4151264 -1521246 1501407 1757876 -486740 -2033829 -1279034
41257 -1279034 206529 670383 378001 295321 554069 953215 1489650 1848662 1658540
41248 1658540 1498926 2230916 3192400 2790281 1228622 723621 2236158 3815573 3349613
41239 3349613 1452233 252012 454569 1053017 1187895 869401 195059 -950850 -2398250
41230 -2398250 -3583364 -3944961 -3215518 -1742843 -745304 -1498609 -3701533 -5282918 -4556191
41221 -4556191 -2177123 -322331 -209864 -1014244 -1073335 309186 2249891 3264143 2896859
41212 2896859 2278289 2741744 4056500 4624463 3414255 1073421 -899736 -1458509 -568719
41203 -568719 709023 755241 -979990 -2840656 -2626256 -544612 901873 406240 -391065
41194 -391065 409529 2071517 2525088 1471563 428828 270758 481084 648275 990588
41185 990588 1229166 507346 -1046601 -1934707 -1161706 445060 1486687 1766688 1990707
41176 1990707 2293327 2092033 1266409 526927 344970 208968 -558012 -1666168 -2206405
41167 -2206405 -2011342 -1921652 -2463341 -2978791 -2664060 -1937141 -1913779 -2739649 -3375351 -3111471
41157 -3111471 -2457342 -2311885 -2976865 -4188775 -5367681 -5609647 -4309393 -2206450 -995711
41148 -995711 -1406498 -2432048 -2909259 -2907581 -2899754 -2622843 -1814109 -1217116 -1577556 -2211607
41138 -2211607 -1906612 -894557 -578027 -1429597 -2467076 -2840418 -2695928 -2310967 -1561490
41129 -1561490 -557350 228064 779046 1534472 2298658 2195249 1107262 139226 86573
41120 86573 336128 -105626 -1270037 -2484769 -3217378 -3116282 -2052538 -789178 -760430
41111 -760430 -2360821 -4215145 -5014569 -5238262 -5932380 -6601735 -5897348 -4040751 -2844996
41102 -2844996 -3154315 -3791964 -3509199 -2610109 -1922351 -1322852 -274447 951805 1598948
41093 1598948 1521701 1139868 673773 182864 -6803 251989 306371 -605419 -2123585 -3019545
41083 -3019545 -2669921 -1546712 -265293 1007108 2047298 2341706 1755500 838446 138531
41074 138531 -267793 -381371 -114509 225182 109849 -158716 454148 1910647 2468472
41065 2468472 985638 -1043664 -1331761 -183146 -153210 -2200712 -4109389 -3595817 -1460887
41056 -1460887 -340561 -1240018 -2682672 -2892818 -1590268 332854 1903629 2594313 2391959
41047 2391959 1675054 874293 230865 -149599 -350037 -769006 -1589073 -2016129 -1019121
41038 -1019121 712956 775863 -1874501 -4851398 -4932123 -2166065 388979 818369 229061
41029 229061 206684 542130 482039 375999 562868 28253 -2032005 -4280126 -4808811 -4056050
41019 -4056050 -4079607 -5121799 -5143166 -3174782 -937312 -121635 -14690 632320 988909
41010 988909 -478160 -2915837 -3745812 -2343110 -875650 -1030648 -1922545 -2174970 -2190839
41001 -2190839 -2750474 -2750508 -542627 2901998 4357312 2346646 -848363 -2005761 -606249
40992 -606249 1340349 2257551 2492866 2990861 3604271 3274711 1564274 -479339 -1252640
40983 -1252640 -395434 694776 502105 -778133 -1722120 -1798432 -1973771 -2945847 -3852107
40974 -3852107 -3471072 -1941835 -444575 250866 51166 -1078988 -2901931 -4391520 -4620626
40965 -4620626 -4122466 -4228816 -4942361 -4673354 -2544884 99526 1244728 566287 -549209
40956 -549209 -941535 -851108 -1200857 -2250174 -3191548 -3067027 -2057203 -1559053 -2575378
40947 -2575378 -4258872 -4736290 -3305798 -969415 1261813 3403663 5282213 5512065
40939 5512065 3038990 -746261 -2823784 -1730210 923906 2414704 1716842 -31737
40931 -31737 -1330023 -1861314 -2186790 -2479503 -2235807 -1356300 -807698 -1459683 -2589019
40922 -2589019 -2596374 -1327323 -530982 -1446028 -2979289 -3227183 -2013794 -735994 -173906
40913 -173906 220319 943500 1592108 1620112 1008374 -37626 -1225057 -1835621 -1140746
40904 -1140746 520218 1832562 1997747 1473523 1050441 1020387 1498998 2545671 3433900
40895 3433900 2821741 502386 -1775256 -2168303 -871428 484517 977396 854656 289244
40886 289244 -954881 -2505084 -3202907 -2429515 -921837 105810 160377 -427007 -1073372
40877 -1073372 -1333124 -1097068 -661923 -413834 -428198 -607543 -1028904 -1736067 -2392717 -2669567
40867 -2669567 -2723228 -2634494 -1765296 244996 2059070 1699091 -669080 -2495832 -2087637
40858 -2087637 -691518 -367510 -1166302 -1836102 -2112984 -2392076 -1920837 363593 3300769
40849 3300769 4151170 2312933 327867 315532 1383555 1889070 2382061 4212238 6371277
40840 6371277 6185387 3022064 -737335 -2706118 -2768480 -1919685 -538467 1186281 2329765
40831 2329765 2031355 731614 -343461 -622983 -366937 228272 1150259 1829238 1229425
40822 1229425 -838925 -2991449 -3475077 -2106768 -569899 -526135 -1739979 -2596806 -2364299
40813 -2364299 -2053746 -2600812 -3139251 -2232327 -339701 467022 -583571 -1828777 -1627447
40804 -1627447 -652338 -631824 -1743186 -2612901 -2428409 -1684188 -941080 -111684 807037
40795 807037 1293546 953916 -36280 -1314055 -2565551 -3378615 -3567268 -3627548 -4063474
40786 -4063474 -4317607 -3438164 -1903282 -1448201 -2582782 -3654839 -3312203 -2646706 -3498282
40777 -3498282 -5487156 -6407982 -5265809 -3297622 -1919775 -1215115 -860049 -1086057 -1853466
40768 -1853466 -2140637 -1153115 338103 886642 313291 -179434 197689 752723 310981
40759 310981 -1267895 -2968089 -3780554 -3622446 -3093803 -2650870 -2351053 -2326883 -2923813
40750 -2923813 -3963787 -4344511 -3145708 -993755 519929 810361 734565 880092 650950
40741 650950 -271208 -807823 -96477 667238 -338708 -2647297 -3792972 -2664668 -864023
40732 -864023 -176514 -315385 -187047 -33037 -872893 -2613692 -4159412 -4996519 -5373443
40723 -5373443 -5178555 -3985722 -2217196 -1010598 -721749 -624512 -286777 -118247 -231098
40714 -231098 39502 862880 1255709 550509 -379167 -364926 298434 464256 -31924 -419649
40704 -419649 -578763 -1144690 -1913375 -1564096 418985 2636478 3390454 2629910 1443118
40695 1443118 303473 -1042345 -2243526 -2198212 -578147 1387602 2190225 1582832 402117
40686 402117 -658984 -1508217 -2199848 -2720886 -3193396 -3694394 -3826470 -3081126 -1826727
40677 -1826727 -1315315 -2272152 -3922248 -4905611 -4774069 -3985291 -2763857 -870164 1423641
40668 1423641 2961535 2781136 1218618 -366668 -815882 -106026 668157 349922 -878100
40659 -878100 -1445342 -414092 854311 299565 -1652346 -2245459 -383581 1360123 197155
40650 197155 -2852019 -4452748 -3652171 -2699943 -3280558 -4347122 -4375336 -3712684 -3504727
40641 -3504727 -3753727 -3686841 -3012539 -1761759 129962 2056351 2592351 1322347 -99458
40632 -99458 -56724 673336 205415 -1448802 -2462661 -2086312 -1618866 -2180247 -3083076 -3060679
40622 -3060679 -1968972 -612039 295187 480905 133728 -70348 374543 905378 439403
40613 439403 -958761 -1862189 -1263577 331935 1947114 3232387 3985800 3671224 2318354
40604 2318354 1093502 992107 1512591 1495670 759544 23274 -316418 -403536 -303985 -87687
40594 -87687 -196019 -812215 -1202476 -672735 159107 216277 -163671 343457 1647283 1862390
40584 1862390 -2362 -2320142 -2879918 -1727915 -754765 -959344 -1417659 -940220 397732
40575 397732 1751971 2705786 3372530 3746865 3613711 3052344 2517615 2245154 1915998
40566 1915998 1200184 409228 173074 478972 502667 -393572 -1854395 -2978949 -3237698
40557 -3237698 -2660204 -1551432 -531277 -469869 -1630229 -3007876 -3293505 -2505010 -1886864
40548 -1886864 -2108370 -2487195 -2332036 -2060930 -2268224 -2519097 -2118190 -1539303 -1818052
40539 -1818052 -2671481 -2625575 -1357883 -542528 -1454488 -2809624 -2385717 -247789 1304770
40530 1304770 1072012 471173 942951 1460457 230892 -2080589 -2893356 -1401574 258927
40521 258927 102248 -1166910 -1706155 -1193730 -563526 -130629 421728 785594 376125
40512 376125 -313478 -223180 466190 506324 -354160 -971022 -756055 -542664 -978104 -1458381
40502 -1458381 -1412888 -1384841 -1909071 -2378731 -2015181 -1073648 -154445 772729 1662151 1686532
40492 1686532 467816 -860633 -1227959 -1465730 -2895564 -4695395 -4735383 -2933396 -1594077
40483 -1594077 -1953244 -2503273 -1767215 -826089 -1437506 -2961918 -3189993 -1723253 -562111
40474 -562111 -1128656 -2343975 -2409569 -1404048 -1069279 -2399941 -4323400 -4895869 -3381443
40465 -3381443 -976167 335579 -498575 -2894575 -5350879 -6633825 -6331553 -4687605
40457 -4687605 -2329257 -123125 1151265 1310270 865858 423984 46690 -589944 -1473869
40448 -1473869 -2045881 -1870824 -1231786 -734584 -477184 -37546 673728 992036 250471
40439 250471 -1216590 -2164780 -1660099 -140232 847113 66516 -2212421 -4498980 -5491723
40430 -5491723 -4991631 -3524901 -1684654 -169000 180960 -843882 -2286418 -2995446 -2916924
40421 -2916924 -2689427 -2323473 -1392067 -361671 -326303 -1170290 -1398950 -335861 853456
40412 853456 1061373 822333 1018951 1293295 1014465 689970 900606 768197 -786394
40403 -786394 -2907728 -3746032 -3146276 -2570476 -2552435 -2167824 -1122860 -417736 -489578 -452989
40393 -452989 194543 681597 431253 -81881 -635915 -1844961 -3492370 -3805768 -1704170
40384 -1704170 1375873 3221955 3478686 3233786 2860369 1851482 354343 -686307 -918030
40375 -918030 -913594 -1017050 -850165 -146966 741176 1452953 2150648 3140492 4264765 4902113
40365 4902113 4527096 3256365 1808522 825976 384458 358316 838092 1599383 1640002
40356 1640002 301206 -1394944 -1843566 -1270127 -1472431 -2846853 -3473393 -2026913 85172
40347 85172 765976 -17556 -1005362 -1888317 -2961235 -3447665 -2232012 28392 1337977
40338 1337977 940155 18665 -182619 360474 1044846 1283177 538342 -1164242 -2775749
40329 -2775749 -3274620 -2970895 -2717160 -2298224 -1089395 45073 -555542 -2570441 -3550187
40320 -3550187 -2244417 -411099 -293184 -1613803 -2296991 -1286559 583957 2048177
40312 2048177 2612058 2391619 1608449 544474 -292928 -284826 723342 1900729 2006383
40303 2006383 917527 43986 526443 1561777 1500342 190339 -968194 -1079821 -542808
40294 -542808 194083 1260940 2475329 3080543 2797902 2106712 1184592 -320676 -2137020
40285 -2137020 -3187601 -3078682 -2674692 -2619672 -2329852 -1136588 467768 1448659 1439840
40276 1439840 825061 244453 357705 1368690 2499037 2698632 2044023 1546910 1550253
40267 1550253 1505573 1419064 1991651 2947267 2882519 1496863 389404 731063 1649898 1923890
40257 1923890 1709408 1378952 265413 -1819116 -3204349 -2400188 -525521 184546 -478199
40248 -478199 -953059 -709113 -747140 -1492013 -2073501 -1864185 -1237572 -659946 -306541 -601605
40238 -601605 -1872711 -3386345 -3848235 -2920219 -1334353 254161 1506756 1941086 1559670
40229 1559670 1584771 3043060 4788271 4545423 1967127 -900143 -2282908 -2220740 -1352520
40220 -1352520 -55191 701474 -445699 -3172995 -5109530 -4724531 -3324086 -2909069 -3132739
40211 -3132739 -1968607 1124217 4262955 5454786 4747450 3736824 3600075 4069721 4184931
40202 4184931 3702402 3433226 4075172 5152978 5645510 5362345 4939805 4602993 3843504
40193 3843504 2439922 903145 -372695 -1576537 -2723509 -3214992 -2697652 -1804285 -1513968
40184 -1513968 -2115146 -3099692 -3701095 -3368877 -2230733 -1264412 -1393917 -2184911 -2157810
40175 -2157810 -771284 669997 697550 -361553 -900411 -143496 1092287 1673593 1429932
40166 1429932 941909 590497 256769 -201896 -633257 -920418 -1308025 -1978744 -2423896
40157 -2423896 -1813287 -134450 1587345 2458081 2550723 2282672 1647152 574377 -582607
40148 -582607 -1539724 -2487629 -3435003 -3842365 -3548377 -3215439 -3095977 -2429366 -1111076
40139 -1111076 -666322 -1955049 -3108126 -1893543 723387 1872561 1115107 666028 1315990
40130 1315990 1221010 -540370 -2171633 -2203561 -1716903 -1952001 -2085426 -1235584 -508838
40121 -508838 -884802 -931308 928095 3299447 3540454 1657954 41118 -51818 585776
40112 585776 1234591 1980786 2474662 2069723 1218036 882888 662391 -595147 -2379662
40103 -2379662 -2807069 -1544364 -426062 -695830 -1552423 -2064936 -2619692 -3469888 -3538030
40094 -3538030 -2035451 -139799 324270 -742372 -1767285 -1569669 -532954 77320 -576787
40085 -576787 -2116174 -3225657 -2990755 -1964872 -1436728 -1771321 -2264885 -2551591 -3010193
40076 -3010193 -3544092 -3258513 -2054261 -1414570 -2545118 -4474671 -5162985 -4091461 -2605498
40067 -2605498 -1812919 -1301931 -226487 1288018 2442904 2908673 2951465 2663932 1865202
40058 1865202 893403 737072 1850668 3338613 3999111 3826907 3624757 3353572 2043484
40049 2043484 -438542 -2680251 -3335407 -2540954 -1199269 189896 1334463 1814479 1799969
40040 1799969 2149831 2872830 2555283 506022 -1597499 -1714783 -198561 1130479 1817328
40031 1817328 2651428 3330724 2682814 1198654 903386 2205936 3094440 2243724 888247
40022 888247 582812 903068 557928 -720586 -2513830 -4483835 -5699220 -4766488 -2029249
40013 -2029249 -181825 -1042128 -2941841 -3111818 -1555015 -455632 -541376 -479824 248150
40004 248150 340261 -868689 -2018341 -1894134 -1447820 -2255717 -3910514 -4480280 -3291043
39995 -3291043 -1862283 -1762355 -2590443 -2837409 -2115175 -1432219 -1321900 -981870 79241
39986 79241 700251 -287871 -1777153 -1572402 142704 536802 -1870963 -4689421 -4584389
39977 -4584389 -1620096 969530 840162 -1153241 -2591584 -2097664 -79597 2107823
39969 2107823 3267997 3120270 2312681 1650661 1461760 1783189 2643600 3737188 4271444
39960 4271444 3681729 2229168 559216 -879143 -1638022 -1188874 310254 1682366 1838799
39951 1838799 848457 -538663 -1810351 -2606686 -2538097 -1900674 -1817446 -2723538 -3439113
39942 -3439113 -2836072 -1718143 -1718168 -2842519 -3570549 -3137717 -2285691 -1821306 -1791681 -2118969
39932 -2118969 -2761600 -3151136 -2691352 -1905246 -1850680 -2294095 -1792758 147049 2285017
39923 2285017 3387741 3548352 3357967 2943729 2363625 1935427 1658364 1164213 520642
39914 520642 113769 -383526 -1632026 -2989898 -2832919 -1079536 219798 -305293 -1472767
39905 -1472767 -1570422 -787633 -318710 -389052 -701451 -1641601 -3275438 -4124498 -2904026
39896 -2904026 -830616 -189363 -1022013 -1346884 -523135 -122654 -1085901 -2191183 -2261118
39887 -2261118 -2088496 -2907567 -4223995 -4515479 -3359529 -1721737 -541687 80100 509035
39878 509035 995920 1368314 1133970 190710 -702575 -873564 -976375 -2117325 -3708955
39869 -3708955 -3776830 -1947166 -423853 -905711 -2149157 -2176502 -1464722 -1761492 -2663468
39860 -2663468 -1997659 478394 2313892 1909675 659660 578752 1586690 2317318 2156862
39851 2156862 1253324 -227519 -1593683 -1544978 58547 1418738 1189073 529091 1128813
39842 1128813 2303569 2181252 968772 501346 837301 94850 -1944669 -2877192 -1410556
39833 -1410556 419206 347307 -881548 -1271789 -834873 -819126 -894053 379593 2717639
39824 2717639 4032822 3249184 1411625 -82201 -754095 -509382 544526 1521183 1449877
39815 1449877 762388 718891 1278337 1151828 195512 -101047 844477 1483227 499103 -1140015
39805 -1140015 -1778231 -1486219 -1467220 -1957947 -2170510 -1785175 -1224072 -772909 -469595 -554467
39795 -554467 -1140395 -1754142 -1925060 -1758597 -1293508 -106190 1506177 1862496 -184181
39786 -184181 -3232904 -4725125 -4050286 -2831124 -2316482 -2031145 -1110751 449667 2170581
39777 2170581 3538281 3873180 2855669 1302392 292717 -446892 -1908399 -3583039
39769 -3583039 -3692899 -2079978 -981646 -2006813 -3990185 -4953500 -4629403 -3712788 -2145287
39760 -2145287 88495 1626188 1177207 -377319 -1170459 -1063309 -1291282 -1880418 -1562563
39751 -1562563 -204279 821434 959631 1103855 1408633 620935 -1403258 -2473679 -878739
39742 -878739 1956164 3222090 2202159 504754 -439603 -576021 -324607 57784 236675
39733 236675 -10470 -355240 -401596 -353179 -469757 -333405 380481 877385 221434 -918042
39723 -918042 -856158 730048 2317665 2675720 2248671 1953775 1731211 1016818 -113092
39714 -113092 -978812 -1020789 -59383 1665756 3374065 4226908 4278338 4359609 4700961 4414161
39704 4414161 2879069 935141 -72392 42032 408490 603047 1189705 2669557 4496183
39695 4496183 5455505 4887288 3398477 2270427 2035224 1820039 503437 -1610582 -2941943
39686 -2941943 -2568800 -1288713 -431677 -308590 -320134 10648 735238 1743295 2680641
39677 2680641 2932525 2304899 1499921 1392442 2041211 2848489 3385309 3539891 3159824
39668 3159824 2204008 1138470 592732 584223 471843 -297243 -1618258 -2820576 -3199490
39659 -3199490 -2680105 -2054601 -2204609 -2970357 -3264042 -2454424 -1039876 264638 1355392
39650 1355392 2265797 2655204 2352944 1761249 1183631 432244 -421683 -779986 -587422
39641 -587422 -656187 -1188423 -1163716 -218190 166032 -1200182 -3037811 -3306639 -2116998
39632 -2116998 -992817 -137113 1178716 2054853 599980 -2644555 -4513014 -3161209
39624 -3161209 -83087 2423888 3644397 3609152 2254554 599641 590270 2299489 3177739
39615 3177739 1621842 -571310 -1068790 -493689 -861405 -2024082 -2270335 -1596481 -1670781
39606 -1670781 -2696654 -2781273 -872712 1586086 2620029 2015488 1043333 794337 1245139
39597 1245139 1465090 654874 -709779 -1192819 -340843 465794 -25959 -992127 -819908
39588 -819908 340462 843920 -3554 -1297384 -2142866 -2432785 -2125085 -1233516 -558261
39579 -558261 -989779 -2005745 -2250521 -1657505 -1494150 -2159370 -2569017 -2121892 -1677462
39570 -1677462 -1944070 -2318783 -2089781 -1591889 -1436110 -1630509 -2034105 -2590546 -2633085 -1254726
39560 -1254726 1010946 2261293 1764636 1026123 1384269 2038631 1724090 920932 813088
39551 813088 1236513 1410974 1667484 2474597 2630372 758699 -1864201 -2527630 -1141764
39542 -1141764 -410188 -1404935 -1746982 424899 3149233 3438232 1590374 203872 8324
39533 8324 -559307 -1991852 -2751006 -2144528 -1671291 -2407455 -3068381 -2131323 -355006 453285
39523 453285 78761 -348047 -386771 -357163 -32084 870879 1300995 33984 -1816258 -1618099
39513 -1618099 993405 3229271 2897385 1143980 275077 545334 641205 38977 -779444
39504 -779444 -1512320 -1866319 -1019738 1149731 2980668 2784866 1160140 4135 -218092
39495 -218092 -542949 -1334713 -1880971 -1876947 -1495042 -269175 2051795 3722753 2478015
39486 2478015 -908508 -2967192 -2149825 -749610 -1157478 -2530034 -2773772 -1850338 -1111969
39477 -1111969 -795552 -269026 171545 -282453 -1328771 -2036956 -2436568 -3062462 -3457643
39468 -3457643 -2775986 -1478254 -763482 -576879 121551 1231206 1453305 540692 -152599
39459 -152599 102942 206027 -930091 -2563238 -3150209 -2381638 -1267064 -689553 -646457
39450 -646457 -648235 -325862 172654 127256 -1043507 -2759206 -3476352 -2371420 -449740
39441 -449740 523194 -81277 -1443147 -2631408 -3509572 -4169967 -4186934 -3098712 -1451905
39432 -1451905 -658677 -1508739 -3199041 -4177838 -3671867 -2049962 -82432 1538521 2229469
39423 2229469 1927303 1477415 1783895 2465018 2225426 761013 -703438 -1179569 -1166833
39414 -1166833 -1468393 -1751679 -1263260 -266612 264037 -77770 -1019247 -2245793 -3258991
39405 -3258991 -3196266 -1864432 -463325 -164206 -466797 -226424 229433 -327172 -1564650
39396 -1564650 -1635297 -36371 1356303 883281 -746024 -1840145 -2023683 -2050639 -2285866
39387 -2285866 -2555587 -2893591 -3384323 -3685964 -3532926 -3223065 -2860939 -1828767 -46383
39378 -46383 907942 -635377 -3922373 -6178760 -5671789 -3280786 -948265 179907 -205919
39369 -205919 -1961044 -4028817 -4626862 -2986403 -385974 1361704 1869599 1808681 1382889
39360 1382889 488100 -105551 646247 2282875 3233413 3205993 3483181 4304366 3906417
39351 3906417 1439037 -920770 -711911 1141938 1668993 213610 -977449 -463588 562189
39342 562189 669171 147616 -354058 -1139062 -2189737 -2332524 -1103010 23925 -236444
39333 -236444 -971131 -837510 -564317 -1687511 -3695132 -4625832 -4096906 -3614839 -3929960
39324 -3929960 -4065373 -3217231 -1878595 -691251 302372 880589 581862 -77129 331254
39315 331254 2220176 4213130 4868508 4245927 3304914 2697789 2647613 3150531 3774010
39306 3774010 3899759 3466814 2882883 2227706 1385157 813753 1033835 1450803 1090950
39297 1090950 476431 1015422 2287773 2025762 -394873 -2538637 -2333553 -1038032 -1000451
39288 -1000451 -2007059 -2058519 -772254 369537 755181 1316673 2361952 2828797 2256834
39279 2256834 1770600 2237181 2731843 1847881 -239098 -1918637 -1986731 -720896 677760
39270 677760 1289517 1156787 908707 772797 265148 -905266 -2093187 -2470840 -2179901
39261 -2179901 -1970711 -1933883 -1539572 -913891 -985608 -1995647 -2825975 -2493833 -1618420 -1502227
39251 -1502227 -2068784 -1730555 416971 2986329 3564486 1470453 -1362188 -2507517 -1611648
39242 -1611648 -387834 -391247 -1526067 -2700693 -3084131 -2420199 -927278 562888 1080691
39233 1080691 836548 1398768 3601543 5790625 5444225 2520430 -92839 68293 2203077
39224 2203077 3452270 2333417 170529 -726409 376728 2116947 2778606 2180420 1579490
39215 1579490 1825195 2216368 1617673 194415 -827335 -984131 -1122826 -1833284 -2318845
39206 -2318845 -1574648 -60368 741096 228537 -692063 -900617 -236580 798005 1835231
39197 1835231 2732963 3277756 3229382 2536984 1362330 115969 -519636 -130694 668358
39188 668358 675118 -287654 -958981 -549104 -222609 -1451756 -3503738 -4246670 -3297940 -2432558
39178 -2432558 -2521103 -2183862 -476569 1162412 1297474 1048950 2072514 3342721 2627518
39169 2627518 464273 -250108 1333931 2843524 2498432 1453207 1251990 1340754 679216
39160 679216 -88645 111850 737011 576986 -259297 -880756 -1228538 -1625684 -1546629 -455053
39150 -455053 747391 739078 -126471 -285983 641583 1363607 888318 -190931 -627716 17103
39140 17103 972866 928424 -640641 -2498472 -2630788 -678492 1408567 1744767 574383
39131 574383 -737409 -1541757 -1677237 -741113 899200 1518028 220694 -1244184 -787028
39122 -787028 786604 1062890 -113106 -609480 322937 993972 265224 -826962 -1158829
39113 -1158829 -1091733 -1075725 -590633 512715 1264857 1159400 981839 1133225 658933 -973201
39103 -973201 -2554934 -2829538 -2310790 -2180241 -2402548 -2209305 -1656759 -1471741 -1847507
39094 -1847507 -2317819 -2390906 -1733566 -407868 589390 -22053 -1993481 -3441081 -3289315
39085 -3289315 -2659451 -2887336 -3413062 -2993611 -2000137 -1864020 -2773749 -3509778 -3385175
39076 -3385175 -2943097 -2684164 -2335340 -1679293 -1205149 -1492485 -2358573 -2874914 -2181667
39067 -2181667 -433308 1052840 1035077 -163198 -983300 -542018 600883 1712604 2705542
39058 2705542 3146761 1853047 -1298032 -4125389 -4229023 -1945748 89746 238866 -404613
39049 -404613 288018 2842545 5515139 6006653 3899136 1385086 1047076 2847316 4217209
39040 4217209 3416847 1616259 953112 1759861 2801992 3173487 2599504 792190 -1826422
39031 -1826422 -3328866 -2017504 1111464 3203676 2952278 1747723 1228323 1179551 561615
39022 561615 -491824 -751573 339947 1710111 1681239 -135138 -2202725 -2697213 -1697003
39013 -1697003 -1023874 -1740817 -2781844 -2624179 -1369745 -331423 -341025 -1339425 -2850942
39004 -2850942 -3896099 -3261092 -1019945 912639 943429 -171410 -705619 -585927 -1086428
38995 -1086428 -2484847 -3714902 -4053845 -3577662 -2229602 -86957 1644711 1632272 415438
38986 415438 -171960 464369 1315260 1797216 2303371 2677087 2078936 672330 -414287
38977 -414287 -1121519 -2488000 -4220756 -4426653 -2622220 -891135 -801381 -1050135 298352
38968 298352 2771445 4364485 4349062 3610971 2966997 2540839 2228501 1654811 253987
38959 253987 -1675185 -2743006 -2259382 -1436487 -1730863 -2769445 -3149705 -2680003 -2466541
38950 -2466541 -3021252 -3498249 -2914834 -1364846 103381 465068 -322385 -1187873 -1070257
38941 -1070257 -152491 540755 567572 214027 -504730 -1645985 -2256592 -1218695 614533
38932 614533 1070344 -68160 -589162 531107 1426535 589463 -623790 -639515 -488109
38923 -488109 -1506690 -2278546 -907585 1177386 1095119 -699092 -1028866 860943 2284246
38914 2284246 1594820 403174 423801 981648 878642 350842 -110027 -839141 -1695406
38905 -1695406 -1549967 -251162 661775 354296 63709 886899 1983385 2361720 2712231
38896 2712231 3792630 4524046 3611326 1887967 1071829 1052523 426887 -815009 -1179886
38887 -1179886 -169980 893836 822948 -13810 -546969 -255772 752466 2109397 3281335
38878 3281335 3719731 3080857 1243814 -1482354 -3946286 -4697076 -3584692 -2199376 -1974221
38869 -1974221 -2434692 -2166433 -950781 81769 92337 -620006 -1228685 -1127620 -374408
38860 -374408 23282 -1161430 -3637097 -5337917 -4852311 -3270250 -2407259 -2152559 -1330928
38851 -1330928 -454988 -1297716 -3744565 -5398451 -4876444 -3431170 -2490746 -1613425 -112567
38842 -112567 1120953 1119810 838552 1794942 3547570 4336709 3732814 2869962 2253003 1123912
38832 1123912 -730496 -2078997 -1798683 -343893 913650 1183951 766516 611574 1540388
38823 1540388 3333077 4543826 3905893 1958720 477500 205964 135603 -663632 -1560184
38814 -1560184 -1384845 -144800 1081636 1479162 1091056 537762 685242 2036805 3839265
38805 3839265 4422459 3198386 1662796 1409021 1790923 945507 -1222561 -2765739 -2544485
38796 -2544485 -1649858 -1372292 -1339863 -720034 77167 315189 568111 1778194 3231097
38787 3231097 3282135 2046530 1565776 2832956 4228907 3765720 1637946 -514905 -1892433
38778 -1892433 -2769450 -3059360 -2150973 -215862 1555068 2398746 2787819 3349644 3698951
38769 3698951 2988071 1246187 -465420 -1197221 -995959 -570586 -344716 -77438 519101
38760 519101 980107 357527 -1450634 -3079186 -3090087 -1874178 -1316415 -2337894 -3652918
38751 -3652918 -3582517 -2342470 -1518301 -1654072 -1588465 -329103 1507811 2639750 2697039
38742 2697039 2221302 1682278 1250659 1214009 1850980 2930417 3852903 4237697 4006239
38733 4006239 3159455 2038250 1542703 2286069 3538204 3829395 2788907 1609476 1366862
38724 1366862 1637940 1309807 126237 -1244699 -2233768 -2722255 -2638058 -1960087 -1081929
38715 -1081929 -537704 -325335 -19687 433332 587941 244404 -226136 -484678 -652471
38706 -652471 -882682 -970689 -764301 -602147 -878663 -1369559 -1476248 -1114654 -909426 -1351312
38696 -1351312 -2078745 -2257653 -1550544 -478366 153311 -28496 -879499 -2125680 -3526694
38687 -3526694 -4641497 -4785913 -3595384 -1617072 20057 752090 1148118 1941774 2651909
38678 2651909 1903287 -528359 -2732101 -2677138 -923310 -86625 -1380585 -3015969 -2800156
38669 -2800156 -1056259 388201 1118019 2106896 3174780 2743116 614462 -1053014 -614243
38660 -614243 843078 1397529 960843 508746 -110080 -1666470 -3567075 -4338709 -3817599
38651 -3817599 -3119845 -2664508 -2010693 -1490085 -1961911 -2769621 -2079359 165462 1710560
38642 1710560 1321226 601593 1145710 1782612 583880 -1758623 -2780107 -1788533 -506824
38633 -506824 -451282 -1519033 -3101352 -4786217 -5711038 -4873445 -2671567 -908358 -702116
38624 -702116 -1347056 -1613750 -1163066 -271921 764930 1370710 809411 -676462 -1633822
38615 -1633822 -1109679 -10837 23624 -1332301 -2913266 -3614526 -3440089 -3186270 -3622668
38606 -3622668 -4830257 -5937789 -5731322 -3884416 -1310742 956274 2672128 3725251
38598 3725251 3383116 1272292 -1257098 -2031171 -527889 1517443 2300316 1879506 1485505
38589 1485505 1719934 2179734 2390842 2324148 2109379 1832759 1638920 1653855 1793632 1860182
38579 1860182 1705047 1124353 -102049 -1722262 -2885223 -3018864 -2608519 -2484688 -2500036
38570 -2500036 -1734350 -107182 1138635 1061717 376503 377423 954488 709620 -883338 -2375970
38560 -2375970 -1958424 301710 2457459 2772499 1264344 -814079 -2344243 -2832193 -2153128
38551 -2153128 -637773 762273 1306388 1556360 2625541 4012902 3516559 342436 -2905472
38542 -2905472 -3089169 -748017 628955 -580984 -2370170 -2619569 -1878133 -1357488 -507891
38533 -507891 1327224 2658283 1822683 29062 -317690 399320 -310188 -2578722 -3637041
38524 -3637041 -2368131 -1319093 -2751195 -5243026 -6094354 -5168360 -4339979 -4526674 -5180014
38515 -5180014 -5687483 -5554531 -4062932 -1314901 1155185 2129675 2109840 1759491 422918
38506 422918 -2020105 -3351612 -1596567 1552669 2648894 1351052 539007 1649465
38498 1649465 2848253 2356819 826029 -532414 -1685342 -2503622 -2085828 -773602 -709189
38489 -709189 -2681856 -4264176 -3014660 -38429 1680935 1308057 377689 -127433 -610733
38480 -610733 -1070068 -649518 704205 1757004 1666350 1095025 1278142 2657092 4551831
38471 4551831 5697162 5267760 3805090 2717339 2465433 2035469 804347 -205552 -9244
38462 -9244 549091 191879 -584953 -532804 -111349 -768013 -2139341 -2296948 -834337 589360
38452 589360 1104127 1677967 2663492 2690099 1158921 -304599 -341662 112051 -65003 124840
38442 124840 1909459 4006353 4173704 2610176 1402575 1088541 201077 -1832398 -3666118
38433 -3666118 -4225535 -3872378 -2992790 -1488881 -291506 -1186215 -3917631 -5356896 -3227263
38424 -3227263 667375 2668491 1744505 -26644 -728340 -378846 312056 930499 777961
38415 777961 -901300 -3344672 -4323307 -2753875 -257136 857964 309709 -508031 -778245
38406 -778245 -709923 -118286 1723355 4426918 6113883 5581779 3937837 3105311 3340611
38397 3340611 3351687 2560136 1958170 2467413 3494849 3749855 2892466 1714146 976323
38388 976323 640979 188286 -679744 -1681130 -2187813 -1937604 -1494126 -1606411 -2043401
38379 -2043401 -1709879 -299655 865897 406909 -1204237 -2282870 -2236033 -2080432 -2568809
38370 -2568809 -3001541 -2421649 -996750 530415 1951666 3221191 3611619 2442332 442265
38361 442265 -808300 -928124 -1124687 -2142167 -2883617 -1936084 195518 1469259 806146
38352 806146 -743269 -1550964 -1344269 -1074846 -1376218 -1898964 -2109364 -2042013 -1934347 -1563013
38342 -1563013 -495064 1066886 2195640 2221488 1524532 1057093 1215143 1516690 1387580
38333 1387580 857120 226215 -614121 -1962742 -3395898 -3764170 -2627778 -1281533 -1524357
38324 -1524357 -3397704 -4997754 -4882500 -3867933 -3758297 -4924924 -6105840 -6264841 -5528706
38315 -5528706 -4302260 -2654485 -963050 -105322 -336637 -769352 -673012 -569712 -1200969
38306 -1200969 -2070869 -2124197 -1492630 -1315992 -1829682 -1854304 -579221 1125742 1807441
38297 1807441 1200654 251641 -240034 -355175 -548277 -944878 -1281492 -1288725 -945491 -380076
38287 -380076 299564 869445 782264 -426725 -2312216 -3588875 -3486964 -2650891 -2144463
38278 -2144463 -1985085 -1453038 -541707 -53326 -231751 -333052 190618 1007454 1736338
38269 1736338 2527056 3322482 3437836 2573631 1542277 1236755 1446921 1457440 1312251
38260 1312251 1646886 2612983 3762315 4708939 5133814 4451412 2434568 98186 -996547
38251 -996547 -524368 225026 -36563 -1185036 -2094672 -1936701 -814456 518418 1359911
38242 1359911 1707356 2206398 3153576 3701144 2650659 105911 -2297425 -3106159 -2518148
38233 -2518148 -1808789 -1737183 -2037997 -2277877 -2591280 -3332564 -4285950 -4602295 -3678977 -1985420
38223 -1985420 -746459 -680390 -1234512 -1280499 -437841 595550 1037065 1017094 1341622 2362918
38213 2362918 3398387 3463666 2413510 987808 -267280 -1553242 -2965545 -3721865 -3085166
38204 -3085166 -1785812 -1479132 -2611627 -3734456 -3322537 -1543847 191521 776146 89477
38195 89477 -1159254 -1746641 -710944 1613957 3781163 4771581 4733553 3992135 2423225
38186 2423225 449494 -489154 458827 2261780 3316287 3293743 2713567 1649842 173760
38177 173760 -783070 -547775 -21464 -317839 -802318 -300184 425281 -326559 -1996970
38168 -1996970 -2089379 40364 2172824 2683109 2652189 3427808 4210778 3577344 1777126
38159 1777126 -11419 -1420370 -2467336 -2569020 -1444892 -86402 504971 751216 1548935
38150 1548935 2817549 4144565 5842061 8001308 9436101 9071556 7637919 6510382
38142 6510382 5602941 4027308 2218780 1597922 2387402 3453424 4172987 4795097 4994392
38133 4994392 3882433 1834443 651894 1164603 1944927 1300372 -360446 -1127028 -107964
38124 -107964 1519513 2018535 1129416 223887 417092 1006353 451275 -1266552 -2354170
38115 -2354170 -1645201 -226294 125758 -818417 -1992399 -2657629 -2688474 -1984637 -811312
38106 -811312 -163932 -642633 -1498517 -1859257 -2128881 -2862824 -3135725 -1816970 85037
38097 85037 343723 -1354350 -3056737 -3340425 -2656291 -1770424 -725017 274081 651640
38088 651640 657830 1279642 2541470 3347291 3337470 3327405 3547496 3177764 2149978 1606195
38078 1606195 1835273 1553591 181868 -893412 -480772 549089 788297 288755 -186348
38069 -186348 -554296 -794461 -266741 1027258 1819339 1599486 1854884 3640197 5313774
38060 5313774 4748879 2688971 1577113 1764283 1377275 -247476 -1477207 -1099380 -33802
38051 -33802 328008 -157008 -976623 -1840303 -2265186 -1522848 223846 1645655 1751698
38042 1751698 955179 239815 44452 326119 881953 1173960 631628 -386676 -649149
38033 -649149 433731 1973614 2749927 2579903 2044315 1448189 720380 -30691 -544552
38024 -544552 -876475 -1318664 -1841126 -1968274 -1314047 -88984 1005268 1394021 1156760
38015 1156760 902465 1121205 1788891 2601593 3287650 3551515 3088942 1988838 875313
38006 875313 341775 411485 685428 670221 -119594 -1711756 -3028641 -2562845 -380637
37997 -380637 1372495 940069 -768065 -1561111 -1037245 -723526 -1390968 -2026529 -1848925
37988 -1848925 -1713650 -2682968 -4414299 -5878490 -6688391 -6748557 -5470612 -2557800 896235
37979 896235 3245096 4056616 4113348 3843612 2838726 1079743 -367801 -446633 640193
37970 640193 1776427 2234685 2217839 2292368 2687621 3130478 3073388 2064790 176519 -1803432
37960 -1803432 -2805649 -2341773 -943219 333412 801096 546900 161539 233874 928556
37951 928556 1828209 2353324 2563512 3223031 4618885 5677501 5087105 3210255 1874871
37942 1874871 2018590 2559061 2146729 1089608 697595 1425576 2601075 3459967 3519385
37933 3519385 2456848 726244 -147540 774565 2099947 1535093 -793220 -2087665 -618998
37924 -618998 1800705 2294454 754986 -413613 131752 1200064 1437799 1453524 2436571
37915 2436571 3735273 3482571 1488463 -143541 90986 952157 390995 -1353831 -2295604
37906 -2295604 -1956307 -2080297 -3678485 -5236684 -4926571 -3120055 -1342885 90390 1762993
37897 1762993 3306597 3698974 3091170 2640453 2579078 2009325 686737 -498853 -1003140
37888 -1003140 -1145739 -952092 -25367 1070442 956234 -386461 -1209362 -649753 -139953
37879 -139953 -899985 -1611726 -468809 1543730 1687501 -540172 -2693668 -2963327 -2387848
37870 -2387848 -2528750 -2685617 -1134693 1700799 3230441 2016468 -348915 -1367912
37862 -1367912 -632974 280612 328859 151069 649557 1554444 1991651 1776764 1420358 1181607
37852 1181607 760155 -154585 -1428896 -2526512 -2865490 -2397089 -1900388 -2206747 -3020301
37843 -3020301 -3237745 -2685130 -2569565 -3663569 -5092029 -5764949 -5968042 -6402637 -6635894
37834 -6635894 -5937829 -4855858 -4343328 -3962735 -2712599 -1109275 -458302 -381591 706214
37825 706214 2642358 3380882 2241939 1028899 1141921 1686526 1444421 786711 483093
37816 483093 372282 402044 1266115 2696491 2820534 781947 -1456738 -1571932 78259
37807 78259 1416682 1467431 637930 -669228 -2045781 -2648281 -2349429 -2321343 -2979065 -2644235
37797 -2644235 -136757 2594595 2786056 912081 -68557 1035273 2702656 3747000
37789 3747000 4642447 5549596 5469893 4055244 2349225 1131143 170083 -513671 -388799
37780 -388799 208518 227241 -128132 569946 2411812 3562101 3073701 2439628 3226664
37771 3226664 4785247 5563898 5297132 4564462 3419033 1928566 1126376 1861101 3204499
$$ [...]
##END NTUPLES=NMR SPECTRUM
##END=
