##TITLE=31Pdec_PR166-n3
 D2O, 24 sc
 12.2.2019
##JCAMPDX= 6.0         $$ Bruker NMR JCAMP-DX V2.0
##DATA TYPE= NMR SPECTRUM
##DATA CLASS= NTUPLES
##ORIGIN= UXNMR, Bruker Analytische Messtechnik GmbH
##OWNER= root
$$ XWIN-NMR		Version 3.5
$$ Tue Feb 12 14:30:53 2019 Russian Standard Time (UT+4h)  she@DPX200
##.OBSERVE FREQUENCY= 81.013821
##.OBSERVE NUCLEUS= ^31P
##.ACQUISITION MODE= SIMULTANEOUS
##.ACQUISITION SCHEME= undefined
##.AVERAGES= 24
##.DIGITISER RES= 17
##SPECTROMETER/DATA SYSTEM= spect
##.PULSE SEQUENCE= zgpg30
##.SOLVENT NAME= CDCl3
##.SHIFT REFERENCE= (INTERNAL, CDCl3, 0, 182.463)
##AUDIT TRAIL= $$ (NUMBER, WHEN, WHO, WHERE, WHAT)
$$ ##TITLE= Audit trail, XWIN-NMR		Version 3.5
$$ ##JCAMPDX= 5.01
$$ ##ORIGIN= Bruker BioSpin GmbH
$$ ##OWNER= she
$$ F:/spectra/data/she/nmr/P31/1/pdata/1/auditp.txt
$$ ##AUDIT TRAIL=  $$ (NUMBER, WHEN, WHO, WHERE, WHAT)
(   1,<2019-02-12 14:29:30.92 +0400>,<she>,<DPX200>,
      <created by zg, POWCHK disabled, PULCHK disabled
       configuration hash MD5:
       00 E9 B6 7A A2 85 ED C7 34 08 36 98 17 FE 4E 26
       data hash MD5: 32K
       CF 5B 02 BD D3 76 D1 EC D2 21 ED 17 9D 39 4B F0>)
(   2,<2019-02-12 14:29:35.65 +0400>,<she>,<DPX200>,
      <Start of raw data processing
       efp BC_mod = 2 LB = 1 FT_mod = 6 PKNL = 1 PHC0 = -1476.955 PHC1 = 77.39893 SI = 64K 
       data hash MD5: 64K
       6E 39 86 80 B0 D1 E9 F4 0D CB 53 3F 53 09 92 EE>)
(   3,<2019-02-12 14:30:16.81 +0400>,<she>,<DPX200>,
      <pk PHC0 = 14.18216 PHC1 = -54.60002 
       data hash MD5: 64K
       BE 65 96 C0 FC 38 94 90 82 05 34 B5 62 5C 5C 99>)
(   4,<2019-02-12 14:30:19.73 +0400>,<she>,<DPX200>,
      <abs ABSG = 5 
       data hash MD5: 64K
       69 45 AC DB 26 FB AA A2 2B 24 F0 42 1A C1 90 FF>)
$$ ##END=
$$ 
$$ hash MD5
$$ 32 01 D4 C2 D6 1D 5F 2E 4A DA 27 38 A8 CC 5E 98
##$RELAX= 
##$RELAX= 
##$RELAX= 
##$RELAX= 
##$RELAX= 
##$RELAX= 
##$RELAX= 
##$RELAX= 
$$ Bruker specific parameters
$$ --------------------------
##$DU= <F:/spectra>
##$EXPNO= 1
##$NAME= <P31>
##$PROCNO= 1
##$TYPE= <nmr>
##$USER= <she>
##$AMP= (0..31)
100 100 100 100 100 100 100 100 100 100 100 100 100 100 100 100 100 100 
100 100 100 100 100 100 100 100 100 100 100 100 100 100 
##$AQSEQ= 0
##$AQ_mod= 1
##$AUNM= <au_zg>
##$AUTOPOS= <>
##$BF1= 81.014009
##$BF2= 200.13
##$BF3= 200.13
##$BF4= 200.13
##$BF5= 200.13
##$BF6= 200.13
##$BF7= 200.13
##$BF8= 200.13
##$BYTORDA= 1
##$CFDGTYP= 0
##$CFRGTYP= 5
##$CHEMSTR= <none>
##$CNST= (0..31)
1 1 145 1 1 1 1 1 1 1 1 1 1 1 1 1 1 1 1 1 1 1 1 1 1 1 1 1 1 1 1 1 
##$CPDPRG= <waltz16>
##$CPDPRG1= <>
##$CPDPRG2= <waltz16>
##$CPDPRG3= <>
##$CPDPRG4= <mlev>
##$CPDPRG5= <mlev>
##$CPDPRG6= <mlev>
##$CPDPRG7= <mlev>
##$CPDPRG8= <mlev>
##$CPDPRGB= <>
##$CPDPRGT= <>
##$D= (0..31)
0 1 0 0 0 0 0 0 0 0 0 0.03 2e-05 3e-06 0 0 0 0 0 0 0 0 0 0 0 0 0 0 0 0 
0 0 
##$DATE= 1549967370
##$DBL= (0..7)
120 120 120 11 120 120 24 19 
##$DBP= (0..7)
150 150 150 150 150 150 150 150 
##$DBP07= 0
##$DBPNAM0= <>
##$DBPNAM1= <>
##$DBPNAM2= <>
$$ [...]
##$SUBNAM3= <"">
##$SUBNAM4= <"">
##$SUBNAM5= <"">
##$SUBNAM6= <"">
##$SUBNAM7= <"">
##$SUBNAM8= <"">
##$SUBNAM9= <"">
##$SW= 369.568048894756
##$SWIBOX= (0..15)
0 1 3 0 0 0 0 0 0 0 0 0 0 0 0 0 
##$SW_h= 29940.119760479
##$TD= 32768
##$TD0= 1
##$TE= 0
##$TE2= 300
##$TE3= 300
##$TEG= 300
##$TL= (0..7)
0 120 53 12 22 120 120 120 
##$TP= (0..7)
150 150 150 150 150 150 150 150 
##$TP07= 0
##$TPNAME0= <>
##$TPNAME1= <>
##$TPNAME2= <>
##$TPNAME3= <>
##$TPNAME4= <>
##$TPNAME5= <>
##$TPNAME6= <>
##$TPNAME7= <>
##$TPOAL= (0..7)
0.5 0.5 0.5 0.5 0.5 0.5 0.5 0.5 
##$TPOFFS= (0..7)
0 0 0 0 0 0 0 0 
##$TUNHIN= 0
##$TUNHOUT= 0
##$TUNXOUT= 0
##$USERA1= <user>
##$USERA2= <user>
##$USERA3= <user>
##$USERA4= <user>
##$USERA5= <user>
##$V9= 5
##$VALIST= <valist>
##$VCLIST= <CCCCCCCCCCCCCCC>
##$VD= 0
##$VDLIST= <DDDDDDDDDDDDDDD>
##$VPLIST= <PPPPPPPPPPPPPPP>
##$VTLIST= <TTTTTTTTTTTTTTT>
##$WBST= 1024
##$WBSW= 4
##$XGAIN= (0..3)
0 0 0 0 
##$XL= 0
##$YL= 0
##$YMAX_a= 19267
##$YMIN_a= -20658
##$ZGOPTNS= <>
##$ZL1= 120
##$ZL2= 120
##$ZL3= 120
##$ZL4= 120
##$ABSF1= 182.463
##$ABSF2= -187.1042
##$ABSG= 5
##$ABSL= 3
##$ALPHA= 0
##$AQORDER= 0
##$ASSFAC= 0
##$ASSFACI= 0
##$ASSFACX= 0
##$ASSWID= 0
##$AUNMP= <proc_1d>
##$AZFE= 0.1
##$AZFW= 0.5
##$BCFW= 0
##$BC_mod= 2
##$BYTORDP= 0
##$COROFFS= 0
##$CY= -3
##$DATMOD= 1
##$DC= 0
##$DFILT= <>
##$DTYPP= 0
##$F1P= 0
##$F2P= 0
##$FCOR= 1
##$FTSIZE= 65536
##$FT_mod= 6
##$GAMMA= 0
##$GB= 0
##$INTBC= 1
##$INTSCL= 5.30512e-09
##$ISEN= 30
##$LB= 1
##$LEV0= 0
##$LPBIN= 0
##$MAXI= 10000
##$MC2= 0
##$MEAN= 0
##$ME_mod= 0
##$MI= 50
##$NCOEF= 0
##$NC_proc= -4
##$NLEV= 6
##$NOISF1= 182.463
##$NOISF2= 159.3651
##$NSP= 0
##$NTH_PI= 0
##$NZP= 0
##$OFFSET= 182.463
##$PC= 4
##$PHC0= -1462.773
##$PHC1= 22.79891
##$PH_mod= 1
##$PKNL= yes
##$PPARMOD= 0
##$PSCAL= 0
##$PSIGN= 0
##$REVERSE= no
##$SF= 81.0140089999434
##$SI= 65536
##$SIGF1= 159.3651
##$SIGF2= -187.1042
##$SINO= 113.3802
##$SIOLD= 16384
##$SREGLST= <1H.CDCl3>
##$SSB= 0
##$STSI= 65536
##$STSR= 0
##$SW_p= 29940.119760479
##$SYMM= 0
##$S_DEV= 0
##$TDeff= 32768
##$TDoff= 0
##$TI= <>
##$TILT= no
##$TM1= 0
##$TM2= 0
##$TOPLEV= 0
##$USERP1= <user>
##$USERP2= <user>
##$USERP3= <user>
##$USERP4= <user>
##$USERP5= <user>
##$WDW= 1
##$XDIM= 65536
##$YMAX_p= 478554049
##$YMIN_p= -5458382
$$ End of Bruker specific parameters
$$ ---------------------------------
##NTUPLES= NMR SPECTRUM
##VAR_NAME=  FREQUENCY,     SPECTRUM/REAL,   SPECTRUM/IMAG
##SYMBOL=    X,             R,               I
##VAR_TYPE=  INDEPENDENT,   DEPENDENT,       DEPENDENT
##VAR_FORM=  AFFN,          ASDF,            ASDF
##VAR_DIM=   65536,         65536,           65536
##UNITS=     HZ,            ARBITRARY UNITS, ARBITRARY UNITS
##FACTOR=    0.456856943014862, 1,           1
##FIRST=     14782.0589164792, 0,            0
##LAST=      -15158.0608439998, 0,           0
##MIN=       -15158.0608439998, -5458382,    0
##MAX=       14782.0589164792, 478554049,    0
$$ Real data points
##PAGE= N=1
##DATA TABLE= (X++(R..R)), XYDATA
$$ [...]
##PAGE= N=2
##DATA TABLE= (X++(I..I)), XYDATA
45572B93425M01081L61058L41422K36975R8458Q9907J78154O7977l86462q27404
$$ 293425 694506 1055564 1396986 1633961 1732419 1822326 2000480 2068457 1681995 854591
45562H54591p39858j70777K46244J48862n4499J17776M03641K53666j44994p8341
$$ 854591 114733 -56044 190200 339062 284563 402339 805980 1059646 914652 836311
45552H36311M60639O07253k2883o36714m55126Q9256Q3322m32297o27812k34805
$$ 836311 1296950 1904203 1881320 1244606 789480 878736 962058 529761 -98051 -332856
45542c32856J56765J35253k0326k1233m4855k40758l34083q0753K89154M17342
$$ -332856 -176091 -40838 -61164 -82397 -127252 -368010 -702093 -782846 -493692 -76350
45532g6350L08912K03071J97770K32411K40978J56233m4413k06886j55904k6475
$$ -76350 232562 435633 633403 865814 1106792 1263025 1218612 1011726 855822 829347
45522H29347j11972l29893k63375J42515M10222K71175O7384R6801Q7704k14187
$$ 829347 717375 387482 124107 266622 676844 948019 1015403 1112204 1199908 985721
45512I85721m25169j06613L88795L54285j81993n05176k81114Q9848J98489P5328
$$ 985721 560552 453939 842734 1197019 1015026 509850 228736 318584 517073 592401
45502E92401j48741m08641m16884J51834R69150J156614M07415n14355p52639
$$ 592401 443660 35019 -381865 -230031 739119 1895733 2303148 1788793 1036154
45493A036154l65310L3429J68138J48976M538k62468l83463j32128K13606K09985
$$ 1036154 670844 704273 872411 1021387 1025925 763457 379994 247866 461472 671457
45483F71457o5128j54051L2640J31863q316j06718O468J06747K7373k0396J57797
$$ 671457 606329 452278 484918 616781 608465 501747 508215 614962 642335 621939 779736
45472G79736L41768K04225j70222l69750j99528Q1916J02877j56194l19116p4499
$$ 779736 1121504 1325729 1155507 785757 586229 668145 771022 614828 295712 221213
45462B21213L71527M85669J15573k53867j71286J22560R0350k43316l50097o8416
$$ 221213 592740 1078409 1193982 940115 768829 891389 981739 738423 388326 319910
45452C19910J61048M9798j03154J0218J75757O8214j76755k10307l6127O6925
$$ 319910 480958 530756 427602 437820 613577 681791 505036 294729 258602 325527
45442C25527J9040k0433K6099R6416J61423K10047J63445J0656j03945j09128
$$ 325527 344567 324134 350233 446649 608072 818119 981564 992220 888275 779147
45432G79147j32365k13699j62647N3475J02745j75989l59685m0555M36098M17264
$$ 779147 646782 433083 270436 323911 426656 250667 -109018 -149573 286525 703789
45422G03789n1557l20032j71026n9311k22900k66014R3751M66578L76548l5052
$$ 703789 652232 332200 161174 101863 -121037 -387051 -293300 173278 549826 514774
45412E14774k94523k47668n1165J97851M37615M72749K15193n7833l6226J52659
$$ 514774 220251 -27417 -78582 119269 556884 1029633 1244826 1186993 1150767 1303426
45402A303426J45170p2815j38709J15549L79855K72067j57820m73846l58514K5360
$$ 1303426 1448596 1375781 1237072 1352621 1732476 2004543 1846723 1372877 1014363 1039723
45392A039723K35234R5063r8339k3710J75778J12860k30678m63852l67098j42647
$$ 1039723 1274957 1370020 1271681 1247971 1423749 1536609 1305931 842079 474981 332334
45382C32334p771Q7216K03775K47888K22967K81221L49209J23107l32852m64149
$$ 332334 324563 411779 615554 863442 1086409 1367630 1716839 1839946 1507094 1042945
45372A042945n6884K82282l5529o61848q05567l44030J79916M42367N45774M72448
$$ 1042945 986061 1268343 1232814 570966 -234601 -578631 -398715 43652 589426 1061874
45362A061874N3785m80557n85176j74811K24063K34295M5747m8765l8531K6792
$$ 1061874 1115659 635102 49926 -124885 99178 333473 379220 330455 291924 318716
45352C18716J65769K26728n469l30879k74893J41026L36994R4545q1911J54774
$$ 318716 484485 711213 705744 374865 99972 240998 577992 672537 590626 745400
45342G45400L84611J55109k35245k51431L1679J83007J30897L3905j91852n65627
$$ 745400 1130011 1285120 1049875 798444 830123 1013130 1144027 1177932 986080 420453
45332D20453o09495K0040P16463N71956k70749p67741m75719k7168L1808j3157
$$ 420453 -189042 -169002 547461 1119417 848668 80927 -394792 -421960 -390152 -403309
45322d03309K08305M57851M16922K68802K50605J67552j34849l12043q5487J76858
$$ -403309 -195004 262847 679769 948571 1199176 1366728 1231879 919836 834349 1011207
45312A011207L5983k55764k10506J8041o2749l43692k64356J85665M03985J59906
$$ 1011207 1047190 791426 580920 598961 536212 192520 -71836 113829 517814 677720
45302F77720r9239o1506L1928p811L3579K28279K39482m1715j81082N8490K25643
$$ 677720 578481 516975 548903 541092 574671 802950 1042432 1000717 819635 878125 1103768
45291A103768o8294m33971l42462j5266K9733n9324K07263O06450M16551l05525
$$ 1103768 1035474 601503 259041 243775 273508 214184 421447 1027897 1444448 1138923
45281A138923o06880n5595N65633M27885j70630l84645q2700J37146n4976l34085
$$ 1138923 532043 476448 1042081 1469966 1299336 914691 831991 969137 914161 580076
45271E80076l04887l759K62665K94853J42740J5871O2777J94371K20642J60479
$$ 580076 275189 271430 534095 828948 971688 987559 1050336 1244707 1465349 1625828
45261A625828J80440J94123j04546o45128q43871l89378K12704L15394L9296j9593
$$ 1625828 1806268 2000391 1895845 1250717 406846 17468 230172 545566 584862 565269
45251E65269K32265L16096L2888k20146q9968K62342M83486M39338J81104j63509
$$ 565269 797534 1113630 1146518 926372 836404 1098746 1582232 2021570 2202674 2039165
45241B039165l73893l27953k47536l99350n57708k42272M40132P52761L48419
$$ 2039165 1665272 1337319 1089783 690433 132725 -109547 330585 1083346 1431765
45232A431765k05061k56583M9283J58701j9768j47536j07578r6231j72256j68004
$$ 1431765 1226704 970121 1019404 1178105 1158337 1010801 903223 806992 634736 466732
45222D66732k2902J41303K43231K61659J23457j44108k66755m6431K73015K92737
$$ 466732 443830 585133 828364 1090023 1213480 1069372 802617 756186 1029201 1321938
45212A321938J7196k10074k26280j35966K1430K61759L70893J04491l15055l91721
$$ 1321938 1339134 1129060 902780 766814 788244 1050003 1420896 1525387 1210332 818611
45202H18611j12983L376k37662l55861K6521N54151O76168M16923J75404P4861
$$ 818611 705628 709004 471342 115481 142002 696153 1372321 1789244 1964648 2039509
45192B039509j9340q4600m3670r7740m28132o88384l81498K72117M77175J3073
$$ 2039509 2020169 1935569 1891899 1794159 1366027 677643 296145 568262 1045437 1058510
45182A058510l86576j21532L66505K79922l22832o24506k22964L88843N77607
$$ 1058510 671934 550402 916907 1196829 873997 249491 26527 415370 992977
45173I92977L09699l9427k27569k40972j05425J19541K81620K81881K03531J53114
$$ 992977 1302676 1263249 1035680 794708 689283 808824 1090444 1372325 1575856 1728970
45163A728970Q1040q6002k43044k24012n8297O0134J8023j44986l46008m85923
$$ 1728970 1810010 1724008 1480964 1256952 1198655 1258789 1276812 1131826 785818 299895
45153B99895m36868j80893R5943K23071K74344L66953L54341M7070l25922l01236
$$ 299895 -136973 -317866 -221923 1148 275492 642445 996786 1043856 717934 416698
45143D16698J11724L46135P4059l32383l97532j94952l9484R8298L70022N18667
$$ 416698 528422 874557 948616 616233 218701 23749 -15735 82563 452585 971252
45133I71252J87451l44879l86766J42597N27950K88814j80422l14180j88626j71671
$$ 971252 1158703 813824 427058 569655 1097605 1386419 1205997 891817 703191 531520
45123E31520j90876M4954L37959J88101l36691n57539j70126K82485K20570j38736
$$ 531520 340644 385598 723557 911658 574967 17428 -152698 129787 350357 211621
45113B11621j77855J87821M56834L03383o8510l40017m30224l38877k4243L62152
$$ 211621 33766 221587 678421 981804 913294 573277 143053 -195824 -220067 142085
45103A42085M38770P4119l18604k75199Q6908K63418Q8904j13849r6244J8876
$$ 142085 580855 654974 336370 61171 148079 411497 500401 386552 290308 309184
45093C09184J04875K82477N62293N90646J26178m46285n07494l9883L43980K46294
$$ 309184 414059 696536 1258829 1849475 1975653 1529368 1021874 981991 1325971 1572265
45083A572265m5375r1709N0059J0616k74281m90172m31601k28114k7921K34904
$$ 1572265 1526890 1435181 1485240 1495856 1221575 731403 299802 71688 43767 278671
45073B78671N80232P28784M03930k01834n69609m89959k73147k33454k62590j22773
$$ 278671 858903 1587687 1991617 1789783 1220174 730215 457068 223614 -38976 -161749
45063a61749J01816J70297J30913K17214L72734K96990r400j69839j6908J56167
$$ -161749 -59933 110364 241277 458491 831225 1128215 1118815 948976 932068 1088235
45053A088235J12975L7311J08640J05481j78865m41183k73561J31012K07365j07625
$$ 1088235 1201210 1238521 1347161 1452642 1273777 832594 559033 690045 897410 789785
45043G89785k60694P0529M83317M20110r1619n26855n13426j74530J11290J40228
$$ 789785 529091 599620 1082937 1503047 1411428 884573 371147 196617 307907 448135
45033D48135M6391N8650J52202Q5901j83356l62728k55873p5945o6181o4051J82412
$$ 448135 494526 553176 705378 791279 607923 245195 -10678 -86623 -152804 -216855 -34443
45022c4443M76216M25680J16033J989J65136K30717O6210j7370J02419J09593
$$ -34443 441773 867453 983486 985475 1150611 1381328 1447538 1430168 1532587 1642180
45012A642180j32343k68126p9321Q6390q5547l03085j66545J30111J21511j67257
$$ 1642180 1509837 1241711 1162390 1248780 1163233 860148 693603 823714 945225 777968
45002G77968l06499j45440P6609J93612K37220J74410m8080k31829j01404K42650
$$ 777968 471469 326029 402638 596250 833470 1007880 959800 727971 626567 869217
44992H69217L97315K06085o6688j29313K6954K14014K29167r883l23657l66759
$$ 869217 1266532 1472617 1405929 1276616 1303570 1517584 1746751 1736868 1413211 1046452
44982A046452o3791K16800J64345k5623k9274L7013j20633l49305k42664J39494
$$ 1046452 982661 1199461 1363806 1338183 1308909 1345922 1225289 875984 633320 772814
44972G72814L22797J71733J2214k6547j76695m27868l92654M160K94910K09257
$$ 772814 1095611 1267344 1279558 1253011 1076316 648448 255794 259954 554864 764121
44962G64121P6890J56812J46114j86537m15480j00428L92424L78395r1419l42363
$$ 764121 841011 997823 1143937 957400 541920 441492 833916 1212311 1120892 778529
44952G78529j21081J37705R7192n1921p7787q0763j57065j28112J08751K79194
$$ 778529 657448 795153 892345 840424 762637 681874 524809 396697 505448 784642
44942G84642R1553k94833m43738j95944J72752L22628K16542Q3549R7047J60655
$$ 784642 876195 581362 137624 -58320 114432 437060 653602 737151 834198 994853
44932I94853O3330j75476k65841n2264K00561J44122j31536k10286J6615J72978
$$ 994853 1058183 882707 616866 564602 765163 909285 777749 567463 584078 757056
44922G57056m638k07579J664M56719M94617j40639q30050p66459L1799O97893
$$ 757056 752418 544839 546503 1003222 1497839 1357200 527150 -239309 -207510 490383
44912D90383N46020j46242n59937l33284J57992M27308M00580K29966l7960l45935
$$ 490383 1036403 890161 330224 -3060 154932 582240 982820 1212786 1174826 828891
44902H28891m37022j31333L11192M24217J13603k57605l57468k11253k7730N3225
$$ 828891 391869 260536 571728 995945 1109548 851943 494475 283222 255492 308717
44892C08717p575j46817j73730M2277L09510K73267q6980l74327l13218j06576
$$ 308717 301142 154325 -19405 22872 332382 605649 518669 144342 -168876 -275452
44882b75452n3003n4869J75399N49658O17510J96704l00648l43415N7368L56360
$$ -275452 -328455 -383324 -207925 341733 959243 1155947 855299 511884 569252 925612
44872I25612J51355k93318l47074J71372O86173N51553j01450n28242l56024N981
$$ 925612 1076967 783649 436575 607947 1294120 1845673 1744223 1215981 859957 865938
44862H65938Q0232l196J03675K68913J09433k60705l14945L5493K54185O669l41938
$$ 865938 946170 942974 1046649 1315562 1424995 1164290 849345 884838 1139023 1145692 803754
44851H03754l29763o2923O8084q115r7193j23709r5198O7213K85182J82619l51732
$$ 803754 473991 411068 479152 471037 373844 250135 154937 222150 507332 689951 338219
44840C38219p19243l15005M83629P12424J86315k59846m1769M01442M37663J71551
$$ 338219 -381024 -696029 -212400 500024 686339 426493 384724 786166 1223829 1395380
44830A395380M2573L2311j20755k92831j95846J7256j3189j77813p9021K04598
$$ 1395380 1437953 1470264 1349509 1056678 860832 878088 864899 687086 608065 812663
44820H12663J89367j48676k34361J93297N94048L64803l32785q06521o47022o0628
$$ 812663 1002030 853354 618993 812290 1406338 1771141 1438356 631835 -15187 -75815
44810g5815M29679M51566J06250j06479J29103M65119L08947k96732o63353m22685
$$ -75815 353864 805430 911680 805201 934304 1399423 1708370 1411638 748285 325600
44800C25600q74J03693K0388J15152L17287L07450R4766p1617j75169l50244m60401
$$ 325600 324726 428419 448807 563959 881246 1188696 1283462 1211845 1036676 686432 226031
44789B26031k34666K09938M16159J98641j42569k75494k00738r0866j8663N4623
$$ 226031 -8635 201303 617462 816103 673534 398040 197302 106436 87773 142396
44779A42396J69988L01683L32308J67238n1899k5891K63343M25771K05826j07163
$$ 142396 312384 614067 946375 1113613 1061714 1035823 1299166 1724937 1930763 1823600
44769A823600j33975p278q4588k84286k53009o1647j09632l48910k71765K01590
$$ 1823600 1689625 1682347 1597759 1313473 1060464 998817 889185 540275 268510 470100
44759D70100M88873K59838m1971K3094J59899q8680m83899m45869j4464K03707
$$ 470100 958973 1218811 1176840 1199934 1359833 1271153 787254 341385 326921 530628
44749E30628j3682k18982o2775J69805M6844l23765m21016j3935N18750O24295
$$ 530628 516946 297964 235189 404994 451838 128073 -292943 -306878 211872 836167
44739H36167K17289k28842k51863O2292K60617J50889k3986n2733n1084j27964
$$ 836167 1053456 824614 572751 635043 895660 1046549 1022563 969830 918746 790782
44729G90782q9115K21178N16842L86206r2989m17886l22345m9677P1465K6580
$$ 790782 701667 922845 1439687 1825893 1732904 1315018 992673 942996 1014461 1041041
44719A041041j4226P95j6353j15192k15268j79232K2904K12832J60339r7629k34991
$$ 1041041 1026815 1027610 1011257 896065 680797 501565 524469 737301 897640 800011 565020
44708E65020n7715K12127K59171J18580M0670N5311O477o3099L7647K00553N1111
$$ 565020 507305 719432 978603 1097183 1137853 1193164 1199641 1136542 1174189 1374742 1425853
44697A425853m31585p22718m33323J16885L20255P6412j66973p4887J98143L09945
$$ 1425853 994268 271550 -161773 -44888 275367 351779 184806 109919 308062 618007
44687F18007J51792j20571l08058l06615j12963J83620M05021L64571L9369l24235
$$ 618007 769799 649228 341170 34555 -78408 105212 510233 874804 914173 589938
44677E89938l81521n8600L18290L81402J47814o3675p6514L636P1013J60917K40256
$$ 589938 208417 149817 468107 849509 997323 933648 857134 860770 931783 1092700 1332956
44666A332956J41425j42022l37704k65575j14368j27950k14644j37230O9510J77659
$$ 1332956 1474381 1332359 994655 729080 614712 486762 272118 134888 204398 382057
44656C82057J51300J31142J10788k1404j45307M970L68186N40503L42509N0933
$$ 382057 533357 664499 775287 753883 608576 613546 981732 1522235 1864744 1915677
44646A915677p6866j42706k66730k88869j24817p2627l40501n44183k04379M09283
$$ 1915677 1838811 1696105 1429375 1140506 1015689 943062 602561 58378 -146001 263282
44636B63282N34124J9160m40850l35817n783M8431k6232J64724M43557L04345
$$ 263282 797406 816566 375716 39899 34116 82547 56315 221039 664596 968941
44626I68941j64944k83715J98340O63789M85452j16109m49468l11316j33389k47037
$$ 968941 803997 520282 718622 1382411 1867863 1751754 1302286 990970 857581 610544
44616F10544m13402k30843K31195M57803J45719l55811m27475M4531N11013M77819
$$ 610544 197142 -33701 197494 655297 801016 445205 17730 62261 573274 1051093
44606A051093J30474j7842R9129R5142j57284l07908j46242M0008j1053p8639
$$ 1051093 1181567 1163725 1262854 1357996 1200712 892804 746562 786570 775517 696878
44596F96878R4591K54047J8987m13905m91591j30674K04007K29874J32329O2327
$$ 696878 791469 1045516 1064503 650598 159007 28333 232340 462214 594543 656870
44586F56870j15598l96251m43494j05339K65595L03646J24041L4385N2864L5226
$$ 656870 541272 145021 -298473 -403812 -138217 165429 289470 323855 376719 411945
44576D11945J7733Q6307J22962L0495K760J97305L35767O8197l99914n22102j99794
$$ 411945 429678 515985 638947 669442 672202 869507 1205274 1273471 873557 351455 151661
44565A51661J22288J63447J27131K14529K72709J19778j31517k66768k16557k436
$$ 151661 273949 437396 564527 779056 1051765 1171543 1040026 773258 556701 554265
44555E54265K66576K92136j16561n61912l86130L29160O77258J88988m30885l74637
$$ 554265 820841 1112977 996416 434504 48374 377534 1054792 1243780 812895 438258
44545D38258M1510Q682l49643k03850M60898O62634m810o38238l88234K76275
$$ 438258 479768 488450 138807 -65043 395855 1058489 1053679 415441 27207 303482
44535C03482L87120m4965k20316J16975M12039K98863P3672L2350k523k11200
$$ 303482 690602 645637 425321 542296 954335 1253198 1326870 1359220 1356697 1145497
44525A145497l35702q2124L39377M41084Q8027l76249n74249m52667k05850p352
$$ 1145497 809795 727671 1067048 1508132 1596159 1219910 645661 192994 -12856 -20208
44515b0208J17042K10753K67409K46837J79984J46500J24952N289j89793k69361
$$ -20208 96834 307587 574996 821833 1001817 1148317 1273269 1278558 1088765 819404
44505H19404j66583o8260r6731r0065P2088J65004l5134l12178l13451j20093
$$ 819404 652821 584561 487830 397765 469853 634857 599723 287545 -25906 -145999
44495a45999n3473n2146J98524N66789N41734Q5984k16630n7022J74910J25190
$$ -145999 -199472 -251618 -53094 513695 1055429 1141413 924783 867761 1042671 1167861
44485A167861R355N2478J2308k70266m17388j61947Q5219n7826j93542J43815
$$ 1167861 1177216 1229694 1242002 971736 554348 392401 477620 419794 226252 370067
44475C70067N06476J94073m42891m31959K22708N14375R5524k06466J19510L91557
$$ 370067 876543 1070616 627725 195766 418474 932849 1028373 821907 941417 1332974
44465A332974k2603n47132l31468L49930N64421J55247k11679k07542j64894k71080
$$ 1332974 1310371 763239 431771 781701 1346122 1501369 1289690 1082148 917254 646174
44455F46174k28410J22801M46155M06266J14652j16541j67660j05714j3251M8963
$$ 646174 417764 540565 986720 1392986 1507638 1391097 1223437 1117723 1104472 1153435
44445A153435M7322P502k9567m9688j6447Q1361P7788k17210n89932n10189R7192
$$ 1153435 1200757 1208259 1178692 1129004 1112557 1193918 1271706 1054496 464564 -45625 51567
44434E1567N67098L78009p0470j05912J45627N7634l44813l90938O5441L55508
$$ 51567 618665 996674 926204 820292 965919 1023553 678740 287802 353243 708751
44424G08751R9420k06708r2013J17956m3012l36664k57889Q7647J93351p1p7234
$$ 708751 808171 601463 509450 627406 584394 247730 -10159 77488 270839 270768 193534
44413A93534J38901L76339L88857K17049n196j54681q5328J78056L03280N7826
$$ 193534 332435 708774 1097631 1314680 1309484 1154803 1069475 1247531 1550811 1608637
44403A608637k62599k19669O0198O2157k56853l49507M9398M69794L96545k5316
$$ 1608637 1346038 1126369 1186567 1248724 991871 642364 691762 1161556 1558101 1532785
44393A532785l16241l47247l09496k49842o9044J36196J41363j1374m7189O8551
$$ 1532785 1216544 869297 559801 309959 240915 377111 518474 507100 459911 528462
44383E28462L1139k92658n40039k86568L37899P42166N87770J80918L5569K03946
$$ 528462 559601 266943 -273096 -559664 -221765 520401 1108171 1289089 1324658 1528604
44373A528604K61073o6178n05682o12219l52349q4183l1454m8081O7592K77652
$$ 1528604 1789677 1723499 1217817 605598 253249 169066 137612 89531 157123 434775
44363D34775M19889M08587K09471j76437n61152o18933k88917O2794J18036N1969
$$ 434775 854664 1263251 1472722 1296285 735133 116200 -172717 -109923 8113 60082
44353F0082K05264M88050N09176K10902o8606j57601k05752k26418j8223K89809
$$ 60082 265346 753396 1262572 1473474 1404868 1247267 1041515 815097 796874 1086683
44343A086683J91863l66516o68078k17548M33738M80857P2146n5544J36054J4199
$$ 1086683 1278546 912030 243952 26404 460142 940999 1013145 957601 1093655 1107854
44333A107854m51664m75237K17031P83236M94908k04282m79204k98175j54975
$$ 1107854 656190 180953 397984 1181220 1676128 1471846 992642 694467 539492
44324E39492j31610k0145J1317k97603n95449l21226L23299O03453L85415K28061
$$ 539492 407882 387737 399054 101451 -493998 -815224 -491925 111528 496943 725004
44314G25004L38369K92839n2530k16940M3102K69785P6382k55245l33710k30133
$$ 725004 1063373 1356212 1303682 1086742 1129844 1399629 1476011 1220766 887056 656923
44304F56923j06979J50163N12474N79978K32736k8235J20637K35865j19325n51978
$$ 656923 549944 700107 1212581 1792559 2025295 1997060 2117697 2353562 2234237 1682259
44294A682259m71583q7443j6506k48593k99902j42842j57097k95761j19881L62216
$$ 1682259 1210676 1123233 1106727 858134 558232 415390 258293 -37468 -157349 204867
44284B04867O46062N50150L91815L09883R3141k46244l84219k64278j58586r7231
$$ 204867 850929 1401079 1792894 2102777 2195918 1949674 1565455 1301177 1142591 1045360
44274A045360J30092L67416J95886k64764l94518n4928K18785J75788J86841L79065
$$ 1045360 1175452 1542868 1738754 1473990 1079472 1024544 1243329 1419117 1605958 1985023
44264A985023L02593j59563m02873j11634J54771m9812k80103p4065J60403p4289
$$ 1985023 2287616 2128053 1725180 1613546 1768317 1718505 1438402 1364337 1524740 1450451
44254A450451l76448j30007L71358M18637O9520j00045o2192k04990m28705l31694
$$ 1450451 1074003 943996 1315354 1733991 1803511 1703466 1641274 1436284 1007579 675885
44244F75885o5209n5243j03325K34963O03905L12442k99834k32900M17408M57633
$$ 675885 610676 555433 452108 687071 1290976 1603418 1303584 1070684 1488092 1945725
44234A945725l86349q81336k83951M27393J77425n10944n23624M9763L30374K19727
$$ 1945725 1559376 678040 394089 821482 998907 487963 -35661 14102 344476 564203
44224E64203K95339N07051K40372l96611n16404J42026P27476N28066o8128k86143
$$ 564203 859542 1366593 1606965 1210354 693950 835976 1563452 2091518 2023390 1737247
44214A737247n1831J21655k5103k51376k81521j39815J6850J66518L68939N03075
$$ 1737247 1685416 1807071 1781968 1530592 1249071 1109256 1126106 1292624 1661563 2164638
44204B164638K70553l81054r85142j000184m82516K1083K30657L44332M58124
$$ 2164638 2435191 2054137 1068995 68811 -413705 -392622 -161965 182367 640491
44195F40491L48772L7086m0603K22977K87741j31976m44584r8726M22666L43216
$$ 640491 989263 1026349 985746 1208723 1496464 1364488 919904 821178 1243844 1587060
44185A587060r2391k1391N30331O13036r8844p30132n03246J97892N00355J77662
$$ 1587060 1494669 1473278 2003609 2616645 2517801 1787669 1284423 1482315 1982670 2160332
44175B160332l18350n17736k64597K57175N69005L06350k45984m16303o9163K22724
$$ 2160332 1841982 1324246 1059649 1316824 1885829 2192179 1946195 1529892 1460729 1683453
44165A683453Q9596j35525j04901l4737j73483k44627L9048L44534J96858k32439
$$ 1683453 1773049 1637524 1532623 1497886 1324403 1079776 1118824 1463358 1660216 1427777
44155A427777m05313k38650n7394P2604L31576N67730L92666r6652k95561M4667
$$ 1427777 1022464 783814 726420 799024 1130600 1698330 2090996 1994344 1698783 1743450
44145A743450M42245M02303P0598j29610j59342k68148m33993l41402N5379L14135
$$ 1743450 2185695 2587998 2658596 2528986 2369644 2101496 1667503 1326101 1381480 1695615
44135A695615N9321m45132n74165j63315K71878K69193M7016P7345K80602J55974
$$ 1695615 1754936 1309804 735639 572324 844202 1113395 1160411 1237756 1518358 1674332
44125A674332l32593n77393k14974L02536L37974j01584n09655n57321k76516
$$ 1674332 1341739 764346 549372 851908 1189882 1088298 578643 21322 -255194
44116b55194J75384N61948N78298J81680k34553l05605j54978q6516n9478J30479
$$ -255194 -79810 482138 1060436 1242116 1007563 701958 546980 460464 400986 531465
44106E31465L56687L17920O5491q6220q5984j23281j60559J0518K70441K48778
$$ 531465 888152 1206072 1271563 1185343 1099359 976078 815519 826037 1096478 1345256
44096A345256n6595k34375j09571N1486Q1393J40149K51608J50764j58061k10900
$$ 1345256 1288661 1054286 944715 996201 1077594 1217743 1469351 1620115 1462054 1251154
44086A251154J96026N49383L17157k45430m65054j86339J44507J98086R3708L2502
$$ 1251154 1447180 1996563 2313720 2068290 1603236 1416897 1561404 1759490 1853198 1885700
44076A885700Q714l8037q5553j43771k86662m68778m76475j87837J99970L30250
$$ 1885700 1894414 1856377 1770824 1627053 1340391 871613 395138 207301 407271 737521
44066G37521J00724j58559m2383L79878N63154J88661l35170l84609L84J91318
$$ 737521 838245 679686 637303 1017181 1580335 1768996 1433826 1049217 1049601 1240919
44056A240919p5360l36588j72086J59498J89085m9313j81914q6352R6743L10800
$$ 1240919 1165559 828971 656885 816383 1005468 956155 774241 687889 784632 1095432
44046A095432N11769M52606J4488l94135k81719J67298L17886L9186j67391o4642
$$ 1095432 1607201 2059807 2074295 1680160 1398441 1565739 1883625 1922811 1755420 1690778
44036A690778l4584k78847l19825K13447Q06168O95461r601n09351m76750l48728
$$ 1690778 1656194 1377347 1057522 1270969 2077137 2772598 2762997 2253646 1776896 1428168
44026A428168m24264l81249L2871M23545L17837q5279k39243p5210K4564n6623
$$ 1428168 1003904 622655 655526 1079071 1396908 1311629 1072386 997176 1021740 965117
44016I65117m3377J30323J50492q4119j96082O3917L55495K58352o7409j48486
$$ 965117 921740 1052063 1202555 1118436 922354 986271 1341766 1600118 1532709 1384223
44006A384223P4966K21515P3851j85025l17951k76104r8984J30245K41354J62523
$$ 1384223 1459189 1680704 1754555 1569530 1251579 975475 876491 1006736 1248090 1410613
43996A410613R9670K36941L49994R9091l57926n11790k77244j16063k76886m32234
$$ 1410613 1510283 1747224 2097218 2196309 1838383 1326593 1049349 933286 656400 224166
43986B24166k85918m8014Q96r884J49767L80254M85931N10961M92093K28024k94803
$$ 224166 -61752 -109766 -108870 -118754 31013 411267 897198 1408159 1900252 2128276 1833473
43975A833473n94127l09357J58641J81632j46143k12223R4399K51626J2614k22374
$$ 1833473 1239346 929989 1088630 1270262 1124119 911896 1006295 1257921 1270535 1048161
43965A048161j13384J17820J51515N7480J9538l4817k01280k97905j30474J52804
$$ 1048161 934777 1052597 1204112 1261592 1281130 1246313 1045033 747128 616654 769458
43955G69458K69847K08960J61104J80327J65769R4962M5398K8996p201m2290J064
$$ 769458 1039305 1248265 1409369 1589696 1755465 1850427 1895825 1924821 1917620 1875330 1876394
43944A876394J08779J61979P6750j06320k58212k58245j03804N0163K7678j62484
$$ 1876394 1985173 2147152 2223902 2117582 1859370 1601125 1497321 1547484 1575162 1412678
43934A412678l26185l08983j39823O4778K29299L07270K51463Q1200q1025j14978
$$ 1412678 1086493 777510 637687 702465 931764 1239034 1490497 1571697 1490672 1375694
43924A375694k1726R8951J62391J57323J02748j6688k22071m23124m18518j42649
$$ 1375694 1353968 1452919 1615310 1772633 1875381 1858693 1636622 1213498 794980 652331
43914F52331J47271J41539p4451j22788O9735J47148l7144r1352K53775N58525
$$ 652331 799602 941141 866690 743902 813637 960785 923641 832289 1086064 1644589
43904A644589K82351l05088m71047j38113O7862r5068j26718K56444N41747K42722
$$ 1644589 1926940 1621852 1150805 1012692 1080554 985486 858768 1115212 1656959 1899681
43894A899681k78804l60236M681L20789L98464M13359L50691R405m66013o16699
$$ 1899681 1620877 1260641 1265322 1586111 1984575 2397934 2748625 2758030 2292017 1675318
43884A675318l25923L071M9733l6526j4262M3714l3664j58445j35002k1648m6456
$$ 1675318 1349395 1352466 1402199 1365673 1351411 1395125 1361461 1203016 1068014 1046366 999910
43873I99910j98963j80981J50821M94352M33824j0860l65136k72255Q2073K37707
$$ 999910 800947 619966 770787 1265139 1698963 1688103 1322967 1050712 1132785 1370492
43863A370492L1767k76436l95872l07190j46172K0553J90969L09724K84840J17820
$$ 1370492 1402259 1125823 729951 422761 276589 297142 488111 797835 1082675 1200495
43853A200495l9950l326K28005L89301K16424j82782m13282l30441k24102k74816
$$ 1200495 1160545 1157219 1385224 1774525 1990949 1808167 1394885 1064444 840342 565526
43843E65526j61806L85402R04485O56405k74434r28042o53700J49716O69492O05709
$$ 565526 403720 789122 1693607 2350012 2075578 1147536 493836 643552 1313044 1918753
43833A918753K20058j37045k39656k2773L01240L64073P7630k49605l45248k58312
$$ 1918753 2138811 2001766 1762110 1739337 2040577 2404650 2482280 2232675 1887427 1629115
43823A629115j25585R492M1559j41367l20091j05782L96253N79925K16959j89253
$$ 1629115 1503530 1513022 1554581 1413214 1093123 987341 1383594 1963519 2180478 1991225
43813A991225k07453o4714p1734o4132J18495J82387m5266j55467J23447L19689
$$ 1991225 1783772 1719058 1647324 1583192 1701687 1884074 1838808 1683341 1806788 2126477
43803B126477K5682k72704o172L88693J73732l59452l83807k3123r5013n38122
$$ 2126477 2152159 1879455 1873283 2261976 2435708 2076256 1692449 1669326 1574313 1036191
43793A036191m49266K45983N36537M1655l34333L1855M78820K97079j12332j13190
$$ 1036191 586925 832908 1369445 1411100 1076767 1108622 1587442 1884521 1772189 1658999
43783A658999O2888l6376j20509K31509O28955M72417m798j96003j76029l84834
$$ 1658999 1721887 1685511 1565002 1796511 2425466 2897883 2893085 2697082 2521053 2136219
43773B136219o38851m24207P3171J92069p8503j22303J94280L35493Q7867j11357
$$ 2136219 1497368 1073161 1146332 1338401 1259898 1137595 1331875 1667368 1755235 1643878
43763A643878o516R0158j1107l056K74951M16746P2121m50566n96595k83469J10575
$$ 1643878 1637362 1727520 1716413 1713357 1988308 2405054 2477175 2026609 1430014 1146545 1257120
43752A257120K57813J32199q4709j68619m2847J18725J09901l622l926J01079
$$ 1257120 1514933 1647132 1562423 1393804 1350957 1469682 1579583 1575961 1572035 1673114
43742A673114J03440j7732n8077L5227P1531m1496j67779k08473j97109r3781
$$ 1673114 1776554 1758822 1700745 1735972 1807503 1766007 1598228 1389755 1192646 1098865
43732A098865J76066M22149L08405j11861l53708j56895J69885K52886J46141
$$ 1098865 1274931 1697080 2005485 1893624 1539916 1383021 1552906 1805792 1951933
43723A951933O9559j3166k22350m08451l28103m1758J71578K05143J60734Q0960
$$ 1951933 2021492 2008326 1785976 1377525 1049422 1007664 1179242 1384385 1545119 1626079
43713A626079p1062j99872j25698J16689K56861J52704L100P1102K93918L27918
$$ 1626079 1555017 1355145 1229447 1346136 1602997 1755701 1758801 1829903 2123821 2451739
43703B451739J135m05113m52755r7889K24326J43378j84020l27072j67245K6773
$$ 2451739 2452874 2047761 1595006 1497117 1721443 1864821 1680801 1353729 1186484 1213257
43693A213257O6875Q6059K31406L72875K83712l2996l38885l96534j37499K87453
$$ 1213257 1280132 1366191 1597597 1970472 2254184 2221188 1882303 1485769 1348270 1635723
43683A635723N42529L24634l09073q83797r00768l13519M13019P25756M93649
$$ 1635723 2178252 2502886 2193813 1310016 409248 95729 508748 1234504 1728153
43674A728153J09668K5110J91762J50837k54190n56478l29422J10726J36686k05055
$$ 1728153 1837821 1862931 2054693 2205530 1951340 1394862 1065440 1176166 1312852 1107797
43664A107797k43870K34015N98952L38709j72498l01677r3202k1550j23513k1316
$$ 1107797 863927 1097942 1696894 2035603 1863105 1561428 1468226 1446676 1323163 1301847
43654A301847L03062L94425O1085l06398l27259j17295K8611Q3293J55793J90106
$$ 1301847 1604909 1999334 2060419 1754021 1426762 1309467 1338078 1421371 1577164 1767270
43644A767270R1164k6955m090O7068k0675k11722k28553q201J62446N0412j90397
$$ 1767270 1858434 1831479 1827389 1894457 1873782 1662060 1433507 1425306 1587752 1638164 1447767
43633A447767k56918j29373m2373o5527K5841L55412O33694M78475k2691l36972
$$ 1447767 1190849 1061476 1019103 953576 979417 1334829 1968523 2446998 2424307 2087335
43623B087335j43652K47697K97607p6076m20701l32889P9013L86513L55596J36954
$$ 2087335 1943683 2191380 2488987 2412911 1992210 1659321 1738334 2124847 2480443 2617397
43613B617397j1807m3494r1265k07439k69167j64383M6853K30395L38714L66518
$$ 2617397 2605590 2562096 2470831 2263392 1994225 1829842 1876695 2107090 2445804 2812322
43603B812322K44849m5996l13128l22756j42684p1609j68313j32440J87541M51521
$$ 2812322 3057171 3011175 2698047 2375291 2232607 2160998 1992685 1860245 2047786 2499307
43593B499307K85480j15839k25421M7807K38362L0921l08660l93809k73437k40323
$$ 2499307 2784787 2668948 2443527 2491334 2729696 2760617 2451957 2058148 1784711 1544388
43583A544388l18650k88740j05696N2028J20042K08875L08624K53269N0203p2098
$$ 1544388 1225738 936998 831302 883330 1003372 1212247 1520871 1774140 1824343 1752245
43573A752245o1165j52571m03823m72392j55239J84705J50505p622K06479O20560
$$ 1752245 1691080 1538509 1134686 662294 507055 691760 842265 834643 1041122 1661682
43563A661682N59070m9463m49446j82516K41389K11528n0383q815K16028J29781
$$ 1661682 2220752 2171289 1721843 1539327 1780716 1992244 1941861 1933046 2149074 2278855
43553B278855j78108j63306J74376K27765j76121m21040o1961M90667O19992L31576
$$ 2278855 2100747 1937441 2111817 2339582 2163461 1742421 1680460 2171127 2791119 3122695
43543C122695K3453j53244k49220j61365J74126M25107J93522l52407n90358k22832
$$ 3122695 3146148 2992904 2743684 2582319 2756445 3181552 3375074 3022667 2432309 2209477
43533B209477L55476N25907R5463n36706p51595l10550L35035M84945L1775m00386
$$ 2209477 2564953 3090860 3186323 2649617 1898022 1587472 1922507 2407452 2439227 2038841
43523B038841l31916p8704j60548m08066k59018K20248L40262q3225l21933J82192
$$ 2038841 1706925 1628221 1467673 1059607 800589 1020837 1361099 1277874 955941 1138133
43513A138133Q99687R23065K35519l46882l48594j12668n1956l7846J65356L24078
$$ 1138133 2037820 2960885 3196404 2849522 2500928 2388260 2336304 2298458 2463814 2787892
43503B787892P2903l98076n09907j33094K16529J51562n4563L532J61921k5688
$$ 2787892 2860795 2462719 1952812 1819718 2036247 2187809 2133246 2136778 2298699 2273011
43493B273011m71633n59073k5733O13637P28686L18828j40174l18596k24034J2806
$$ 2273011 1801378 1242305 1216572 1830209 2558895 2877723 2737549 2418953 2194919 2207725
43483B207725K23836K03354o7660k68150r7781K57630L24217k519l15933k76851
$$ 2207725 2431561 2634915 2567255 2299105 2201324 2458954 2783171 2780652 2464719 2187868
43473B187868k8910J02376O4085K6251N9033Q3327M3440o6724k73966n26640n87534
$$ 2187868 2158958 2261334 2325419 2351670 2410703 2494030 2537470 2470746 2196780 1670140 1082606
43462A082606k67301K21623L94501Q4701l03545l00610L7536K74806K22166J21840
$$ 1082606 815305 1036928 1431429 1516130 1212585 911975 949511 1224317 1446483 1568323
43452A568323K04482L66035L91519K48776J3982k70418m89364m24289n1010L09040
$$ 1568323 1772805 2138840 2530359 2779135 2793117 2522699 2033335 1609046 1558036 1867076
43442A867076L61365J90150K1064j28674k67650j75855K31974N19946K53771k44969
$$ 1867076 2228441 2418591 2439655 2310981 2043331 1867476 2099450 2619396 2873167 2628198
43432B628198k97973N8018J41403j85860k51734K34644N86669K46756k67953k15927
$$ 2628198 2330225 2388243 2529646 2343786 2092052 2326696 2913365 3160121 2892168 2676241
43422B676241J79431J99927j41634k22975P9002K63387J08903r3853k20358m65370
$$ 2676241 2855672 3055599 2913965 2690990 2769992 3033379 3142282 3048429 2828071 2362701
43412B362701p28031n65074M5928N20319M76410J92130L0673o3066k22794k96021
$$ 2362701 1634670 1069596 1115524 1635843 2112253 2304383 2335056 2271990 2049196 1753175
43402A753175j37105J05933K67757L90799M52622K44559k13725m96673l17388
$$ 1753175 1616070 1722003 1989760 2380559 2833181 3077740 2864015 2367342 2049954
43393B049954M2030J42084k1672j19745K7854L21490N58221N45152K25559j61395
$$ 2049954 2091984 2234068 2212396 2092651 2120505 2441995 3000216 3545368 3770927 3609532
43383C609532k75499j48184j60170m08814m80856j02728L54858L64144n1448m37606
$$ 3609532 3334033 3185849 3025679 2616865 2136009 2033281 2388139 2752283 2700835 2263229
43373B263229n01693k67507J25110M42085L91701k4320l82539l57338j43691o1710
$$ 2263229 1761536 1494029 1619139 2061224 2452925 2428605 2046066 1688728 1545037 1483327
43363A483327l6793J29973K73826J57323J4391K17487N44286M16659j49244m75350
$$ 1483327 1446534 1576507 1850333 2007656 2022047 2239534 2783820 3200479 3051235 2575885
43353B575885k02452K55341M03673K58238K3849k67149m89133l12534K34721N39996
$$ 2575885 2373433 2628774 3032447 3290685 3314534 3047385 2558252 2245718 2480439 3020435
43343C020435K22106k02703m7437M35703L76870l56304q79580n61048R3321K35503
$$ 3020435 3242541 3039838 2992401 3428104 3804974 3448670 2569090 2008042 2101363 2336866
43333B336866j29747l06130n050L30916K94804N2528o2561n5302q0162o3862J21457
$$ 2336866 2207119 1900989 1895939 2226855 2521659 2574187 2511626 2456324 2376162 2312300 2433757
43322B433757K94481J63937j70152k88995o7733J24109l6780l60127m08652o3082
$$ 2433757 2728238 2892175 2722023 2433028 2365295 2489404 2452624 2092497 1683845 1620763
43312A620763L65854N04659K67371j00118k49421o7293J91553K08941J8678p4741
$$ 1620763 1986617 2491276 2758647 2658529 2409108 2341815 2533368 2742309 2760987 2686246
43302B686246J2157L3790r6322o6168L10626O32006L93840k11968m73595j50245
$$ 2686246 2698403 2732193 2635871 2569703 2880329 3512335 3906175 3694207 3220612 3070367
43292C070367J97485N0753l23714l26541O6394L21740J86108j913L8755M0312
$$ 3070367 3267852 3318605 2994891 2668350 2734744 3056484 3242592 3240679 3279434 3319746
43282C319746l14534p31146o36316n6333L64747K81511P1074J46800L35666K79840
$$ 3319746 3005212 2274066 1637750 1581417 1946164 2227675 2298749 2445549 2781215 3061055
43272C061055M7736r4852j92341l69956l69576Q0427N98989N32219l1505l21230
$$ 3061055 3108791 3013939 2821598 2451642 2082066 2162493 2761482 3293701 3262196 2940966
43262B940966m8668J92135o9856m39390l12671K32967O42893O09883K20853k92746
$$ 2940966 2892298 3084433 3014577 2575187 2262516 2495483 3138376 3748259 3969112 3676366
43252C676366o15903m80436m8529J48040p3737k58804k7462L57632M92407M32744
$$ 3676366 3060463 2580027 2531498 2679538 2605801 2346997 2319535 2677167 3169574 3602318
43242C602318L52525P8422m64264p57368l20006M44962P13170L56641n1859j85465
$$ 3602318 3954843 4033265 3569001 2811633 2491627 2936589 3649759 4006400 3954541 3769076
43232C769076k26778k73245j73731J9536M8292n9835m1064O4467j8160k02353
$$ 3769076 3542298 3269053 3095322 3114858 3163150 3103315 3062251 3126718 3108558 2906205
43222B906205j15688K05748L23430J58685J04508K64140K46828p6512k64241m1325
$$ 2906205 2790517 2996265 3319695 3478380 3582888 3847028 4093856 4017344 3753103 3711778
43212C711778K31494J59450j11565k53687k48466k00820o5062J40493K10248R8191
$$ 3711778 3943272 4102722 3991157 3737470 3489004 3288184 3223122 3363615 3573863 3672054
43202C672054K2697K7350j24145m04779l95611m89K41347m9158m72001m71398
$$ 3672054 3694751 3722101 3597956 3193177 2797566 2797077 3038424 2989266 2517265 2045867
43192B045867j28143J54581L26310M98631M64111M1235l69430k29014K93537N33735
$$ 2045867 1917724 2072305 2398615 2897246 3361357 3402592 3033162 2804148 3097685 3631420
43182C631420K93952o22n9499l8976n7818K1767J87110J48114j69940l96308k10041
$$ 3631420 3925372 3924750 3865251 3826275 3768457 3790224 3977334 4125448 3955508 3559200 3349159
43171C349159K14958M57685L30630k9657l52269l89372p8539L19165M03183Q2286
$$ 3349159 3564117 4021802 4352432 4322775 3970506 3581134 3502595 3821760 4224943 4307229
43161D307229k85835l08648Q66K96951L10130O6505k35838m36756m86737m00974
$$ 4307229 4021394 3712746 3713612 4010563 4320693 4387198 4151360 3714604 3227867 2826893
43151B826893k16823N663K02846L61133M96801N40411L43808p6990m03766l27921
$$ 2826893 2610070 2615733 2818579 3179712 3676513 4216924 4560732 4483742 4079976 3752055
43141C752055K6787K16949L4196k74794l82962k40341J6953K69433M02081L08339
$$ 3752055 3778842 3995791 4029987 3755193 3372231 3131890 3148843 3418276 3820357 4128696
43131D128696O0853q8537j1758J38695J67565N8929j19280l20453m24384k70483
$$ 4128696 4189549 4101012 4089254 4227949 4395514 4454443 4335163 4014710 3590326 3319843
43121C319843O7146K58615J45957q233J05208L89131M79629K40739p3152j36213
$$ 3319843 3386989 3645604 3791561 3783328 3888536 4277667 4757296 4998035 4924883 4788670
43111D788670N6975J39543k16786p88829r14023l39583L01469K83291j70929k49674
$$ 4788670 4845645 4985188 4768402 3979573 3065550 2725967 3027436 3310727 3139798 2890124
43101B890124J66918L70856M6853k37627p0519J29599j2840o9994L74290Q04470
$$ 2890124 3057042 3427898 3474751 3237124 3166605 3296204 3283364 3213370 3587660 4392130
43091D392130N16370j80593m01559m6603J66748r1459l74057l01692n8712P9466
$$ 4392130 4908500 4727907 4326348 4279745 4446493 4355034 3980977 3679285 3620573 3700039
43081C700039J21197J25180N9003j8685o147J9786k6537K6022K95156M55421J63077
$$ 3700039 3821236 3946416 4005419 3986734 3980587 4000373 3973836 3999858 4295014 4750435 4913512
43070D913512l00755l80578j00805M1204p3682r9545O4377J46622P7887M1756
$$ 4913512 4612757 4232179 4131374 4172578 4098896 3999351 4063728 4210350 4288237 4329993
43060D329993j9276k55300l19908K45318J004940R43615p189p02427m11118K00557
$$ 4329993 4310717 4055417 3735509 3980827 4985767 5929382 5922193 5219766 4808648 5009205
43050E009205K30965j59252k92173j19262m2505q5516j1683P7109l3721j20860
$$ 5009205 5240170 5080918 4788745 4669483 4626978 4541462 4529779 4606888 4573167 4452307
43040D452307J31661M54474L18165k03143n15849l79304j16789J2029R0989J61651
$$ 4452307 4583968 5038442 5356607 5153464 4637615 4258311 4141522 4153551 4244540 4406191
43030D406191P3244j56008k37586k9113K44742L15784J90478N1316J8475P6383
$$ 4406191 4479435 4323427 4085841 4056728 4301470 4617254 4807732 4859048 4877523 4953906
43020D953906J16555M2412q7923j06319k5045j09948m57608o84152l71475K63236
$$ 4953906 5070461 5112873 5024950 4918631 4893586 4783638 4326030 3641878 3270403 3533639
43010C533639N41268K23134j38192N7165O36261Q89991N15960k4937j76846j2770
$$ 3533639 4074907 4298041 4159849 4217014 4853275 5743266 6259226 6234289 6057443 6044673
43000F044673j9507l16921m93716k86547j6193p5914k94271k10360J81469M07641
$$ 6044673 6025166 5708245 5214529 4927982 4911789 4835875 4541604 4331244 4512713 4920354
42990D920354K10110j37587k61014j02193J49840K65466R2782k59254l91946q1252
$$ 4920354 5130464 4992877 4731863 4629670 4779510 5044976 5137758 4878504 4486558 4405306
42980D405306L10409K79970n1830j30618J20124J96967j00612l54479k92820j94696
$$ 4405306 4715715 4995685 4943855 4813237 4933361 5130328 5029716 4675237 4382417 4187721
42970D187721k24873m7775M51699P08882L28867j48954k4762M43389M56983n5313
$$ 4187721 3962848 3915073 4366772 5075654 5404521 5255567 5230805 5674194 6131177 6075864
42960F075864l82491j58890J97225K41151O4306n8873p9349l6289R9638K63260
$$ 6075864 5693373 5534483 5731708 5972859 6037165 5978292 5898943 5862654 5962292 6225552
42950F225552K68863Q7228q6740j28521j20574j33656r8040L3514J82681K64149
$$ 6225552 6494415 6581643 6494903 6366382 6245808 6112152 6014112 6047626 6230307 6494456
42940F494456K53616J21556j32603l64065l71944j45503J10781K26938K30327
$$ 6494456 6748072 6869628 6737025 6372960 6001016 5855513 5966294 6193232 6423559
42931F423559K36004K72000K59912J37912k5631q4730j8232Q847r9214j71601
$$ 6423559 6659563 6931563 7191475 7329387 7303756 7219026 7200794 7209641 7110427 6938826
42921F938826m6948P4545r4743l55752j91503L92819P02755K99490l20888l84514
$$ 6938826 6891878 6966423 6871680 6515928 6324425 6717244 7419999 7719489 7398601 7014087
42911G014087J29539N50583M40329M5667j30981R5410M70984N81177K54616k35244
$$ 7014087 7143626 7694209 8134538 8180205 8049224 8144634 8615618 9196795 9451411 9216167
42901I216167m35835j99266K18228M89974M41266L5974n10405o77561j68657N12494
$$ 9216167 8780332 8581066 8799294 9289268 9730534 9766508 9256103 8578542 8409885 8922379
42891H922379N56632k4043l91325j32791K13409J66795N4308K63050M59365K06283
$$ 8922379 9479011 9454968 9063643 8930852 9144261 9311056 9365364 9628414 10087779 10294062
42881A0294062k04006k36629M875P2123j9389M8381K29908K54532J62230J15122
$$ 10294062 10090056 9853427 9858302 9930425 9911036 9959417 10189325 10443857 10606087 10721209
42871A0721209j8612l05485l36870J55381O31477M38329j35715k98037J4935K01000
$$ 10721209 10702597 10397112 10060242 10215623 10847100 11285429 11149714 10851677 10866612 11067612
42861A1067612J08823J66457M21888L68154j25302m83232k58765K90653O41288
$$ 11067612 11176435 11342892 11764780 12132934 12007632 11524400 11265635 11556288 12197576
42852A2197576N49064Q5965m28727n38715j22528L26132L20850Q7904J23581L07415
$$ 12197576 12746640 12832605 12403878 11865163 11742635 12068767 12389617 12477521 12601102 12908517
42842A2908517J49490k55602k96987J71138O37250P28967N53201K69117l4715
$$ 12908517 13058007 12802405 12505418 12676556 13313806 14042773 14595974 14865091 14830376
42833A4830376r0403K59388N77430L00404l88049q25865q78854r19798r33311
$$ 14830376 14739973 14999361 15576791 15877195 15489146 14663281 13784427 12864629 11931318
42824A1931318n12591K57336P58461P42143N22850K84603l2602k09842N1381M48610
$$ 11931318 11418727 11676063 12434524 13176667 13699517 13984120 13951518 13741676 13793057 14241667
42814A4241667M39873J94304K73968N15130K98278j64548l7388O08956P79470
$$ 14241667 14681540 14875844 15149812 15664942 15963220 15798672 15761284 16370240 17149710
42805A7149710K55105k9680L48064N99915K13706j29907J85166O47621N75353
$$ 17149710 17404815 17375135 17723199 18323114 18536820 18406913 18592079 19239700 19815053
42796A9815053K11664J30525L14749M58908N12510M43615J52085n2555L05072
$$ 19815053 20026717 20157242 20471991 20930899 21443409 21887024 22039109 21986554 22291626
42787B2291626Q88085P87644L0756k73048L06106Q21907N77591K15555M36105
$$ 22291626 23179711 23967355 23998111 23725063 24031169 24853076 25430667 25646222 26082327
42778B6082327P76293N69541J69962K84402Q06061J119792J003555O65928M43438
$$ 26082327 26858620 27428161 27598123 27882525 28688586 29808378 30811933 31477861 31921299
42769C1921299P42595J563130K002306J242243N3808J2823J133457J837107J478870
$$ 31921299 32663894 34227024 36229330 37471573 37525381 37538204 38671661 40508768 41987638
42760D1987638J118516J381878J508659J178608J302200K152995K642393K331252
$$ 41987638 43106154 44488032 45996691 47175299 48477499 50630494 53272887 55604139
42752E5604139K209592K626979K559526J817234J685520K455411K845920K802482
$$ 55604139 57813731 60440710 63000236 64817470 66502990 68958401 71804321 74606803
42744G4606803L928405O074435O923148O290190O909297R321423J0611550J0301485
$$ 74606803 78535208 84609643 91532791 97822981 104732278 114053701 124665251 134966736
42736A34966736J1929290J5960285J7949041J7475410J9114553J6606648j1903577
$$ 134966736 146896026 162856311 180805352 198280762 217395315 234001963 222098386
42729B22098386p5180333j40237001j54271049j01775256k4219281K5415261L4208069
$$ 222098386 146918053 6681052 -147589997 -249365253 -273584534 -248169273 -213961204
42722b13961204K5925237K1202885J9658614J5616407J1420940J0607122J0544834
$$ -213961204 -188035967 -166833082 -147174468 -131558061 -120137121 -109529999 -98985165
42715i8985165Q167309N662294N692518O385031N080072K882243K077627K330944
$$ -98985165 -90817856 -85155562 -79463044 -73078013 -67997941 -65115698 -63038071 -60707127
42707f0707127K306636K324066K961803L330818K770791K252894K482407K566931
$$ -60707127 -58400491 -56076425 -53114622 -49783804 -47013013 -44760119 -42277712 -39710781
42699c9710781J943313J630548K233427K651701K120314J682261K243874K824916
$$ -39710781 -37767468 -36136920 -33903493 -31251792 -29131478 -27449217 -25205343 -22380427
42691b2380427K099619K31790j993567m385505o479637o868601m795209j477340
$$ -22380427 -20280808 -20049018 -22042585 -26428090 -32907727 -39776328 -44571537 -46048877
42683d6048877J203523K509290K687498K129406J447145J334935J634687J484256
$$ -46048877 -44845354 -42336064 -39648566 -37519160 -36072015 -34737080 -33102393 -31618137
42675c1618137Q30888O09201J008238J015682K87253q1067N26730J077600O67435
$$ -31618137 -30787249 -30178048 -29169810 -28154128 -27866875 -27947942 -27421212 -26343612 -25676177
42666b5676177O3939L02470R73339J140312Q98290P87223O08834N9643k94458
$$ -25676177 -25612238 -25309768 -24336429 -23196117 -22297827 -21510604 -20901770 -20842127 -21136585
42657b1136585J09071P01564O69823K98054L14440N37228L08951k42803m66484
$$ -21136585 -21027514 -20325950 -19656127 -19358073 -19043633 -18506405 -18197454 -18440257 -18906741
42648a8906741k84645o4033J85406N76951P56711M31609N6267J56022M28010L40674
$$ -18906741 -19191386 -19255419 -19070013 -18493062 -17736351 -17304742 -17248475 -17092453 -16664443 -16323769
42638a6323769J09587J94635L53215J55187m2089L38837R43532R38601L15442
$$ -16323769 -16214182 -16019547 -15666332 -15511145 -15553234 -15214397 -14270865 -13332264 -13016822
42629a3016822k55213n82440r40284j135043o82039J65718N93819M43045L18678
$$ -13016822 -13272035 -13854475 -14794759 -15929802 -16611841 -16446123 -15852304 -15409259 -15090581
42620a5090581M71438M98946K47091J06596K26496K34485l2095k18148j00851
$$ -15090581 -14619143 -14120197 -13873106 -13766510 -13540014 -13305529 -13337624 -13555772 -13656623
42611a3656623P2159J01291J24493K01296J43308n4731j10981M4774J40005Q4622
$$ -13656623 -13584464 -13483173 -13358680 -13157384 -13014076 -13068807 -13179788 -13135014 -12995009 -12910387
42601a2910387J49690M29782N85158L71897M7260k8759R9132J46344N2343J2406
$$ -12910387 -12760697 -12330915 -11745757 -11373860 -11326600 -11355359 -11256227 -11109883 -11057540 -11045134
42591a1045134J34074K70240K26652N2379J9026K29735L62048O4633m20552m43710
$$ -11045134 -10911060 -10640820 -10414168 -10361789 -10342763 -10113028 -9750980 -9686347 -10106899 -10550609
42581a0550609J17036N72357L73319r6197j24822K83882N23461L21687p185j68543
$$ -10550609 -10433573 -9861216 -9487897 -9584094 -9708916 -9425034 -8901573 -8579886 -8587071 -8755614
42571h755614k19077k59476k16329k0483K60211M90823N08012K01147k57185m50379
$$ -8755614 -8974691 -9234167 -9450496 -9470979 -9210768 -8719945 -8211933 -8010786 -8267971 -8718350
42561h718350k24111O7182Q5482Q011J55951L99820L71903P2596j84049k86500
$$ -8718350 -8942461 -8875279 -8789797 -8781786 -8625835 -8226015 -7854112 -7781516 -7965565 -8252065
42551h252065l56829l78428k02889J40254M65232O52677N99200J87242l87776
$$ -8252065 -8608894 -8987322 -9190211 -9049957 -8584725 -7932048 -7332848 -7145606 -7533382
42542g533382n79553j77145L06322L75846K80112M21939M88407k4626p24819p14248
$$ -7533382 -8112935 -8290080 -7983758 -7607912 -7327800 -6905861 -6417454 -6442080 -7166899 -7881147
42532g881147O683M73218J90715k56771k52061L2302J94247K51390L03991J54871
$$ -7881147 -7874464 -7401246 -7210531 -7467302 -7719363 -7687061 -7492814 -7241424 -6937433 -6782562
42522f782562k64103n45491l29005J68955M98836N36057M00458J47398j48529
$$ -6782562 -7046665 -7592156 -7921161 -7752206 -7253370 -6717313 -6316855 -6169457 -6317986
42513f317986k81824j81884o2641p9685q1370Q6285K77001K72785J08758k7717
$$ -6317986 -6599810 -6781694 -6844335 -6924020 -7005390 -6919105 -6642104 -6369319 -6260561 -6288278
42503f288278n5090k1777l4856k18264n32578o40203k53134L74114O63549M65992
$$ -6288278 -6343368 -6365145 -6400001 -6618265 -7150843 -7791046 -8044180 -7670066 -7006517 -6540525
42493f540525J87381J00135J0545k26191l55288j64650J31648K47723K13429J42633
$$ -6540525 -6353144 -6253009 -6242464 -6468655 -6823943 -6988593 -6856945 -6609222 -6395793 -6253160
42483f253160j8595k23056j78011J83378M24860J82726k70346m22680k20382L1425
$$ -6253160 -6271755 -6494811 -6672822 -6489444 -6064584 -5881858 -6152204 -6574884 -6795266 -6763841
42473f763841K09632L65482L78948J18147j63341q2934K42834L02559l0262k84110
$$ -6763841 -6554209 -6188727 -5809779 -5691632 -5854973 -5937907 -5695073 -5392514 -5422776 -5706886
42463e706886j04943K28220K64003M6428k8522J28717J78216o9842k99254j45802
$$ -5706886 -5811829 -5583609 -5319606 -5273178 -5301700 -5172983 -4994767 -5064609 -5363863 -5509665
42453e509665K01388K18801j63007m05587j54696K17668J99852o8581q8670J33765
$$ -5509665 -5308277 -5089476 -5252483 -5658070 -5812766 -5595098 -5395246 -5463827 -5552497 -5418732
42443e418732J38347j21546j48329K02371L61440n5562n44317m08838K17062N90258
$$ -5418732 -5280385 -5401931 -5550260 -5347889 -4986449 -5042011 -5586328 -5995166 -5778104 -5187846
42433e187846L81884l8651k43063j94195n3093P2238J09658K5305q6466r0519
$$ -5187846 -4805962 -4844613 -5087676 -5281871 -5334964 -5262726 -5153068 -5127763 -5214229 -5304748
42423e304748j070N7714M7202K9415M0086P8722J51484K03021J17902p5759j54216
$$ -5304748 -5305818 -5248104 -5200902 -5171487 -5131401 -5052679 -4901195 -4698174 -4580272 -4656031 -4810247
42412d810247k3135P8937n7302k10985k5268L77667M66710N5541l68158k78251
$$ -4810247 -4833382 -4754445 -4811747 -5022732 -5048000 -4670333 -4203623 -4148082 -4516240 -4794491
42402d794491J59304K96593j06445n21646l50363K33261M88947J49365j98064
$$ -4794491 -4635187 -4338594 -4445039 -4966685 -5317048 -5083787 -4594840 -4445475 -4643539
42393d643539k2222K98163P9105m84865n19570J23567N17913O8202n15505k85164
$$ -4643539 -4665761 -4367598 -4288493 -4773358 -5292928 -5169361 -4651448 -4583246 -5098751 -5383915
42383e383915M89670P53469K33706k92251k35402J17771K91144K81418K56984
$$ -5383915 -4894245 -4140776 -3907070 -4199321 -4434723 -4316952 -4025808 -3744390 -3487406
42374c487406J56056o8274k07437j31230n5325j91023l95867m30774l09673j44399
$$ -3487406 -3331350 -3399624 -3607061 -3738291 -3793616 -3984639 -4380506 -4811280 -5120953 -5265352
42364e265352R0132L51046L56854j3445l53146j79331L50593O01856L29541l8178
$$ -5265352 -5175220 -4824174 -4467320 -4480765 -4833911 -5013242 -4662649 -4060793 -3731252 -3769430
42354c769430o1847J61952K87776K14628M5985j74558l94131m15674j58349Q0280
$$ -3769430 -3831277 -3669325 -3381549 -3166921 -3120936 -3295494 -3689625 -4105299 -4263648 -4183368
42344d183368k7055l06665k93806L7868K02397l6946k93099j81489J09714K30935
$$ -4183368 -4210423 -4517088 -4810894 -4773026 -4570629 -4607575 -4900674 -5082163 -4972449 -4741514
42334d741514K60918L98202L85844j05993o75068n18970L34799Q59402L95492
$$ -4741514 -4480596 -4082394 -3696550 -3802543 -4477611 -4996581 -4661782 -3802380 -3406888
42325c406888m33671o23336j05575L95221M76417L74824L05265J29886k09814
$$ -3406888 -3840559 -4463895 -4569470 -4174249 -3697832 -3323008 -3017743 -2887857 -3097671
42316c097671m23934k59187J30255L78460L07745L0987k11078k53955j52844j24199
$$ -3097671 -3521605 -3780792 -3650537 -3272077 -2964332 -2933345 -3144423 -3398378 -3551222 -3675421
42306c675421k48504l10678j05528J96246K53863R3079J13252M79188Q12188O80597
$$ -3675421 -3923925 -4234603 -4340131 -4143885 -3890022 -3796943 -3683691 -3204503 -2392315 -1711718
42296a711718J89467j59673j04193J09896R7604j98102m89055n11852l09817j25228
$$ -1711718 -1522251 -1681924 -1786117 -1676221 -1578617 -1776719 -2265774 -2777626 -3087443 -3212671
42286c212671q7382j06445o8942o818J733o633O0643J90479K80053K73798J71998
$$ -3212671 -3300053 -3406498 -3475440 -3482258 -3480525 -3487158 -3426515 -3236036 -2955983 -2682185 -2510187
42275b510187m5420l52253n55726m28687j7053L35124L58507J43004n2738j61068
$$ -2510187 -2555607 -2907860 -3463586 -3892273 -3909326 -3574202 -3215695 -3072691 -3125429 -3286497
42265c286497k92058l99437k13885L41737Q39296P24681K2098o00043n93202j45801
$$ -3286497 -3578555 -3977992 -4191877 -3850140 -3010844 -2286163 -2264065 -2864108 -3457310 -3603111
42255c603111J60233J24137N2319J87358L68517L39771J08724j48425l35645m36748
$$ -3603111 -3442878 -3318741 -3266422 -3079064 -2710547 -2370776 -2262052 -2410477 -2746122 -3182870
42245c182870m14048k52578j7510K15435L96964M47437L13721J12452K6318J3279
$$ -3182870 -3596918 -3849496 -3867006 -3651571 -3254607 -2807170 -2493449 -2380997 -2354679 -2341400
42235b341400j44501m16832m34510j1356M86852N58320J94495j72439k54354j71858
$$ -2341400 -2485901 -2902733 -3337243 -3348599 -2861747 -2303427 -2108932 -2281371 -2535725 -2707583
42225b707583j55697k20958k06640j5315K56654M05128L20898Q4372j64649l66350
$$ -2707583 -2863280 -3084238 -3290878 -3306193 -3049539 -2644411 -2323513 -2239141 -2403790 -2770140
42215b770140m56773k86040J52756N17116M53902J07352o1316N2367J22289K3330
$$ -2770140 -3226913 -3512953 -3360197 -2843081 -2389179 -2281827 -2343143 -2290776 -2168487 -2145157
42205b145157K2953J86518J41876k53923n15237k17496L16729M80324K03304j46036
$$ -2145157 -2122204 -1935686 -1793810 -2047733 -2562970 -2780466 -2463737 -1983413 -1780109 -1926145
42195a926145l76773m96075l76053N6086M59464M29410J04107l5960J29565K89698
$$ -1926145 -2302918 -2798993 -3175046 -3118960 -2659496 -2230086 -2125979 -2161939 -2032374 -1742676
42185a742676K15433p1596m92251q42549p31277q3585M91329M03967k7236m1281
$$ -1742676 -1527243 -1598839 -2091090 -2933639 -3664916 -3748501 -3257172 -2853205 -2880441 -2921722
42175b921722L62973M68076O5490k13093J3561K59693K2634m12502m86737j91584
$$ -2921722 -2558749 -2090673 -2025183 -2238276 -2224715 -1965022 -1942388 -2354890 -2841627 -3033211
42165c033211R2471K16424K75201K56661P9948j60612k82095k44326j26530l399
$$ -3033211 -2940740 -2724316 -2449115 -2192454 -2112506 -2273118 -2555213 -2799539 -2926069 -2929468
42155b929468N4187J5804j8105N5226J36392Q7332L0040J49267K79528J27355
$$ -2929468 -2875281 -2859477 -2877582 -2822356 -2685964 -2598632 -2568592 -2419325 -2139797 -2012442
42145b012442j42997p8218K79160L59488n1240m79540n13570l17371j52463M8680
$$ -2012442 -2155439 -2233657 -1954497 -1595009 -1646249 -2125789 -2639359 -2956730 -3109193 -3060513
42135c060513L20105M00846J87973j1786j846J915j23029j39951j9856j53604
$$ -3060513 -2740408 -2339562 -2151589 -2163375 -2165221 -2163306 -2286335 -2426286 -2446142 -2599746
42125b599746n64512n76545J31944P74828N25305j79569k93440K35999M95063
$$ -2599746 -3164258 -3740803 -3608859 -2834031 -2308726 -2488295 -2781735 -2545736 -2050673
42116b050673R1770l64426l52782j31921r0255j28818l7455O6582M7491R0343
$$ -2050673 -1958903 -2323329 -2676111 -2808032 -2898287 -3027105 -3064560 -2997978 -2950487 -2860144
42106b860144L61708O01731M07040j85663o51612n31388N5759M98399L48133j47422
$$ -2860144 -2498436 -1896705 -1489665 -1675328 -2326940 -2858328 -2802569 -2304170 -1956037 -2103459
42096b103459l59071j29462M3589j64464l42860j0825N27947N71841P5101k96980
$$ -2103459 -2462530 -2591992 -2548403 -2712867 -3055727 -3066552 -2538605 -1966764 -1891663 -2188643
42086b188643j46998J84348K25599k4193k73011l51853k64482p3923R8429J16325
$$ -2188643 -2335641 -2151293 -1925694 -1949887 -2222898 -2574751 -2839233 -2913156 -2814727 -2698402
42076b698402l0025k08266k67653j23355J72122L67048K22364r7201j24351K42526
$$ -2698402 -2728427 -2936693 -3204346 -3327701 -3155579 -2788531 -2566167 -2663368 -2787719 -2545193
42066b545193N23726L65665N0919n6152j08577l18928l73961J8351L96145J66511
$$ -2545193 -2021467 -1655802 -1604883 -1661035 -1769612 -2088540 -2462501 -2444150 -2048005 -1881494
42056a881494l34734l09713J68301K86713j05710l10784r2198m0657l37131k99822
$$ -1881494 -2216228 -2525941 -2357640 -2070927 -2176637 -2487421 -2579619 -2620276 -2957407 -3257229
42046c257229L17758O66882J73419l92771j19339N71161O69286J93399n5918N6519
$$ -3257229 -2939471 -2272589 -2099170 -2491941 -2611280 -2040119 -1370833 -1177434 -1233352 -1176833
42036a176833l0908l46303k95039J49114K65858j45977l18881K35320Q67223P45411
$$ -1176833 -1207741 -1554044 -1849083 -1699969 -1434111 -1580088 -1898969 -1663649 -796426 -51015
42026e1015K2120n70255p76564p95774n74008R3947Q58282R58317K31107n85646
$$ -51015 -28895 -599150 -1375714 -2171488 -2745496 -2651549 -1793267 -834950 -603843 -1189489
42016a189489p96670n35780l05761j55637J88976O04537N84280L6607m45564l53066
$$ -1189489 -1986159 -2521939 -2827700 -2983337 -2794361 -2189824 -1605544 -1568937 -2014501 -2367567
42006b367567P6749K70546J03851r4856j32985j27078j49299r5102O1413J94126
$$ -2367567 -2290818 -2020272 -1916421 -2011277 -2144262 -2271340 -2420639 -2515741 -2454328 -2260202
41996b260202K47907K66177J94150m6238k82469k36633J4602R2157r1197j76226
$$ -2260202 -2012295 -1746118 -1551968 -1598206 -1880675 -2117308 -2102706 -2010549 -2101746 -2277972
41986b277972O5472L90367N13186M95079M53481K59225j49688m73299m45956k73450
$$ -2277972 -2212500 -1822133 -1308947 -813868 -360387 -101162 -250850 -724149 -1170105 -1443555
41976a443555k83300l58526j62921K11376L04362j1411l22863k61560L7591J98001
$$ -1443555 -1726855 -2085381 -2248302 -2036926 -1732564 -1743975 -2066838 -2328398 -2290807 -2092806
41966b092806Q6020j10961j63764n5734J2979j16400k94432j96776J93342M43722
$$ -2092806 -2006786 -2117747 -2281511 -2337245 -2324266 -2440666 -2735098 -2931874 -2738532 -2294810
41956b294810K15073k36207l74302q5022K44195K83291Q7981j17510j82594k7872
$$ -2294810 -2079737 -2315944 -2690246 -2775268 -2531073 -2247782 -2159801 -2277311 -2459905 -2487777
41946b487777L09174N58952M13956o4292m52822m71318k67051j08395l0711O3023
$$ -2487777 -2178603 -1619651 -1205695 -1269987 -1722809 -2194127 -2461178 -2569573 -2600284 -2537261
41936b537261J55347J72002J56704J88357J98104N0686k24303m32949m33891k35907
$$ -2537261 -2381914 -2209912 -2053208 -1864851 -1666747 -1616061 -1840364 -2273313 -2707204 -2943111
41926b943111Q3265M05073N35083L35721l9085k17220m7578J67848N4705l18246
$$ -2943111 -2859846 -2454773 -1919690 -1583969 -1623054 -1840274 -1887852 -1720004 -1665299 -1983545
41916a983545n25135l39573N0140L85102N88354N92954K76230k16329m15912j29704
$$ -1983545 -2508680 -2848253 -2798113 -2413011 -1824657 -1231703 -955473 -1171802 -1587714 -1717418
41906a717418J85025N3574k63445j82658K12713K72518j27711l36356Q700L75053
$$ -1717418 -1532393 -1478819 -1742264 -1924922 -1712209 -1439691 -1567402 -1903758 -1895058 -1520005
41896a520005K19710j29359n9329L03811L36336o1041l58836k51526j4096M1845
$$ -1520005 -1300295 -1429654 -1488983 -1185172 -848836 -909877 -1268713 -1520239 -1534335 -1492490
41886a492490l4029q4706r7094q0665o604N1188j4584j05271l0264J35583J32108
$$ -1492490 -1526519 -1611225 -1708319 -1788984 -1795588 -1744400 -1758984 -1864255 -1894519 -1758936 -1626828
41875a626828l0930o3203R4841J39050p0538k19936k2305L02906L30773L3111
$$ -1626828 -1657758 -1720961 -1626120 -1487070 -1557608 -1777544 -1799849 -1496943 -1166170 -1133059
41865a133059k14006j53980O0898J14893q6639l24210l14255l6732K22747K08177
$$ -1133059 -1347065 -1501045 -1440147 -1325254 -1411893 -1736103 -2050358 -2087090 -1864343 -1656166
41855a656166N095r7676K706J39178J50557N5249n0396r2963k8164Q2227M8781
$$ -1656166 -1651071 -1748747 -1746041 -1606863 -1456306 -1401057 -1451453 -1544416 -1572580 -1490353 -1441572
41844a441572j66311k25927J83820P44554P37225K3935o41055n62086J2729L37975
$$ -1441572 -1607883 -1833810 -1649990 -905436 -168211 -144276 -785331 -1347417 -1334688 -996713
41834i96713K03129L0102Q9034J51537j9501k74872l45453k13380n2489J953q9295
$$ -996713 -793584 -763482 -674448 -522911 -542412 -817284 -1162737 -1376117 -1428606 -1426653 -1515948
41823a515948k60950l17575j21226J35384J07832j52281j66516K45460N76550
$$ -1515948 -1776898 -2094473 -2215699 -2080315 -1972483 -2124764 -2291280 -2045820 -1469270
41814a469270L41915j30546j57230K24292L02925j39100m30027q5460L78384K57923
$$ -1469270 -1127355 -1257901 -1415131 -1190839 -887914 -1027014 -1457041 -1542501 -1164117 -906194
41804i06194k06946k42969J79724L03265j67800n61674k69351L41920M87806M4514
$$ -906194 -1113140 -1356109 -1176385 -873120 -1040920 -1602594 -1871945 -1530025 -1042219 -997705
41794i97705l97837l58765N2511M03303L88395K7761m01624o19970n79214l99457
$$ -997705 -1395542 -1754307 -1701796 -1298493 -910098 -882337 -1283961 -1903931 -2483145 -2882602
41784b882602j40712J66359L35232K00328k3074M5999L27208L39215J2504j16939
$$ -2882602 -3023314 -2856955 -2521723 -2321395 -2344469 -2298470 -1971262 -1632047 -1619543 -1736482
41774a736482K06799M69156K14346j81737j49973J16176M1802l20468m31787k29996
$$ -1736482 -1529683 -1060527 -846181 -1027918 -1177891 -1061715 -1019913 -1340381 -1772168 -2002164
41764b002164j54680k63008j25617K96975M42600O2748l11716j73937K11129K63446
$$ -2002164 -2156844 -2419852 -2545469 -2248494 -1805894 -1743146 -2054862 -2228799 -2017670 -1754224
41754a754224p4731l46001k08785K28579N78528N21600J05422k49985j98441J08975
$$ -1754224 -1828955 -2174956 -2383741 -2155162 -1576634 -1055034 -949612 -1199597 -1398038 -1289063
41744a289063K50551Q7194j90987m24089n04786k12191M54966R06063N62253k05236
$$ -1289063 -1038512 -951318 -1142305 -1566394 -2071180 -2283371 -1828405 -922342 -360089 -565325
41734e65325m64164r1973P8614l20915n67100j04490M49143K90325k55802k86400
$$ -565325 -1029489 -1121462 -1042848 -1363763 -1930863 -2035353 -1586210 -1295885 -1551687 -1838087
41724a838087K41384N30263K15777k14215k78537q8232M8599Q7342J48162K79905
$$ -1838087 -1596703 -1066440 -850663 -1064878 -1343415 -1431647 -1383048 -1295706 -1147544 -867639
41714h67639M13058L69431J893m90724o06337j79629K73040K13966j60932k68092
$$ -867639 -454581 -85150 -83257 -573981 -1180318 -1359947 -1086907 -872941 -1033873 -1301965
41704a301965j8271J59363L8144j83426l12813l25810j47559K40289N08620L03418
$$ -1301965 -1320236 -1160873 -1122729 -1306155 -1618968 -1944778 -2092337 -1852048 -1343428 -1040010
41694a040010j40813k29108J13151L30646J21849j21974J727K69889K21894j44914
$$ -1040010 -1180823 -1409931 -1296780 -966134 -844285 -966259 -964532 -694643 -472749 -617663
41684f17663m21046l52247r0177M0386j28868m42741n29883j86589L38269N89575
$$ -617663 -1038709 -1390956 -1481133 -1440747 -1569615 -2012356 -2542239 -2728828 -2390559 -1800984
41674a800984M28387J39183L7962J61449L25865L16476N7232k59157l23230j47644
$$ -1800984 -1372597 -1233414 -1195452 -1034003 -708138 -391662 -334430 -593587 -916817 -1064461
41664a064461j29157m26609n93926k49183K12349J76822j53687m6554N19118P51455
$$ -1064461 -1193618 -1620227 -2214153 -2463336 -2250987 -2074165 -2227852 -2274406 -1755288 -1003833
41654a003833L13178j65854j50625K5006r8445l02097k08290k4032j23264l29440
$$ -1003833 -690655 -856509 -1007134 -982128 -1080573 -1382670 -1590960 -1614992 -1738256 -2067696
41644b067696k55611j1512M8892j3808O4339J48008m1343k74289r3440L74436
$$ -2067696 -2323307 -2334819 -2285927 -2299735 -2235396 -2087388 -2128731 -2403020 -2496460 -2122024
41634b122024N48439K87067J9399p888J0028l1067L1425J69859J14575j07729
$$ -2122024 -1573585 -1286518 -1267119 -1275007 -1264979 -1296046 -1264621 -1094762 -980187 -1087916
41624a087916j35950Q2107J65302j6637j21221j8116p5126m26397n65496j38221
$$ -1087916 -1223866 -1141759 -976457 -993094 -1114315 -1132431 -1207557 -1633954 -2199450 -2337671
41614b337671L86501M00321Q2312J3291J84804R4007l23275n50873l07970Q6379
$$ -2337671 -1951170 -1550849 -1468537 -1455246 -1270442 -1176435 -1499710 -2050583 -2358553 -2272174
41604b272174K74368K91579K89088K41078J16178K3981K1776J5033l7838m2756
$$ -2272174 -1997806 -1706227 -1417139 -1176061 -1059883 -1035902 -1014126 -999093 -1036931 -1079687
41594a079687L6161J17267J69934K11975J47692j02782l23074k04211J42104K67615
$$ -1079687 -1043526 -926259 -756325 -544350 -396658 -499440 -822514 -1026725 -884621 -617006
41584f17006N3560j44478j38412j94732m41800n02306j09039L39159L19363l1934
$$ -617006 -563446 -707924 -846336 -1041068 -1482868 -1985174 -2094213 -1755054 -1435691 -1467625
41574a467625j84703l0767R6719P1105J02429K62721L61186L04759J80166j1869
$$ -1467625 -1652328 -1683095 -1586376 -1515271 -1412842 -1150121 -788935 -484176 -304010 -315879
41564c15879l10816n09246l30689Q9566K97972J24393j72714l49353l74905k18566
$$ -315879 -626695 -1135941 -1466630 -1377064 -1079092 -954699 -1127413 -1476766 -1851671 -2070237
41554b070237J26395M13520L82306J97322J73468J57649j94944o03286m27300
$$ -2070237 -1943842 -1530322 -1148016 -950694 -777226 -619577 -814521 -1417807 -1845107
41545a845107J78419L07857k32866m98627N9228O24588L47933k47751k01786K46804
$$ -1845107 -1666688 -1358831 -1591697 -2090324 -2031096 -1406508 -1058575 -1306326 -1508112 -1261308
41535a261308J58230m06317m83518J10016M62768R7222l19095j48891K83804M07618
$$ -1261308 -1103078 -1509395 -1992913 -1882897 -1420129 -1322907 -1642002 -1790893 -1507089 -1099471
41525a099471K73851J95804J29455o7531k20145j43907r780k7040r4129q1825
$$ -1099471 -825620 -629816 -500361 -567892 -788037 -931944 -941724 -968764 -1062893 -1144718
41515a144718j23266l15660m58307l75195j87381j7859K27739N37452O33972M26056
$$ -1144718 -1267984 -1583644 -2041951 -2417146 -2604527 -2622386 -2394647 -1857195 -1223223 -797167
41505g97167K34041K58174K29535n5907k89822j87932o4252l12708o43004m78268
$$ -797167 -563126 -304952 -75417 -131324 -421146 -609078 -673330 -986038 -1629042 -2107310
41495b107310P6533L33873M4947l08197l01078o7788J35605L41509N87335O40831
$$ -2107310 -2030777 -1696904 -1651957 -1960154 -2261232 -2329020 -2193415 -1851906 -1264571 -623740
41485f23740L38478p1810k42861k08466k50413l90691l43375o200K89907K03668
$$ -623740 -285262 -357072 -599933 -808399 -1058812 -1449503 -1792878 -1799078 -1509171 -1305503
41475a305503j15239k14940N262J52058k9486k13842L043M12123M62720J14522
$$ -1305503 -1420742 -1635682 -1630420 -1478362 -1507848 -1721690 -1718647 -1306524 -843804 -729282
41465g29282j18070n91J19719J4681j8036K15831L24236l0049m51560l80700k2842
$$ -729282 -847352 -847943 -728224 -713543 -731579 -515748 -191512 -221561 -673121 -1053821 -1076663
41454a076663k5659l93035m52437N8921N62629N10215J29497k8394J04363J34802
$$ -1076663 -1102322 -1495357 -1947794 -1888873 -1326244 -816029 -686532 -714926 -610563 -475761
41444d75761j61284n52084o50103l36911R8631K21927p4950m05396l41767K9929
$$ -475761 -637045 -1189129 -1839232 -2176143 -2077512 -1855585 -1930535 -2335931 -2677698 -2647769
41434b647769K51033J57714Q1402K84432N08657L26535k22826o07147m08681J90291
$$ -2647769 -2396736 -2239022 -2157620 -1873188 -1364531 -1037996 -1260822 -1867969 -2276650 -2086359
41424b086359N91731M27581l5149k16304O5839L89199L23264r376k05756k11280
$$ -2086359 -1494628 -1067047 -1102196 -1318500 -1252661 -863462 -540198 -549574 -755330 -966610
41414i66610k98678n01822n08644j91182J51783K43016J83403J57891R5919r4745
$$ -966610 -1265288 -1767110 -2275754 -2466936 -2315153 -2072137 -1888734 -1730843 -1634924 -1729669
41404a729669k06830o857L04669K96020l5625j83696J46149N37349L67694l21489
$$ -1729669 -1936499 -1943356 -1638687 -1342667 -1378292 -1561988 -1415839 -878490 -510796 -832285
41394h32285p89046m85501K74767P09150M78706l5741l14403k71557j54290r7162
$$ -832285 -1621331 -2106832 -1832065 -1122915 -644209 -679950 -994353 -1265910 -1420200 -1517362
41384a517362N388K37022M43885L57199p0732m94933m70251J430L81536K51957
$$ -1517362 -1511974 -1274952 -831067 -473868 -544600 -1039533 -1509784 -1508354 -1126818 -874861
41374h74861j15404j82656J8733J003k58295j87827L66623P06423L20586k53896
$$ -874861 -990265 -1172921 -1154188 -1153185 -1411480 -1599307 -1232684 -526261 -205675 -459571
41364d59571k61596P5203q51m57673n14918N2820N60751N16693K74272K86931
$$ -459571 -721167 -645964 -646815 -1104488 -1619406 -1566586 -1005835 -489142 -214870 72061
41354G2061L92264K38551r8005l33965m29108m59534l64922j36518K3245q025
$$ 72061 464325 702876 604871 270906 -158202 -617736 -982658 -1119176 -1095931 -1103956
41344a103956q2608p7856p6276p9569Q2865L46238L24593p7821l69559j41844
$$ -1103956 -1186564 -1264420 -1340696 -1420265 -1337400 -991162 -666569 -744390 -1113949 -1255793
41334a255793L15507M54091K20808k4066q1904j6060R5434J37724p9046m69046
$$ -1255793 -940286 -486195 -265387 -289453 -371357 -387417 -291983 -154259 -233305 -702351
41324g02351n40195l1747N60098N62653L9028l70823l67209k25042j95341k05958
$$ -702351 -1242546 -1274293 -714195 -151542 -112514 -483337 -850546 -1075588 -1270929 -1476887
41314a476887j73113j42345o7528J54019L96494M21867K74090J82246J10273j59054
$$ -1476887 -1650000 -1792345 -1859873 -1705854 -1309360 -887493 -613403 -431157 -320884 -479938
41304d79938m99594m88704n7046L58573M17390K15108n4885l20709m06596r8779
$$ -479938 -979532 -1468236 -1525282 -1166709 -749319 -534211 -589096 -909805 -1316401 -1415180
41294a415180L70610M09649r7277n17761l56167N8182J69050L7451O9134K40062
$$ -1415180 -1044570 -634921 -732198 -1249959 -1606126 -1547944 -1378894 -1341443 -1272309 -1032247
41284a032247K01559k0762m3154J91645K95291P1773j93442k14771q7269j8635
$$ -1032247 -830688 -851450 -894604 -702959 -407668 -335895 -529337 -744108 -831377 -850012
41274h50012k362M6199P2430R77r5963j14765p7609m5470J787P4052P5915n5420
$$ -850012 -852374 -806175 -733745 -732768 -828731 -943496 -1021105 -1066575 -1064788 -990736 -914821 -970241
41262i70241j95762j62474K9548J62411Q4962r0078j10463J07262L48109L33767
$$ -970241 -1166003 -1328477 -1298929 -1136518 -1051556 -1141634 -1252097 -1144835 -796726 -462959
41252d62959O6970j64743j58773l0538J9905K0953J20528K71342K74796J08469
$$ -462959 -395989 -560732 -719505 -750043 -730138 -709185 -588657 -317315 -42519 65950
41242F5950m6871j23107k40769m06525m14803j88478L2070K7548p8092m1211J29007
$$ 65950 19079 -104028 -344797 -751322 -1166125 -1354603 -1322533 -1294985 -1373077 -1414288 -1285281
41231a285281K39162K02008M3939k12402m30161l15335J77196N57796L43126k03827
$$ -1285281 -1046119 -844111 -800172 -1012574 -1442735 -1758070 -1580874 -1023078 -679952 -883779
41221h83779l57531M2838L86437K35677q9210j54717j01225k26625l20119j3827
$$ -883779 -1241310 -1198472 -812035 -576358 -665568 -820285 -921510 -1148135 -1468254 -1482081
41211a482081M61499N26576J66706n1984Q4607J37522j60152l85108j08965L56652
$$ -1482081 -1020582 -494006 -327300 -379284 -294677 -157155 -317307 -702415 -811380 -454728
41201d54728L81461q4146n03346n12722k54536L397J69853K01928L4013k24830
$$ -454728 -73267 -157413 -660759 -1173481 -1428017 -1424620 -1254767 -1052839 -1018826 -1243656
41191a243656k89569p1762J36322M3923k02104j92680J65619M81261L72406l9733
$$ -1243656 -1533225 -1604987 -1468665 -1424742 -1626846 -1819526 -1653907 -1172646 -800240 -839973
41181h39973l00567k01962K6168J20632J31734K08311K41163J0054l80746n32231
$$ -839973 -1140540 -1342502 -1316334 -1195702 -1063968 -855657 -614494 -604440 -985186 -1517417
41171a517417k78722Q3169K16726J61141J49608K09859J84824L7490j10870k00966
$$ -1517417 -1796139 -1712970 -1496244 -1335103 -1185495 -975636 -790812 -753322 -864192 -1065158
41161a065158k67671k63521q0335K05463L24942J71936O19R4955L35550L16768
$$ -1065158 -1332829 -1596350 -1676685 -1471222 -1146280 -974344 -973725 -878770 -543220 -226452
41151b26452q3152m64395l92277Q570J95058n3527l16861j30487L16285L97456
$$ -226452 -309604 -773999 -1166276 -1157706 -962648 -1016175 -1333036 -1463523 -1147238 -749782
41141g49782q7877o12902n89231p0347L97433M48860K01593k5283o3360M7612
$$ -749782 -837659 -1450561 -2039792 -2110139 -1712706 -1263846 -1062253 -1087536 -1150896 -1103284
41131a103284J79032K11206R4040j10530k55050k20685l7629J16173Q9585n0997
$$ -1103284 -924252 -713046 -619006 -729536 -984586 -1205271 -1242900 -1126727 -1037142 -1088139
41121a088139q7188M4059J32705J7986j00926P5791M25087M52177l8605n94984
$$ -1088139 -1175327 -1131268 -998563 -980577 -1081503 -1005712 -580625 -128448 -167053 -762037
41111g62037o27791j00567M80673O52418L90302Q15k04337j41345J3747K0659
$$ -762037 -1389828 -1490395 -1009722 -357304 32998 33813 -170524 -311869 -298122 -277463
41101b77463j44545k49577j02902J78414K92897J21820j16749j20685J08184K02294
$$ -277463 -422008 -671585 -774487 -596073 -303176 -181356 -298105 -418790 -310606 -108312
41091a08312j41690o94599q63695m22426J70638L84785K91418K91189L98549K88730
$$ -108312 -250002 -944601 -1808296 -2230722 -2060084 -1675299 -1383881 -1092692 -694143 -405413
41081d05413m3991k33211j76268j69743l04239k91417p4693k1381k30340k46335
$$ -405413 -449404 -682615 -858883 -1028626 -1332865 -1624282 -1698975 -1720356 -1950696 -2197031
41071b197031J51130M54681K19051j87440k07013J2066K2037m7686J77108M19752
$$ -2197031 -2045901 -1591220 -1372169 -1559609 -1766622 -1754556 -1732519 -1780205 -1603097 -1183345
41061a183345J10452m84907m63702K88313P98961M33885k01878k43792K17236
$$ -1183345 -1072893 -1557800 -2021502 -1733189 -934228 -500343 -702221 -946013 -728777
41052g28777M68564K51828j00632l24422m34426l86269n0336M14311N53244J62694
$$ -728777 -260213 -8385 -109017 -433439 -867865 -1254134 -1304470 -890159 -336915 -174221
41042a74221l74726n09798k10871n117k54275o07036m58670J48795N28910L34631
$$ -174221 -548947 -1058745 -1269616 -1274733 -1529008 -2136044 -2594714 -2445919 -1917009 -1582378
41032a582378K7520Q5504K64229J38157p1369J14059N00098M52827m1649l26475
$$ -1582378 -1554858 -1469354 -1205125 -1066968 -1138337 -1024278 -524180 -71353 -113002 -439477
41022d39477j21867J14937J7376j94129k61905l05121m07805l45920j9954L07977
$$ -439477 -561344 -446407 -429031 -623160 -885065 -1190186 -1597991 -1943911 -1963865 -1655888
41012a655888M49036N07223M88201K05581k33136m08157k69541k40075m08134
$$ -1655888 -1206852 -699629 -211428 -5847 -238983 -647140 -916681 -1156756 -1564890
41003a564890l07732J73073M18825R4009k21339j2865K60832l04m26069k99949
$$ -1564890 -1872622 -1699549 -1280724 -1186715 -1408054 -1420919 -1160087 -1160391 -1586460 -1886409
40993a886409J81713K70554j8318j436L73435L88902j55256n04425j48393L49266
$$ -1886409 -1704696 -1434142 -1452460 -1453896 -1080461 -691559 -846815 -1351240 -1499633 -1150367
40983a150367K21635l69253o22070k06983M02790O07442L33854k0864j07019K9516
$$ -1150367 -928732 -1297985 -1920055 -2127038 -1724248 -1116806 -782952 -803816 -910835 -881319
40973h81319J15095N3968o061J8828N1179J07262K98470M64727K42702k79503
$$ -881319 -766224 -712256 -718317 -699489 -648310 -541048 -242578 222149 464851 185348
40963A85348m67628n1608L70572K10045k22712k99958r6578j02582k75214j95753
$$ 185348 -282280 -333888 36684 246729 24017 -275941 -372519 -475101 -750315 -946068
40953i46068O1792O2398j32563q6623J27226M7602k06752l9240M82757N75720
$$ -946068 -884276 -821878 -954441 -1041064 -913838 -866236 -1072988 -1112228 -629471 -53751
40943e3751L7828l70885j65504J84633K19296K00047L36172K00631m05472q08726
$$ -53751 -15923 -386808 -552312 -367679 -148383 51664 387836 588467 182995 -625731
40933f25731m69222N1835j4652l64809j84315M30915O34296K08426j90654j53081
$$ -625731 -1094953 -1043118 -1057770 -1422579 -1606894 -1175979 -541683 -333257 -523911 -676992
40923f76992k694n1604j28525o5188l9506j77127k71100j28431J43492L45089
$$ -676992 -679686 -731290 -859815 -925003 -964509 -1141636 -1412736 -1541167 -1397675 -1052586
40913a052586L89597K34189q9620l44155l07658j47862k23702m87994m81063j4091
$$ -1052586 -662989 -428800 -518420 -862575 -1170233 -1318095 -1541797 -2029791 -2510854 -2524945
40903b524945N16909O51839L89006L7808j62657j19731J45273M15681L90259O9078
$$ -2524945 -2008036 -1356197 -967191 -929383 -1092040 -1211771 -1066498 -650817 -260558 -191480
40893a91480j60534j9264K51597K03495j99247n25684m41496j05050R4300M6990
$$ -191480 -352014 -371278 -119681 83814 -115433 -641117 -1082613 -1187663 -1093363 -1046373
40883a046373k564J33286L06205K81763J05516p485n4431k01210l59145j94973
$$ -1046373 -1048937 -915651 -609446 -327683 -222167 -229652 -284083 -485293 -844438 -1039411
40873a039411K87228N53080K12356m01788o56316l91575O7187M41709O32588N05143
$$ -1039411 -752183 -199103 13253 -388535 -1044851 -1436426 -1369239 -927530 -294942 210201
40863B10201L7134l88055l23315R5164K91527O9188j78833j46513m378M4395J10537
$$ 210201 247335 -140720 -464035 -368871 -77344 -8156 -186989 -333502 -337880 -293485 -182948
40852a82948K71781L10191J02782r0651n3479Q740j34067k80380j55236M5589
$$ -182948 88833 399024 501806 411155 357676 366416 232349 -48031 -203267 -157678
40842a57678m7187l15920l11454J2498K45054K07172J68283K62754K06575j55177
$$ -157678 -204865 -520785 -832239 -819741 -574687 -367515 -199232 63522 270097 114920
40832A14920m56297l20190M8566J75450J0198j06541n8730q9893k92381l77941
$$ 114920 -341377 -661567 -613001 -437551 -427353 -533894 -592624 -682517 -974898 -1352839
40822a352839j28945K31534L56552K55359K00521K84364L41948K72772J71701
$$ -1352839 -1481784 -1250250 -893698 -638339 -437818 -153454 188494 461266 632967
40813F32967J02127k6852k56367m30470l83963j59978P0848K01440J99965O6444
$$ 632967 735094 708242 451875 21405 -362558 -522536 -451688 -250248 -50283 16161
40803A6161q5766n1152J71048K38012j08805n70574n94313j45363K18601J47251
$$ 16161 -69605 -120757 50291 288303 179498 -391076 -985389 -1130752 -912151 -764900
40793g64900n4127r103J26788N6087k3963K40834N81323L69986l00443n50418
$$ -764900 -819027 -828130 -701342 -645255 -669218 -428384 152939 522925 222482 -327936
40783c27936j6372M68373M1289q53220j028233k13891O25762O59719J62144j17899
$$ -327936 -344308 124065 165354 -687866 -1716099 -1929990 -1304228 -644509 -482365 -600264
40773f00264J4042J84033J08328j29318k92437k09864J01962L68427K78827q1323
$$ -600264 -586222 -402189 -293861 -423179 -715616 -925480 -823518 -455091 -176264 -257587
40763b57587k56006n1900J44086m5745l67247l04681J03523K93975J0193l37513
$$ -257587 -513593 -565493 -421407 -467152 -834399 -1139080 -1035557 -741582 -731389 -1068902
40753a068902k70891J30971M01263K79497n8154k77438k46590j04138j8576M4968
$$ -1068902 -1339793 -1208822 -807559 -528062 -586216 -863654 -1110244 -1214382 -1232958 -1187990
40743a187990K20610M36419M25660J29774j36013r4535J13447J74146L7586j42670
$$ -1187990 -967380 -530961 -105301 24473 -111540 -206075 -92628 81518 119104 -23566
40733b3566l24114n17278n50286k40359K59008N86451N93506L76044J6322l75584
$$ -23566 -347680 -864958 -1415244 -1655603 -1396595 -810144 -216638 159406 175728 -199856
40723a99856n03428j89568K28958K41085j27986l74134k58663l5522O7161R7504
$$ -199856 -703284 -892852 -663894 -422809 -550795 -924929 -1183592 -1219114 -1151953 -1054449
40713a054449O6342j02609k25095M174L95755L58736j82913n40130k25863L52056
$$ -1054449 -988107 -1090716 -1315811 -1311637 -915882 -557146 -740059 -1280189 -1506052 -1153996
40703a153996N24426K26604j46758l37595k88579J3882L79546M35318J42525p0228
$$ -1153996 -629570 -402966 -549724 -887319 -1175898 -1162016 -782470 -347152 -204627 -274855
40693b74855J933k1369l84721o26280k74653L17702M69640J73504m7164l1518
$$ -274855 -272922 -294291 -679012 -1305292 -1579945 -1262243 -792603 -619099 -666263 -697781
40683f97781o4743k20150k58933j23575J7227J47285L32162L87934J31301j72371
$$ -697781 -762524 -982674 -1241607 -1365182 -1347955 -1200670 -868508 -480574 -349273 -521644
40673e21644j46214N3852O884k00888j22086K08026K68917p4848l68630l26867
$$ -521644 -667858 -614006 -607122 -808010 -930096 -722070 -453153 -528001 -896631 -1223498
40663a223498j70658q1902P4821L15989L83473K13826O3461J3313j43809l79629
$$ -1223498 -1394156 -1476058 -1401237 -1085248 -701775 -487949 -424488 -411175 -554984 -934613
40653i34613l40696K4024K80314J88202N8819J71394L13801K06758k7192j21810
$$ -934613 -1275309 -1251285 -970971 -782769 -723950 -552556 -238755 -31997 -59189 -180999
40643a80999n7448N2712J62257J99958Q4655o1783n2718j0414j65794l06761k4025
$$ -180999 -238447 -185735 -23478 176480 261135 199352 146634 136220 -29574 -336335 -360360
40632c60360M48642L71279l28484p80707m15171K42046M41565J99477p4059k76823
$$ -360360 88282 459561 131077 -649630 -1064801 -822755 -381190 -181713 -255772 -532595
40622e32595l88197j62603L32736M54276p7091n27913j80764N10119O16970J40569
$$ -532595 -920792 -1083395 -750659 -296383 -373474 -901387 -1082151 -572032 44938 185507
40612A85507j95046j95928k60764m02842k28887J47810J48895k29842l22288R8335
$$ 185507 -9539 -205467 -466231 -869073 -1097960 -950150 -801255 -1031097 -1353385 -1255050
40602a255050M47484L00668k2658j21800p0594j7537J22445K64418O4770m12586
$$ -1255050 -807566 -506898 -529556 -651356 -721950 -739487 -617042 -352624 -287854 -700440
40592g00440n37582l2168M96476M07695n9342k39440k9259J31860K1994j53809
$$ -700440 -1238022 -1270190 -773714 -366019 -425361 -664801 -694060 -562200 -540206 -694015
40582f94015j97004j19298L2207K11799K84126J67721Q413j4299L8455n117j38057
$$ -694015 -891019 -1010317 -978110 -766311 -482185 -314464 -306051 -320350 -281895 -287012 -425069
40571d25069k32525k64969k55035j09314K04747M28173K63220j62229l76602j59380
$$ -425069 -657594 -922563 -1177598 -1286912 -1082165 -653992 -390772 -553001 -929603 -1088983
40561a088983J97650L14426J87456P7498R0298Q8194j1809o7972N9307K46717
$$ -1088983 -891333 -576907 -389451 -311953 -221655 -133461 -145270 -213242 -153935 92782
40551I2782K42986K3526j71390j77768j03837j09008j68218j79473j38083n6896
$$ 92782 335768 359294 187904 10136 -93701 -202709 -370927 -550400 -688483 -745379
40541g45379J10375K85593K08777j75280m58763k43386K51550M45923K07560k4862
$$ -745379 -635004 -349411 -140634 -315914 -774677 -1018063 -766513 -320590 -113030 -137892
40531a37892M4338J77504P1199j74091k69837j39382R8306L04989L17542J7775
$$ -137892 -93554 83950 155149 -18942 -288779 -428161 -329855 -24866 292676 310451
40521C10451m12926n55887k69719Q8342J54231K4167q707N9779L7127n8075k3880
$$ 310451 -102475 -658362 -928081 -839739 -685508 -661341 -670048 -610269 -573142 -631217 -655097
40510f55097J61064K97317K61421J06508r2264k66256k78953p1232J46699J09638
$$ -655097 -494033 -196716 64705 171213 78949 -187307 -466260 -537492 -390793 -281155
40500b81155r0550q0097K47021N17473L49898j65608o17930p47552n92854k88751
$$ -281155 -371705 -451802 -204781 312692 662590 496982 -120948 -868500 -1461354 -1750105
40490a750105N8659L28971M20535L61597K54362J00324j61177m22559m32289j58143
$$ -1750105 -1691446 -1362475 -941940 -580343 -325981 -225657 -386834 -809393 -1241682 -1399825
40480a399825P9687K1655j60570j46393L4838J07008N1333J13774L11028L51838
$$ -1399825 -1320138 -1298483 -1459053 -1605446 -1570608 -1463600 -1412267 -1298493 -987465 -635627
40470f35627J40727n6508r2354j49666k80129k05716J28940K99804R6974k3657
$$ -635627 -494900 -551408 -643762 -793428 -1073557 -1279273 -1150333 -850529 -753555 -777212
40460g77212K92082N62521J98550m26529m77210J0526K16880j13909l68795j93783
$$ -777212 -485130 77391 275941 -150588 -627798 -617272 -400392 -514301 -883096 -1076879
40450a076879K5384L5585J40374M02199L21452k10539m87467j02563L09719J34091
$$ -1076879 -1051495 -1015910 -875536 -473337 -151885 -362424 -849891 -952454 -642735 -508644
40440e08644j86872j4955K66741o6135o66762n49938K61192O77598K01938l95446
$$ -508644 -695516 -710471 -443730 -509865 -1176627 -1726565 -1465373 -787775 -585837 -981283
40430i81283l17344K16227N38526M61357K11475n1672k62556l35357k97387k67943
$$ -981283 -1298627 -1082400 -543874 -82517 128958 77286 -185270 -520627 -818014 -1085957
40420a085957j85092J05235M19142L38847j19043m03178j96271J52897K05444
$$ -1085957 -1271049 -1165814 -746672 -407825 -526868 -930046 -1126317 -973420 -767976
40411g67976K9566o0849p368N7564R2892R3970n78j27141p9481J33368K05528
$$ -767976 -738410 -799259 -806627 -749063 -656171 -562201 -562779 -689920 -769401 -636033 -430505
40400d30505J7512j24287J6788K03033J24395r4561j45427m4328j0246l0126O4864
$$ -430505 -412993 -537280 -520492 -317459 -193064 -287625 -433052 -477380 -487626 -517752 -452888
40389d52888K20928K32154J08264L7571M2096k4160j76875k78559k74101k02293
$$ -452888 -231960 194 108458 146029 188125 163965 -12910 -291469 -565570 -767863
40379g67863l5811K29667L82943J74227l13047o86981o45459k05858L69485P01395
$$ -767863 -803674 -574007 -191064 -16837 -329884 -1016865 -1662324 -1868182 -1498697 -797302
40369g97302M99246j00839n25699l78506N1174J95133j5724j74978j00064k0578
$$ -797302 -298056 -398895 -924594 -1303100 -1251926 -1056793 -1072517 -1247495 -1347559 -1368137
40359a368137n4407q816J56409J46057j51702l73358k07745J16900K03687P3543
$$ -1368137 -1422544 -1431360 -1274951 -1128894 -1280596 -1653954 -1861699 -1744799 -1541112 -1467569
40349a467569K3068J02805J22447N8732P8838J87291J87904K9361r5454o0439
$$ -1467569 -1444501 -1341696 -1219249 -1160517 -1081679 -894388 -706484 -677123 -772577 -833016
40339h33016K2111L3915N7485K15597M22049M40528J81049j52439k65994j20634
$$ -833016 -810905 -776990 -719505 -503908 -81859 358669 539718 387279 121285 651
40329F51R998r1542k53929j59184J16109J25098k64322n56167k85832K81128N06545
$$ 651 10649 -80893 -334822 -494006 -377897 -252799 -517121 -1073288 -1359120 -1077992 -571447
40318e71447K60424k1311q3090j16777k06461o6758L86853O72020L63278k27710
$$ -571447 -311023 -332334 -415424 -532201 -738662 -805420 -418567 253453 616731 389021
40308C89021m57346k41648m9707r5227q1709J56179K83931K7020k95529k06736
$$ 389021 -68325 -309973 -359680 -454907 -536616 -380437 -96506 -69486 -365015 -571751
40298e71751J84592L29159N3873k33069k30998j78048l33739m23698n5465N20609
$$ -571751 -387159 -58000 -4127 -237196 -468194 -646242 -979981 -1403679 -1459144 -938535
40288i38535O22559J22959l24251k34417M4320j7187k56715j53121K42335L76353
$$ -938535 -315976 -193017 -517268 -751685 -707365 -724552 -981267 -1134388 -892053 -515700
40278e15700J38412M4347L28364N04016J69567k97225l32995p0963m4364k47051
$$ -515700 -377288 -332941 -4577 499439 669006 371781 38786 -32177 -76541 -323592
40268c23592j48091L60150O51366K40496m67718o66349j77003L65502L51739o9402
$$ -323592 -471683 -111533 539833 780329 312611 -353738 -530741 -165239 186500 117098
40258A17098k70231j6835K46108R2984k06214q2494L97261N24897q928n99556
$$ 117098 -153133 -169968 76140 169124 -37090 -119584 277677 802574 793646 194090
40248A94090n65528o1762K70857K23534Q2791J5354o9549j69372j97918k46967
$$ 194090 -371438 -433200 -162343 61191 143982 159336 89787 -79585 -277503 -524470
40238e24470l69351k53123L25780Q62892O32832j77502o01448k73056J22270L8206
$$ -524470 -893821 -1146944 -821164 41728 674560 497058 -104390 -377446 -255176 -216970
40228b16970j24071J11381L63210M9314n45812o60725k33549P9104m1649k01642
$$ -216970 -341041 -229660 133550 182864 -362948 -1023673 -1257222 -1178118 -1219767 -1421409
40218a421409k8178K98634M11113K45903o1j51028j73886j61985k15153k55538
$$ -1421409 -1449587 -1150953 -739840 -493937 -493998 -645026 -818912 -980897 -1196050 -1451588
40208a451588q7723K42994L86981K00847N0396K75379N98668M96686l985l67785
$$ -1451588 -1539311 -1296317 -909336 -708489 -658093 -382714 215954 712640 708655 340870
40198C40870l17106j01163oQ132J7031k707o7467j17700j44802j63450q9930J06992
$$ 340870 23764 -77399 -77405 -69273 -52242 -54949 -122416 -240116 -384918 -548368 -638298 -531306
40186e31306K19546P1117j22523k8798K43043K82555M2443j06293j4840L8172
$$ -531306 -311760 -240643 -363166 -391964 -148921 133634 176077 69784 54944 93116
40176I3116j03320j95417o8633L8940j15132l61707l66161o1455L52963O35851
$$ 93116 -10204 -205621 -274254 -235314 -350446 -712153 -1078314 -1139769 -786806 -150955
40166a50955O04049K47271j52435k69216j66361j70133k67915p1271M63409P59514
$$ -150955 453094 700365 547930 278714 112353 -57780 -325695 -396966 66443 825957
40156H25957L83828l00634o22613m50095j66539l7417r144Q36r709j0714Q790
$$ 825957 1209785 909151 286538 -163557 -330096 -367513 -376657 -375821 -385530 -396244 -387454
40145c87454n6856k41327l28462j13239K52075M16031K63052j4348j92692j75561
$$ -387454 -444310 -685637 -1014099 -1127338 -875263 -459232 -196180 -210528 -403220 -578781
40135e78781J9965K35823K36952j643j83700o3970J93107K43347L4171j86366
$$ -578781 -558816 -322993 -86041 -87684 -271384 -335354 -142247 101100 135271 -51095
40125e1095k39063j65007p6864n5653j24559j68654l012L16125M25224J17051
$$ -51095 -290158 -455165 -532029 -587682 -712241 -880895 -883907 -567782 -142558 -25507
40115b5507l13894m50965k93459j07886N9677L12424M73997K20180l41821o70501
$$ -25507 -339401 -790366 -1083825 -1191711 -1132034 -819610 -345613 -125433 -467254 -1137755
40105a137755m70915j6100L11936M43512M45408K76819n1659l24489l54025k10266
$$ -1137755 -1608670 -1624770 -1312834 -869322 -423914 -147095 -198754 -523243 -877268 -1087534
40095a087534o6996K0352O3549N3107M4013J35106K40176J13782k24814l56168
$$ -1087534 -1154530 -1134178 -1070629 -1017522 -973509 -838403 -598227 -484445 -709259 -1065427
40085a065427k2048L95439L27095j55609l83924p880N21675N71690J28929k94766
$$ -1065427 -1087475 -692036 -364941 -520550 -904474 -912354 -390679 181011 309940 15174
40075A5174l79296k82240k33745j75702M5977L30744L89050J24407k11752k90850
$$ 15174 -364122 -646362 -880107 -1055809 -1009832 -679088 -290038 -165631 -377383 -668233
40065f68233o5942J75250J12647k37033m79345k62548K59824N49753L44962k599
$$ -668233 -734175 -558925 -446278 -683311 -1162656 -1425204 -1165380 -615627 -270665 -273264
40055b73264l2820J71710J58132j71152m08504k74627j4854K0455j27484k05319
$$ -273264 -306084 -134374 23758 -147394 -555898 -830525 -845379 -824924 -952408 -1157727
40045a157727j79902j82265j68805K9752L51751M85366K70832o4309j62828N4166
$$ -1157727 -1337629 -1519894 -1688699 -1658947 -1307196 -821830 -550998 -615307 -778135 -723969
40035g23969L02872K57818n2636k37534k7910L04901K42327k61874o50465m77771
$$ -723969 -421097 -163279 -215915 -453449 -481359 -176458 65869 -196005 -846470 -1324241
40025a324241L2082L61114L76330L23507L15035J93586j16348m22704m86279k50880
$$ -1324241 -1292159 -931045 -554715 -231208 83827 277413 161065 -261639 -747918 -998798
40015i98798J45089M39444L85490P803l21796k56465R8650L08142J32851k39605
$$ -998798 -853709 -414265 -28775 -20972 -342768 -599233 -500583 -192441 -59590 -299195
40005b99195m74483m24428j74247R7818K62938L16854L13436K23426k1172l05943
$$ -299195 -773678 -1198106 -1372353 -1274535 -1011597 -694743 -381307 -157881 -179053 -484996
39995d84996l58907j20613J14894J00582l0923m8404j2288r3652j89919o7634
$$ -484996 -843903 -964516 -849622 -749040 -779963 -828367 -840655 -934307 -1124226 -1191860
39985a191860K22878M09731L96581K88419J17731j19995k48326r8467J38259J18760
$$ -1191860 -968982 -559251 -162670 125749 243480 123485 -124841 -223308 -85049 33711
39975C3711j30336k75786k14775j31850n4695J63937L94810K90564q7677k33152
$$ 33711 -96625 -372411 -587186 -719036 -773731 -609794 -214984 75580 -12097 -245249
39965b45249J9061J94794l7565k99150j35729K03644J60108k22633l54267j44
$$ -245249 -226188 -31394 -68959 -368109 -503838 -300194 -140086 -362719 -716986 -717130
39955g17130L81945K94533j77224n41383m69661n8140L50082M90685L67167J69201
$$ -717130 -335185 -40652 -217876 -759259 -1228920 -1287060 -936978 -446293 -79126 90075
39945I0075L4163n2462j28673j57325j16959p2599o2986j2809J35869K71168K04315
$$ 90075 124238 71776 -56897 -214222 -331181 -403780 -466766 -479575 -343706 -72538 131777
39934A31777r1291l96980m28335j16616K80484M11426K13174l6901j13914j21637
$$ 131777 40486 -356494 -784829 -901445 -620961 -209535 3639 -33262 -147176 -268813
39924b68813k23670k96869j40771R2706M3077k97029n16225l41979M4154L29203
$$ -268813 -492483 -789352 -930123 -837417 -794340 -1091369 -1607594 -1949573 -1905419 -1576216
39914a576216M13452L28312R5721j69374k32137J4715L92409O11132N13009J53504
$$ -1576216 -1162764 -834452 -738731 -908105 -1140242 -1125527 -733118 -121986 391023 544527
39904E44527k20623l30994j81931j13490l17275m66383j70961L58454N63213L56581
$$ 544527 323904 -7090 -189021 -302511 -619786 -1086169 -1257130 -898676 -335463 21118
39894B1118J59652J42781K8957k59271l65492j15119J69880K00636Q6018k4520
$$ 21118 180770 323551 352508 93237 -272255 -387374 -217494 -16858 69160 44640
$$ [...]
##END NTUPLES=NMR SPECTRUM
##END=
