##TITLE=31Pdec_PR165R_d6
 DMSO-d6, 24 sc
 20.8.2019
##JCAMPDX= 6.0         $$ Bruker NMR JCAMP-DX V2.0
##DATA TYPE= NMR SPECTRUM
##DATA CLASS= NTUPLES
##ORIGIN= UXNMR, Bruker Analytische Messtechnik GmbH
##OWNER= root
$$ XWIN-NMR		Version 3.5
$$ Tue Aug 20 15:00:47 2019 Russian Standard Time (UT+4h)  she@DPX200
##.OBSERVE FREQUENCY= 81.013821
##.OBSERVE NUCLEUS= ^31P
##.ACQUISITION MODE= SIMULTANEOUS
##.ACQUISITION SCHEME= undefined
##.AVERAGES= 24
##.DIGITISER RES= 17
##SPECTROMETER/DATA SYSTEM= spect
##.PULSE SEQUENCE= zgpg30
##.SOLVENT NAME= CDCl3
##.SHIFT REFERENCE= (INTERNAL, CDCl3, 0, 182.463)
##AUDIT TRAIL= $$ (NUMBER, WHEN, WHO, WHERE, WHAT)
$$ ##TITLE= Audit trail, XWIN-NMR		Version 3.5
$$ ##JCAMPDX= 5.01
$$ ##ORIGIN= Bruker BioSpin GmbH
$$ ##OWNER= she
$$ F:/spectra/data/she/nmr/P31/1/pdata/1/auditp.txt
$$ ##AUDIT TRAIL=  $$ (NUMBER, WHEN, WHO, WHERE, WHAT)
(   1,<2019-08-20 15:00:07.42 +0400>,<she>,<DPX200>,
      <created by zg, POWCHK disabled, PULCHK disabled
       configuration hash MD5:
       00 E9 B6 7A A2 85 ED C7 34 08 36 98 17 FE 4E 26
       data hash MD5: 32K
       CE C2 E8 A7 60 3B 49 F6 68 BA 9E E7 08 69 09 02>)
(   2,<2019-08-20 15:00:09.57 +0400>,<she>,<DPX200>,
      <Start of raw data processing
       efp BC_mod = 2 LB = 1 FT_mod = 6 PKNL = 1 PHC0 = -405.0508 PHC1 = 81.80041 SI = 64K 
       data hash MD5: 64K
       10 F9 B3 03 D7 54 05 4E 95 19 18 0D 69 23 55 DF>)
(   3,<2019-08-20 15:00:20.50 +0400>,<she>,<DPX200>,
      <abs ABSG = 5 
       data hash MD5: 64K
       C2 4A 6C ED F5 34 E2 ED 61 8E 31 88 A2 6D 45 6B>)
$$ ##END=
$$ 
$$ hash MD5
$$ 70 EE F1 2B 80 50 34 D2 7D C4 9F 14 4D CD 0F 03
##$RELAX= 
##$RELAX= 
##$RELAX= 
##$RELAX= 
##$RELAX= 
##$RELAX= 
##$RELAX= 
##$RELAX= 
$$ Bruker specific parameters
$$ --------------------------
##$DU= <F:/spectra>
##$EXPNO= 1
##$NAME= <P31>
##$PROCNO= 1
##$TYPE= <nmr>
##$USER= <she>
##$AMP= (0..31)
100 100 100 100 100 100 100 100 100 100 100 100 100 100 100 100 100 100 
100 100 100 100 100 100 100 100 100 100 100 100 100 100 
##$AQSEQ= 0
##$AQ_mod= 1
##$AUNM= <au_zg>
##$AUTOPOS= <>
##$BF1= 81.014009
##$BF2= 200.13
##$BF3= 200.13
##$BF4= 200.13
##$BF5= 200.13
##$BF6= 200.13
##$BF7= 200.13
##$BF8= 200.13
##$BYTORDA= 1
##$CFDGTYP= 0
##$CFRGTYP= 5
##$CHEMSTR= <none>
##$CNST= (0..31)
1 1 145 1 1 1 1 1 1 1 1 1 1 1 1 1 1 1 1 1 1 1 1 1 1 1 1 1 1 1 1 1 
##$CPDPRG= <waltz16>
##$CPDPRG1= <>
##$CPDPRG2= <waltz16>
##$CPDPRG3= <>
##$CPDPRG4= <mlev>
##$CPDPRG5= <mlev>
##$CPDPRG6= <mlev>
##$CPDPRG7= <mlev>
##$CPDPRG8= <mlev>
##$CPDPRGB= <>
##$CPDPRGT= <>
##$D= (0..31)
0 1 0 0 0 0 0 0 0 0 0 0.03 2e-05 3e-06 0 0 0 0 0 0 0 0 0 0 0 0 0 0 0 0 
0 0 
##$DATE= 1566298806
##$DBL= (0..7)
120 120 120 11 120 120 24 19 
##$DBP= (0..7)
150 150 150 150 150 150 150 150 
##$DBP07= 0
##$DBPNAM0= <>
##$DBPNAM1= <>
##$DBPNAM2= <>
##$DBPNAM3= <>
##$DBPNAM4= <>
##$DBPNAM5= <>
##$DBPNAM6= <>
##$DBPNAM7= <>
##$DBPOAL= (0..7)
0.5 0.5 0.5 0.5 0.5 0.5 0.5 0.5 
##$DBPOFFS= (0..7)
0 0 0 0 0 0 0 0 
##$DE= 6
$$ [...]
##$SUBNAM3= <"">
##$SUBNAM4= <"">
##$SUBNAM5= <"">
##$SUBNAM6= <"">
##$SUBNAM7= <"">
##$SUBNAM8= <"">
##$SUBNAM9= <"">
##$SW= 369.568048894756
##$SWIBOX= (0..15)
0 1 3 0 0 0 0 0 0 0 0 0 0 0 0 0 
##$SW_h= 29940.119760479
##$TD= 32768
##$TD0= 1
##$TE= 0
##$TE2= 300
##$TE3= 300
##$TEG= 300
##$TL= (0..7)
0 120 53 12 22 120 120 120 
##$TP= (0..7)
150 150 150 150 150 150 150 150 
##$TP07= 0
##$TPNAME0= <>
##$TPNAME1= <>
##$TPNAME2= <>
##$TPNAME3= <>
##$TPNAME4= <>
##$TPNAME5= <>
##$TPNAME6= <>
##$TPNAME7= <>
##$TPOAL= (0..7)
0.5 0.5 0.5 0.5 0.5 0.5 0.5 0.5 
##$TPOFFS= (0..7)
0 0 0 0 0 0 0 0 
##$TUNHIN= 0
##$TUNHOUT= 0
##$TUNXOUT= 0
##$USERA1= <user>
##$USERA2= <user>
##$USERA3= <user>
##$USERA4= <user>
##$USERA5= <user>
##$V9= 5
##$VALIST= <valist>
##$VCLIST= <CCCCCCCCCCCCCCC>
##$VD= 0
##$VDLIST= <DDDDDDDDDDDDDDD>
##$VPLIST= <PPPPPPPPPPPPPPP>
##$VTLIST= <TTTTTTTTTTTTTTT>
##$WBST= 1024
##$WBSW= 4
##$XGAIN= (0..3)
0 0 0 0 
##$XL= 0
##$YL= 0
##$YMAX_a= 4329
##$YMIN_a= -10730
##$ZGOPTNS= <>
##$ZL1= 120
##$ZL2= 120
##$ZL3= 120
##$ZL4= 120
##$ABSF1= 182.463
##$ABSF2= -187.1042
##$ABSG= 5
##$ABSL= 3
##$ALPHA= 0
##$AQORDER= 0
##$ASSFAC= 0
##$ASSFACI= 0
##$ASSFACX= 0
##$ASSWID= 0
##$AUNMP= <proc_1d>
##$AZFE= 0.1
##$AZFW= 0.5
##$BCFW= 0
##$BC_mod= 2
##$BYTORDP= 0
##$COROFFS= 0
##$CY= -3
##$DATMOD= 1
##$DC= 0
##$DFILT= <>
##$DTYPP= 0
##$F1P= 0
##$F2P= 0
##$FCOR= 1
##$FTSIZE= 65536
##$FT_mod= 6
##$GAMMA= 0
##$GB= 0
##$INTBC= 1
##$INTSCL= 5.30512e-09
##$ISEN= 30
##$LB= 1
##$LEV0= 0
##$LPBIN= 0
##$MAXI= 10000
##$MC2= 0
##$MEAN= 0
##$ME_mod= 0
##$MI= 50
##$NCOEF= 0
##$NC_proc= -9
##$NLEV= 6
##$NOISF1= 182.463
##$NOISF2= 159.3651
##$NSP= 0
##$NTH_PI= 0
##$NZP= 0
##$OFFSET= 182.463
##$PC= 4
##$PHC0= -405.0508
##$PHC1= 81.80041
##$PH_mod= 1
##$PKNL= yes
##$PPARMOD= 0
##$PSCAL= 0
##$PSIGN= 0
##$REVERSE= no
##$SF= 81.0140089999434
##$SI= 65536
##$SIGF1= 159.3651
##$SIGF2= -187.1042
##$SINO= 113.3802
##$SIOLD= 16384
##$SREGLST= <1H.CDCl3>
##$SSB= 0
##$STSI= 65536
##$STSR= 0
##$SW_p= 29940.119760479
##$SYMM= 0
##$S_DEV= 0
##$TDeff= 32768
##$TDoff= 0
##$TI= <>
##$TILT= no
##$TM1= 0
##$TM2= 0
##$TOPLEV= 0
##$USERP1= <user>
##$USERP2= <user>
##$USERP3= <user>
##$USERP4= <user>
##$USERP5= <user>
##$WDW= 1
##$XDIM= 65536
##$YMAX_p= 395555940
##$YMIN_p= -224991560
$$ End of Bruker specific parameters
$$ ---------------------------------
##NTUPLES= NMR SPECTRUM
##VAR_NAME=  FREQUENCY,     SPECTRUM/REAL,   SPECTRUM/IMAG
##SYMBOL=    X,             R,               I
##VAR_TYPE=  INDEPENDENT,   DEPENDENT,       DEPENDENT
##VAR_FORM=  AFFN,          ASDF,            ASDF
##VAR_DIM=   65536,         65536,           65536
##UNITS=     HZ,            ARBITRARY UNITS, ARBITRARY UNITS
##FACTOR=    0.456856943014862, 1,           1
##FIRST=     14782.0589164792, 0,            0
##LAST=      -15158.0608439998, 0,           0
##MIN=       -15158.0608439998, -224991560,  0
##MAX=       14782.0589164792, 395555940,    0
$$ Real data points
##PAGE= N=1
##DATA TABLE= (X++(R..R)), XYDATA
$$ [...]
##PAGE= N=2
##DATA TABLE= (X++(I..I)), XYDATA
4815a5171599J4500112J8562113M314021j2008506j3488855o004797n633668j0458606
4807b5389785l806740J5055810K3877335R062623j2211035j4933000P8629J1635696
4799C369533J0441082O931978P445140K665141j2245633k2478246j2949407O669521
4791a0150891J2903801J386247p827296o02873J0911732P091943j0646291k2182924
4783a9116552j4770853M451593K0286968K3526571J3355931l787222j5477014
4776H469422j2798595j932005K334654k569577l709737M867926J0242777J992244
4768F897109p909776l584287O309922R88611j5750056j7300488L298263J9000716
4760h049986R207160q461911o080363J2143250J9133408O937705n609126n137030
$$ y = [-15171599, -671487, 17890626, 22204647, 10196141, -3292714, -9297511, -14931179, -25389785, -29196525, -14140715, 9736620, 18799243, 6588208, -8344792, -8266163, 3369533, 13810615, 20742593, 28187733, 30852874, 18607241, -3871005, -16820412, -10150891, 2752910, 4139157, -3688139, -4291012, 6620720, 13712663, 3066372, -19116552, -33887405, -29435812, -9148844, 14377727, 27733658, 23946436, 8469422, -4329173, -6261178, -3926524, -6496101, -10205838, -5337912, 4904865, 6897109, -1012667, -4596954, 1712968, 2701579, -13048477, -30348965, -27050702, -8049986, 1157174, -7304737, -13385100, -1241850, 17891558, 24829263, 19220137, 14083107]
4752A4083107n77504l472533r801484r485535k139487M243773L643824l074360
4744f580199q997259o651790K491009P051179J052533n343449p89443P733198
4736a0034221N133560o104844q352999L241772J3517243J0716604n3054j0287029
4728b222968j7532824j7096727l089845J5745412K0203314Q623065J248267P414553
4720A3292247J0414543j437169j1849301m601135O038137j691090j8889592j9024288
4712b7747648q9283J4066990J0558796J15567n668107o387068k294183O566220
4704a0878716J0515863L26017j3171978j0960402L256141P702240j028408k798941
4696a7038184R633628J6549231M406433j1948892j4384411p045151j480004L606384
$$ y = [14083107, 13505603, 10033070, 231586, -9253949, -11393436, -7149663, -3505839, -6580199, -15577458, -22229248, -19738239, -12687060, -11634527, -16977976, -17767419, -10034221, -4900661, -11005505, -19358504, -16116732, -2599489, 8117115, 8064061, -2222968, -19755792, -36852519, -39942364, -24196952, -3993638, 4629427, 5877694, 13292247, 23706790, 22269621, 10420320, 5819185, 11857322, 10166232, -8723360, -27747648, -27836931, -13769941, -3211145, -3095578, -8763685, -15150753, -17444936, -10878716, -362853, -36836, -13208814, -24169216, -20913075, -13210835, -14239243, -17038184, -7404556, 9144675, 13551108, 1602216, -12782195, -19827346, -21307350, -17700966]
4688a7700966J0569915R509677l518639j1115687P65376J6012206J0413089q827204
4680F107767j2013917P725353K4107625J6420478l699436j2886806o674618J680687
4672B0767133K215200l386219r508067j3204858j3464957r715583l171617K189667
4664b7279301K617911k99305J8447O309535J1583422Q189722O92098M30372P389441
4655I652342R309459J759437m213666j130540J559079o175519j6573495j5625902
4647b1438805m921169K483588K697570L015769O275268P226146L956789P12942
4639H098r87388l480798n215022j933361M373851P273221O470867P098737Q823440
4630B2431645N831099j877670p289962p600061o842584n985897p29258Q044649
$$ y = [-17700966, -7131051, 2378626, -1140013, -12255700, -11490324, 4521882, 14934971, 6107767, -5906150, 1819203, 25926828, 42347306, 38647870, 25761064, 19086446, 20767133, 22982333, 19596114, 10088047, -3116811, -16581768, -26297351, -29468968, -27279301, -24661390, -24960695, -24942248, -18632713, -7049291, 1140431, 1832529, 2262901, 9652342, 18961801, 20721238, 16507572, 15377032, 16936111, 10760592, -5812903, -21438805, -26359974, -23876386, -21178816, -18163047, -11887779, -4661633, -704844, 8098, -979290, -4460088, -9675110, -11608471, -7234620, 38601, 6509468, 13608205, 22431645, 28262744, 26385074, 19095112, 11495051, 4652467, -1333430, -2062688, 5981961]
4622E981961J1687380O337877j93049M29462N304673N422327j415572q112286
4614B5442773p600372j405920K254788p70686l792726J695892J0688399Q061393
4606C4573541q366156j9677599j0824580O205196Q355917o222698j8014748j4351535
4598b8322662j120602J1676244J8795391J4796320j358458j5199959r210647J0073032
4590A28659J6777259K741351j0722448o268484N640897Q587267N294340M470750
4582B6649591R96926j0691267j8435797r913168L068064J397853q706866n249636
4574b0884300J1925612J9715480Q754672l893402m543376j675779n202740p608633
4566c412466N37374J1556870J1898385K500072m791139m112064J296170O520493
$$ y = [5981961, 17669341, 24007218, 23814169, 24243631, 29548304, 34970631, 33555059, 25442773, 17842401, 16436481, 18691269, 17920583, 14127857, 15823749, 26512148, 34573541, 26207385, 6529786, -4294794, 1910402, 10266319, 4043621, -13971127, -28322662, -29443264, -17767020, 1028371, 15824691, 14466233, -733726, -9944373, 128659, 16905918, 19647269, 8924821, 2656337, 8297234, 16884501, 22178841, 26649591, 27646517, 16955250, -1480547, -11393715, -8325651, -6927798, -15634664, -20884300, -8958688, 10756792, 19511464, 15618062, 11074686, 9398907, 4196167, -3412466, -2875092, 8681778, 20580163, 23080235, 18289096, 14177032, 15473202, 21993695]
4558B1993695O967948n28960j0865554j2297941k799317L870232j906068r031994
4550d597959k448433J1147690J1488680m011103j5237878q462218N586609R521561
4542B986949K332661m710385o152628n742741o160624m795712P09486Q229192
4534a3303802J2498237Q936280j084546p721700j280843J3545379J9232470P060730
4526C7882205r751318j2868836k744686N218357M197365J919743L377607K323930
4518B9554367n251889j1917257j0925743p581255r105880j0893761l819088R307958
4510b0632548J5815769J0581191J942439m19374L814022P947859N553270n022839
4502A9579789j8193817k3139245j3551718M146105J6613627J7244346R886391
$$ y = [21993695, 28961643, 28432683, 17567129, 5269188, 2469871, 6340103, 4434035, -4597959, -7046392, 4101298, 15589978, 11578875, -3659003, -12121221, -6534612, 2986949, 5319610, 609225, -5543403, -11286144, -17446768, -22242480, -21532994, -13303802, -805565, 8130715, 7046169, -675531, -1956374, 11589005, 30821475, 37882205, 28130887, 15262051, 12517365, 17735722, 21933087, 23852830, 27230437, 29554367, 24302478, 12385221, 1459478, -6121777, -15227657, -26121418, -29940506, -20632548, -4816779, 5764412, 7706851, 7287477, 11101499, 19049358, 24602628, 19579789, 1385972, -21753273, -35304991, -31158886, -14545259, 2699087, 12585478]
4495A2585478Q56045o338455q872861m609423L611054Q775463O928878N61845
4487A3498024n133151n930590j90030Q054358R541297M3042j1220425j1358680
4479b696155j291278N789655L891783J322145N027776Q667022L121320q895459
4471A4936809j6347359j3403778l771178M694064N717411q50102p311060n777814
4463b2113007R50727L137194j70679M43378P264681R082809l15104r773667p479880
4454a8973548J087195M422004L758475N692312N647908l150553j1429571n345064
4446a8290842P995103R161563p75505j443360R714765R709337r942510k3287049
4438a7158498r184824J3097574J3234920k695092m688610J1068874J8188196N750341
$$ y = [12585478, 13441523, 7103068, -1769793, -6379216, -2768162, 6007301, 12936179, 13498024, 8364873, 2434283, 2244253, 10298611, 19839908, 19882950, 8662525, -2696155, -3987433, 1802222, 5694005, 7016150, 12043926, 20710948, 23832268, 14936809, -1410550, -14814328, -18585506, -13891442, -8174031, -9024133, -16335193, -22113007, -21162280, -18025086, -18195765, -17752387, -10487706, -1404897, -1720001, -11493668, -18973548, -17886353, -13464349, -9705874, -4013562, 1634346, -1516207, -12945778, -18290842, -10295739, -1134176, -1909681, -3353041, 6361724, 16071061, 6128551, -17158498, -26343322, -13245748, -10828, -2705920, -7394530, 3674344, 21862540, 27612881]
4430B7612881n126410R13595Q411246j83905j3996641j2498570J416191R010415
4422A5558802N869135K805458L018204m2478m638567j855685M564351M62746j2760302
4413A2981664j5435739j000186J0338901K636446r178268k698562J4822269J5908054
4405B8374579n349085k4001911j9596751j664252P508364J374396q865638j1300960
4397c3521258l400440R178238J6762927J2604448P92711o407286k974413L521452
4389c443621L112146k783053m589181J160525P041503M651107m669746j1151962
4381a0672282q062461o5499K407039k875961o506018r04816Q602816J2303905
4373e773277J0061633P616454L595038p211051j9186783j8843054m794965Q406671
$$ y = [27612881, 22486471, 23400066, 31811312, 31627407, 17630766, 5132196, 6548387, 15558802, 21427937, 24233395, 27251599, 27209121, 22570554, 20714869, 25279220, 25741966, 12981664, -2454075, -3454261, 6884640, 9521086, 342818, -2355744, 12466525, 28374579, 23025494, -976417, -20573168, -22237420, -14729056, -13354660, -22220298, -33521258, -36921698, -27743460, -10980533, 1623915, 2416626, -3990660, -6965073, -3443621, -331475, -3114528, -7703709, -6543184, 498319, 5149426, 479680, -10672282, -18734743, -18800242, -16393203, -19269164, -25775182, -26679998, -18077182, -5773277, 4288356, 11904810, 15499848, 8288797, -10897986, -29741040, -34536005, -26129334]
4365b6129334J0301758N704947J541948l304280q026382m424035Q016801J4486647
4357a831930N090966q159550q592540M05523L446904j916592n560254m798247
4349b1915720n677287o575773O67566J2087014J2324295j161939j0814280l606054
4341b4672178J0169357J2345360J840246o124218j173899J0447853J4807934O604491
4333B4244946m644546n506135M096437R545695J565826r205493o712939O737846
4325B0121637J3590534N814508o692349j2886055j2544920r048386k881895L407356
4317a119570M715663J975041J184818J200874n384241j5572361j4545800J809244
4309b5736332J6567701J4010454O87086o882412n242005k175140o31148J380513
$$ y = [-26129334, -15827576, -10122629, -8580681, -11884961, -19911343, -24335378, -16318577, -1831930, 3259036, -4900514, -13493054, -13087531, -9640627, -11557219, -17117473, -21915720, -27593007, -34168780, -33501214, -21414200, -9089905, -10251844, -21066124, -24672178, -14502821, -2157461, -317215, -6441433, -7615332, 2832521, 17640455, 24244946, 19600400, 14094265, 18190702, 27736397, 29302223, 20096730, 13383791, 20121637, 33712171, 39526679, 32834330, 19948275, 7403355, -1645031, -4526926, -1119570, 3596093, 5571134, 6755952, 7956826, 2572585, -12999776, -27545576, -25736332, -9168631, 4841823, 5528909, -1353503, -6595508, -8770648, -9401796, -8021283]
4301h021283J068119m343011p099983J894744J5215240J5556299J459321q578041
4293G151405k473395Q396069O990264m810883j1025305n734395M66942j045896
4285b085194l782458J697969J0292926Q345140m443055j1697577l636440P739673
4277B430984O417323l674792o555292o79425K00947p206842q563984K659203J0596353
4268d375525R85086j3677287j0074350J1634607K6635150J7731008n329110k1118994
4260B410585k0271864r754075p82870J964455J004109o63253m068886r323718
4252c9485517r101763L994908K2113266K5619858Q628324r484166q583008M775316
4244a522782P919392n279706j7806953j4973835k016424P078140O934490J921200
$$ y = [-8021283, -6953164, -11296175, -18396158, -16501414, -1286174, 14270125, 15729446, 7151405, 4678010, 13074079, 20064343, 15253460, 4228155, -1506240, -1039298, -2085194, -5867652, -4169683, 6123243, 14468383, 10025328, -1672249, -5308689, 2430984, 8848307, 5173515, -1381777, -2061202, -1860255, -9067097, -17631081, -14971878, -4375525, -3390439, -17067726, -27142076, -15507469, 11127681, 28858689, 23529579, 2410585, -17861279, -27615354, -28398224, -26433769, -25429660, -26092913, -30161799, -39485517, -48587280, -44592372, -22479106, 3140752, 11769076, 2284910, -6298098, -1522782, 6396610, 1116904, -16690049, -31663884, -33680308, -26602168, -19667678, -17746478]
4236a7746478k150986k494501j69636Q33553j254548j893630L759845J1446093
4228i670288J1000718o2984j2048172j4081200n692251L808283N148177j341555
4220b2939272m959003L122238J5786598J5927258P58601j0439958k542167J2098982
4212F813277J1759852j356199o032716K920618P512240k185229j2314574j0023779
4204b906510l705594m757369o320721K091589J1586396O140861r120030j3121991
4196b0113369j164916P880392P95032j0685894q524636N864861J5641941J1904725
4188A598136K426931j210296L043040Q201961O684218l347172j6394952k2697605
4180b1695739j5921632j36411J2879685J5397285J0558233N159409j24631p259697
$$ y = [-17746478, -19897464, -22391965, -22561601, -21728048, -22982596, -24876226, -21116381, -9670288, 1330430, 1267446, -10780726, -24861926, -30554177, -26745894, -21597717, -22939272, -27898275, -24776037, -8989439, 6937819, 7696420, -2743538, -5285705, 6813277, 18573129, 17216930, 11184214, 14104832, 21617072, 19431843, 7117269, -2906510, -6612104, -11369473, -17690194, -15598605, -4012209, 2128652, -6991378, -20113369, -21278285, -13397893, -12602861, -23288755, -31813391, -25948530, -10306589, 1598136, 4025067, 2814771, 5857811, 14059772, 20743990, 17396818, 1001866, -21695739, -37617371, -37753782, -24874097, -9476812, 1081421, 6240830, 6116199, -1143498]
4172a143498j1214127m553915P457971Q847105m289987j5210992j0392959j25744
4164c0626146p43889o385226J127784J8968012K3908650Q872005n114683k602811
4156G403696K898365n631944j8534416j5241364J893526J1904961P548550J710483
4148f048143K661789L428052p32314k399276L154910P465543K533887n427271
4140D637177n927283q21501o05922p478015j2017192p402862R28905L870840K252331
4131b2563522M990406J3213732J4250101j088371j9977075j9152944L194915K1138550
4123e994208J4466151m637889j1519840m650313k226849q845057q717357N015752
4115b7109610J6319520J1317720o66997m315934k019286m316879p589060l81632
$$ y = [-1143498, -12357625, -16911540, -9453569, -606464, -4896451, -20107443, -30500402, -30626146, -31370035, -37755261, -36627477, -17659465, 6249185, 15121190, 10006507, 7403696, 10302061, 4670117, -13864299, -29105663, -27212137, -15307176, -7758626, -6048143, -3386354, 41698, -690616, -3089892, 65018, 7530561, 10064448, 4637177, -1290106, -2111607, -2717529, -10195544, -22212736, -29615598, -28686693, -24815853, -22563522, -17573116, -4359384, 9890717, 8802346, -11174729, -30327673, -27132758, -5994208, 8471943, 3834054, -7685786, -12336099, -14562948, -23408005, -32125362, -27109610, -10790090, 527630, -139367, -4455301, -6474587, -10791466, -18380526, -18762158]
4107a8762158J3204945J5948062L818093p398128n853380R27187J177194l260620
4099a98805m032366k246878n723842j4197358j7817443j0511069K403525J1016587
4091d1307649J0622335M324101o08437Q61819O079033P092566J476041k475517
4083a3935708L042544J1820759J0068315l517347j4176868j1389698k888285p50133
4075b1726421j967410M949920J8036466K1262272Q268373o482715p473096R28723
4067A5796112L328159l499014q564755n726796j895126l224605m276217J723911
4059f338331R073176N609565r586106k2806773k1177364o041372J0494541J8115076
4051b2657588J5798677J0174974Q135026R266678O194468m402812j3338368q837473
$$ y = [-18762158, -5557213, 10390849, 14208942, 6810814, 957434, 1884621, 3061815, -198805, -4231171, -6478049, -12201891, -26399249, -44216692, -54727761, -52324236, -41307649, -30685314, -26361213, -26969650, -26107831, -20028798, -12936232, -11460191, -13935708, -10893164, 927595, 10995910, 7478563, -6698305, -18088003, -20976288, -21726421, -23693831, -18743911, -707445, 20554827, 28823200, 22340485, 14867389, 15796112, 19124271, 15625257, 7060502, 1333706, -561420, -3786025, -8062242, -6338331, 2734845, 8344410, -1241696, -24048469, -45225833, -51267205, -40772664, -22657588, -6858911, 3316063, 11451089, 20717767, 26912235, 22509423, 9171055, 333582]
4043C33582N001315J0011075j122933j2685695q379498L708150L773277p614666
4035f975393r691026M713072J6050833P941335p237590p387643O961601J6699129
4027B1074318J3232484N298350n78324q207024j8022651k0993596j2220260L79459
4019b0037244O660333N420686J171863k361740k136007L188700Q944862Q216455
4011I067908K001641j831582p36198N28934J034909N331067J1388011R756254
4003C6540944l56986p211447n221891m057176j0642544j5992717j1244826l518131
3995b1704774j959989l82352R405927J7554414R421964p901002j3370132l159171
3987a2095115O681524P758988P940303J0024533L804961j2818042k3398751j4482545
$$ y = [333582, 5334897, 15345972, 14223039, 1537344, -6842154, -3134004, 639273, -6975393, -16666419, -11953347, 4097486, 12038821, 4801231, -2586412, 4375189, 21074318, 34306802, 39605152, 39026828, 30819804, 12797153, -8196443, -20416703, -20037244, -13376911, -7956225, -6784362, -9146102, -11282109, -8093409, 851453, 9067908, 11069549, 9237967, 8501769, 9030703, 10065612, 15396679, 26784690, 36540944, 36183958, 28972511, 23750620, 19693444, 9050900, -6941817, -18186643, -21704774, -23664763, -24047115, -14641188, 2913226, 12335190, 4434188, -8935944, -12095115, -5413591, 2345397, 10285700, 20310233, 24115194, 11297152, -12101599, -26584144]
3979b6584144N576351J8547971J6229124J912462j5722139k3373786j1291439
3972c4705600J0510464J7218249N59499j7392486j3425141N913799J6584276R780751
3964d956189l498058j2717924j5624269j0501548K552665J4116736J3722473M943031
3956a1963083j85664O25783P87178P86947O687063J3248427O846081j1300936
3948E531796k2103262j4894079j097604N513228O636332Q241300O980479O98997
3940d492813n58454J0312457K0929056J4785163l187972j3412891j0173938n879448
3932H321160p957429r632820o710486o293016j1564007j2323670r68555J2467310
3924c4661513J2642479P2578j0585917j0024626k661545L280019N881491Q209947
$$ y = [-26584144, -21007793, -2459822, 13769302, 15681764, -40375, -23414161, -34705600, -24195136, -6976887, -6417388, -23809874, -37235015, -31321216, -14736940, -4956189, -8454247, -21172171, -36796440, -47297988, -44745323, -30628587, -16906114, -11963083, -12148747, -11522964, -10735786, -9948839, -3261776, 9986651, 16832732, 5531796, -16571466, -31465545, -32563149, -27049921, -20413589, -12172289, -5191810, -4492813, -5051267, 5261190, 26190246, 40975409, 37787437, 24374546, 14200608, 8321160, 363731, -9269089, -15979575, -22272591, -33836598, -46160268, -47128823, -34661513, -22019034, -21946456, -32532373, -42556999, -45218544, -41938525, -36057034, -27847087]
3916b7847087J1871604J4338110J1974539N636389J866501N150263R983011O661780
3908C9635110m423747j1791610q578743j037276K615740K623481Q12191o546765
3900A3308381j8904581k3130349q504064J4885463K6306845J9979249P247904
3893C1188848l551992j3183624j8138148r975725P061980J4911963O370535l865959
3885A0817878k368727L036740j032818j0074767r734761K95507O497860K425990
3877a37098m622102o933791m829873j765695l8733r07968k136263J650482R393861
3868a0327180J0379377R3566p973043r7708J4017326J2892040l850916j4068523
3860A064939o630232M122104M342467J273414N604886J0102905K859996r384378
$$ y = [-27847087, -15975483, -1637373, 10337166, 15973555, 17840056, 22990319, 32973330, 39635110, 35211363, 23419753, 14841010, 13803734, 16419474, 19042955, 19855146, 13308381, -5596200, -28726549, -37230613, -22345150, 3961695, 23940944, 31188848, 27636856, 14453232, -3684916, -13660641, -6598661, 8313302, 14683837, 10817878, 8449151, 11485891, 10453073, 378306, -9356455, -9060948, -2563088, -137098, -4759200, -11692991, -16522864, -18288559, -18327292, -19235260, -21371523, -19721041, -10327180, 52197, 145763, -7827280, -7924988, 6092338, 18984378, 15133462, 1064939, -5565293, -1443189, 2899278, 4172692, 9777578, 19880483, 22740479, 13356101]
3852A3356101j0066737L83523M785105m127065j3585223j1096070j653957K245321
3844a9759002j125451k718496L125847J1702679J4679316R327888K12105n957191
3836I487695o109000k604043k74368j296171k437260J454561R532481J2386315
3828B0140210K386909j3153497j6684072k726522J2121583J0032098l430869q089664
3820E96176N39908N839924k277563j1113487o101401N428474N769277n423759
3812f742451j0696792o67374J3604004J6955762Q256646k696752q912702j0653959
3804a553618j0113115p746586l616296J333375O076381R414028Q493264L58607
3796B646040j2097004j8124630r246703P884959J6321826J0328211L562249Q305043
$$ y = [13356101, 3289364, 3672887, 8457992, 4330927, -9254296, -20350366, -22004323, -19759002, -20884453, -23602949, -20477102, -8774423, 5904893, 15232781, 15444886, 9487695, 3378695, 774652, 500284, -795887, -3233147, -1778586, 7753895, 20140210, 22527119, 9373622, -7310450, -10036972, 2084611, 12116709, 8685840, 596176, 1136084, 6976008, 4698445, -6415042, -12516443, -7087969, -1318692, -6742451, -17439243, -18106617, -4502613, 12453149, 20709795, 18013043, 9100341, -1553618, -11666733, -19413319, -23029615, -21696240, -15619859, -6205831, 2287433, 2646040, -9450964, -27575594, -36822297, -28937338, -12615512, -2287301, 1274948, 9579991]
3788I579991J5702991R904165m829505r410409p60722L527579m298094q617025
3780A0798971J833270J2691055P138435n640499n936584L518515L255983r547907
3772A8111239j7117862j1019265l931428o104309r093978k200945R261819J2901696
3764i193033P119065M54782j111349J171503L131927J913376j352617j691884
3756D41770K896166N700724n64099j0549639j0801213J001038J1498741R874853
3748I498341J022521m337755l919058k189774j529026j295807p47838J411620
3740b086776N499654O703938k76295j0097487r922084J752880R871627L561001
3732E006458p915826r457259j642010L669497K691406J565101K451337J255826
$$ y = [9579991, 25282982, 35187147, 30357642, 20947233, 20186511, 23714090, 19415996, 10798971, 12632241, 25323296, 32461731, 26821232, 20884648, 24403163, 27659146, 18111239, 993377, -10025888, -13957316, -20061625, -29155603, -31356548, -22094729, -9193033, -2073968, -1619186, -2730535, -1559032, 1572895, 3486271, 2133654, 441770, 3337936, 9038660, 8474561, -2075078, -12876291, -11875253, -376512, 9498341, 10520862, 6183107, 2264049, 74275, -1454751, -2750558, -3498396, -2086776, 3412878, 10116816, 9840521, -256966, -10179050, -8426170, 1445457, 5006458, -2909368, -12366627, -14008637, -10339140, -7647734, -6082633, -3631296, -2375470]
3724b375470j017514K866170J3277842J9269141J1823084m379379j6046739j4581074
3716H836061k862060P947320P989800j766915j0132691q616964j299139K447718
3708B543130J489400J972409M947995M185462k354551p256910l629040N533866
3700G431761J1896471J1480953O369833K09355m372824n858660m278259j132660
3692B1745970J734138K282195j637239r662091j7127544j8990028j4772061o690130
3684d3116790M497192J6336892K0229566R406641p967693j3828338k640511J0088833
3676f994208Q100429m528498j0966963m392574O857755J3560548J4310830J0451430
3668B6398749K634867n214602o817619j953550K072690J94086m583070p212224
$$ y = [-2375470, -3392984, -526814, 12751028, 32020169, 43843253, 39463874, 23417135, 8836061, 5974001, 13921321, 21911121, 20144206, 10011515, 1394551, 95412, 2543130, 4032530, 6004939, 10952934, 15138396, 12783845, 5526935, 1897895, 7431761, 19328232, 30809185, 37179018, 37388373, 33015549, 27156889, 22878630, 21745970, 23480108, 25762303, 24125064, 14462973, -2664571, -21654599, -36426660, -43116790, -38619598, -22282706, -2053140, 7353501, -614192, -14442530, -17083041, -6994208, 1106221, -3422277, -14389240, -18781814, -11924059, 1636489, 15947319, 26398749, 29033616, 23819014, 17001395, 15047845, 17120535, 17314621, 12731551, 5519327]
3660E519327o555096l027651L087900P856360N254757l152112p131182j716882
3652A35421M978116M503337J002308K509600O480619N497236J694470J608025
3644B8409132L29637j2502230l0437715l1713461q954137J7627557K5202480J4410004
3636B371267J686318l287152k121265J145299K553725j486707p397207m922063
3628a1457785P368896J5715344R638141k734291q533822q765695r862772p856841
3620a6488825J843025Q429327j95359j3960176j3140673R5044N903877m985k711364
3611c0230109K036303J596781n570320l722173R812354J5574033N074886l986609
3603i414854n1870K414121o087553p578848R751609K1631774L607259k3759083
$$ y = [5519327, -1035769, -4063420, -975520, 6880840, 12135597, 8983485, 1852303, 135421, 5113537, 9616874, 10619182, 13128782, 19609401, 25106637, 26801107, 28409132, 28738769, 16236539, -14201176, -45914637, -54868774, -37241217, -12038737, 2371267, 4057585, 770433, -1350832, -205533, 2348192, 861485, -6535722, -11457785, -4088889, 11626455, 21264596, 18530305, 9996483, 1230788, -8631984, -16488825, -14645800, -6216473, -6411832, -20372008, -33512681, -33417637, -27513760, -27518745, -30230109, -28193806, -26597025, -32167345, -35889518, -26077164, -10503131, -5428245, -9414854, -9466724, -7052603, -13140156, -20719004, -10967395, 10664379, 14271638, -9487445]
3595i487445k2350053M613590K0007891J1698915L662716Q426015Q666735n319120
3587A9919244j5774916r419430K98112j085711n780634k489028K897403J589828
3579i845132j473780l10945p7735k874525N49189J0543766R625818q511807k0302322
3570b2677473m690316K1846770K7591931J0938867k921110k702158q16964n075533
3562B1494014p374957l564471j537692l833555j557060P582690J1726024K887804
3554B5822797j0803503j7598656j5561116q334759J312953Q516856P373300O6440
3546i205688m438985m252528o302966j0713641o573910R631767K3447682K0161072
3538A1752803M372156p706935q436132k067767N629633J0939259R746504J506696
$$ y = [-9487445, -31837498, -27223908, -7216017, 4482898, 8145614, 16571629, 25238364, 19919244, 4144328, -5275102, -4976990, -6062701, -11843335, -14332363, -11434960, -9845132, -11318912, -11629857, -11707592, -14582117, -14032928, -3489162, 6136656, -2375151, -22677473, -27367789, -5521019, 22070912, 33009779, 30088669, 27386511, 26569547, 21494014, 14119057, 10554586, 9016894, 5183339, 3626279, 11208969, 22934993, 25822797, 15019294, -2579362, -18140478, -26475237, -25162284, -16645428, -9272128, -9205688, -13644673, -17897201, -24200167, -34913808, -41487718, -31855951, -8408269, 11752803, 16124959, 8418024, -18108, -2085875, 3543758, 14483017, 24229521, 25736217]
3530B5736217o323592o033279m40645J208547l164842o185407k506306L642572
3522E933265M262405k526428j0137311j0412888l106067K489658j471087r724006
3514b4692459r457804J523380J0539703Q071241J328621K124646Q413274Q575192
3506F425794L15640o075962l025950N522078J1665380J1502685M236012q338230
3498B2227447j8905735j8755349q344714K229270N973627N714622N339165K559881
3490a961786l838511p044748j280660O760201N405341m589994r891549k978329
3482a9420035Q285925J2789990R894421N589781J722540k879158m611802J588088
3474A2959750J1131246J1632668n85506j3669921j5279577p974663k704493k608981
$$ y = [25736217, 19412625, 13379346, 12938701, 14147248, 10982406, 4796999, 2290693, 5933265, 10195670, 7669242, -2468069, -12880957, -15987024, -13497366, -14968453, -24692459, -34150263, -32626883, -22087180, -14015939, -12687318, -10562672, -2149398, 6425794, 6741434, 665472, -2360478, 3161600, 14826980, 26329665, 30565677, 22227447, 3321712, -15433637, -23778351, -21549081, -15575454, -9860832, -4521667, -1961786, -5800297, -12845045, -14125705, -7365504, -1960163, -6550157, -16441706, -19420035, -11134110, 1655880, 11550301, 17140082, 18862622, 15983464, 11371662, 12959750, 24090996, 35723664, 35138158, 21468237, 6188660, -1786003, -4490496, -7099477]
3466g099477k664845j758870l396570m801488J869953J4255939J8472263R392005
3458B4268910j25905K97290J174029r558958k2112463j7266896J571201J0911012
3450a0841780K983114l854266K536736Q162335p26000j1395870n140504J0424110
3442g852125J3650666M866637L664614J2575899J1383112o843712k0389553j2238047
3434a182509L187083M143372m629968l593727P081120Q358831n510700j7661196
3426i807694j4277851j827247O774035Q699801P134473K732695k647089k755186
3418e974063M139517R715677O587032m08471j176261N339933J0678144Q066396
3410C6967904j521074j2165262j7026229j2208139j505040N054771J999447m657942
$$ y = [-7099477, -9764322, -11523192, -14919762, -19721250, -17851297, -3595358, 14876905, 24268910, 24143005, 24440295, 25614324, 16055366, -6057097, -23323993, -21752792, -10841780, -7858666, -11712932, -9176196, -1013861, -1739861, -13135731, -18276235, -7852125, 5798541, 10665178, 14329792, 26905691, 38288803, 31445091, 11055538, -1182509, 2004574, 6147946, 1517978, -2075749, 5005371, 13364202, 7853502, -9807694, -24085545, -25912792, -19138757, -10438956, -3304483, -571788, -3218877, -5974063, -1834546, 7881131, 14468163, 14059692, 12883431, 18223364, 28901508, 36967904, 35446830, 23281568, 6255339, -5952800, -7457840, -2403069, -403622, -5061564]
3402e061564n665074o32954L439836K867280J8908k992982o530070r416812q764815
3393c2738247m534046M26189M832349Q756578R801644N508087n47944j880503
3385a0375893P16233n43981p447243j0667758k741700R727178J3563589N755391
3377b014184l547304l835740M809402J3437260J3162512K250822j2569384k0954055
3369i260671j6970993l698357R687693J5104342J1046666L105923j154446J57308
3361H017465J560493j310273l887508R63378J0063840J1941556L637076l822578
3353B7163449j996099J802480l263914j2742655j2093691J255385J2569275Q629250
3345B1323480o688444j8873136j8485081p310959N797742J1488310N955494n687243
$$ y = [-5061564, -10726638, -11359592, -7919756, -5052476, -5033568, -8026550, -14556620, -23973432, -32738247, -37272293, -36846104, -32013755, -23257177, -13455533, -7947446, -8495390, -10375893, -9659660, -10203641, -17650884, -28318642, -31060342, -21333164, -7769575, -2014184, -5561488, -9397228, -4587826, 8849434, 22011946, 24262768, 11693384, -9260671, -26231664, -29930021, -20242328, -5137986, 5908680, 9014603, 7860157, 8017465, 9577958, 8267685, 4380177, 5343555, 15407395, 27348951, 30986027, 27163449, 25167350, 26969830, 23705916, 10963261, -1130430, 124955, 12694230, 21323480, 14635036, -4238100, -22723181, -30034140, -24236398, -12748088, -6792594, -12479837]
3337a2479837j3160519j0070998P56531J0322128J0999158K922920n587364o407028
3329b2705009j545302q6182l500004k194510P878335J5151227R543609N05471
3321C047635K688998J0415948O146905q433496j3075757l360289Q19867r657772
3313a1407961j5105575p32703J4610208P198529j1459329j1900139O278190J5515571
3305g003209N212810n479559l531790j124150q334397j2540292j337437J3455805
3297b0682219J3286135J310856m387150K597381J2909554J7544423J3835009Q48216
3289C7262205j6990113k5516755j4490813N404343J2228088K88780j3388823j2120218
3281b7323306J114097J1223482R962239K211891k310315O77684O674650P641725
$$ y = [-12479837, -25640356, -35711354, -34954823, -24632695, -13633537, -10710617, -16297981, -22705009, -24250311, -24336493, -27836497, -30031007, -22152672, -7001445, 2542164, 3047635, 5736633, 16152581, 22299486, 13865990, 790233, -2570056, -1750189, -11407961, -26513536, -27246239, -12636031, -5437502, -16896831, -28796970, -22518780, -7003209, -1790399, -7269958, -10801748, -11925898, -20260295, -32800587, -34138024, -20682219, -7396084, -6085228, -10472378, -7874997, 5034557, 22578980, 36413989, 37262205, 20272092, -5244663, -19735476, -14331133, -2103045, -1814265, -15203088, -27323306, -26209209, -14985727, -5023488, -2811597, -5121912, -4444228, 2230422, 9872147]
3273I872147J061152p021030r078788m309733J785943L409287j533174r611113
3265a5425309j2027967k016842J4131900J9508935O225564j2419578j6885185
3258a8908482m726102R077034J2248638O625302M40425j628069P01496N041650
3250H871892O616828K061027n509507r306769p016135k099832K156054M874092
3242F47650M769719R65571l432076m093994j771069m81393k8515L170098P687499
3233G433490O921332n48022o824811m335863M676317J1187093Q967787n74219
3225B6903104j0374188j3221810p392853K431941J0329649J3274870R542267j505498
3217B9987482j4094788j6818543o041295O346623P020834j443062p026071p048512
$$ y = [9872147, 10933299, 3912269, -5166519, -9476252, -7690309, -4281022, -5814196, -15425309, -27453276, -29470118, -15338218, 4170717, 10396281, -2023297, -18908482, -23634584, -14557550, -2308912, 4316390, 4756815, 3128746, 3830242, 8871892, 15488720, 17549747, 12040240, 2733471, -4282664, -6382496, -4226442, 647650, 5417369, 6382940, 2950864, -1143130, -2914199, -3395592, -3424107, -254009, 7433490, 14354822, 13806800, 6981989, 2646126, 7322443, 18509536, 27477323, 26903104, 16528916, 3307106, -4085747, -1653806, 8675843, 21950713, 31492980, 29987482, 15892694, -925849, -6967144, -620521, 6400313, 4957251, -2068820, -9117332]
3209i117332p480292o906633K283241J5695058J7239385L245826r300900o915337
3201a256984J885417K687096k495796k268773L607297N519023J619769K90089
3193I587138N151051Q602684K790120r603274j7921502j4245367j495876Q530909
3185h604117P786843K073686K643373Q293332O295886n900249j2844511l343083
3177c598840J0928433J1372492j099293r572510o420879p84142j670891o189597
3169g035227o614642m36571Q340244J2424771O921412l242093n612330L575441
3161H321005J1345522N336681p018281r079864k4798N696355J962752k244843
3153A4294529j055863n01150m497125o787751l665220j722148m749071m661506
$$ y = [-9117332, -16597624, -23504257, -21221016, -5525958, 11713427, 14959253, 5658353, -1256984, 628433, 3315529, 819733, -1449040, 2158257, 7677280, 9297049, 9587138, 14738189, 23340873, 26130993, 16527719, -1393783, -15639150, -17135026, -8604117, -817274, 1256412, 3899785, 12193117, 18489003, 12588754, -255757, -3598840, 7329593, 18702085, 17602792, 8030282, 1609403, 825261, -845630, -7035227, -13649869, -14086440, -5746196, 6678575, 13599987, 10357894, 4745564, 8321005, 19666527, 25003208, 17984927, 8905063, 8880265, 14576620, 16539372, 14294529, 13238666, 12737516, 8240391, 1452640, -2212580, -3934728, -8683799, -13345305]
3145a3345305M415783J2669410P141621q133252j6284794r597882K475766P161290
3137a3497363K492984l998003n835127m183081m524351p724300p357804N73147
3129d4053898Q568306O223315k901870l551924R166522K0990204J8216929O220517
3121A8878101j135599k345016o225502j3790347j5848425q552908Q70506O363458
3113b1785732J0231146J3789912J0880183j484853j2912403j0179075M143726
3106g317096J3188268P394509l672032n637263J114444M088190j920712p716078
3098d77770m163640M606212Q289574N157225K132364K608261K076239l403998
3090A6824467j0445468j2236452o018974M163559J0125302O295774l158974o491578
$$ y = [-13345305, -8929522, 3739888, 10881509, 2748257, -13536537, -23134419, -20658653, -13497363, -11004379, -15002382, -20837509, -25020590, -29544941, -37269241, -44627045, -44053898, -35485592, -29262277, -32164147, -35716071, -26549549, -5559345, 12657584, 18878101, 17742502, 15397486, 9171984, -4618363, -20466788, -29019696, -28149190, -21785732, -11554586, 2235326, 13115509, 11630656, -1281747, -11460822, -7317096, 5871172, 13265681, 9593649, 3956386, 5070830, 9159020, 7238308, -477770, -4641410, -35198, 8254376, 13411601, 15543965, 18152226, 20228465, 16824467, 6378999, -5857453, -11876427, -7712868, 2412434, 8708208, 5549234, -942344]
3082i42344J803965J2277328J1959195J766236n783628m402423N51123M099453
3074B1328905O902823O152317m949161k1663729k4862691n626641J6795102J6508565
3066A0585490m177020j7095151n692605J4656917J9009027L795659j3409965j7994004
3058a0321652j1646759l284424L317737Q689784J0550498M998098n395637j1201509
3050a4293864p236007L69816K917484J227130K172881N636543M399709k201921
3042g008229n095245n03766J854451o051142j4973234r471741Q985920K2111945
3034a0151041J8393836N802733j850143j449091J715079M355835N472981J917158
3026B4207347o854234j2191170m777126R527636J2956296o06687j5123729j3462698
$$ y = [-942344, 861621, 13138949, 25098144, 26864380, 21080752, 16678329, 17229452, 21328905, 28231728, 34384045, 29434884, 7771155, -17091536, -22718177, -5923075, 10585490, 6408470, -10686681, -16379286, -1722369, 17286658, 21082317, 7672352, -10321652, -21968411, -25252835, -21935098, -13245314, -2694816, 2303282, -3092355, -14293864, -21529871, -21160055, -18242571, -17015441, -14842560, -9206017, -4806308, -7008229, -12103474, -12607240, -10752789, -16803931, -31777165, -41248906, -32262986, -10151041, 8242795, 14045528, 12195385, 10746294, 12461373, 16817208, 22290189, 24207347, 17353113, 5161943, 384817, 9912453, 22868749, 22262062, 7138333, -6324365]
3018f324365n58333O283519M040899M451187R108084M283052j2469955k0232573
3010a1418485m330324J6904668J5207597o514522j8673105q007019O823445O347442
3002c660303l764485o792513Q09195R961103J2897816P484284m002386j3511408
2994e78697j2417554l053934L131771J898041K02109J443497M08197k786412N24758
2985a1228224R812485J0914959j047932j0904078p260801j12369m65266j86162
2977a0477388R279337J4888829K248801j4939116j2050996P692636J8152174R558817
2969B4353094l340513j0371150j6222018k0059687j1384620P811630J9876376
2962i336888J7423680J1735291R292954J736827j2604512j8741234q018762O949613
$$ y = [-6324365, -6882698, -599179, 3441720, 7892907, 17000991, 21284043, 8814088, -11418485, -15748809, 1155859, 16363456, 9848934, -8824171, -16831190, -10007745, -3660303, -7424788, -14217301, -13408106, -3447003, 9450813, 16935097, 12932711, -578697, -12996251, -16050185, -12918414, -11020373, -10818264, -9374767, -8966570, -11752982, -11228224, -1415739, 9499220, 8451288, -2452790, -9713591, -9825960, -10291226, -10477388, -1198051, 13690778, 15939579, 1000463, -11050533, -3357897, 14794277, 24353094, 21012581, 10641431, -5580587, -25640274, -37024894, -29213264, -9336888, 8086792, 19822083, 29115037, 30851864, 18247352, -493882, -8512644, -1563031]
2954a563031J1460041O718687p25865j0127696j6691927q707604J2394721K5410975
2946A8168301J6657444o86948p665381m920682l082611l207568k562079n449993
2938G250483j1681936q560114P760155J7535519M687302j4769600j4971706O19771
2930a2130126Q155234K609859k82271L679146K726009l322063o78330R330635
2922A0088093P502829r167719j8036951p081131M702624j249314j3236292r893952
2914c6371813O490095J7498646J7136130J3156554Q523512L92671p665734r229921
2906I930140p417603r146226j0535705k752554R966405J3220438L456310p627359
2898i06154j0916567r261696o797883j698089N664559Q310582K866145l980423
$$ y = [-1563031, 9897010, 16615697, 15889832, 5762136, -10929791, -19637395, -7242674, 18168301, 34825745, 34138797, 26473416, 21552734, 18470123, 15262555, 12700476, 7250483, -4431453, -12991567, -5231412, 12304107, 16991409, 2221809, -12749897, -12130126, -3974892, -1365033, -1647304, 2031842, 4757851, 1435788, 757458, 10088093, 17590922, 8423203, -9613748, -16694879, -11992255, -13241569, -26477861, -36371813, -29881718, -12383072, 4753058, 17909612, 26433124, 26825795, 19160061, 9930140, 2512537, -6633689, -17169394, -19921948, -9955543, 3264895, 6721205, -906154, -11822721, -21084417, -27882300, -29580389, -23915830, -15605248, -12739103, -16719526]
2890a6719526n192436k368853P80733O321466J5386401J9781202J0959331m975942
2882B3972376j2260830o759313k018065r314484k0359089j8457803k117790J2813805
2874c4501193J4251847P212231K867442L005435K020721j399104k844128j89111
2866i575860M137633P966016J0367296R038187L232078j900793j487547n06389
2858B1270621p576209j8484237j7768844j406364J3833457J2260164O18537l711177
2850i64052J905014N864015L830898L617513Q090511Q937286K240463l469183
2842C0052465k065572o98661o268646j1642563p772758j280153m497981j2387715
2834a6561584p208994J2291527K3812494J1212673j2340413k1838225j1738869
$$ y = [-16719526, -21911962, -24280815, -23500082, -17178616, -1792215, 17988987, 28948318, 23972376, 11711546, 4952233, 2934168, -6380316, -26739405, -45197208, -47314998, -34501193, -20249346, -13037115, -10169673, -7164238, -5143517, -6542621, -9386749, -9575860, -5438227, 2527789, 12895085, 21933272, 25165350, 23264557, 21777010, 21270621, 13694412, -4789825, -22558669, -23965033, -10131576, 2128588, 2747125, -964052, 940962, 6804977, 10635875, 14253388, 22343899, 31281185, 33521648, 30052465, 27986893, 27288232, 21019586, 9377023, 1604265, 324112, -4173869, -16561584, -23770578, -11479051, 12333443, 23546116, 11205703, -10632522, -22371391]
2827b2371391K210793O636853L361806L17833Q30788L263011L731147j373947
2819c393107r637411j1224532q30445J1357240J0703124j041297p933442l546343
2811a5546213J446875q05299k938729J849379N803473P48706n325962r24961Q259701
2802g433030Q236283P55135K93P194073P840362l162911j1977622p689109K067844
2793d168682N570799L463943J464957j109485m885929l250132O397040J2986314
2785A6468825O138091o696762j0481474m505566m60469k537006l823067j048316
2777f945744J245312J891971N172155R620556P266842k507691r772312q880804
2769b909715n842227o121614n581914J23685O367816O972790L506372O93626p19822
$$ y = [-22371391, -20160598, -13523745, -10161939, -9844106, -9013318, -5750307, -2019160, -3393107, -13030518, -24255050, -25085495, -13728255, -3025131, -4066428, -11999870, -15546213, -14099338, -14904637, -17843366, -15993987, -10190514, -9441808, -14767770, -15692731, -7433030, 803253, 1558388, 1558681, 8752754, 16593116, 13430205, 1452583, -6236526, -4168682, 1402117, 4866060, 6331017, 5221532, 335603, -2914529, 3482511, 16468825, 22606916, 15910154, 5428680, 923114, 462645, -2074361, -5897428, -6945744, -5700432, -3808461, 1363694, 10984250, 18251092, 15743401, 5971089, -2909715, -8751942, -14873556, -20455470, -20331785, -13963969, -6991179, -3484807, -2791181, -3511003]
2760c511003r50793J413111L305216k604777j4395603j7457829m509277J0347709
2752b8363246J0298815O04389o61151Q841953J4221643Q906480L139249M002529
2744B0990661M386593j545545p065222n978478m315914q545912j2543515p925358
2736b2542690N19645K068514k318890j919864O101442J1963078P305790l829208
2728b652183j0378665o742820J420022L554144k023513l266672R101590K2124326
2720A1136229J2460201j7622794l4040529j4311965J8288256K4540567K868363
2713C318328j2314202k487601J2736352J0944648j382330n831403o63280M388439
2705H708951P520081J1150343Q925679m937200j9117844j6540505q12634N939799
$$ y = [-3511003, -4461796, -3048685, 256531, -2348246, -16743849, -34201678, -38710955, -28363246, -18064431, -17460042, -18121193, -9279240, 4942403, 13848883, 16988132, 20990661, 25377254, 23831709, 16766487, 10788009, 6472095, -2073817, -14617332, -22542690, -22023045, -19954531, -22273421, -24193285, -18091843, -6128765, 1177025, -2652183, -13030848, -19773668, -18353646, -14799502, -16823015, -20089687, -10988097, 11136229, 23596430, 5973636, -28066893, -42378858, -24090602, 449965, 3318328, -8995874, -11483475, 1252877, 12197525, 10815195, 4983792, 4320512, 8708951, 16229032, 27379375, 36305054, 31367854, 12250010, -4290495, -5103129, 836670]
2697H36670n969515k0228274j7702849r30354J2946991J5089506J0487736M806602
2689f63487k894963j2373320j6251834q840712L136084P030681J442560j837677
2681c1252668L901563R585811N271656k931326k629314M154904M992865p62421
2673i668930r59172O520192Q091993j876422r031507j535024R967435Q654720
2665A0163285l131057r539470m607481L901920Q435176O863729j145228j1306851
2657c65977j3492697m373779M891175M556338J309918M032137M934591o374732
2649d883026j8433714j0958507J0970423K0418141P614886q522588j1934874q181314
2641b3910573m310272N155908J9371516K0916893J875404j7561661j5389056J264804
$$ y = [836670, -5132845, -25361119, -43063968, -43994322, -31047331, -15957825, -5470089, -663487, -3558450, -15931770, -32183604, -41024316, -37888232, -30857551, -29414991, -31252668, -27351105, -17765294, -12493638, -15424964, -18054278, -13899374, -8906509, -9668930, -10628102, -4107910, 3984083, 2107661, -6923846, -8458870, 1508565, 10163285, 7032228, -2507242, -7114723, -3212803, 5222373, 12086102, 10940874, -365977, -13858674, -18232453, -13341278, -8784940, -7475022, -3442885, 1491706, -4883026, -23316740, -34275247, -23304824, -2886683, 4728203, -3794385, -15729259, -23910573, -28220845, -23064937, -3693421, 17223472, 19098876, 1537215, -13851841, -12587037]
2633a2587037J0220796O879658K327768j252539j0384131k0276142j7514131k907742
2625d5493500P747186P560110N630932P659491P127482J182914j232711M500103
2617e317993Q453765K271586o011000n078051O69491j118394r170459r604397
2609b4905452J619116J1133778P924373l00693O37645R210796R702157m364927
2601A0656793j9108700j7894683k808339R492310R657563M006225J329000J294598
2593c375233j16934j761711n77995J264545n89311n179558p886646p530948n871080
2584c1624871j947062N936909J2937355J0323394j941705j1715778q293389M627140
2576b1698007J4356131J4682118J0330162P117972M305375q12915n898816o378530
$$ y = [-12587037, -2366241, 4513417, 6841185, 5588646, -4795485, -25071627, -42585758, -45493500, -37746314, -30186204, -24555272, -16895781, -9768299, -8585385, -9818096, -5317993, 3135772, 5407358, -603642, -5681693, -5012202, -6130596, -15301055, -24905452, -23286336, -12152558, -4228185, -4528878, -3891233, 5319563, 15021720, 10656793, -8451907, -26346590, -29154929, -19662619, -10005056, -5998831, -4669831, -3375233, -3492167, -5253878, -5831873, -4567328, -5156639, -10336197, -18222843, -25753791, -31624871, -33571933, -27635024, -14697669, -4374275, -6315980, -18031758, -26325147, -21698007, -7341876, 7340242, 17670404, 24788376, 29093751, 28280836, 22382020, 16003490]
2568A6003490l312345k947409p757203j2416136j0628015k643064O042227J0480961
2560g177494Q775570K102327n157231q364529q114894r066553j0895212o285066
2552d4183082O935852J7648841J3748103r05067j0836228q514963n36239M780117
2544b1862666N909315L168448m378146j2878122j2938845j136419J2504289J4312674
2536a7299472K577293j0314457j1316339p54061Q535903P093131L73482j501671
2528b2606191j332105q676810j6840837p064708J6982286K4349293L491115j4058333
2520b5756290n676192m441405m6157509q8779217n1428334O0044782J35576882
2513b6617283R9470352P895727l6526973j8193852J717186o724788j5011966n097707
$$ y = [16003490, 12691145, 9743736, 1986533, -10429603, -21057618, -23700682, -17658455, -7177494, 1598076, 3700403, -1456828, -9821357, -17936251, -27002804, -37898016, -44183082, -37247230, -19598389, -5850286, -6755353, -17591581, -26106544, -26642783, -21862666, -15953351, -12784903, -17163049, -30041171, -42980016, -44116435, -31612146, -17299472, -14722179, -25036636, -36352975, -37107036, -28571133, -21478002, -21104520, -22606191, -23938296, -32615106, -49455943, -56520651, -39538365, -15189072, -11697957, -25756290, -31432482, -35873887, -82031396, -170810613, -222238947, -162194165, -26617283, 72853069, 80748796, 44221823, 26027971, 27745157, 21020369, 6008403, 910696]
2505I10696K569055k911804k892003Q322836Q175743r454933j6463237J617062
2497a0126585J7814217Q547521p041639j453420J4752513J3052269n911638j7731752
2489A1901486j4734742j0487106r985526l557408R858909J7167251J2393117N215723
2481A7771704L654487K779713l525913j0420590r042783k36160N307405Q20399
2473G108262o467806l903277P349602J0288918l217503j5252095n024632J6761340
2465G642809J8796420m600915k2717447j2557943R509907J5003077K621327q461783
2457E235452r707179o985225k972972M331799J0919552J1135366Q295790P485415
2449B7737998M347486n104327j1523557n364931M015502M94590j2330116j5619921
$$ y = [910696, 3479751, 567947, -2324056, 5998780, 14174523, 4719590, -11743647, -10126585, 7687632, 16235153, 9193514, 7740094, 22492607, 35544876, 29633238, 11901486, -2833256, -13320362, -23305888, -26863296, -17004387, 162864, 12555981, 17771704, 21426191, 24205904, 20679991, 10259401, 1216618, 980458, 6287863, 7108262, 640456, -3262821, 4086781, 14375699, 11158196, -4093899, -9118531, 7642809, 26439229, 21838314, -879133, -13437076, -3927169, 11075908, 13697235, 5235452, -4471727, -11456952, -14429924, -10098125, 821427, 11956793, 20252583, 27737998, 32085484, 26981157, 15457600, 10092669, 14108171, 14602761, 2272645, -13347276]
2441a3347276m279927O677163N133774m850683j3719583j5886318q009968Q014304
2433d0268514J9676665J5202103R51248n708005o14503M384407K579027K84201
2425c513371J827649K804267J845852L759062O633608J047491j2317090j8803374
2417a6715906j0058208N045730J5660572K1102593K1185517J0145167r388187
2410C6977278k0277525j1753138L862351P827442k66762o906854o423823m930574
2402a891605o596346p935653m578985L904410J3650458J6477032O389342q985273
2394A0433380j2765553j688579O890705J143620n656965J908312J1462861q1264
2386A1646517k5502612l1720367q531366J4887077J3532562J591031M857267J7883448
$$ y = [-13347276, -17627203, -10950040, -5816266, -10666949, -24386532, -40272850, -48282818, -40268514, -20591849, -5389746, -4438498, -10146503, -10761006, -6376599, -3797572, -3513371, -1685722, 1118545, 2964397, 6723459, 13357067, 14404558, 2087468, -16715906, -26774114, -21728384, -6067812, 15034781, 36220298, 46365465, 36977278, 16699753, 4946615, 8808966, 16636408, 16369646, 9462792, 3038969, -1891605, -8487951, -16423604, -21002589, -17098179, -3447721, 13029311, 19418653, 10433380, -2332173, -4020752, 2869953, 4013573, -1643392, 264920, 11727781, 11646517, -13856095, -45576462, -54107828, -39220751, -25688189, -24097158, -19239891, -1356443]
2378a356443J5064094n209773j6413925n447885P559916J422632j3973504j4287576
2370c2642464K159914J2977828M689381j0103049j2646886k285523P201602P562132
2362b3087065K813522p44604j981088j590264J331414N957864P641789L385507
2354f272925k926721m631794n43381M307514N586496L690197P65559k154413l442748
2345e622216l50591O498368J1036935Q339102J203192m459862q577617j4465436
2337f398125j8485843j1951150L412495J2019588M363877p343100m465557J1635608
2329a7212207K1325086J4191550J542484k101108J848532K400818m035449j1303522
2321F656184j3282238r098210j708826L601801K395144l307513o270149l999710
$$ y = [-1356443, 13707651, 8497878, -7916047, -13363932, -5804016, -4381384, -18354888, -32642464, -30482550, -17504722, -12815341, -22918390, -35565276, -37850799, -30649197, -23087065, -20273543, -21018147, -22999235, -24589499, -23258085, -17300221, -9658432, -6272925, -9199646, -13831440, -14374821, -10067307, -4480811, -790614, -25055, -2179468, -5622216, -5972807, 525561, 11562496, 19901598, 21104790, 16644928, 8067311, -6398125, -24883968, -36835118, -33422623, -21403035, -17039158, -24382258, -28847815, -17212207, 4112879, 18304429, 19846913, 17745805, 19594337, 21995155, 17959706, 6656184, -6626054, -15724264, -17433090, -13831289, -11436145, -14743658, -21013807, -25013517]
2313b5013517k066502l667287k861674N445295J5156311J6617090R616538O33569
2305A3859823p687258j4587175j3716493m81500J4867004J5416152Q51728j0520603
2297a998322p458325p32001m267493j2404626q838118P163725J7823790J1386205
2289F74835k343474o850421j118012J941490m206324j1193001r421610j482114
2281c3998631L925268N326714P524944J0481377Q542869R73709n235521n131954
2273g591225j466663J348563K446029K062170O04385J274271O183071R563624
2265A4424225M417747l750843k456746O519391O884053n877945j5110104r118253
2257d068475Q58388J883706R86744P962427J2747984K584867j0787658p085393
$$ y = [-25013517, -27080019, -30747306, -33608980, -28163685, -13007374, 3609716, 13226254, 13859823, 6172565, -8414610, -22131103, -22612603, -7745599, 7670553, 8522281, -1998322, -9456647, -10188648, -14456141, -26860767, -35698885, -28535160, -10711370, 674835, -1668639, -8519060, -9637072, -7695582, -11901906, -23094907, -32516517, -33998631, -30073363, -24746649, -17221705, -6740328, 1802541, 2776250, -2459271, -7591225, -9057888, -7709325, -5263296, -3201126, -2596741, -1322470, 4860601, 14424225, 18841972, 15091129, 12634383, 19153774, 26037827, 20159882, 5049778, -4068475, -3210087, -1326381, -339637, 7622790, 20370774, 22955641, 12167983, 5082590]
2249E082590P350953P985712p710314j6673410q074590K602504K531473q23708
2241g728790O96612J537877k266130l268823J567039K969402l246724q024398
2233a7763935o877257p628082j1247413m950301J3442583K3951295J2780124m693164
2225b986150o086816O831329J5601846J1614897j91886j2995508j9276623j1657292
2217a9146203M228664R987488J67838p002660J699194J2682338R972093K754397
2209A5343149N768023R320045l519473k2839841k5051545j1304243k278005j093503
2201c5655393O294562J7091138J2840711l314415n546808J0858882J8246962J713773
2193B2529412j6068317j2758841r41238k588101j2083080j0455977J47277L271130
$$ y = [5082590, 12433543, 20419255, 12708941, -3964469, -12039059, -9436555, -6905082, -7728790, -7032178, -5494301, -7760431, -11029254, -9462215, -6492813, -9739537, -17763935, -24641192, -32269274, -43516687, -48466988, -35024405, -11073110, 1707014, -2986150, -9072966, -2241637, 13360209, 24975106, 24783220, 11787712, -7488911, -19146203, -14917539, -4930051, -4762213, -11764873, -10065679, 2616659, 12588752, 15343149, 21111172, 30431217, 26911744, 4071903, -20979642, -32283885, -34561890, -35655393, -29360831, -12269693, 571018, -2743397, -8290205, 2568677, 20815639, 22529412, 6461095, -6297746, -7238984, -9827085, -21910165, -32366142, -32218865, -28947735]
2185b8947735o08010L885926J7229739K1128286O911877j0919540j5094914o182697
2177a2597068L337568O012140L506999n61861m511520o033444j612009P790595
2169d668600J3080611N652994r051091j4461833m175479Q037126P576281l35882
2161A654127j195151N584572R598992R372423J0629958Q783751m777147j9684814
2153A9966711j4781161O763626J6477167L147580j0107005m596226M672038j765396
2145A9777334j3118991q758262M499776M393329q665086j4112730n738818L233050
2137a8490398O119390P976794O595274n342709j8069604j1510123J0851213K0901762
2129i68401P154958p978412m581450M935072M95949j0761869p640516Q733473
$$ y = [-28947735, -29555745, -25669819, -8440080, 12688206, 19600083, 8680543, -6414371, -12597068, -9259500, -3247360, 259639, -302222, -4813742, -10847186, -12459195, -4668600, 8412011, 14065005, 5013914, -9447919, -13623398, -5586272, 1990009, 1654127, 458976, 6043548, 15642540, 25014963, 35644921, 44428672, 39651525, 19966711, 5185550, 11949176, 28426343, 31573923, 21466918, 16870692, 21542730, 19777334, 6658343, -2099919, 2399857, 6793186, -1871900, -15984630, -21723448, -18490398, -12371008, -4394214, 2201060, -3141649, -21211253, -32721376, -21870163, -968401, 6186557, -1791855, -6373305, -1438233, -942284, -11704153, -19344669, -10611196]
2121a0611196J6173776N756090o789999o629170O63323J916821l508370n573643
2113h602368M84158Q545296J0849494O880143J449534k325632m532443m376952
2105H371230J65111O934147R160318M500252n08417p27869j635172r523773j7390521
2096f54694j3140063j1858N968893Q02181j052985Q913992J8050760J2412835
2088C1289061j355811p941876p098225r319644j4315122j1501138k09788P352112
2080a3100431N122402O79240M43086N43238k714815m891613j992939K466998M722514
2071h722320O492808Q138180M990246l227079p796967k999821M713661O532706
2063H121414K905836j615533o755616j1208809p720550N485480J5800092J1372368
$$ y = [-10611196, 5562580, 11318670, 4528671, -2100499, -1437176, 479645, -3028725, -8602368, -8118210, 427086, 11276580, 18156723, 19606257, 17280625, 12748182, 8371230, 8536341, 15470488, 24630806, 29131058, 28622641, 27894772, 26259600, 16735827, -654694, -13794757, -13806615, -7837722, -7035541, -8088526, 825466, 18876226, 31289061, 29933250, 21991374, 14893149, 5573505, -8741617, -20242755, -20452543, -13100431, -7978029, -7298789, -6855703, -6312465, -9027280, -13918893, -15911832, -13444834, -8722320, -2229512, 5908668, 10898914, 7671835, -125132, -3124953, 1588708, 8121414, 11027250, 9411717, 2656101, -8552708, -16273258, -10787778, 5012314, 16384682]
2055A6384682n88054l899582L012164P865462N036219j84176n389127j2352676
2047I884912j5309816o006199P972202Q662386m521626j1528939k385360Q297478
2039d934962O626162r7327o57705L20134m674931q895954m164849K327339J302956
2030a2849137p78775M860949J0128602M108528m858353l022594K758961k867375
2022b519194j3551069j0035880N236292J0408106L50932p539212n640808n693312
2014b8984145j0847462o719842R982000K0124812J1795451j682763n723110m537602
2006a6592661m626738m20091R006158J0142296j869954j0317629l819144L729188
1998a4768575j638801q763317k585555P783556O043830j715604N62310R484390
$$ y = [16384682, 15796628, 11897046, 14909210, 22774672, 27810891, 27626715, 22237588, 9884912, -5424904, -11431103, -3458901, 5203485, 681859, -10847080, -13232440, -4934962, 1691200, 1593873, 936168, 1256302, -3418629, -12314583, -16479432, -14152093, -12849137, -13627912, -8766963, 1361639, 5470167, 611814, -2410780, 348181, -2519194, -16070263, -26106143, -20869851, -10461745, -10110813, -17650025, -23290833, -28984145, -39831607, -46551449, -36569449, -16444637, -4649186, -6331949, -12055059, -16592661, -21219399, -21639490, -12633332, -2491036, -4360990, -14678619, -18497763, -14768575, -16407376, -25170693, -27756248, -19972692, -13928862, -15644466, -15082156, -5597766]
1990e597766J0301291M138374K776397N401263M251885M029367J1287150J4379924
1982E0967885O46557j5736212j2593268J240731j382268j8524176k0528708m02332
1974a6311791J3966050O246649m235588J350751J1534360Q599406k177143n912356
1966A3060338j644852L742759Q621045J0191843J525107j2804163j5462962k791447
1958D437668N914744j583522j0934645p084088M24233k570130p544005J045516
1950a7894229J6012086J7110337K354106j1595043j4589185r881692j267744R034677
1942a0716687J4064726R491984K874095J901657N13876q448537j5525532p768163
1934a3612581P520957J2044558M561503p74273o45314n120604j4218559j4344464
$$ y = [-5597766, 4703525, 8841899, 11618296, 17019559, 21271444, 25300811, 36587961, 50967885, 51614442, 35878230, 23284962, 24525693, 23143425, 4619249, -15909459, -16311791, -2345741, 3900908, -334680, 1016071, 12550431, 21149837, 18972694, 13060338, 11415486, 15158245, 23779290, 33971133, 35496240, 22692077, 7229115, 4437668, 10352412, 8768890, -2165755, -9249843, -8825610, -11395740, -18939745, -17894229, -1882143, 15228194, 17582300, 5987257, -8601928, -18483620, -19751364, -10716687, 3348039, 12840023, 15714118, 17615775, 18129651, 9681114, -5844418, -13612581, -6091624, 5952934, 10514437, 9740164, 9094850, 3974246, -10244313, -24588777]
1926b4588777k397916O392799J575511p973718r945383n130992m97425K749907
1918c9815994O719151J0873035J3732014J3773361P126479p029148j8694890j5941208
1910b9257200k681177M772847R89459k162055L849850J1188305R830381K273331
1902a196259l925809p567217r373835n743877M049007J2274532J2795564R498597
1894A0810703O950733R85287j1493099k0741578j4767271J900227J2235156R025117
1886e094725K455933L817524J0832443J3198238O649991l219817q479871o795237
1878A3364479k635391k132947o413238r886226o208677L876447J2162724J1697581
1870A3824752M923415N95416K110841K884061k958856r345571o029561L321157
$$ y = [-24588777, -26986693, -20593894, -19018383, -26992101, -36937484, -42068476, -42565901, -39815994, -33096843, -22223808, -8491794, 5281567, 12408046, 5378898, -13315992, -29257200, -31938377, -27165530, -26176071, -28338126, -24488276, -13299971, -3469590, -1196259, -5122068, -12689285, -22063120, -27806997, -23757990, -11483458, 1312106, 10810703, 17761436, 18746723, 7253624, -13487954, -28255225, -26354998, -14119842, -5094725, -2638792, 1178732, 12011175, 25209413, 31859404, 28639587, 20159716, 13364479, 10729088, 8596141, 2182903, -7703323, -13912000, -10035553, 2127171, 13824752, 18748167, 19343583, 21454424, 24338485, 21379629, 12034058, 6004497, 9325654]
1862I325654K505562j2899464k4251688j3470459J0223009K1007416J0261850
1855B701880m805407o710730J780395O808736K461626n213709o892431J240127
1847h629513J3105745J6664186P550276l034374k038390O265342O169694n209723
1839C0843243j3394537q632553J615551P138192Q098671O868860K91141j0614132
1831B2214436j5304207q892632k191811n128449r960468m128250Q442283J3419794
1823a529304P734671P83762k001249k737718j307233L657604N778912k340214
1815H039231j3540210j2227434K104099J2351869Q739882J535932K010545M535839
1807A3549753j490724j2140645j4666188p491017j339091j252029M63939R698308
$$ y = [9325654, 11831216, -1068248, -25319936, -38790395, -28567386, -7559970, 2701880, -2103527, -8814257, -7033862, -225126, 2236500, -2977209, -9869640, -8629513, 4476232, 21140418, 28690694, 25656320, 23617930, 29883272, 36052966, 30843243, 17448706, 8816153, 10431704, 17569896, 25668567, 32537427, 32828568, 22214436, 6910229, -1982403, -4174214, -9302663, -19263131, -23391381, -14949098, -1529304, 6205367, 6989129, 4987880, 2250162, 942929, 4600533, 10379445, 8039231, -5500979, -17728413, -15624314, -3272445, 5467437, 7003369, 9013914, 13549753, 12059029, -81616, -14747804, -22238821, -23577912, -24829941, -24366002, -14667694]
1799a4667694J8116211J2910904m477628j7460766j3898597o57303O353926K932158
1791a0848789n44332L158800P236891K881566n658402o993722M13845O822546
1783c531597N941226K171817J800892M516755O330558N081332K64039p709261
1775A4865761j5067251j5463123o632796N704134J2790929J0740285L206626k400703
1767G743862j918555Q15479j814404r715925j1443120K144171K2545864K9569609
1759C7926981J4083420j0869140k3831890j5930454K842125J4322920Q400545
1752B6944507p735309j6370839q619838M888891Q017054Q31761k203531M593746
1744A0346442R106887P19205j2362538j4633341n217005K850147K489943O38588
$$ y = [-14667694, 3448517, 16359421, 11881793, -5578973, -19477570, -20134873, -13780947, -10848789, -11393121, -8234321, -997430, 1884136, -3774266, -10767988, -10354143, -3531597, 2409629, 4581446, 6382338, 10899093, 17229651, 22310983, 22575022, 14865761, -201490, -15664613, -22297409, -16593275, -3802346, 6937939, 10144565, 7743862, 5825307, 6640786, 4826382, -4889543, -16332663, -14188492, 8357372, 37926981, 52010401, 41141261, 17309371, 1378917, 4221042, 18543962, 26944507, 19209198, 2838359, -5781479, -892588, 7124466, 7956227, 5752696, 10346442, 19453329, 20172534, 7809996, -6823345, -12040350, -9190203, -6700260, -6061672]
1736f061672M850827J0831508Q699912k379352j1523780q812460K194712P706343
1728E506038N19648r397140o018776J1150133K3291159J4457710p400739j8995671
1720A3112362r813793O684859J2185772N589016p59001j018878j005831l925289
1712B1049217l548912K822774N906171o69413o167316J707346J3163160P794570
1704D2057597j0965238j5689798L894404K2399739J5513588m767428j1262807
1697D1180057j935063M614134K836948L389684Q268826Q359456L920621M137375
1689G4772038P845321P290561P223122J4807734J6893128K09194j2168096R828203
1681A26701205L5446035o272035j14159058j82174505j26256483m7792P3801385
$$ y = [-6061672, -1210845, 9620663, 18320575, 15941223, 4417443, -4395017, -2200305, 5506038, 6025686, -3371454, -9390230, 1759903, 25051062, 39508772, 32108033, 13112362, 3298569, 9983428, 22169200, 27758216, 26999215, 25980337, 24974506, 21049217, 17500305, 20323079, 26229250, 25559837, 19392521, 21099867, 34263027, 42057597, 31092359, 15402561, 19296965, 41696704, 57210292, 52442864, 41180057, 39244994, 43859128, 46696076, 50085760, 58354586, 66714042, 70634663, 74772038, 82617359, 89907920, 97131042, 111938776, 128831904, 129041098, 116873002, 126701205, 162147240, 155875205, 41716147, -140458358, -266714841, -266762633, -192961248]
1674a92961248N7179573J6217218N611825Q452799j843722r805908L065996J8568467
1666i5515000J5302437O070803J0038345J6231294N923326j1208314j3504975
1659f6662084k855179L782687M513092Q507939J3504255J1502410P240494Q510344
1651a1956042P502835n554628j8893645j3431555N406650J4214126O840101n48107
1643a6420265P11467J92731r293046j7916724j4818972l433840O089435R560522
1635d5328692Q944968P402564O851048N754657R25411m278653l99076J2155434
1627g972339J7369296N546506r323304r623395j419926k030685r008327n949292
1619b2411466N417883O373146n104472r992760k607126q57175j2161388j6957476
$$ y = [-192961248, -135781675, -119564457, -113952632, -105499833, -107343555, -117149463, -114083467, -95515000, -80212563, -74141760, -64103415, -47872121, -41948795, -53157109, -66662084, -69517263, -65734576, -61221484, -52713545, -39209290, -27706880, -20466386, -11956042, -4453207, -10007835, -28901480, -42333035, -36926385, -22712259, -15872158, -16420265, -15708798, -15516067, -24809113, -42725837, -57544809, -60978649, -54889214, -45328692, -36383724, -28981160, -22130112, -16375455, -15450044, -19728697, -20127773, -7972339, 9396957, 14943463, 5620159, -4003236, -5423162, -7453847, -16462174, -22411466, -16993583, -10620437, -15724909, -25717669, -28324795, -29181970, -41343358, -58300834]
1611e8300834j963900J4934891J3206554K306538K522381R716721N546154p627820
1603a9659315r578115L568864J3355616Q852492L08145k152549m195500j2694797
1595b2195159j9914650j3600181M620320K0036199K0965596R126719l615192o237858
1587a0814206J335475Q183754M927831m660021q860411l635182L302133M813187
1579e407440L743526O056735R626305O497929m053140j0942298m422678Q431263
1571I530202Q849251r329079k7071392k1050862N155498K2492806J2286919j0275750
1563i412407j6514491n25526J5818945J2082849o661172j8153692r825546P835859
1555b5355181J5240016P559090r91167J609768P740001K827254j0174477j3472560
$$ y = [-58300834, -60264734, -45329843, -32123289, -29816751, -27294370, -17577649, -12031495, -19659315, -29237430, -25668566, -12312950, -3460458, -3152313, -5304862, -9500362, -22195159, -42109809, -55709990, -51089670, -31053471, -10087875, -961156, -4576348, -10814206, -9478731, -1294977, 3632854, -1027167, -9887578, -13522760, -10220627, -5407440, -1663914, 4392821, 14019126, 20517055, 16463915, 5521617, 1098939, 9530202, 18379453, 9050374, -18021018, -39071880, -33916382, -11423576, 863343, -9412407, -25926898, -26452424, -10633479, 1449370, -5211802, -23365494, -33191040, -25355181, -10115165, -2556075, -3547242, -1937474, 5802527, 8629781, -1544696, -15017256]
1547a5017256j830023Q354350K917948j0842553j6974998j1110547J011418J3763289
1539b9728372K0065023J1099009r606006k1890092j3088669K523701M196702l944977
1531d0373681j324662J4668745K4512002J6944314K986879m185151n140217m516229
1523C572000k191837j059459q199173j9858916j9301936J72874K1777197K5667697
1515E78447J3314388P17162m112343m784191l928078k39810L721852K036425n247973
1506B055879j1078241j0892676p309609m248033j379586L383751Q938136J1316728
1498i213651Q645692L930731J531339J837963K158820K190936L486776K952190
1490A7520796n024319j6197226j6103779l59122J4016245R671207o204613j2841134
$$ y = [-15017256, -16847279, -8492929, -5574981, -16417534, -33392532, -44503079, -43491661, -29728372, -9663349, 1435660, -8170346, -30060438, -43149107, -40625406, -36428704, -40373681, -41698343, -27029598, -2517596, 14426718, 17413597, 13228446, 8088229, 3572000, 1380163, 320704, -7878469, -27737385, -47039321, -46866447, -25089250, 578447, 13892835, 14609997, 10497654, 5713463, 1785385, 1545575, 5267427, 7303852, 2055879, -9022362, -19915038, -27224647, -31472680, -32852266, -29468515, -20530379, -9213651, -567959, 3362772, 4894111, 6732074, 8890894, 11081830, 14568606, 17520796, 12496477, -3700749, -19804528, -20163650, -6147405, 3523802, -2680811, -15521945]
1482a5521945n928293P48576M78074P10410M430361M471993J13178K27892M962618
1473e307136L538691l962432l664021N446609N230931r209352j5402895K53840
1465b3075765J5481526N584796j5383473j6003123L309198J4004028N534982l821592
1457a4369423j743420K100203n86523k805642R20686M455559L533304J652902
1449f842354j827330j1239709j8915300j0463794R169967J6617995M646286o222916
1441b5077155q80680P863175M057664n025452n324302j055725k854651m991012
1433c3288138L483838J4986278J3302199J089480l962344K794119Q758901O628103
1425A3792436K234696n53071m978383r423449o651214J879981N791771L131499
$$ y = [-15521945, -21450238, -20701662, -20223588, -19513178, -15082817, -10610824, -10497646, -10269754, -5307136, -1768445, -5730877, -9394898, -3948289, 1282642, -7926710, -23329605, -23075765, -7594239, -2009443, -17392916, -33396039, -30086841, -16082813, -10547831, -14369423, -16112843, -14012640, -14599163, -17404805, -16484119, -12028560, -8495256, -6842354, -8669684, -19909393, -38824693, -49288487, -40118520, -23500525, -18854239, -25077155, -25957835, -18094660, -14036996, -19062448, -24386750, -25442475, -28297126, -33288138, -29804300, -14818022, -1515823, -426343, -4388687, -1594568, 7164333, 13792436, 16027132, 15474061, 10495678, 1072229, -5578985, -3699004, 2092767, 5224266]
1417E224266L527597J0167589J3058967N752774m533442r808305j1905074j3347883
1409a863511r703322O87816R892447J1692354J0093708Q935765M113661m525055
1401B9323863n657173O151912J6170732Q536572q409150j3749821n689105j634336
1393B5043494q102036j1992500n592133M62517k312199n144001N95151O350514
1385f91193J447842o933114n314894L189915M770253j897022n905170m575288
1377a5908671n540886q333804k431417J2088292J9178605J0202478j480656L29404
1369H103345J1565423J5209936M774346j0009004j6919847j2383226j859390M633851
1361C115434M40504r628526j3006721m742736O325217J0031080N913967k342095
$$ y = [5224266, 8751863, 18919452, 31978419, 37731193, 33197751, 23389446, 11484372, -1863511, -11566833, -10879017, -986570, 10705784, 20799492, 29735257, 33848918, 29323863, 23666690, 29818602, 45989334, 54525906, 46116756, 32366935, 26677830, 25043494, 16941458, 4948958, -643175, -180658, -2492857, -7636858, -7041707, -691193, 756649, -6176465, -11491359, -8301444, -3531191, -5428213, -11333383, -15908671, -21449557, -29783361, -32214778, -20126486, -947881, 9254597, 7773941, 8103345, 19668768, 34878704, 39653050, 29644046, 12724199, 340973, -1518417, 3115434, 3555938, -6072588, -19079309, -23822045, -17496828, -7465748, -1551781, -3893876]
1353c893876j3481043k2563182j8995980j562056J3422078J1652811J335467K93951
1345c3791830Q901302J2124928M978503j762442j387875K83065p51066M87603
1337a0917812N642274P123704P83528o629127q331144n999961l039855M78035
1329b0890358K278066j612313o636242k130373J0825167J6982795R157389n86580
1321G387551p01141K653921l20304m827333k019036K668134j496898j0161912
1313f817018r712878K20563O490597L338893j595458k374153j680278r68513L375920
1304i722325J0949976J5016262J2051429M884730m189079j3526951j5909463n156069
1296e601490R359561R344525o184386j5771171n222364J0952663J0500090m425987
$$ y = [-3893876, -17374919, -39938101, -58934081, -60496137, -47074059, -35421248, -34085781, -33791830, -24890528, -12765600, -7787097, -9549539, -10937414, -10654349, -11405415, -10917812, -5275538, 1848166, 2631694, -3997433, -12328577, -18328538, -21368393, -20890358, -18612292, -20224605, -26860847, -28991220, -18166053, -1183258, 7974131, 7387551, 6686410, 9340331, 9020027, 4192694, 2173658, 4841792, 3344894, -6817018, -16529896, -16309333, -9818736, -6479843, -8075301, -10449454, -12129732, -13098245, -9722325, 1227651, 16243913, 28295342, 33180072, 28990993, 15464042, -445421, -5601490, 3758071, 13102596, 6918210, -8852961, -14075325, -3122662, 7377428, 2951441]
1288B951441j2242581m164996N953858N264386o72944j075704J976157n2470m986169
1279g049022k830502N616680O909364m042909j3390695q021901L458525K876226
1271a6474234r255610j3914091k716302J0093429J1137212P482334J1028248J6230835
1263A3611821R768075n007151j1392388n388743j150277p439709j3831063p576056
1255b8405491O807911J4175901R152165J025621n76042J710505k128526j3503816
1247a1741772j9207672p108429J4030030K0944772N811271j1995600j2772130
1240b2039530l227894k136323r197813q226721K874992P883006L90755n113428
1232c8792956K245443J2279349J1091581J554563m374797k607316L290980R212311
$$ y = [2951441, -9291140, -13456136, -7502278, -2237892, -2910836, -3986540, -2010383, -2062853, -7049022, -9879524, -4262844, 2646520, -1396389, -14787084, -22808985, -19350460, -16474234, -25729844, -39643935, -42360237, -32266808, -21129596, -13647262, -2619014, 13611821, 23379896, 18372745, 6980357, 1591614, 441337, -6998372, -20829435, -28405491, -21597580, -7421679, 1730486, 2756107, 2180065, 3890570, 1762044, -11741772, -30949444, -38057873, -24027843, -3083071, 2728200, -9267400, -22039530, -25267424, -27403747, -36601560, -44828281, -41953289, -34070283, -33679528, -38792956, -36547513, -24268164, -13176583, -11622020, -15996817, -18604133, -15313153, -6100842]
1224f100842R523685k43441j2451802j1774535J215071N922909p130027j7258283
1216c8297265l255182K1159183K3921243k3513k2733801k1802519m354705J0487976
1208c4898583J5250778J3525275Q890458K864966k490074n248448m592171j321406
1200h019205K55231m527245j1397753q530842N747069J6080399J1291557J999435
1192B898646K795179P424106Q71112j2228533j4376441n598653j728840m005723
1184b3949147J777805J3417294R956080j0287413j9765266m463472J1968345O801948
1176a4543826n376129o53778J1888038P309538j0201569j3258887L674769J7025891
1168d135953J2299271J270881l142002m241509o754906n849387M54104M831447
$$ y = [-6100842, 3422843, 3179402, -9272400, -21046935, -19831864, -13908955, -21038982, -38297265, -41552447, -20393264, 3527979, 3504466, -19229335, -41031854, -45386559, -34898583, -19647805, -6122530, 2767928, 5632894, 3142820, -2105628, -6697799, -8019205, -7763974, -12291219, -23688972, -32219814, -26472745, -10392346, 899211, 2898646, 5693825, 13117931, 13989043, 1760510, -12615931, -18214584, -19943424, -23949147, -22171342, -8754048, 1202032, -9085381, -28850647, -33314119, -21345774, -14543826, -19919955, -20573733, -8685695, -1376157, -11577726, -24836613, -21161844, -4135953, 8163318, 9434199, 6292197, 2050688, -4704218, -10553605, -10099501, -5268054]
1160e268054M286345N509075J0463597J1317322N832588K815717N135445K282081
1152D2374116j1164832k3276140k1353496r526507R9132L530800K607582k742034
1144a9451379r228012p192995M962413J2146557K063155j3551361j2504255O479152
1136c6276725K1515233J7255302K797194m233557m71982L347064p56186q713292
1128e536949j1229627n347143L082967P528075Q027793Q076687P783126N535845
1120A7920774L963539O444243Q708519L278801p506836j3704431j4063331j6837375
1112a1796097k1233097j4446255M892246J7437419J0488938q51275K691078J2928177
1104A11134Q060662j0407018j9178194r122366M219838Q045562P643823Q729238
$$ y = [-5268054, -981709, 4527366, 14990963, 26308285, 32140873, 34956590, 40092035, 42374116, 31209284, 7933144, -13420352, -22946859, -22847727, -19316927, -16709345, -19451379, -28679391, -35872386, -30909973, -18763416, -16700261, -30251622, -42755877, -36276725, -14761492, 2493810, 5291004, 1057447, 585465, 3932529, 3176343, -5536949, -16766576, -22113719, -19030752, -11502677, -3474884, 4601803, 12384929, 17920774, 21884313, 28328556, 37037075, 40315876, 32809040, 19104609, 5041278, -11796097, -33029194, -47475449, -42583203, -25145784, -14656846, -15508121, -12817043, 111134, 8171796, -2235222, -21413416, -30535782, -26315944, -18270382, -10626559, -1897321]
1096a897321N124515o498151j6034178j4408002o202085M07345M740148P605056
1088b7162673O197127K099066K427632O282571L207541p388063j0150458K639197
1080b1848060J6183892J4846477N004538R87901Q00102n654046j3710362j0159884
1072a3549442K465479Q027406J962886m036330k938859n01944l15087K627905
1064f257986R016265J0754787N318279J787373N777449R147617K359964j0757469
1056B7146279j7589328j1317117K952627J2552005P263693r093516j8449058q540578
1048a5074993Q718967J1132915k265475r800291o66523Q678536J675404j1576862
1040i178322j0745806L019254J0626997N064758q09364K985328R199465O793487
$$ y = [-1897321, 3227194, -3270957, -19305135, -33713137, -39915222, -39507877, -34767729, -27162673, -20965546, -18866480, -16438848, -10156277, -6948736, -14336799, -24487257, -21848060, -5664168, 9182309, 14186847, 15174748, 15974850, 10320804, -3389558, -13549442, -11083963, -3056557, -1093671, -5130001, -8068860, -8570804, -8885891, -6257986, 2758279, 13513066, 18831345, 20618718, 26396167, 35543784, 37903748, 27146279, 9556951, -1760166, 1192461, 13744466, 21008159, 11914643, -6534415, -15074993, -6356026, 4776889, 2511414, -7288877, -7955400, 723136, 2398540, -9178322, -19924128, -16904874, -6277877, -1213119, -2022483, 962845, 10162310, 16955797]
1032A6955797k774676r394210p763603j465646K700230Q61978n028145q566365
1024a4474640n322537J412962L925295j94337m310402l75688J0692790J7800511
1016I153954J0651279o715388j6259637n414588J4725961J9378278J042804j9199633
1008G363030j8379888p58837J0725932N802490m529389q628069p770072n932605
1000b2107408o29667Q086142J0620925O15313j1958462j1638811J447920J1467964
992a4096084P684381l212955p487128n46234J0362682J5638784J2411137N733678
984B6488261K255725K407597Q6791q205036j6490487j6061289p910826k507998
976a9937262o054907j2719853j3402792p100819P91985P244685J2593366J5069708
$$ y = [16955797, 14181121, 4786911, -2976692, -4442338, -1742108, -880130, -5908275, -14474640, -19797177, -18384215, -14458920, -14653257, -18963659, -19339347, -8646557, 9153954, 19805233, 13089845, -3169792, -8584380, 6141581, 25519859, 26562663, 7363030, -11016858, -11775695, -1049763, 4752727, 223338, -8404731, -16174803, -22107408, -22737075, -14650933, -4030008, -3414695, -15373157, -27011968, -25564048, -14096084, -6411703, -9624658, -17111786, -17658020, -7295338, 8343446, 20754583, 26488261, 28743986, 31151583, 31238374, 23033338, 6542851, -9518438, -17429264, -19937262, -25992169, -38712022, -52114814, -59215633, -58423648, -51178963, -38585597, -23515889]
968b3515889J1355396L310104j734548J95025M827245O327325N217384N790563
960A1772605P986474O790930L3337p436849r749816p591457o038172n620346j019110
951a0872404Q288351J1506015j108501k0658689k5307088p829957J2893900J6430679
943a6657694P313369L718182O964817J742381j3775080k0222143p547925O767816
935c1696277M443198m998665j758105R802476Q141479q384112j6542754l995007
927d4987767J2284232J2584816J394006m730498k360478L68093J290043M788130
919a9369423R226626P950000K061282J77956M038775M765405k852693j0716589
911d718661q147288K493104P917802J053597r932354j2431419n085073K645868
$$ y = [-23515889, -12160493, -8850389, -10584937, -10389912, -5562667, 764658, 5982042, 11772605, 19759079, 26550009, 26583346, 19146497, 9396681, 1805224, -4232948, -9853294, -10872404, -2584053, 8921962, 7813461, -12845228, -38152316, -45982273, -33088373, -16657694, -9344325, -5626143, 1338674, 3081055, -10694025, -30916168, -38464093, -31696277, -27253079, -32251744, -34009849, -24207373, -16065894, -24450006, -40992760, -44987767, -32703535, -20118719, -18724713, -23455211, -25815689, -25447596, -24157553, -19369423, -10142797, -2192797, -131515, 46441, 4085216, 8850621, 5997928, -4718661, -12865949, -10372845, -2455043, -1401446, -11333800, -23765219, -28850292, -26204424]
903b6204424M935728N893899R048378Q974600P50039q336115p052843K147121
895i843617N059119l783065j3191619j1309802l80871R303375J2724458J1622141
887B00119Q052438K561343l349406o665330m616471K257996P315958K552214q854932
878e46071j1226793K771360J6756397J1016201o608212j0336037L588892J0633400
870A6049137k153942j5223347r211345M143587L472985p677720j0658970l344653
862b4604268J894787L345474R186690J6340090J3183010J959062k552284L034377
854B1786938P125753L911963l18464j974539l618753k724365M678832R423726
846C8291091j402571j9383497k1169809l704575R684100M889504m304572k871840
$$ y = [-26204424, -21268696, -15374797, -6326419, 2648181, 3398220, -4937895, -11990738, -9843617, -4784498, -8567563, -21759182, -33068984, -33449855, -24146480, -11422022, 200119, 8252557, 10813900, 7464494, 799164, -3817307, -1559311, 5756647, 8308861, -546071, -11772864, -9001504, 7754893, 18771094, 12162882, 1826845, 5415737, 16049137, 13895195, -1328152, -10539497, -6395910, -2922925, -10600645, -21259615, -24604268, -22709481, -19364007, -10177317, 6162773, 19345783, 21304845, 18752561, 21786938, 28912691, 32824654, 32506190, 30531651, 26912898, 24188533, 28867365, 38291091, 36888520, 17505023, -3664786, -7369361, 2314739, 7204243, 2899671, 27831]
838B7831K710032J880610j68859L603149N620534j176354o325788J321968J1694279
829A9187402P759983p334456j6442470j4806920j1288267q083141J209455J4171668
821a5626746J8057880Q390755m252946q672912m228980L102255O645008J457214
813D871528j0124732j6521309r460103L518406Q725397N701372N239019R883102
805A832680J0412889L508440r69199L933550R879171M878154r462740j9907666
797D105279j7530605o199697L218039L512751l189666q291756n339662L916032
789b5799285J2050002J3195410P246396p80098m483716j812192K288114K286961
781D191592L48283J929895L973663j877018j2134411j1366784L572501J3825727
$$ y = [27831, 2737863, 4618473, 4449614, 8052763, 13673297, 12496943, 6171155, 7493123, 19187402, 26947385, 19612929, 3170459, -11636461, -22924728, -31007869, -29798414, -15626746, 2431134, 10821889, 6568943, -2103969, -6332949, -3230694, 3414314, 4871528, -5253204, -21774513, -31234616, -27716210, -18990813, -13289441, -8050422, 1832680, 12245569, 15754009, 14784810, 18718360, 28597531, 33475685, 24012945, 4105279, -13425326, -19625023, -16406984, -12894233, -16083899, -24375655, -29715317, -25799285, -13749283, -553873, 6692523, 5912425, 1428709, -383483, 1904631, 4191592, 4539875, 6469770, 10443433, 8566415, -3567996, -14934780, -11362279, 2463448]
773B463448N682429o051550k02008J5200178J3127637r520440k4533268j3209322
765a7042896Q096322J4456170O165173P29235L625552M692007j528113p736306
757A1457144o710715r58891L058477L180616J276906q80713k907865m761673n786473
748c033187m701514r67307L694222O085466M017946k319875j0040293j3534709
740b0799251p779846N010527J4540003J2672984K846288n104505p225196o888536
732a2727532n994134k199524M642866R931701R879460N025348k110059q130154
724a682028q136185p6184R899418J2216605M759706n802985j2865704j4337814
716a6025171r662221j15063P837911P434133J075949k242326K51851K490521O33302
$$ y = [2463448, 8145877, 2094327, 1892319, 17092497, 30220134, 20699694, -3833574, -17042896, -8946574, 5509596, 11674769, 12404004, 16029556, 20721563, 19193450, 11457144, 4746429, 3787538, 6846015, 10026631, 11303537, 10422824, 7514959, 2753286, -3033187, -7734701, -8702008, -5007786, 1077680, 5095626, 2775751, -7264542, -20799251, -28579097, -23568570, -9028567, 3644417, 6490705, 1386200, -5838996, -12727532, -18721666, -20921190, -16278324, -6346623, 3532837, 8558185, 6448126, -1682028, -9818213, -9894397, 5021, 12221626, 16981332, 11178347, -1687357, -16025171, -25687392, -25802455, -17964544, -10530411, -9454462, -11696788, -11444937, -8954416, -8321114]
707h321114j682750j058248R50846L115218O334713P794605K175197p941966j1805037
698a0438536n167148L001938L620731k77557k42976M950177R184310P138082j312541
689A0456480j0773003j3016748n579525K546795J743473l112849k29666P205249
681a0759794L686672j0617082j4741457K76295J3528851N389353j0873047j0116953
673c4227162M977827J0736034K272466r60091R769237J7713877Q634405p266394
665A1650199j2433215n603924L095549Q966164J2876911J2620168N446800m485014
657C2133638r320696o400140J43322L713018q56308j2672455k1891177j7587562
649c2738360j410787J2720992J5193740R968831M435656j068724p813559j1099793
$$ y = [-8321114, -10003864, -11062112, -10111266, -6996048, -661335, 7133270, 9308467, 1366501, -10438536, -15605684, -12603746, -8983015, -9260572, -9503548, -4553371, 4630939, 11769021, 10456480, -316523, -13333271, -18912796, -16366001, -14622528, -17735377, -17965043, -10759794, -7073122, -17690204, -32431661, -32155366, -18626515, -13237162, -24110209, -34227162, -29249335, -18513301, -16240835, -17200926, -7431689, 10282188, 18916593, 11650199, -783016, -6386940, -3291391, 5674773, 18551684, 31171852, 36618652, 32133638, 22812942, 16412802, 16556124, 20269142, 19412834, 6740379, -15150798, -32738360, -34149147, -21428155, -6234415, 3734416, 8170072, 7101348, -712211, -11812004]
641a1812004o701469N12479K941933J439530J776513L003601j121321r536201
633a9496939j2029794k742089J1120651J7818114J4241465P179298M018292N325871
625B5434869N888689J273592o725768j1174701p333854J507600P206364N784925
617B1861716J310475J33730L183971N536240K690490m307907r984183r812069
609A0612463m445984J051229K368673K22673j422508j106477j356482l458876
601B464711m445514k705603k743416p817186j0566513j132025J4713355J8214262
593E982071M082912q827693m261261O212440J639963j3317600j4255152L936420
585a8807900J8255043J3087182J255474j169460K87352n398176j1861661q027724
$$ y = [-11812004, -18513473, -18000994, -15059061, -13619531, -11843018, -8839417, -9960738, -19496939, -31526733, -34268822, -23148171, -5330057, 8911408, 16090706, 20108998, 25434869, 31323558, 32597150, 25871382, 14696681, 7362827, 8870427, 16076791, 21861716, 23172191, 23305921, 26489892, 32026132, 34716622, 30408715, 20424532, 10612463, 6166479, 7217708, 9586381, 9809054, 8386546, 7280069, 5923587, 2464711, -1980803, -4686406, -7429822, -15247008, -25813521, -26945546, -12232191, 5982071, 10064983, 1237290, -3023971, 3188469, 4828432, -8489168, -22744320, -18807900, -552857, 12534325, 13789799, 12620339, 12907691, 7509515, -4352146, -12379870]
577a2379870k1358L25939j886976M558453J2215226N388614r712105j1348154
569a2860231J824253P809532j870722q827411l15249R511207M796500o177726
561f109847p326887r59138M68332k891726j755797L794221N723127K918493O46525
552e492697o06469l425801n027510k179916J57618l202315o130046k40806R161515
543a6986427J0173509L957837K240842O656504O727802k8721k244140N656416
535A6153622J2258121O326841n511961q673994j674652L299928j369562r138809
527A1669534r666416k760297K388355L17478l248861L0213Q471915J2717319R971178
518B9890418P034782O550455Q46289j3081951k2376403j4310726K732505Q464657
$$ y = [-12379870, -12401228, -12075289, -13962265, -9403812, 2811414, 8200028, -1512077, -12860231, -11035978, -3226446, -5097168, -13924579, -14239828, -4728621, 67879, -6109847, -13436734, -14395872, -13927540, -16819266, -18575063, -14780842, -9057715, -6139222, -5492697, -6099166, -9524967, -14552477, -16732393, -16574775, -19777090, -25907136, -26147942, -16986427, -6812918, -2855081, -614239, 6042265, 12770067, 12741346, 10497206, 16153622, 28411743, 34738584, 29226623, 20552629, 18877977, 22177905, 20808343, 11669534, 2003118, -757179, 1631176, 1948654, -1300207, -1269994, 7201921, 19919240, 29890418, 36925200, 43475655, 44321944, 31239993, 8863590, -5447136, -2714631, 5750026]
510E750026j495506j1192051q131593K191646Q438186P585496K348596m615389
502H79411q494019l958697N268050P369382j141605q730649n361651K816225L700449
493g653104l013224p940715o845082l512433p05420K474473N270947N267173L550053
484a3107332L445359M379504K864493o80151j819261R13416L989323M289522K057333
475F332206j763210o435420q885349n014469M177914J1142788R413507J393428
467A0361395l844127p65008N961365O553406j829330j0547946r736435j082837
459d929517M696593K660667r50803j58855J523434j329153n590540m548721N27781
450h099114K542241O75962J240422N695085O708136l30640r050269j0594679n469073
$$ y = [5750026, 4254520, -6937531, -15069124, -12877478, -4439292, 3146204, 5494800, 879411, -7614608, -11573305, -6305255, 1064127, -77478, -8808127, -14169778, -11353553, -7653104, -10666328, -18607043, -25452125, -28964558, -29669978, -27195505, -21924558, -16657385, -13107332, -9661973, -5282469, -2417976, -3098127, -4917388, -4003972, -14649, 4274873, 6332206, 4568996, -1866424, -10751773, -15766242, -11588328, -445540, 8967967, 10361395, 6517268, 5752260, 11713625, 18267031, 16437701, 5889755, -3846680, -4929517, -232924, 2427743, 1476940, 1318085, 2841519, 1512366, -4078174, -8626895, -8099114, -5556873, -4880911, -3640489, 2054596, 8762732, 8432092, -618177, -11212856, -16681929]
441a6681929j038083k82885M00469K944822L915753J324943l71526L096693P503241
432H11498N103316k592888m830939K612470R373876M893715n325986p680615j101390
423A263057K430420k049319n150544J81757P146357P409851M213986M133749M875552
414B4454866J682358j719467J00664K832960m44992o238389p168296o113564r702029
405b315889j2573139m955363O919168P229877k320904k885057R546939J4553152
397A3198784j44361j6784083j3611216L215781J1842184P153599J588162Q87142
389G345992j207030o499552q162217l702821J795796N973730J0464291J2075741
381A8083930N341319n503813r469876n068565j668028l113113k645143K946011
$$ y = [-16681929, -17720012, -18002897, -17602428, -14657606, -10741853, -9416910, -9788436, -6691743, 811498, 5914814, 3321926, -1509013, 1103457, 10477333, 15371048, 10045062, 2364447, 1263057, 3693477, 1644158, -3506386, -3324629, 3821728, 11231579, 15445565, 19579314, 24454866, 26137224, 24417757, 24518421, 27351381, 26906389, 20668000, 13499704, 7386140, -2315889, -14889028, -19844391, -12925223, -5695346, -8016250, -10901307, -1354368, 13198784, 13054423, -3729660, -17340876, -14125095, -2282911, 4870688, 6458850, 7345992, 6138962, -360590, -8522807, -12225628, -10429832, -4456102, 6008189, 18083930, 23425249, 17921436, 8451560, 3382995, 1714967, -1398146, -4043289, -1097278]
373a097278O918447N053519K459766J928928k678058j3167280j7718300n976453
365b4276709J3150977K0029730P895815j0851313k0255905j5391394k543153Q295535
357b3946417J0378007M156547m289920r549438j0124986n541201M605131J5887557
349a8424720J8819747R121414m607332r164451j814219P372861Q076534R78624
341A0358458m533007k048903M315365N535257L27708k609771J641321M468846
333A7455274l474723j4206931j0828532N698478J4095228L100979j1160180r273474
325h593881L261796P523813J393461q47600M602072M933788n507562j3392869
317f626982o769798N914714P980544k255186j1083857q450821J716039R284329
$$ y = [-1097278, 5821169, 10874688, 13334454, 15263382, 12585324, -581956, -18300256, -24276709, -11125732, 8903998, 16799813, 5948500, -14307405, -29698799, -32241952, -23946417, -13568410, -9411863, -13701783, -23251221, -33376207, -38917408, -34312277, -18424720, 395027, 9516441, 4909109, -4255342, -6069561, 1303300, 9379834, 10358458, 5825451, 3776548, 8091913, 13627170, 13954878, 11345107, 12986428, 17455274, 13980551, -226380, -11054912, -5356434, 8738794, 11839773, 679593, -8593881, -5332085, 2191728, 3585189, 2737589, 7339661, 12273449, 6765887, -6626982, -13396780, -7482066, 498478, -1756708, -12840565, -21291386, -19575347, -10291018]
309a0291018Q942474K495254m945472q727899o819144q09598M670399N044940
301a0440064N52650k377478K044981R911369J0293901N3292r554608p050663L009828
292c556792O363651o81956p185715m582285K041859L639613J92305k035322r47994
283f752636M69551J184296L398279O424030M799910m074730j3066157j1403297
275a9020754Q22022R497230L460494q997592r935263K554540J0866643M185814
267f566866n462089l224474N075383M419669l651263n301977N12270J575975l617082
258a6240454k499563P342435J1308537K838585l956986K170964J0521314O590906
250A8075738n022253j0933915j0114554q759355m570922O209195J4175542P975033
$$ y = [-10291018, -1348544, 1146710, -3798762, -12526661, -19345805, -20155403, -15485004, -10440064, -9887414, -12264892, -10219911, -308542, 9985359, 10038651, 484043, -6566620, -3556792, 2806859, 2124903, -5060812, -9643097, -7601238, -3961625, -3769320, -5804642, -6752636, -6283085, -5098789, -1700510, 4723520, 9523430, 5448700, -7617457, -19020754, -18198732, -8701502, -5241008, -14238600, -24173863, -21619323, -10752680, -6566866, -12028955, -15253429, -10178046, -5758377, -9409640, -14711617, -14199347, -12623372, -16240454, -18740017, -11397582, -89045, 2749540, -1207446, 963518, 11484832, 18075738, 13053485, 2119570, -7994984, -16754339, -21325261, -15116066, -940524, 7034509]
242G034509m897736p133891J602732N687032J33462l492341J71578J158213o201914
233e938356j1966866p691599l72988P26328r04270J921752N899887L804597j873534
224a6395049l256405j86051J375780L71023K82453N62467j944799m758392k460912
215b6409885K899464L524460j180036k749604K381544N869410r4283r954520j1706127
206c7419577l104920O549852R834149Q907779Q095268N792142q24978p159387
198i329672m984329M815739J0497496M390635n562754n554277N065359J2159548
190A1497745N630674p221306j2018559o083458M01168L65586j632334M50215L323355
181e286914O09780m875974m521896J402211K859280l383430o760895O25963R597676
$$ y = [7034509, 2136773, -4997118, -3394386, 2292646, 2426108, -1066233, -894655, 263558, -5938356, -17905222, -25596821, -25969809, -25243481, -26147751, -24225999, -18326112, -14521515, -16395049, -19651454, -19837505, -18461725, -18090702, -17808249, -17245782, -19190581, -23948973, -26409885, -23510421, -19985961, -21165997, -23915601, -21534057, -15664647, -15758930, -25713450, -37419577, -40524497, -33974645, -24140496, -15232717, -7137449, -1345307, -2170285, -9329672, -14314001, -9498262, 999234, 5389869, -172885, -5727162, -661803, 11497745, 17128419, 9907113, -2111446, -8194904, -7793736, -7428150, -9060484, -8610269, -5286914, -4677134, -9553108, -14075004, -12672793, -9813513, -13196943, -19957838, -19331875, -9734199]
172i734199O652203m812290r086697j702521N566285M537790J535740L664184
164c379505O723889M342051r76603m177514o285508q240469m825731N174163J0728669
155i16558K605595j0198158j1158318K74022R054745O500455j380662p192265
147a2411144j0376591j0207072l243269P895193J3497845R301381J939144j684218
139e288731k285445k118755J69463L843387L301538l063150p532971k670015Q119000
130g525679J4608266J1135385O96302q995951j1306057n999357O5724J131946
122f189421L94452L878312Q567621O115571j897031m215224J897119N028289k387066
113A1192622j2165872j3911680r547369n278138N54719J0053653J4831546O397550
$$ y = [-9734199, -3081996, -7894286, -16980983, -18683504, -13117219, -8579429, -7043689, -3379505, 3344384, 7686435, 6709832, 2532318, -3753190, -11993659, -16819390, -11645227, -916558, 1689037, -8509121, -19667439, -19393417, -10338672, -3838217, -5218879, -12411144, -22787735, -32994807, -36238076, -28342883, -14845038, -5543657, -3604513, -5288731, -7574176, -9692931, -9523468, -5680081, -2378543, -5441693, -12974664, -15644679, -7525679, 7082587, 18217972, 18914274, 9918323, -1387734, -7387091, -7321367, -6189421, -5794969, -1916657, 6650964, 12766535, 10869504, 6654280, 8551399, 13579688, 11192622, -973250, -14884930, -24432299, -29710437, -29155718, -19102065, -4270519, 2127031]
105B127031p424248j0315267l1705R085754O224971l861234r979073o823830K994270
96a8003331J1877972J1627729J625267p509785n162307N126372J0120350M666443
88A4368710l489702o747873o141086m780272j898061K482269M209260J157341
80h39414k494399k146361J476725N490256Q798906R626629M611648m920884j0515418
71I087688o276119K180632M581717k15212l898727j680642J672198J123719R7738
62F672992M274742J0363536Q612637l032254j4116135j4370124o050150J202864
54f441892L553423M281636M588636J775614k955646l521366J265873M398126J260223
45H204627l217075l039106n70174j266978m193830m756244k920305j717642q92289
$$ y = [2127031, -5297217, -15612484, -15644189, -6558435, -333464, -4194698, -14173771, -20997601, -18003331, -6125359, 5502370, 7127637, -382148, -5544455, -418083, 9702267, 14368710, 10879008, 4131135, -2009951, -6790223, -8688284, -6206015, -1996755, -839414, -3333813, -5480174, -4003449, 1486807, 10285713, 19912342, 24523990, 19603106, 9087688, 2811569, 4992201, 9573918, 9358706, 5459979, 3779337, 5451535, 6575254, 6672992, 10947734, 21311270, 29923907, 26891653, 12775518, -1594606, -7644756, -6441892, -2888469, 1393167, 5981803, 7757417, 4801771, 1280405, 2546278, 6944404, 8204627, 4987552, 1948446, 1378272, 111294, -4082536, -8838780, -11759085, -13476727, -14369016]
36a4369016R74115J181611k796494o665484n009968r07806o72420j374577M926159
27b4713880J4632112J3607227j049767j2732118p192806O850844J0005885o44132
19a236635r256813n130291L480961L746663l070166n703642r47045K502215j004796
10a6619549m669910k84041Q076741R924714M417643L78671Q51207q48109o727965
1e500598p868062
0a3368660
$$ y = [-14369016, -13394901, -12213290, -15009784, -21675268, -26685236, -27593042, -28265462, -29640039, -24713880, -10081768, 3525459, 2475692, -10256426, -17449232, -10598388, -592503, -1236635, -10493448, -15623739, -12142778, -8396115, -11466281, -17169923, -18116968, -15614753, -16619549, -21289459, -21573500, -13496759, -3572045, 845598, 1224269, 2075476, 1227367, -5500598, -13368660]
##END NTUPLES=NMR SPECTRUM
##END=
