##TITLE=31Pdec_PR165-1
 D2O, 24 sc
 16.1.2019
##JCAMPDX= 6.0         $$ Bruker NMR JCAMP-DX V2.0
##DATA TYPE= NMR SPECTRUM
##DATA CLASS= NTUPLES
##ORIGIN= UXNMR, Bruker Analytische Messtechnik GmbH
##OWNER= root
$$ XWIN-NMR		Version 3.5
$$ Wed Jan 16 16:06:11 2019 Russian Standard Time (UT+4h)  she@DPX200
##.OBSERVE FREQUENCY= 81.013821
##.OBSERVE NUCLEUS= ^31P
##.ACQUISITION MODE= SIMULTANEOUS
##.ACQUISITION SCHEME= undefined
##.AVERAGES= 24
##.DIGITISER RES= 17
##SPECTROMETER/DATA SYSTEM= spect
##.PULSE SEQUENCE= zgpg30
##.SOLVENT NAME= D2O
##.SHIFT REFERENCE= (INTERNAL, D2O, 0, 182.463)
##AUDIT TRAIL= $$ (NUMBER, WHEN, WHO, WHERE, WHAT)
$$ ##TITLE= Audit trail, XWIN-NMR		Version 3.5
$$ ##JCAMPDX= 5.01
$$ ##ORIGIN= Bruker BioSpin GmbH
$$ ##OWNER= she
$$ F:/spectra/data/she/nmr/P31/1/pdata/1/auditp.txt
$$ ##AUDIT TRAIL=  $$ (NUMBER, WHEN, WHO, WHERE, WHAT)
(   1,<2019-01-16 16:05:07.60 +0400>,<she>,<DPX200>,
      <created by zg, POWCHK disabled, PULCHK disabled
       configuration hash MD5:
       00 E9 B6 7A A2 85 ED C7 34 08 36 98 17 FE 4E 26
       data hash MD5: 32K
       0E 82 9D 1F 64 A2 12 B4 48 42 6B 09 1E A5 B4 3F>)
(   2,<2019-01-16 16:05:28.34 +0400>,<she>,<DPX200>,
      <Start of raw data processing
       efp BC_mod = 2 LB = 1 FT_mod = 6 PKNL = 1 PHC0 = -1466.758 PHC1 = 110.199 SI = 64K 
       data hash MD5: 64K
       DC 52 72 98 B8 A3 82 52 3D C8 E5 89 66 E8 60 FA>)
(   3,<2019-01-16 16:05:44.85 +0400>,<she>,<DPX200>,
      <pk PHC0 = -66.46475 PHC1 = 75.19999 
       data hash MD5: 64K
       7F 8C 28 1C 24 AA 9E 49 F2 9E FD 5F 6B B1 88 93>)
(   4,<2019-01-16 16:05:48.03 +0400>,<she>,<DPX200>,
      <abs ABSG = 5 
       data hash MD5: 64K
       4E 13 B4 55 CC 98 30 05 01 08 6F 31 EB 5C 1F 31>)
$$ ##END=
$$ 
$$ hash MD5
$$ 56 D0 65 D2 F7 A6 39 49 F6 48 02 39 B3 7E AD 26
##$RELAX= 
##$RELAX= 
##$RELAX= 
##$RELAX= 
##$RELAX= 
##$RELAX= 
##$RELAX= 
##$RELAX= 
$$ Bruker specific parameters
$$ --------------------------
##$DU= <F:/spectra>
##$EXPNO= 1
##$NAME= <P31>
##$PROCNO= 1
##$TYPE= <nmr>
##$USER= <she>
##$AMP= (0..31)
100 100 100 100 100 100 100 100 100 100 100 100 100 100 100 100 100 100 
100 100 100 100 100 100 100 100 100 100 100 100 100 100 
##$AQSEQ= 0
##$AQ_mod= 1
##$AUNM= <au_zg>
##$AUTOPOS= <>
##$BF1= 81.014009
##$BF2= 200.13
##$BF3= 200.13
##$BF4= 200.13
##$BF5= 200.13
##$BF6= 200.13
##$BF7= 200.13
##$BF8= 200.13
##$BYTORDA= 1
##$CFDGTYP= 0
##$CFRGTYP= 5
##$CHEMSTR= <none>
##$CNST= (0..31)
1 1 145 1 1 1 1 1 1 1 1 1 1 1 1 1 1 1 1 1 1 1 1 1 1 1 1 1 1 1 1 1 
##$CPDPRG= <waltz16>
##$CPDPRG1= <>
##$CPDPRG2= <waltz16>
##$CPDPRG3= <>
##$CPDPRG4= <mlev>
##$CPDPRG5= <mlev>
##$CPDPRG6= <mlev>
##$CPDPRG7= <mlev>
##$CPDPRG8= <mlev>
##$CPDPRGB= <>
##$CPDPRGT= <>
##$D= (0..31)
0 1 0 0 0 0 0 0 0 0 0 0.03 2e-05 3e-06 0 0 0 0 0 0 0 0 0 0 0 0 0 0 0 0 
0 0 
##$DATE= 1547640307
##$DBL= (0..7)
120 120 120 11 120 120 24 19 
##$DBP= (0..7)
150 150 150 150 150 150 150 150 
##$DBP07= 0
##$DBPNAM0= <>
##$DBPNAM1= <>
##$DBPNAM2= <>
$$ [...]
##$SUBNAM3= <"">
##$SUBNAM4= <"">
##$SUBNAM5= <"">
##$SUBNAM6= <"">
##$SUBNAM7= <"">
##$SUBNAM8= <"">
##$SUBNAM9= <"">
##$SW= 369.568048894756
##$SWIBOX= (0..15)
0 1 3 0 0 0 0 0 0 0 0 0 0 0 0 0 
##$SW_h= 29940.119760479
##$TD= 32768
##$TD0= 1
##$TE= 0
##$TE2= 300
##$TE3= 300
##$TEG= 300
##$TL= (0..7)
0 120 53 12 22 120 120 120 
##$TP= (0..7)
150 150 150 150 150 150 150 150 
##$TP07= 0
##$TPNAME0= <>
##$TPNAME1= <>
##$TPNAME2= <>
##$TPNAME3= <>
##$TPNAME4= <>
##$TPNAME5= <>
##$TPNAME6= <>
##$TPNAME7= <>
##$TPOAL= (0..7)
0.5 0.5 0.5 0.5 0.5 0.5 0.5 0.5 
##$TPOFFS= (0..7)
0 0 0 0 0 0 0 0 
##$TUNHIN= 0
##$TUNHOUT= 0
##$TUNXOUT= 0
##$USERA1= <user>
##$USERA2= <user>
##$USERA3= <user>
##$USERA4= <user>
##$USERA5= <user>
##$V9= 5
##$VALIST= <valist>
##$VCLIST= <CCCCCCCCCCCCCCC>
##$VD= 0
##$VDLIST= <DDDDDDDDDDDDDDD>
##$VPLIST= <PPPPPPPPPPPPPPP>
##$VTLIST= <TTTTTTTTTTTTTTT>
##$WBST= 1024
##$WBSW= 4
##$XGAIN= (0..3)
0 0 0 0 
##$XL= 0
##$YL= 0
##$YMAX_a= 45583
##$YMIN_a= -39824
##$ZGOPTNS= <>
##$ZL1= 120
##$ZL2= 120
##$ZL3= 120
##$ZL4= 120
##$ABSF1= 182.463
##$ABSF2= -187.1042
##$ABSG= 5
##$ABSL= 3
##$ALPHA= 0
##$AQORDER= 0
##$ASSFAC= 0
##$ASSFACI= 0
##$ASSFACX= 0
##$ASSWID= 0
##$AUNMP= <proc_1d>
##$AZFE= 0.1
##$AZFW= 0.5
##$BCFW= 0
##$BC_mod= 2
##$BYTORDP= 0
##$COROFFS= 0
##$CY= -3
##$DATMOD= 1
##$DC= 0
##$DFILT= <>
##$DTYPP= 0
##$F1P= 0
##$F2P= 0
##$FCOR= 1
##$FTSIZE= 65536
##$FT_mod= 6
##$GAMMA= 0
##$GB= 0
##$INTBC= 1
##$INTSCL= 5.30512e-09
##$ISEN= 30
##$LB= 1
##$LEV0= 0
##$LPBIN= 0
##$MAXI= 10000
##$MC2= 0
##$MEAN= 0
##$ME_mod= 0
##$MI= 50
##$NCOEF= 0
##$NC_proc= -5
##$NLEV= 6
##$NOISF1= 182.463
##$NOISF2= 159.3651
##$NSP= 0
##$NTH_PI= 0
##$NZP= 0
##$OFFSET= 182.463
##$PC= 4
##$PHC0= -1533.223
##$PHC1= 185.399
##$PH_mod= 1
##$PKNL= yes
##$PPARMOD= 0
##$PSCAL= 0
##$PSIGN= 0
##$REVERSE= no
##$SF= 81.0140089999434
##$SI= 65536
##$SIGF1= 159.3651
##$SIGF2= -187.1042
##$SINO= 113.3802
##$SIOLD= 16384
##$SREGLST= <1H.CDCl3>
##$SSB= 0
##$STSI= 65536
##$STSR= 0
##$SW_p= 29940.119760479
##$SYMM= 0
##$S_DEV= 0
##$TDeff= 32768
##$TDoff= 0
##$TI= <>
##$TILT= no
##$TM1= 0
##$TM2= 0
##$TOPLEV= 0
##$USERP1= <user>
##$USERP2= <user>
##$USERP3= <user>
##$USERP4= <user>
##$USERP5= <user>
##$WDW= 1
##$XDIM= 65536
##$YMAX_p= 334789826
##$YMIN_p= -10725506
$$ End of Bruker specific parameters
$$ ---------------------------------
##NTUPLES= NMR SPECTRUM
##VAR_NAME=  FREQUENCY,     SPECTRUM/REAL,   SPECTRUM/IMAG
##SYMBOL=    X,             R,               I
##VAR_TYPE=  INDEPENDENT,   DEPENDENT,       DEPENDENT
##VAR_FORM=  AFFN,          ASDF,            ASDF
##VAR_DIM=   65536,         65536,           65536
##UNITS=     HZ,            ARBITRARY UNITS, ARBITRARY UNITS
##FACTOR=    0.456856943014862, 1,           1
##FIRST=     14782.0589164792, 0,            0
##LAST=      -15158.0608439998, 0,           0
##MIN=       -15158.0608439998, -10725506,   0
##MAX=       14782.0589164792, 334789826,    0
$$ Real data points
##PAGE= N=1
##DATA TABLE= (X++(R..R)), XYDATA
$$ [...]
40220 -365897 -309138 -272547 86610 320991 -235353 -1252192 -1655714 -1049090 -128585 318883
40210 318883 149136 -423099 -1142290 -1619508 -1540127 -1142554 -971354 -1030717 -749502 41153
40200 41153 712611 741876 470156 533697 953662 1267888 1289091 1259844 1394173 1654734
40190 1654734 1915090 2059017 2003019 1844059 1847168 2054618 2082451 1598765 862596 458151
40180 458151 568469 822297 818378 507309 66398 -336671 -641850 -955073 -1458812 -2074821
40170 -2074821 -2359261 -2027979 -1444829 -1194989 -1260956 -1083175 -418688 373391 953124 1342655
40160 1342655 1510736 1236633 672564 427006 680233 816517 452372 190714 605973
40151 605973 1060738 567939 -503276 -784291 51724 825356 668673 104269 -182922
40142 -182922 -477398 -1128539 -1518429 -1010937 -233055 -244553 -876884 -1080691 -661339 -442548
40132 -442548 -745774 -915678 -536773 -20619 309341 675745 1005095 665551 -380653
40123 -380653 -1094148 -740212 30505 246224 36319 102401 384899 317435 54146 348654
40113 348654 1284361 2084402 2250383 2071899 1902761 1689770 1383071 1130038 866043 336466
40103 336466 -271567 -335494 299369 983880 1135889 933562 803433 717724 460111 218064
40093 218064 361786 756533 755574 -30746 -1166320 -1705497 -1115220 108342 895313 788158
40083 788158 405901 456446 676559 352047 -383803 -628449 -90415 502204 581061 448743
40073 448743 460114 372266 31493 -130572 45823 -102093 -916689 -1470741 -824689 337749
40063 337749 578065 -108605 -323445 532662 1443897 1475249 1048423 952300 1101267 1019373
40053 1019373 793593 745758 681230 229655 -396479 -638936 -362554 133554 637094 1088406
40043 1088406 1383734 1562759 1900348 2342664 2216349 1128314 -134610 -367291 497106
40034 497106 1350681 1443866 1171703 1140101 1198387 823218 -56584 -1063371 -1837690 -2128952
40024 -2128952 -1766614 -956718 -339554 -328350 -581843 -521178 -168309 -26125 -289086 -696292
40014 -696292 -1097896 -1571777 -1892520 -1507657 -354181 786664 1154569 864697 474330
40005 474330 65947 -627777 -1398333 -1620949 -1231708 -956519 -1268203 -1679193 -1496812 -844408
39995 -844408 -411203 -470032 -684967 -725157 -519484 10855 867195 1547876 1301648 87302
39985 87302 -1134083 -1396595 -767070 -109794 -12255 -225813 -92966 668270 1597250 1869390
39975 1869390 1128281 -86790 -897874 -975181 -591474 54902 1025155 2100574 2703003
39966 2703003 2650376 2431639 2353189 1998982 1084770 271153 319491 825047 757308 124339
39956 124339 53899 1051179 2163112 2314460 1659822 1007806 554712 -42360 -719846 -962021
39946 -962021 -649744 -309015 -409883 -859045 -1286885 -1481019 -1424299 -1200421 -1009296 -1068247
39936 -1068247 -1341841 -1478040 -1139291 -383940 325696 526588 218623 -97969 26101
39927 26101 408882 431480 -106786 -606808 -377727 479475 1210651 1327884 1056357 867502
39917 867502 893654 932967 819509 609754 467730 478916 589890 710042 840137 1028711
39907 1028711 1195365 1122370 698460 77780 -468927 -763400 -750638 -492206 -196175 -52617
39897 -52617 47631 384960 900388 1161789 1052376 1079999 1609458 2167760 2077667 1518941
39887 1518941 1277317 1537976 1653790 1177408 423984 -173065 -601104 -891426 -833368 -429073
39877 -429073 -76285 85067 437358 1047042 1192613 408528 -498720 -316575 941918
39868 941918 2064782 2166104 1449301 571459 45079 224662 1003943 1419516 476063
39859 476063 -1337276 -2238996 -1334048 198418 700748 83601 -522487 -573167 -545656 -799149
39849 -799149 -1010061 -857585 -505543 -192053 87410 306038 311309 172291 173885 321988
39839 321988 305926 100062 112809 516288 904625 909883 716807 618577 471480 23145
39829 23145 -530330 -766278 -592303 -185497 380228 1011978 1349937 1168983 865916 990329
39819 990329 1400934 1497217 1231954 1165964 1403619 1268668 428763 -340556 -117252 900890
39809 900890 1759063 2095853 2412503 3049723 3587617 3462411 2702285 1802761 1198328 1073303
39799 1073303 1394276 1832460 1835193 1110791 44708 -605511 -522159 -201748 -383349 -1139137
39789 -1139137 -1710799 -1365521 -282417 658242 947241 979626 1373091 2076439 2482758
39780 2482758 2251681 1645381 1093971 765047 584442 397367 75744 -288827 -323987 168713
39770 168713 697700 449751 -656624 -1663904 -1602393 -571673 472642 794128 440201
39761 440201 -91740 -386674 -332753 -106933 -14482 -192395 -447200 -483322 -248117 81377
39751 81377 412091 857576 1490640 2079002 2194224 1662063 887395 570711 966791 1557030
39741 1557030 1666058 1260117 808970 497682 115548 -231469 33890 1047351 1975401
39732 1975401 1929229 1067428 257579 -103758 -356303 -796146 -1207466 -1204593 -631691 376984
39722 376984 1404075 1908699 1739291 1367715 1260486 1247165 977422 703193 913512 1376103
39712 1376103 1356919 754064 157954 -254493 -907652 -1692502 -1703691 -628343 527048
39703 527048 762110 334002 -45759 -473670 -1364709 -2316560 -2564238 -2241946 -2147116 -2430832
39693 -2430832 -2526627 -2282774 -2134088 -2101482 -1646201 -741376 -141751 -220628 -361614 37821
39683 37821 661243 889963 749666 674653 738943 676278 418778 154372 -8208 -99472
39673 -99472 -133267 -112589 -60355 79210 383540 730995 886611 834241 707447 418491
39663 418491 -177719 -733225 -626553 100949 646073 534591 176691 6942 -229317 -826947
39653 -826947 -1417827 -1573133 -1555621 -1726081 -1668484 -779585 551853 1257540 1011023 556695
39643 556695 613568 1120625 1574513 1507115 672232 -619809 -1431704 -1144903 -399786 -335477
39633 -335477 -957229 -1164464 -462286 378711 647060 636576 758690 669491 19793 -680569
39623 -680569 -776921 -485570 -383715 -370543 -7762 476506 452434 -53886 -465484 -687832
39613 -687832 -1109779 -1585233 -1391110 -405752 560497 945174 1134784 1553026 1820217 1448268
39603 1448268 769604 432503 366654 5615 -702507 -1260308 -1482012 -1634477 -1709767 -1333752
39593 -1333752 -581176 -127764 -229008 -241625 297025 733979 235620 -735381 -848035 229919
39583 229919 1334859 1408161 737350 155593 -215899 -699621 -1070285 -735418 236678 1045921
39573 1045921 1159626 777860 264673 -279598 -755488 -941703 -863771 -866560 -1141461 -1530430
39563 -1530430 -1846316 -1941086 -1468630 -240912 1048791 1239272 203491 -798288 -769680
39554 -769680 -256693 -289587 -731714 -662874 -17867 239455 -448811 -1528976 -2176389 -2121106
39544 -2121106 -1540040 -790132 -352704 -436786 -574050 -201762 394662 475668 157575 337579
39534 337579 1092441 1245058 96459 -1376627 -1856173 -1435443 -1095046 -1044820 -723205
39525 -723205 -149195 -80703 -733159 -1331746 -1224635 -673319 -209850 125941 487391 680238
39515 680238 425984 -105772 -434715 -300606 191430 770221 1091495 810136 -129378 -1310531
39505 -1310531 -2156250 -2397715 -2109997 -1410195 -392514 625450 1102148 780301 110595
39496 110595 -137111 202569 424294 -108926 -953541 -998848 49949 1114468 973232
39487 973232 -321145 -1631085 -2041442 -1534407 -613744 155747 296885 -292001 -1067319
39478 -1067319 -1311106 -1000963 -796026 -1051372 -1347148 -1231641 -930879 -913561 -1126735 -1162561
39468 -1162561 -964347 -837781 -820386 -558679 53635 514596 273868 -507343 -1012738 -612935
39458 -612935 465694 1382382 1559841 1220049 987887 1091146 1173122 890656 422991 231572
39448 231572 490357 943115 1227674 1166756 792071 247612 -303267 -730009 -900696 -667701
39438 -667701 -70682 436517 254614 -663132 -1585642 -1743420 -1179999 -608566 -522219 -766523
39428 -766523 -963744 -976746 -825999 -495982 -110303 -85556 -721560 -1624426 -1876492 -991175
39418 -991175 437843 1241387 806123 -416327 -1461250 -1720346 -1291476 -744580 -663626
39409 -663626 -1190082 -1824838 -1850156 -1142192 -382411 -233208 -533605 -657431 -431871 -168564
39399 -168564 98650 713808 1603728 2070974 1754382 1247788 1270509 1640855 1649485 1180279
39389 1180279 827883 958815 1202880 979557 189281 -693845 -1021959 -526581 330235
39380 330235 701381 276567 -355297 -538517 -433227 -628795 -1164957 -1534315 -1506693 -1317225
39370 -1317225 -1092366 -736134 -399205 -401167 -613981 -592655 -414878 -626722 -1142585 -1053899
39360 -1053899 16035 1157728 1425408 1195053 1477266 2322316 2800185 2399786 1625330
39351 1625330 1147533 1005875 810340 301538 -420040 -956272 -905884 -321863 246880 416951
39341 416951 452455 766457 1233464 1453724 1423288 1362099 1097558 330461 -554763 -703380
39331 -703380 66727 994241 1416325 1460499 1480744 1429715 1141413 733924 356642 -58194
39321 -58194 -458608 -485288 21157 679682 1100090 1427722 1962978 2513030 2560611 1942694
39311 1942694 1022024 288209 37931 308387 876636 1403657 1703619 1757346 1507994 1000114
39301 1000114 705815 1128842 1902020 1939227 864651 -364393 -789844 -743148 -1063924
39292 -1063924 -1631435 -1676560 -1197316 -944146 -1094260 -1066636 -756606 -803095 -1258453 -1081763
39282 -1081763 355180 2068512 2591387 1804289 851311 518049 441621 -98984 -1166952
39273 -1166952 -2066408 -2024020 -966926 312122 930474 867318 813934 1084749 1250836 1014705
39263 1014705 734201 670726 436665 -184658 -542654 -94809 463080 98182 -847072 -1037217
39253 -1037217 -206013 394769 -109044 -1019010 -1327717 -1202796 -1410621 -1945648 -2135618
39244 -2135618 -1761173 -1265179 -988988 -843486 -670055 -407041 43350 668746 1149336
39235 1149336 1226554 1162107 1384280 1777918 1831054 1459161 1152266 1230543 1462138 1572815
39225 1572815 1647737 1767337 1667624 1141273 507846 271799 412126 378821 -165914 -872751
39215 -872751 -1105975 -694185 -119588 66442 -109045 -142658 212014 579518 511602 174285
39205 174285 147236 626770 1213537 1517325 1571613 1506107 1197220 540104 -180524 -519505
39195 -519505 -360760 58892 481512 718803 533950 -207860 -1224674 -1927265 -1957689 -1462704
39185 -1462704 -778671 -46924 712917 1291617 1302600 589217 -483823 -1283072 -1484384
39176 -1484384 -1312211 -1139045 -974913 -573029 -14941 146892 -434084 -1265640 -1405639
39167 -1405639 -533539 601403 942364 228444 -798240 -1246648 -970095 -510980 -290602
39158 -290602 -157423 138455 341704 -10387 -755101 -1079694 -539413 287629 498861 -26777
39148 -26777 -587566 -587094 -149186 152901 -94109 -769167 -1245122 -915874 46256 629088
39138 629088 45842 -1252956 -2052758 -1783196 -972944 -339107 -38181 31663 -171282 -542749
39128 -542749 -629792 -210571 229763 76006 -575590 -1104389 -1230298 -1203839 -1187158 -951086
39118 -951086 -338254 309634 417635 -218804 -1175339 -1712606 -1402418 -533712 142835 108368
39108 108368 -571886 -1523166 -2377084 -2755792 -2370580 -1408459 -477748 125385 718611 1454554
39098 1454554 1749678 1129734 250893 216378 1012722 1529935 1202955 726600 867115 1401737
39088 1401737 1688809 1595173 1325598 904077 398100 196407 489332 854429 894863 892366
39078 892366 1244649 1663270 1637465 1369291 1443646 1766998 1694707 1155471 758955 692190
39068 692190 413561 -271268 -688149 -340549 232869 282540 12315 198347 932286 1471383
39058 1471383 1306839 786836 552646 762976 1050323 1008130 567449 -15955 -468632 -763090
39048 -763090 -985062 -977027 -413528 600946 1305392 1004951 -94143 -1083621 -1318002 -879916
39038 -879916 -150444 666620 1435954 1819030 1452359 426014 -590836 -882909 -429517
39029 -429517 3411 -263802 -897813 -876846 105364 1017558 731034 -430493 -1053184 -497830
39019 -497830 348062 441614 6526 -6928 568175 949295 682967 301000 416053 778622
39009 778622 770808 485507 630140 1367153 1904311 1532870 590432 -79297 -310602 -626072
38999 -626072 -1127859 -1121590 -196461 862477 841529 -415916 -1844787 -2456643 -2288590 -1947440
38989 -1947440 -1709009 -1406982 -928363 -428672 -118847 -97259 -358788 -765048 -1036531 -977488
38979 -977488 -713835 -530547 -467708 -288287 83039 312566 54286 -501661 -715470 -185802
38969 -185802 795167 1551833 1679883 1297103 755343 289677 -59700 -376017 -802970 -1411278
38959 -1411278 -2018824 -2272733 -2067935 -1781001 -1861440 -2214382 -2256393 -1681266 -923477 -632965
38949 -632965 -834834 -924100 -501265 123666 449852 535892 851602 1447260 1727056 1253241
38939 1253241 432571 51462 323185 796421 1102967 1305815 1446173 1261302 631185
38930 631185 -62380 -360105 -264720 -63795 135088 360238 506945 501262 528176 673880
38920 673880 561594 -96392 -722222 -350750 1030376 2293622 2559140 2150687 1837053
38911 1837053 1748675 1595346 1467816 1687274 2058687 1993329 1415274 965836 1149607 1723358
38901 1723358 2138136 2236185 2247979 2330562 2401889 2358001 2213598 1985668 1598557 1044226
38891 1044226 597694 664984 1259011 1760994 1481355 450580 -628479 -1230859 -1450178
38882 -1450178 -1499684 -1245179 -559005 235574 722734 976123 1348691 1842149 2120005 2028018
38872 2028018 1670866 1098957 423473 161093 843656 2162703 3053686 2873551 2070356
38863 2070356 1446222 1171487 866161 344370 -140803 -299170 -141976 103990 282167
38854 282167 479496 910787 1591430 2209306 2430203 2198793 1597458 669386 -320986 -781990
38844 -781990 -495587 -210742 -856653 -2240707 -3259906 -3384782 -3074303 -2642217 -1787434
38835 -1787434 -649578 -226776 -977785 -1902516 -1929682 -1466529 -1514810 -1887415 -1597556 -695344
38825 -695344 -345059 -1023880 -1850628 -1946792 -1435101 -782876 -102316 485572 602585 199081
38815 199081 -225264 -339034 -340798 -355621 -132968 379764 860126 1292172 2054349 2986830
38805 2986830 3250543 2634207 2125612 2500987 3169925 3231892 2891329 2830017 2848553 2298497
38795 2298497 1400197 908006 766042 361132 -59437 400650 1583632 2178314 1677112
38786 1677112 1136938 1422305 1888578 1621912 984853 922508 1432794 1764548 1686809 1569676
38776 1569676 1482365 1171451 835189 1027433 1716845 2182904 1998324 1510483 1193158 1067616
38766 1067616 957705 828033 627190 209733 -304538 -423592 138877 962327 1279293
38757 1279293 771629 -155846 -823252 -861458 -414809 83293 289277 173432 -17872 55009
38747 55009 589774 1394099 1897092 1691775 1128756 1018113 1569877 2037365 1732696 972050
38737 972050 496980 318490 -123349 -788663 -877590 -26061 1040482 1382521 865174 10616
38727 10616 -678346 -924947 -667329 -205312 21572 90862 567448 1501738 2056948 1651543
38717 1651543 877703 564511 450397 -272136 -1419415 -1920049 -1426112 -759744 -575209
38708 -575209 -572064 -356927 -118022 43061 531630 1338114 1507049 395228 -1127308 -1661702
38698 -1661702 -1061782 -311628 49837 352611 784687 1049854 1163178 1582483 2234022
38689 2234022 2300270 1434324 435394 177833 482003 616339 388525 107304 -121113 -386586
38679 -386586 -546994 -447738 -371916 -665709 -1083370 -1135687 -964330 -1158252 -1687045 -1755702
38669 -1755702 -929386 236063 993350 1276399 1383763 1286362 802493 174635 -119438
38660 -119438 -66211 -124517 -481687 -740992 -535683 -125596 -83573 -526192 -950403 -848256
38650 -848256 -248079 463961 1067389 1615147 2077156 2174141 1713158 927610 314501 190616
38640 190616 475850 782799 645934 -110186 -1034397 -1296309 -565983 505044 1013954
38631 1013954 885254 801742 1126037 1426065 1215778 675953 316717 244794 129965 -255811
38621 -255811 -770988 -1121478 -1146171 -915200 -647457 -483165 -323070 -16008 319315 385390
38611 385390 125493 -230669 -576278 -1028395 -1509619 -1621924 -1157080 -386922 395354 1256042
38601 1256042 2225595 2881827 2774134 2058206 1300207 788975 393672 -30055 -420951
38592 -420951 -591251 -299634 536570 1477572 1762016 1211390 535310 293741 25300 -936953
38582 -936953 -2199024 -2724544 -2309677 -1726632 -1462193 -1255320 -950670 -833371 -881326 -614071
38572 -614071 -31598 173491 -241560 -575910 -345535 -92001 -382479 -772028 -537486 179553
38562 179553 753899 1055217 1262645 1246330 981562 1043406 1727689 2181302 1530111 466858
38552 466858 400065 1220371 1388721 377221 -481351 -76394 905012 1260051 1000105 843444
38542 843444 857475 677969 482183 655479 841198 363870 -550729 -937922 -490512 63246
38532 63246 131108 66824 506283 1411880 2114045 2034931 1186254 146719 -384560 -195049
38522 -195049 290343 613445 842288 1227074 1574450 1521335 1291225 1472162 1970903 1933799
38512 1933799 1008051 -2508 -228632 85843 137942 -124943 -56647 482115 828120 591503
38502 591503 295610 543807 1060063 1068970 363764 -482137 -864244 -722851 -424339 -407769
38492 -407769 -927805 -1819585 -2483582 -2386952 -1633891 -815754 -326634 -133551 -170773 -472092
38482 -472092 -789137 -619899 44033 451406 35361 -731723 -986182 -719867 -706927 -1254359
38472 -1254359 -1726089 -1460243 -572549 388563 1075657 1330420 994941 155807 -683951
38463 -683951 -1042574 -928977 -667637 -489106 -527473 -949245 -1736013 -2477260 -2664699 -2120533
38453 -2120533 -1016973 279624 1209258 1244998 515067 -74859 192816 942381 1257030
38444 1257030 988386 894831 1427324 2021116 1917894 1247531 841479 1142377 1693001 1737523
38434 1737523 1092826 310827 50603 402016 899608 1154234 1280888 1593459 2049923
38425 2049923 2242113 1904596 1228237 640768 420160 555085 875271 1259002 1707004
38416 1707004 2172276 2364839 1934890 950170 -3798 -386920 -269973 -204596 -624030 -1453818
38406 -1453818 -2179368 -2254660 -1658105 -1072384 -1185383 -1755007 -1837285 -1108993 -374888 -413034
38396 -413034 -948197 -1301355 -1394946 -1344072 -691873 837417 2216885 2064841 666368
38387 666368 -275844 -85758 82188 -626541 -1236753 -518908 964695 1613679 991180
38378 991180 112165 -142753 159961 640445 1081824 1220336 834815 170720 -287289 -491776
38368 -491776 -764902 -1101396 -1114710 -699207 -207539 84955 211387 186243 -50248 -299641
38358 -299641 -210649 167100 375166 228548 109905 414387 1008943 1398663 1234755 625411
38348 625411 126290 317107 1101057 1576679 1011684 -176704 -888935 -689123 -108603
38339 -108603 353047 793310 1261495 1266415 445872 -677434 -1139745 -603930 353803 936749
38329 936749 876527 556159 535222 930797 1287276 1165126 725616 454262 423250 256575
38319 256575 -174014 -500060 -443594 -247832 -338482 -866537 -1691140 -2465440 -2658862 -1933383
38309 -1933383 -674040 248393 414592 180677 -29184 -231137 -482232 -556681 -391491
38300 -391491 -361834 -694471 -1044937 -1091607 -1106801 -1415830 -1678452 -1325340 -468746 210588
38290 210588 340622 112673 -194428 -432816 -423948 -64763 427252 728306 761753 527137
38280 527137 -166462 -1330463 -2373431 -2597571 -2030330 -1300905 -831317 -630317 -681909
38271 -681909 -916734 -917893 -319762 537583 988829 1010736 1084452 1146476 605632 -408136
38261 -408136 -797221 -11584 980578 918725 -87135 -805025 -455716 577591 1403301
38252 1403301 1454645 792216 -759 -284125 30100 463632 667983 772836 863398 642701
38242 642701 15437 -501256 -510557 -449233 -896739 -1509604 -1433560 -605740 178914 479150
38232 479150 647145 913605 864084 223405 -469832 -484153 168928 816916 876181 237922
38222 237922 -783194 -1584401 -1660589 -1187765 -962948 -1436434 -2072286 -2052036 -1360068 -685856
38212 -685856 -405201 -230059 101187 350853 243993 -6201 11381 307863 534798 529531
38202 529531 474049 470011 287768 -232417 -730117 -646362 -31226 339821 -82145 -808104
38192 -808104 -872183 -123439 546313 396255 -239049 -559150 -423792 -335561 -508359 -593708
38182 -593708 -396892 -278496 -556210 -927806 -898253 -572680 -604290 -1342444 -2322614 -2730790
38172 -2730790 -2276833 -1504650 -1196364 -1489428 -1721088 -1257058 -292813 444238 633766
38163 633766 544015 324318 -221503 -923635 -1029095 -284481 314172 -325561 -1784667 -2588998
38153 -2588998 -2199679 -1575811 -1576473 -1792965 -1473452 -780261 -385361 -361814 -274099 -65985
38143 -65985 -118473 -571746 -1203608 -1833424 -2267018 -2056060 -1038120 -697 16356 -858242
38133 -858242 -1410449 -1004919 -325460 -151570 -292601 -317478 -535712 -1377765 -2312243 -2358163
38123 -2358163 -1475676 -554544 -89427 231589 532833 306880 -611618 -1391861 -1167372
38114 -1167372 -210345 455973 335760 -208985 -684983 -894856 -695092 23563 939481
38105 939481 1394073 1169012 817040 928368 1359050 1521461 1219376 802240 586794 505801
38095 505801 338289 -22441 -550466 -1041709 -1074683 -377650 657389 1186167 843316 171000
38085 171000 -99609 112930 414956 642409 934510 1246173 1272623 902125 389664 19583
38075 19583 -137290 -128834 -63708 -133240 -401120 -614286 -551280 -471072 -766030 -1225245 -1237416
38064 -1237416 -799823 -634895 -1041453 -1352192 -1025617 -618448 -944311 -1731711 -1984356
38055 -1984356 -1457382 -901179 -860037 -1069128 -1191959 -1377808 -1768733 -2072658 -1991510 -1588448
38045 -1588448 -928480 119848 1350489 2022093 1722386 1038218 816035 1077105 1239804
38036 1239804 1109644 940582 702344 123267 -492489 -346519 639994 1420858 1132183
38027 1132183 253891 -133702 143727 290789 -199900 -952900 -1416430 -1492464 -1219952 -414445
38017 -414445 887486 1936294 1812375 540327 -701656 -712255 488162 1699287 1835444
38008 1835444 1047227 416811 607876 1138579 1184799 786420 768898 1535247 2499622 2891981
37998 2891981 2615773 1992441 1137042 109390 -636822 -611139 -36481 321778 130675
37989 130675 -178222 -117477 281076 710695 950546 820199 227836 -495753 -707800 -169577
37979 -169577 670423 1300390 1639624 1697143 1303241 615696 342688 813176 1259417 834020
37969 834020 50167 217546 1460401 2373501 1996878 1145844 1094390 1685675 1689082 672355
37959 672355 -455395 -759211 -299524 352713 897806 1221445 1094054 512108 38393
37950 38393 233594 841005 1039579 525306 -135263 -355375 -271433 -353305 -631702 -724316
37940 -724316 -460071 -87332 84138 -53128 -420279 -729264 -563875 121253 670349 385374
37930 385374 -486861 -973327 -655017 -106890 116055 191009 326933 135297 -583036 -1064138
37920 -1064138 -561505 290834 191797 -885786 -1631051 -1394850 -1046666 -1383416 -1835960
37911 -1835960 -1591431 -1091553 -1284589 -1903823 -1733328 -503324 629426 739470 309132
37902 309132 281539 707770 1014675 1133787 1555818 2350366 2821432 2335462 1074712 -259867
37892 -259867 -1215946 -1819930 -2232854 -2468715 -2434917 -2054431 -1326222 -411919 291288 286572
37882 286572 -675733 -2299663 -3753386 -4104853 -3054821 -1375744 -345478 -461444 -936852
37873 -936852 -827279 -371407 -562893 -1500314 -2071486 -1587274 -855334 -955123 -1609100 -1687382
37863 -1687382 -969611 -397278 -612020 -1173828 -1426872 -1367692 -1331231 -1408406 -1517545 -1608279
37853 -1608279 -1517273 -1017765 -250950 249636 149805 -393666 -1081411 -1655447 -1709934 -957652
37843 -957652 136628 654670 429920 276356 684977 1068310 819091 329929 209006
37834 209006 168241 -361021 -1010771 -953954 -328968 -72300 -372578 -383382 357307 1239369
37824 1239369 1639026 1716199 1647306 936132 -695988 -2268777 -2336410 -768256 956316
37815 956316 1364428 444082 -665463 -1041971 -726848 -289819 -58148 57825 199288
37806 199288 340147 433062 481368 370998 -82670 -748295 -1114599 -856431 -234163 313509
37796 313509 700346 1007574 1080665 765591 325316 119001 33774 -227605 -461069 -246766
37786 -246766 118968 -221317 -1377523 -2306985 -2169235 -1506677 -1477086 -2257201 -2856002 -2439338
37776 -2439338 -1298945 -390836 -275244 -726922 -1226894 -1581523 -1948537 -2348849 -2417442
37767 -2417442 -1833562 -862571 -177415 -128439 -437753 -662077 -697039 -689898 -670518 -519228
37757 -519228 -277324 -275482 -778585 -1523079 -1845597 -1453141 -840598 -576966 -379756 455492
37747 455492 1707834 2177595 1345012 239376 2361 338720 289385 -86579 38169
37738 38169 676162 954561 593272 267743 351399 392134 91342 -210695 -317449 -472109
37728 -472109 -588165 -210872 414443 348486 -493643 -957495 -445289 99702 -136798 -370878
37718 -370878 401867 1544860 1718575 1037004 821635 1546821 2424588 2878410 3083155
37709 3083155 3018781 2290191 1143105 529495 762062 1011680 570016 -137924 -256024
37700 -256024 342488 1001732 1034530 298729 -679507 -1081812 -595409 215696 648766 739298
37690 739298 934762 1214529 1226175 1047905 990820 810204 53152 -863264 -960131 -201930
37680 -201930 350617 144332 -159129 36619 347660 371542 558845 1291331 1887342 1495288
37670 1495288 449922 -217033 -273357 -360331 -747521 -931295 -551875 33813 324277 310882
37660 310882 302407 444474 634636 738325 726657 659026 620440 716868 1118874 1941906 2910954
37649 2910954 3321556 2690559 1395149 305986 -156927 -187626 64895 662661 1304789
37640 1304789 1311391 516864 -364834 -596040 -161030 583628 1400421 1972280 1869146 1216774
37630 1216774 820601 1058537 1203667 511762 -519754 -773793 -53085 819423 1235068
37621 1235068 1320048 1281478 1007798 455509 -119336 -460978 -515799 -374097 -303093 -622286
37611 -622286 -1168175 -1219091 -505706 56142 -588885 -2058861 -2871812 -2345598 -1300850
37602 -1300850 -747714 -724926 -733521 -549365 -160935 497248 1256919 1596146 1262378 704044
37592 704044 511270 708151 934266 1052836 1199269 1387973 1417483 1142633 658320 234150
37582 234150 123373 366620 798522 1329031 2056445 2890642 3322001 3002971 2367873 2081506
37572 2081506 1964398 1212719 -210248 -1224823 -1051987 -265421 121492 48163 203724
37563 203724 801241 1308838 1329790 1132669 1196339 1612499 2059850 2166526 1843036 1338475
37553 1338475 935997 629686 310537 200564 652440 1438735 1812873 1559773 1416276
37544 1416276 2010425 2915047 3315631 3130130 2786598 2342034 1684531 1290591 1750748
37535 1750748 2614240 2765898 2085344 1668838 2081571 2487979 2135419 1669314 1986548
37526 1986548 2526406 1952957 252282 -1102754 -1189774 -728335 -732096 -1000770 -658074 378977
37516 378977 1272258 1420121 1075827 791003 777418 980133 1377858 1920347 2354828 2396038
37506 2396038 2067742 1721162 1676265 1923008 2207663 2328873 2243286 1913780 1254229 364127
37496 364127 -328535 -414846 29641 581447 1057553 1608841 2139183 2107500 1261100 195781
37486 195781 -307450 -256960 -207901 -246579 59242 707280 1071913 915341 843812 1354770
37476 1354770 2099022 2580392 2918984 3278015 3196641 2379299 1622219 1857797 2576068 2424109
37466 2424109 1329387 712958 1330424 2203298 2261513 1841939 1716868 1690906 1273775 954595
37456 954595 1511619 2494979 2693621 1947740 1280795 1240769 1316533 1173771 1268789 1799384
37446 1799384 2108521 1758257 1329419 1432062 1627950 1149089 179490 -414159 -322606 -4725
37436 -4725 135577 78107 -165036 -543564 -676269 -212792 525254 883123 848512 1014495
37426 1014495 1490602 1604312 986491 274543 248442 773374 1171192 1292980 1579962 2191703
37416 2191703 2697872 2737453 2536831 2594926 3135488 4002451 4841307 5226738 4847028 3820846
37406 3820846 2747395 2215163 2246982 2375340 2259175 2033511 1975304 2034830 1930841 1630253
37396 1630253 1461625 1710317 2326998 3093212 3810183 4214372 4043266 3458796 3131328
37387 3131328 3534154 4330991 4822589 4796741 4486389 3902729 2865510 1662199 959253
37378 959253 898991 939077 798244 861125 1316436 1633131 1414345 1102375 1178737 1258043
37368 1258043 768604 52084 -123721 170443 205770 -115570 -108878 546140 1366560 1839501
37358 1839501 1865914 1427888 635840 122788 497013 1331715 1628310 1336154 1311753 1637521
37348 1637521 1340902 243073 -357604 294812 1029756 559725 -421045 -357554 754422
37339 754422 1626825 1841922 2123634 2599475 2403027 1276692 240750 182472 744225
37330 744225 1051775 785910 179840 -393261 -546040 -147141 373057 511897 489194 901456
37320 901456 1610975 1780401 1114845 277810 -103259 -113565 -78036 -138715 -445724 -1035501
37310 -1035501 -1405273 -984776 -118964 273465 88188 82631 421747 370003 -242261 -523253
37300 -523253 -68862 224015 -324409 -977113 -839053 -316412 -270109 -569568 -602152 -493487
37290 -493487 -659688 -743251 -181732 608874 742053 178442 -497866 -1179678 -2001020 -2435800
37280 -2435800 -1894601 -955345 -725307 -1128899 -1102426 -412722 56082 -90255 -203709 86845
37270 86845 270947 89527 111388 616102 898599 349714 -532859 -837137 -364473 421661
37260 421661 1056700 1295044 1158758 1064185 1411287 1869875 1687495 888995 436818 895370
37250 895370 1670993 1982960 1895721 1884659 1961563 1791596 1295768 702383 282641 253229
37240 253229 565702 687538 120095 -763933 -1041876 -517059 92034 401059 844720 1529417
37230 1529417 1617447 559427 -856807 -1475273 -1196165 -730052 -496474 -470380 -591374
37221 -591374 -606856 860 1212596 2068975 1805665 958700 600217 892582 1170549 1076296
37211 1076296 807329 526219 265752 157767 127802 -247697 -948057 -1144611 -442008 168797
37201 168797 -317706 -1175018 -912686 380767 1182960 934049 689727 1153722 1619977
37192 1619977 1414548 1006342 967316 1033202 979131 1280516 1979177 1984262 667636 -743769
37182 -743769 -722615 269669 563473 -19553 32044 1266955 2128416 1251172 -401444 -862674
37172 -862674 147746 1132321 1101560 668380 701165 1013736 974446 639521 513620 614564
37162 614564 551694 337855 390661 774516 1122928 1327751 1603147 1789545 1394409 574038
37152 574038 242936 745148 1183020 694962 -261050 -638545 -255017 316577 849647 1525719
37142 1525719 2179294 2403662 2249524 1980092 1351594 92480 -1078742 -1050244 5720
37133 5720 670413 222515 -521091 -635305 -274052 89360 578047 1306532 1660645 1054705
37123 1054705 -92633 -909799 -1241061 -1592791 -2187554 -2671170 -2607207 -1868171 -751381
37114 -751381 33686 -119071 -908330 -1299498 -838073 -238857 -249828 -579344 -575537 -361681
37104 -361681 -469880 -772568 -671533 -110086 448552 885849 1419355 1814424 1501114 583783
37094 583783 -73110 10696 385811 517141 517462 677555 814830 574229 70288 -193197
37084 -193197 92604 787734 1471680 1656593 1035181 -169524 -1155204 -1152291 -238070 592085
37074 592085 383349 -707377 -1501460 -1116853 19093 791838 835015 785398 1113504 1414829
37064 1414829 1178270 623263 252393 55237 -236904 -469961 -312751 39808 78424 -203778
37054 -203778 -310121 -8904 445030 817086 1092666 1200188 1047623 807362 668215 381344
37044 381344 -365499 -1155086 -1074028 153002 1806754 3018910 3430259 3006034 1914579
37035 1914579 775727 343840 633741 919440 847970 919872 1520043 2130673 2042147 1359341
37025 1359341 749099 552833 655257 890520 1044053 740168 -91051 -802239 -636581
37016 -636581 309143 1188446 1445640 1346976 1460668 1950839 2450788 2433230 1720181 771464
37006 771464 351026 733540 1404324 1734929 1714424 1718597 1800232 1638793 1092303 388409
36996 388409 -214955 -618249 -759159 -649231 -538555 -723140 -1159619 -1544980 -1753881 -1863662
36986 -1863662 -1750453 -1083119 120368 1259511 1704394 1409173 842984 490952 526853
36977 526853 768866 820751 435943 -145979 -429347 -331825 -333788 -759327 -1245946 -1313700
36967 -1313700 -1189730 -1479150 -2061691 -1997033 -810500 671604 1249440 769786 85683
36958 85683 -174643 -160023 -165820 -153620 -105067 -238117 -507756 -413207 212844 657008 201809
36947 201809 -701530 -848881 141930 1322831 1634725 1094355 508948 430912 738535 1014110
36937 1014110 1000771 720932 332435 -51645 -351731 -374667 37461 545250 381260 -677068
36927 -677068 -1703180 -1622970 -669821 -84416 -335352 -485151 362821 1739502 2457742
36918 2457742 2088289 1285865 975444 1592885 2823245 3811116 3973014 3749285 4001421
36909 4001421 4521498 4033512 2167517 452047 428427 1565462 2199078 1934622 1714491
36900 1714491 1833259 1528828 712002 496382 1369433 2168089 1783753 859001 738148
36891 738148 1481428 2052188 1989232 1727697 1491360 1037436 550597 692243 1442942 1828484
36881 1828484 1298118 609631 693692 1248260 1302606 818285 722858 1319685 1665786 989185
36871 989185 -51812 -265584 382909 852763 629113 299288 361263 364515 -231744 -1009789
36861 -1009789 -1134374 -598054 -204390 -429036 -935476 -1229811 -1238731 -1144602 -1112341 -1304759
36851 -1304759 -1774762 -2218168 -2195818 -1729475 -1318937 -1206286 -992254 -260126 695271 1133738
36841 1133738 794649 233460 129999 455262 557379 65237 -594006 -803041 -607948
36832 -607948 -507893 -557546 -358820 19107 -35344 -526382 -571122 114548 425462 -442134
36822 -442134 -1385764 -887730 475097 737355 -387595 -1028226 -105295 1076493 1044388
36813 1044388 369326 427773 1168182 1540773 1358091 1301816 1534990 1608881 1505697 1633631
36803 1633631 1930173 1962321 1768193 1672052 1453201 670407 -336009 -764689 -578062 -394871
36793 -394871 -243070 441300 1495649 1918614 1409925 934231 1268344 1939594 2164082
36784 2164082 1973118 1748760 1388051 701481 115588 214865 893556 1573238 2002514 2317360
36774 2317360 2558410 2626562 2530162 2276373 1734422 961885 394773 338978 559819 745626
36764 745626 999634 1377721 1351263 476353 -609799 -728039 217694 967697 593521 -242306
36754 -242306 -290178 519437 1122519 1006223 938299 1641461 2462184 2165978 799090 -165747
36744 -165747 268580 1374094 1813087 1357722 835051 826788 1233520 1877930 2664178 3164986
36734 3164986 2888838 2102548 1668214 1878312 2112303 1828099 1211422 614208 46610
36725 46610 -469881 -705118 -697410 -789789 -918827 -614710 -18590 18679 -637321 -870029
36715 -870029 22300 1065607 1042221 383655 378075 1054326 1271501 677318 154911 250975
36705 250975 451391 291284 69213 89829 143289 101581 175165 250038 -150072 -862358
36695 -862358 -950077 -78548 813929 837462 392406 376305 780970 894856 486060 -11872
36685 -11872 -273660 -379381 -469339 -608400 -848662 -1038992 -824033 -215021 197033 70323
36675 70323 -54370 434100 1159333 1315726 1038765 1257698 2165690 2843351 2740894 2621814
36665 2621814 3365789 4455336 4518855 3189813 1652130 1235096 2043660 3189458 3879298
36656 3879298 3888076 3298253 2336481 1447025 1031111 941374 596325 -190081 -830297 -708813
36646 -708813 1407 667585 1093460 1569378 2146469 2445114 2248112 1768771 1207842 539663
36636 539663 -83484 -222637 237402 758595 780759 418034 236597 560288 1229499 1833622
36626 1833622 2005501 1731609 1498745 1801324 2366671 2312596 1327376 238925 49615
36617 49615 790832 1703336 2156502 1964672 1194924 204407 -405145 -382169 -153264 -134346
36607 -134346 -58104 476423 1147822 1304848 968805 682243 501188 -29961 -874484 -1296809
36597 -1296809 -865291 15571 802153 1413590 1872179 1953761 1585851 1133989 907628 740009
36587 740009 396745 67472 100414 518578 1127531 1855043 2631957 3133032 3042614 2541930
36577 2541930 2201151 2313926 2549314 2383083 1770419 1229743 1220356 1589139 1820639 1745207
36567 1745207 1684300 1880655 2196883 2524546 3010653 3553278 3543560 2622949 1376875 745439
36557 745439 986911 1702734 2566969 3449838 4139024 4632994 5468554 7050060 8905820
36548 8905820 10373995 11742860 13846887 16874907 20639819 25594027 31941516 37656271
36540 37656271 39200830 35069358 27462459 19811931 13821991 9544822 6828066 5376871
36532 5376871 4376068 3376502 2955706 3513850 4188162 4044826 3553964 3641206 3993512
36523 3993512 3701671 3013609 2924849 3364808 3318257 2595143 1990306 1720623 1205403 532628
36513 532628 661239 1805878 2917804 3195988 2973260 2731582 2386417 1976804 1954180
36504 1954180 2300887 2383587 2099665 2084957 2367113 2060198 1010747 458919 1191959 2199955
36494 2199955 2176019 1317342 559723 35724 -444623 -297213 941097 2244915 2203970
36485 2203970 1141149 596927 935315 1108179 815841 1130437 2473089 3556379 3219400
36476 3219400 2113821 1568109 1689491 1664416 1289215 1057743 1042373 758486 119814 -347600
36466 -347600 -361642 -242171 -231974 -82204 396360 864591 908729 629165 407876 332290
36456 332290 247286 226687 532490 1075526 1328309 954102 249144 -235618 -301177 -125152
36446 -125152 131362 478339 938454 1443664 1850655 1955652 1641855 1147107 961702 1239766
36436 1239766 1551244 1500173 1311201 1405136 1663189 1646771 1359814 1175849 1103896 790101
36426 790101 229238 -220304 -545878 -1016055 -1315852 -690611 702301 1529438 974142
36417 974142 -93112 -366781 121394 310096 -295341 -1205166 -1823150 -1920798 -1414477 -428559
36407 -428559 481598 773498 512371 84252 -397330 -864577 -881786 -212578 516451 578248
36397 578248 341814 757247 1769596 2299180 1874783 1228610 1015193 961660 723034 645250
36387 645250 1062572 1574564 1689631 1611625 1715785 1714046 1068906 -33899 -786390 -706834
36377 -706834 25491 1042293 2061324 2737311 2775434 2356085 2094814 2332029 2606826
36368 2606826 2094718 649659 -761910 -953756 120786 1259705 1461224 1048140 906073
36359 906073 1039662 686320 -268198 -901993 -504829 518446 1306758 1489645 1153201
36350 1153201 476124 -157699 -189044 473153 1175013 1284558 926550 627160 589403 686421
36340 686421 837051 999139 1041083 921607 759488 562928 263816 142512 645212 1535659
36330 1535659 1905077 1430032 928291 1143036 1702185 1962726 2127450 2579924 2757157
36321 2757157 1885447 484780 -128211 248652 515782 84895 -343032 -141433 229012
36312 229012 135253 -203916 -266217 -110177 -55093 -11797 240840 542358 709795 1036301
36302 1036301 1805235 2566182 2532044 1617843 578483 136318 361193 860904 1196617
36293 1196617 1112377 703957 418617 631190 1177515 1522781 1426224 1234173 1439031 2091175
36283 2091175 2736230 2864507 2360144 1540509 822025 398424 229012 217126 296285 429635
36273 429635 675712 1186253 1938709 2505587 2354941 1474358 508751 148717 475213 982246
36263 982246 1153463 931014 651078 583189 608785 451606 170915 166579 604410 1138627
36253 1138627 1418084 1557377 1774812 1865181 1516259 955067 720047 858971 905916 647016
36243 647016 347554 180379 17541 -109481 51712 414285 542604 401646 451680 720389
36233 720389 536815 -329293 -994471 -631975 247205 496101 -66606 -594304 -509365 -12908
36223 -12908 590558 1230448 1700936 1740417 1589117 1728865 1940364 1442329 253857 -453277
36213 -453277 69662 961790 953884 256074 239514 1353420 2396376 2181430 1097202 390403
36203 390403 431085 511270 189550 -83195 55298 75173 -609272 -1489874 -1518556 -678852
36193 -678852 -101610 -450993 -1070061 -1150412 -924191 -976534 -1026983 -370165 802094 1552982
36183 1552982 1608559 1600876 1779658 1527902 597120 -104670 306138 1332777 1735008 1196866
36173 1196866 596050 729041 1444163 2092835 2306225 2158480 1888959 1623519 1261278
36164 1261278 675610 112761 147503 981149 2026235 2558077 2571745 2547218 2553237 2182576
36154 2182576 1360014 593699 268009 208159 134702 46081 -78151 -414775 -786946 -540675
36144 -540675 549277 1641798 1710981 843508 56789 -31921 282582 557058 758283 901137
36134 901137 795662 497630 485539 968602 1442411 1420184 1262539 1670282 2510004 2812809
36124 2812809 2053837 889623 338621 571581 846265 489471 -342023 -875849 -549905
36115 -549905 399809 1137033 1016585 160340 -778852 -1309743 -1414316 -1294672 -1106761 -960855
36105 -960855 -889398 -719430 -250766 315658 437938 -53270 -594754 -590829 -263497 -345138
36095 -345138 -957156 -1278320 -532822 1005888 2287429 2638197 2382984 2286472 2561341
36086 2561341 2632536 1952434 869256 351535 770507 1333873 1065549 84559 -585246
36077 -585246 -376000 235944 579756 610294 587302 506948 364484 565086 1398421 2267707
36067 2267707 2125143 747938 -956115 -2035245 -2406378 -2539999 -2743908 -3053491 -3420486
36058 -3420486 -3625898 -3278087 -2289032 -1200282 -693718 -851254 -1147527 -1091854 -672790
36049 -672790 -271191 -303946 -813996 -1291909 -1176997 -719663 -927043 -2230928 -3586999
36040 -3586999 -3538087 -2003018 -342940 299958 41354 -399976 -621765 -535472 -121960
36031 -121960 389542 582627 466461 587713 1195592 1784538 1864595 1671634 1607430 1475134
36021 1475134 922110 253516 69197 328270 492999 433700 457634 545523 346361 -36394
36011 -36394 -9098 626333 1428477 2107846 2865810 3697061 4032642 3482871 2448482 1631201
36001 1631201 1331285 1486313 1940258 2366423 2373039 2021257 1825585 1937267 1814220 1108161
35991 1108161 403260 520111 1387711 2141355 2172006 1653706 1173273 1175273 1622060 1960586
35981 1960586 1653269 912658 515705 675225 672093 19081 -653818 -547204 18101 117928
35971 117928 -327661 -565415 -285223 94344 420173 1112754 2257389 3209289 3431492
35962 3431492 3093366 2579758 2017163 1529390 1329105 1254825 820424 50400 -336406 48329
35952 48329 654798 872182 945659 1442100 2249384 2739172 2637523 2170846 1586599 1052876
35942 1052876 805381 871726 865016 574227 501715 1164805 2057656 2113967 1238877 567795
35932 567795 927265 1746166 1966632 1513356 1245791 1686787 2388480 2600168 2180316 1707208
35922 1707208 1841684 2634382 3403725 3373057 2536858 1790522 2040825 3277101 4694075
35913 4694075 5596558 5896414 5835810 5721568 6083270 7581900 10298429 13364660 15784529
35904 15784529 17466438 18880621 19771995 19017058 16122980 12241440 9095083 7253787
35896 7253787 6063735 4968445 4103165 3605851 3162495 2553430 2066314 1956896 1914098
35887 1914098 1515310 953919 844845 1388038 2116224 2505679 2544128 2583372 2808011 3015330
35877 3015330 2914648 2535302 2224528 2243178 2516004 2842305 3130119 3251030 2949289 2271918
35867 2271918 1876439 2357002 3282880 3503780 2581830 1384232 978773 1425789 2028090
35858 2028090 2333821 2396557 2353960 2319123 2563085 3265965 4056019 4223982 3511443 2414727
35848 2414727 1642596 1502516 1842663 2309966 2529721 2247187 1528322 806192 569017
35839 569017 902248 1378056 1505339 1273698 1064373 991583 690736 35101 -316783 334628
35829 334628 1610458 2369502 2167817 1681903 1512371 1356766 782727 110134 -82001
35820 -82001 193847 586905 1054738 1610409 1842712 1433027 866690 900301 1543741 2265718
35810 2265718 2918358 3613809 3933913 3331355 2327360 2195327 3170624 4007383 3788926
35801 3788926 3232316 3506948 4532465 5322794 5529906 5720193 6300148 6999647 7486685
35792 7486685 7875180 8467687 9429367 10876009 12961400 15698775 18906184 22541775 27072132
35783 27072132 33325306 41648142 50864709 58143754 60492465 56911294 49117541 40082900
35775 40082900 32027941 25764387 21246693 18038856 15441623 12922319 10641301 9146065
35767 9146065 8422917 7689487 6337836 4669214 3377039 2671789 2364293 2508521 3292600
35758 3292600 4330104 4793652 4514181 4294447 4662259 4906311 4093255 2631551 1834031
35749 1834031 2016244 2129647 1540744 1053407 1499756 2269178 2245563 1591547 1448104 2135065
35739 2135065 2810239 2929260 2945255 3283215 3568810 3360647 2954533 2911596 3206446 3283066
35729 3283066 2711517 1569947 439135 76676 712785 1674161 2211198 2624946 3816232
35720 3816232 5694496 7070628 7500826 8153741 10100842 12669178 14486936 15429211 16278688
35711 16278688 16863668 15957690 13179808 9846016 7525501 6555997 6344029 6359082 6288395
35702 6288395 5767935 4626798 3235892 2192708 1723284 1598713 1479699 1140572 523086
35693 523086 -197747 -693785 -806469 -715412 -656382 -583424 -297111 148535 402788 278982
35683 278982 105425 408941 1242358 2025661 2160289 1627436 837856 140675 -217231 84715
35673 84715 1083768 2053854 2051953 1136221 437563 726362 1505999 1932090 1995992 2161544
35663 2161544 2352237 2134322 1627398 1366749 1333466 938196 37835 -772737 -1030470 -882505
35653 -882505 -504018 267905 1383509 2271244 2530727 2495002 2665420 2951512 2920981 2505095
35643 2505095 1977698 1450438 895791 559145 806651 1486815 1894636 1582372 906746
35634 906746 526690 567111 588830 315829 57379 299872 1117769 2159189 3022550 3426213
35624 3426213 3208247 2539510 2062470 2365275 3237452 3863613 3880597 3791500 4125568 4679868
35614 4679868 4944169 4834855 4567333 4186175 3717662 3442832 3477522 3413232 2981102 2723614
35604 2723614 3237617 4019514 4013840 3262375 3002036 3931773 5322869 6192931 6470641 6494666
35594 6494666 6189962 5467546 4838565 4828692 5145692 5157823 4917688 4966459 5293519 5275055
35584 5275055 4666036 3930988 3430176 2943396 2323777 2048813 2587362 3541447 4015675
35575 4015675 3764362 3406336 3409138 3443374 3092781 2702413 2899132 3532086 3836800 3609849
35565 3609849 3407128 3441386 3218441 2691056 2791446 4010696 5270975 5286930 4441135
35556 4441135 4043818 4139426 3545245 2021126 830076 795177 1245315 1466604 1821613
35547 1821613 2582323 2909312 2160469 1301020 1725938 3225831 4313040 4228141 3545450
35538 3545450 3022899 2871715 3059227 3435062 3611806 3482346 3707350 4894044 6467004
35529 6467004 7261665 7178994 7329474 8495649 10374959 12489335 14888754 17548081 19782777
35520 19782777 20723066 19953341 17523770 13914830 10198231 7566395 6285250 5547163
35512 5547163 4638056 3750013 3315478 3086237 2428584 1270430 272673 113719 834671
35503 834671 1790328 2145076 1628173 885638 805966 1411402 1788551 1290557 404825 115094
35493 115094 702017 1535251 1877683 1570869 1020453 767927 1023690 1428956 1347228 580907
35483 580907 -252191 -270977 680837 1741884 1882643 1049611 284495 548179 1586398
35474 1586398 2295049 2128372 1612545 1346642 1178612 835828 743828 1416154 2379706 2640292
35464 2640292 2173139 2055123 2919887 4036380 4263190 3378268 2147903 1485905 1766378
35455 1766378 2587688 3050142 2621895 1795778 1489643 1848423 2230278 2353847 2645308
35446 2645308 3234118 3447152 2768463 1642069 821246 482473 467437 830931 1557686
35437 1557686 2183347 2289625 2051992 1825474 1561371 1101638 650227 460094 446358 576569
35427 576569 1160243 2188066 2896653 2697233 2107003 1989180 2241096 2083424 1368401
35418 1368401 683546 290750 -132486 -699063 -1082637 -1135272 -1013588 -683370 -29367 556613
35408 556613 501245 19365 -51478 510987 1056481 1166050 1129463 1106300 759876 128793
35398 128793 -31349 658617 1495100 1653234 1222897 756000 447901 370041 832592 1745574
35388 1745574 2180056 1441420 213679 -213146 396032 1141810 1376709 1336388 1441163
35379 1441163 1749931 2177491 2600622 2666442 2077109 1153450 607537 702916 1102685 1504972
35369 1504972 1873169 2062363 1857476 1470043 1405169 1733464 2065482 2297483 2693818 3110472
35359 3110472 2941276 2150607 1581301 1764412 2118395 1898716 1304513 947315 754102
35350 754102 221862 -569201 -1028624 -981703 -764091 -477592 99318 828289 1139992 803603
35340 803603 226365 -132922 -151550 221950 1035665 1943913 2285495 1858596 1243526 1093948
35330 1093948 1420633 1794531 1947575 1919981 1834676 1746106 1594191 1229451 618702 -2381
35320 -2381 -373907 -506882 -487778 -199405 374428 829391 893518 1041494 1792320 2595125
35310 2595125 2416817 1421044 884996 1218211 1356743 655512 44432 398756 976921
35301 976921 715024 118082 422588 1513501 2151635 1887812 1331314 803533 190585
35292 190585 -34309 790934 2033411 2225041 1256737 623000 1113880 1796676 1866725 1940626
35282 1940626 2577335 2911950 2016777 614627 120779 647427 1185566 1292393 1424057
35273 1424057 1864605 2378759 2815376 3188428 3240754 2682428 1822030 1340919 1479812 1911716
35263 1911716 2265339 2342371 2052219 1590830 1461711 1913411 2588039 3005271 3015410 2564740
35253 2564740 1663313 929671 1309820 2637186 3374207 2668457 1796250 2395658 3992674
35244 3992674 4730427 4140743 3599346 4023345 4614326 4256799 2987036 1600627 690401
35235 690401 492206 965876 1658137 2001801 1930428 1770075 1629075 1478589 1605216 2192061
35225 2192061 2658220 2332550 1616019 1462691 1855927 1947255 1613150 1556181 1812712 1623034
35215 1623034 1056797 1237082 2409199 3281392 3064440 2755230 3370762 4157388 3817088
35206 3817088 2584151 1769978 1866418 2315758 2723524 3176181 3622129 3890557 4141494
35197 4141494 4553954 4821231 4601516 4125702 3740578 3287821 2610660 2204156 2588557
35188 2588557 3414481 3926526 3956431 3769569 3359646 2675227 2180560 2410215 3250819 4301499
35178 4301499 5504924 6716057 7200903 6499803 5386099 5006769 5377543 5657845 5612357
35169 5612357 5808656 6563554 7634156 8794863 9865107 10416332 10365550 10572969 11830014
35160 11830014 13496027 14240900 13979592 13918928 14753486 16003648 17217451 18682949 20724922
35151 20724922 23250530 26198034 29669902 33612285 38097585 43724436 50979224 59736886
35143 59736886 70434078 84988861 105225270 131538819 165057267 208919617 262158542
35136 262158542 311451137 334789826 318681336 270874570 213316693 163737783 126414894
35129 126414894 98040532 76313898 60924524 50402227 42008238 34230089 27426341
35122 27426341 22248649 18682411 16450329 15296925 14696658 13856819 12288568 10301396
35114 10301396 8840093 8616411 9213042 9316755 8199221 6674002 6063917 6482968 6824678
35105 6824678 6323805 5384040 4826805 5003892 5748026 6568094 6766791 5965323 4684987
35096 4684987 3904540 3933071 4219245 4297237 4275698 4262226 4001330 3392369 2796689 2482243
35086 2482243 2225923 1793930 1406240 1394244 1715207 2064498 2199300 2019063 1664534 1600929
35076 1600929 2136435 2779585 2680279 1892478 1480551 1980064 2475645 1853543 420770
35067 420770 -504593 -298943 446082 959705 1113229 1190291 1456111 2066588 2954133 3734183
35057 3734183 4076594 4105063 4025958 3550402 2340433 967814 578352 1342166 2039965
35048 2039965 1701140 986811 1239527 2624206 4037995 4634147 4576000 4296424 3872300
35039 3872300 3371850 3095728 3089115 2964334 2574657 2328150 2417138 2316412 1647834 1029972
35029 1029972 1270909 2053634 2339912 1940772 1686216 1935958 1955503 1188559 268914 140681
35019 140681 813620 1646097 2335916 2900864 3065348 2486642 1475628 814898 866375 1359740
35009 1359740 1970150 2567998 2971047 3038932 3059609 3517761 4375548 5023073 5053258 4718944
34999 4718944 4544672 4813305 5462349 6152184 6430026 6149735 5686629 5419988 5180792
34990 5180792 4679811 4253868 4463659 5018907 4976070 4185187 3657840 4080812 4768006 4717575
34980 4717575 4079079 3804118 4233178 4810069 5023100 4928534 4760069 4583876 4401638 4213971
34970 4213971 3990602 3859449 4145628 4833027 5216678 4657883 3578423 3059471 3396844
34961 3396844 3694477 3104916 1903340 999647 858178 1318782 2112662 3023659 3707658
34952 3707658 3879371 3724054 3759386 4201630 4721590 4882572 4578879 3978403 3282895 2665245
34942 2665245 2228552 1882448 1450517 1039393 1046177 1548368 1948830 1658183 997213 877193
34932 877193 1531237 2142167 1979152 1355209 1014626 1026483 915621 629066 636711 1068385
34922 1068385 1423790 1331631 1068271 1058804 1260712 1308192 974248 295950 -460133 -789950
34912 -789950 -264106 899213 1863768 2040230 1693759 1479619 1627942 1820908 1655593
34903 1655593 1025510 257811 -2306 632463 1670856 2101310 1609878 1002521 1106245
34894 1106245 1746527 2253603 2461920 2576411 2486098 2015606 1610376 1906974 2671957 2983824
34884 2983824 2524349 1902795 1568639 1217245 568503 -18514 -154089 -41344 -7841 94827
34874 94827 505939 944528 918106 440012 24972 108606 728044 1551726 2005208 1688413
34864 1688413 935845 610823 1047730 1597694 1572580 1178189 1041551 1282937 1668072 2251957
34854 2251957 3105704 3714711 3525764 2954503 2959621 3642846 4180588 4199466 4222469 4526293
34844 4526293 4608279 4251327 4109068 4537384 4734729 3938392 2766984 2348710 2629859
34835 2629859 2655036 2191132 1882486 1906248 1704767 1205108 1131507 1725314 2206129 2048483
34825 2048483 1862111 2310131 2934860 2875629 2166154 1471231 994126 555770 445532 1178624
34815 1178624 2410882 2995639 2350665 1142340 413745 546977 1237933 1984302 2378523
34806 2378523 2322019 2154283 2277392 2592497 2677994 2551570 2754357 3512914 4280460 4361988
34796 4361988 3653583 2583383 1681680 1368843 1738839 2302731 2329427 1704457 1103239
34787 1103239 1098265 1522678 1978252 2447123 2957071 3123613 2647722 1982120 1873336 2378629
34777 2378629 2884687 2990845 2844294 2691344 2648513 2886055 3489743 4121922 4353788 4366209
34767 4366209 4732020 5388157 5475202 4521497 3247019 2737004 3170818 3817008 4041386
34758 4041386 3877742 3748268 4040353 4902157 6077187 6934583 7014108 6637832 6716147 7808423
34748 7808423 9537187 11023599 11737114 11809184 11699044 11775042 12152355 12701708 13174304
34739 13174304 13478300 13856237 14614388 15679663 16737713 17932951 20017018 23420184
34731 23420184 27526511 31515446 35814398 41957225 50823561 61750304 73822511 87436853
34723 87436853 103881313 123469650 144304309 162405234 172784748 171482876 158142252
34716 158142252 136921705 114030897 93839543 77399397 64107880 53543156 45440022
34709 45440022 39110233 33873369 29661789 26564260 24106060 21567612 18779489 16079802
34701 16079802 13686929 11635517 10177596 9652358 9879265 10091998 9611767 8394055 6938390
34692 6938390 5874428 5544317 5695550 5620138 4880200 3875709 3416348 3753726 4351927
34683 4351927 4630411 4563624 4407319 4185666 3756060 3197662 2790969 2624545 2506243 2343389
34673 2343389 2363927 2764351 3283869 3395512 2918135 2212291 1729235 1591316 1679100 1844766
34663 1844766 1878157 1561293 1025783 794587 1137256 1634787 1798749 1872170 2448778 3450824
34653 3450824 4175099 4355902 4430386 4589608 4385213 3696823 3338185 4017756 5192495
34644 5192495 5704870 5278383 4651967 4373691 4208359 3814119 3355963 3172897 3227400 3161126
34634 3161126 2730653 2062925 1575313 1620284 2073862 2370380 2134387 1652230 1478283 1726353
34624 1726353 2073250 2324840 2538871 2603803 2184407 1268334 411304 192652 647018 1439146
34614 1439146 2369614 3378643 4146105 4138617 3312944 2513939 2701403 3726707 4358993
34605 4358993 3816955 2806595 2485135 2779750 2599229 1606465 737472 700860 985672
34596 985672 904905 680654 713116 621948 46990 -269317 543648 1812489 1980748 872323
34586 872323 -38084 210023 911461 1109112 950251 976623 1089381 1066666 1322250 2191591
34576 2191591 2982870 2721311 1604697 840617 1071500 1698579 1858791 1450819 963109
34567 963109 735935 744076 927459 1387951 2147630 2884768 3179797 3056819 2962595 3036628
34557 3036628 2813256 2047603 1411731 1689440 2556946 3021039 2964165 3257800 4212777 4973518
34547 4973518 4861226 4368278 4250040 4458920 4626047 4849788 5285104 5610247 5648429 5907319
34537 5907319 6735616 7568129 7859946 8143227 9153311 10466152 11177751 11540345 12644884
34528 12644884 14681548 16840830 18921072 21665468 25299116 29119670 33077951 38541084
34520 38541084 46629495 56547780 66244581 74028138 78841406 79699230 76068446 68954714
34512 68954714 61007004 55184689 53144381 54604691 58132934 62647060 67952445 73503716
34504 73503716 77170271 76325228 70342152 61195381 51437450 42474720 34945595 29398202
34496 29398202 25680848 22589628 19190650 15982825 13898401 12711263 11427746 9854865
34488 9854865 8700702 8235591 7817188 6828023 5374106 3987431 3165834 3130692 3530569
34479 3530569 3569965 2974088 2521698 2935490 3596612 3286083 1994157 924744 695832
34470 695832 642262 135201 -469255 -642576 -542987 -512033 -419307 -43166 464663 922897
34460 922897 1364679 1605361 1264559 608130 547383 1244416 1591000 848285 -55125 97619
34450 97619 875873 970894 427334 537711 1526412 1942065 868500 -581863 -803698 218542
34440 218542 1262350 1631710 1622736 1609832 1587535 1544427 1575643 1571270 1306054 885178 687482
34429 687482 822468 993586 958136 839422 901046 1187386 1453465 1423228 1182734 1251799
34419 1251799 1970504 2831369 2946171 2342129 2095632 2708653 3110632 2153981 520728
34410 520728 -72581 673287 1361259 1177317 968350 1492964 2022779 1703745 1144298 1289489
34400 1289489 1538639 601794 -1139455 -1839554 -886540 184891 -22979 -957248 -1383451
34391 -1383451 -1315341 -1562841 -2065274 -1881045 -637374 940555 1930766 1981093 1241054
34382 1241054 159494 -627772 -724232 -356010 -21870 105747 74874 -267021 -992845 -1558375
34372 -1558375 -1249958 -193028 744251 1136648 1397967 1796038 1818458 997516 -172139
34363 -172139 -724908 -354541 421263 1010448 1218006 1128019 949716 917281 1000508 803349
34353 803349 96999 -647911 -704668 -95162 301481 -143833 -925409 -960265 88886 1377438
34343 1377438 1844450 1382275 805425 716530 763180 276130 -604780 -956919 -301380 686274
34333 686274 999547 489250 -159591 -369993 -100449 512374 1332568 1978339 1978486 1448758
34323 1448758 1162651 1580134 2154532 2068921 1437732 1210382 1875249 2793192 3026114 2425797
34313 2425797 1596476 1075449 953362 1151525 1596745 2048612 2150829 1868386 1624139
34304 1624139 1795541 2294193 2864660 3537183 4397897 5060828 4874485 3742424 2341210
34295 2341210 1379439 988613 986476 1290989 1731663 1836924 1341024 742556 828762 1646613
34285 1646613 2413903 2525789 2215626 2075518 2336610 2862941 3495489 4052362 4214580
34276 4214580 3793027 3041801 2427230 2140858 2083900 2242632 2740519 3495227 4170777 4630052
34266 4630052 5169376 6070774 7115011 7860348 8333993 9053185 10220372 11252426 11480418
34257 11480418 11172741 11405820 12814312 14852078 16553277 17771633 19343874 22168615
34249 22168615 26459990 31867912 38033978 45025408 53504347 64575795 79390190 98896854
34241 98896854 123687761 152968583 182575909 204520212 210588948 198084981 172054990
34234 172054990 141384289 112870326 89007626 69915740 55391747 44917321 37281580
34227 37281580 31298437 26502389 22702986 19418206 16306261 13715747 12156167 11412347
34219 11412347 10716579 9683107 8581582 7721304 7037479 6394863 5932775 5856264 5987856
34210 5987856 5727132 4610744 2998895 2045331 2625098 4222449 5264834 4777016 3368679
34201 3368679 2327330 2146425 2411632 2782039 3348848 4031910 4316587 3877782 3051777
34192 3051777 2413795 2164057 2145891 2207473 2277458 2231310 1933800 1408776 876046 633032
34182 633032 854109 1366829 1664825 1359767 643338 90862 -17167 54831 -43687 -314865
34172 -314865 -524575 -485813 -115966 530099 1144660 1338558 1095652 823808 790640 771302
34162 771302 469895 28243 -161256 66060 642904 1524477 2589842 3452708 3782934
34153 3782934 3763402 3859165 4168579 4376927 4323291 4159044 3869857 3140505 1956952 935836
34143 935836 663138 943549 1098821 854636 508245 294237 94718 -101114 41947 615245
34133 615245 986963 459497 -680397 -1338644 -978108 -269118 -33211 -20380 619124 1844013
34123 1844013 2489211 1738706 223419 -773315 -814574 -522748 -522314 -730764 -721583 -307890
34113 -307890 440413 1421205 2406948 2859736 2244053 725470 -642804 -790080 229952
34104 229952 1252156 1334466 764532 387411 276431 -226051 -1205616 -1779157 -1348205 -523695
34094 -523695 -225526 -406084 -367181 42994 357263 439330 686646 1228890 1618804 1490614
34084 1490614 989848 410562 -105873 -405796 -371698 -271818 -548638 -1092525 -1244214 -730916
34074 -730916 -80711 165159 151621 287523 575754 753894 753787 668385 559347 562949 820259
34063 820259 1046054 646306 -361852 -1049368 -708812 139395 465312 94021 -311653
34054 -311653 -356250 -246937 -127067 179366 665686 973092 869260 487066 54026 -223493
34044 -223493 -63524 629197 1431356 1810129 1826945 1941430 2213012 2315448 2266940 2365023
34034 2365023 2344865 1518048 41115 -879391 -591264 11759 -178536 -871589 -1024024
34025 -1024024 -592758 -526298 -1149967 -1666014 -1456775 -942361 -730903 -666309 -279718 343938
34015 343938 779387 1018182 1365185 1700369 1481173 592486 -315071 -587948 -317646 -37204
34005 -37204 37009 52798 -31235 -528687 -1447941 -2258081 -2485101 -2249278 -1943288 -1666671
33995 -1666671 -1356210 -1237566 -1609190 -2201136 -2266432 -1448377 -176240 900003 1461131
33986 1461131 1408548 749143 -96382 -358813 221366 919676 908050 355505 92813 358592
33976 358592 556405 293887 -15670 141351 611790 927827 1078762 1467782 2247557 3106474
33966 3106474 3686674 3881298 3694933 3122879 2287482 1460028 787935 171173 -422828
33957 -422828 -708235 -436288 94290 283893 69054 74425 633411 1054648 427443 -997321
33947 -997321 -1899960 -1496008 -447979 137474 101277 121140 556776 1026554 1068993 699108
33937 699108 218273 -152836 -332780 -340411 -311423 -391107 -574423 -774915 -983405 -1182312
33927 -1182312 -1214916 -983759 -672221 -494320 -357526 -117645 -11593 -346125 -822888 -769450
33917 -769450 -137741 327989 139608 -302396 -452427 -413499 -493756 -483901 -63437 391708
33907 391708 198550 -499024 -750694 -121774 649558 650685 -16499 -460706 -142295 624833
33897 624833 1204324 1297162 1012502 538784 -44896 -619105 -831178 -287718 917705 2016812
33887 2016812 2183574 1376090 379315 -19256 272185 759937 914974 541950 -148105
33878 -148105 -687544 -749159 -497000 -353795 -363045 -102949 598488 1253946 1383786 1260158
33868 1260158 1451039 1817192 1640716 791238 53456 -113 169033 -129186 -686428 -771919
33858 -771919 -368737 -221396 -600512 -788718 -139834 911942 1378903 920870 46090
33849 46090 -682574 -1146536 -1413604 -1429295 -1114364 -550555 25376 312828 90252 -552172
33839 -552172 -1177036 -1400702 -1285928 -1149241 -1093873 -1009642 -913954 -904662 -836021 -510344 -195266
33828 -195266 -370344 -818743 -656837 332821 1060698 512084 -696977 -1035418 -156124
33819 -156124 670946 362178 -620343 -1119104 -803122 -269265 -60987 -183718 -389237 -441237
33809 -441237 -180369 317384 722510 830264 786727 727793 508322 119031 -6339 393689
33799 393689 820582 690215 327560 480728 982233 877538 5462 -598324 -291349 168911
33789 168911 -114262 -748429 -768266 -156932 336018 478343 630402 788603 599025 234675
33779 234675 240119 501847 404155 76178 349263 1224098 1560477 774102 -279302 -743046
33769 -743046 -959195 -1378273 -1363998 -289462 987853 1126688 290006 -234837 -88191
33760 -88191 -81992 -495451 -617649 -204840 -1607 -350888 -502791 96932 878820 1149676
33750 1149676 1066755 927726 411327 -638615 -1458132 -1323883 -673175 -376613 -450732 -432847
33740 -432847 -492816 -1024576 -1458345 -764497 806713 1656154 848046 -705641 -1500513
33731 -1500513 -1177325 -514518 -195113 -152430 12359 367283 525720 176958 -345093 -345001
33721 -345001 226149 502256 -128389 -1026900 -1145161 -544114 -237377 -647463 -1115371 -1018430
33711 -1018430 -519230 -6436 414278 611565 372665 -27587 69486 683130 1005808 644979
33701 644979 291820 617491 1221716 1329062 901262 354639 -240989 -888748 -1114391 -598250
33691 -598250 10529 -155855 -858745 -1084310 -502262 363743 1279837 2503192 3739435
33682 3739435 4043273 3193633 2242662 2129227 2471912 2349702 1692156 1203043 1259765 1529290
33672 1529290 1528961 1115838 520408 177008 353692 760941 811589 451632 318590 795732
33662 795732 1395458 1512436 1311999 1289876 1368240 1172336 927870 1209675 1843514 1949872
33652 1949872 1274145 675183 930551 1720899 2244858 2264906 2008591 1539536 925506 720447
33642 720447 1486450 2860524 3792185 3841286 3642049 3852105 4211354 4071838 3462427 3060037
33632 3060037 3216556 3522472 3422603 2895444 2348838 2090660 2116451 2281776 2461394 2570645
33622 2570645 2608726 2693389 2891681 2966364 2475833 1312581 65513 -405091 148375 1054502
33612 1054502 1434781 1125151 739203 889535 1555914 2249183 2602317 2666174 2700870 2814816
33602 2814816 2874131 2774628 2725277 3079859 3818941 4435518 4567636 4533922 4859437 5413762
33592 5413762 5569412 5238262 5077385 5373381 5382418 4358467 2759919 1695903 1436254
33583 1436254 1269769 758781 273167 110205 -94203 -635785 -1034061 -635723 394546
33574 394546 1207712 1259282 775761 300385 70577 -134759 -642089 -1364260 -1729308 -1374836
33564 -1374836 -800902 -839903 -1443337 -1636219 -930388 -90712 23483 -226904 144387 1229951
33554 1229951 2166529 2451015 2457634 2553811 2492470 2007079 1434030 1316425 1695785 2141916
33544 2141916 2335252 2387899 2631004 3157190 3572701 3349358 2552282 1963235 2169651 2770655
33534 2770655 2932726 2546228 2261727 2443765 2710016 2587954 2053919 1278225 378436
33525 378436 -382694 -653887 -461420 -183113 64451 490803 986000 1110672 980144 1366046
33515 1366046 2449164 3258682 3051682 2552542 2897156 3864654 4275072 3902581 3762126
33506 3762126 4359667 4836697 4379928 3568982 3550264 4398367 5086160 4871010 4030186 3229206
33496 3229206 2726796 2389171 2137357 2108991 2448323 3051063 3522523 3439121 2765905 2012672
33486 2012672 1840120 2434147 3329023 3898587 3951594 3766230 3627634 3530506 3383436 3302084
33476 3302084 3502997 3968908 4398614 4505635 4281694 4009548 4098686 4793138 5890001
33467 5890001 6875622 7538383 8279619 9527870 11038990 12234795 13132282 14358569 16204044
33458 16204044 18299296 20431896 23046225 26597318 31026664 36321039 42911069 50743061
33450 50743061 58362707 63768440 66054172 65589711 62920124 58489753 53459636 49703733
33442 49703733 48451992 49488643 51984505 55446581 59375999 62605934 63726211 62021507
33434 62021507 57631382 51187117 43857766 37345311 32852010 29875800 26746902 22675485
33426 22675485 18685904 16131114 14887315 13731267 12136092 10747818 10055438 9564062
33418 9564062 8714886 7805249 7286504 6765459 5638158 4375716 4112940 4957354 5722310
33409 5722310 5579844 5068752 5066366 5559621 5951303 5945432 5615356 5133500 4870412 5195231
33399 5195231 5775338 5739472 4989053 4584570 5270481 6458846 7373713 8266467 9558201
33390 9558201 10728936 11303744 12140148 14271467 17055239 19046865 20352778 22569243
33382 22569243 26680113 32579891 40380534 50597940 63580524 80620720 104392809
33375 104392809 134431627 161775596 172679298 160867416 134088346 106163712 84556086
33368 84556086 68159000 54492770 44082228 37677430 33515339 29360507 25114866 21879602
33360 21879602 19900615 18693818 18118389 18237114 18826294 19804214 21579728 24439605 28105535
33351 28105535 32263571 37064510 42926425 50289675 59392448 69427844 77933205 82026762
33343 82026762 80598510 74749291 66263426 56594131 47155589 39184642 32858142 27517398
33335 27517398 23031605 19940287 18092322 16408260 14398481 12705541 11684255 10731951
33327 10731951 9618363 9108395 9418961 9378136 8199294 6909070 6754849 7207260 6940892
33318 6940892 5973240 5312274 5065093 4484393 3616011 3382969 4029309 4756735 4965250
33309 4965250 4738108 4093190 2908344 1702519 1378302 1943139 2436282 2337868 2128646
33300 2128646 2222869 2284179 1960858 1486248 1152124 870192 602475 574402 714452 507692
33290 507692 -200275 -778724 -576836 280025 1131612 1473884 1273168 974349 1218741 2073434
33280 2073434 2612402 1944511 615233 83791 674161 1098135 431823 -501861 -470024
33271 -470024 332541 745083 347949 -303199 -794737 -1186841 -1324782 -761921 436242
33262 436242 1453872 1543376 755777 -202846 -582751 -149331 566688 713713 106627 -478357
33252 -478357 -372702 -26406 -334252 -1207179 -1629344 -1140776 -419662 -128740 51405 725440
33242 725440 1662690 2032578 1552308 825947 537042 729098 985584 1009992 842160 663008
33232 663008 594941 690834 966898 1341383 1589712 1491959 1062514 538318 98021 -294397
33222 -294397 -700507 -994367 -958210 -499200 322093 1337338 2197646 2418123 1765538 592418
33212 592418 -398102 -726015 -394193 274669 850348 978442 665354 357968 453343 738906
33202 738906 634222 3777 -658783 -980126 -1220691 -1739069 -2282143 -2278050 -1714685 -1230832
33192 -1230832 -1237422 -1365979 -1057067 -415534 -78417 -292401 -552651 -336165 157745 381685
33182 381685 358395 660076 1372367 1682102 956325 -171086 -461034 299433 1041664 916716
33172 916716 345874 192583 494388 636320 397475 100074 -103162 -318953 -290979 481740
33162 481740 1736303 2329451 1652323 556500 198805 437723 240151 -576097 -1061407
33153 -1061407 -742720 -498548 -1270203 -2621836 -3320771 -2927601 -2056308 -1293560 -659991
33144 -659991 -141910 12135 -211706 -345643 -7246 652933 1296005 1788729 1983160 1541898
33134 1541898 447794 -584780 -736919 -51404 664599 866870 746467 614589 314326
33125 314326 -439749 -1423726 -2000827 -1830882 -1232949 -797032 -787506 -991682 -1059847 -894893
33115 -894893 -694188 -655718 -721153 -665199 -391737 -26260 292133 558098 754666 728423
33105 728423 421460 128355 198748 441526 209264 -676146 -1422663 -1144342 -57415 765231
33095 765231 826571 741496 1126188 1628919 1578882 1071847 699564 515204 80588 -548033
33085 -548033 -714831 -173569 538653 957041 1203261 1334400 937492 -79743 -936284
33076 -936284 -942802 -573676 -763483 -1393668 -1376401 -271572 1012266 1418779 1015857 637825
33066 637825 655697 625036 98017 -620741 -760138 -49058 861569 1136261 732383 251233
33056 251233 -84406 -642304 -1393844 -1526244 -640103 339713 320943 -357212 -506334 35246
33046 35246 323278 57655 43894 560964 615093 -422745 -1550859 -1509073 -572997 137339
33036 137339 488633 1182474 2116214 2292246 1470157 692947 781965 1275523 1368522 1117691
33026 1117691 1082151 1317603 1400897 1167415 858444 686632 710091 1029920 1671407 2259126
33016 2259126 2191735 1309240 219620 -201505 342922 1252148 1610509 1139456 490095
33007 490095 475169 1122304 1716601 1702794 1203405 615139 111706 -231160 -184086 357691
32997 357691 1009306 1229051 1012364 885179 1115945 1293026 934946 252015 -106186 21873
32987 21873 133926 -31507 48439 820505 1620491 1297321 -123654 -1257029 -1177003 -617350
32977 -617350 -711707 -1221397 -1000389 119245 1027578 960671 391328 25674 -153966 -380772
32967 -380772 -444531 -154281 156828 218260 382209 930634 1315711 893834 77528 -122668
32957 -122668 435405 872867 612151 35749 -324497 -491433 -621203 -498516 118372 1026206
32947 1026206 1788383 2142945 1985750 1279547 245471 -616568 -949011 -809373 -424386
32938 -424386 41463 355902 237498 -236805 -535243 -262446 366695 864508 1036287 968293
32928 968293 717859 350872 123034 281678 726188 1089394 1122697 875699 598146 576073
32918 576073 930433 1481714 1952917 2302610 2583964 2518971 1741701 616268 170079 790515
32908 790515 1566349 1519301 968029 872512 1230150 1170191 549439 311341 949836 1612069
32898 1612069 1316798 317954 -459896 -809868 -1240020 -1836275 -1981690 -1330584 -439502
32889 -439502 -110577 -417659 -692059 -389859 262807 595048 376155 131588 409468 964086
32879 964086 1083029 657560 376409 705872 1256646 1525628 1715762 2207426 2604113 2134134
32869 2134134 962153 292316 892509 2114560 2775688 2585868 2231222 2301900 2669580
32860 2669580 2907402 2854720 2568018 2010208 1114359 101976 -569315 -729061 -783147 -1223451
32850 -1223451 -1909092 -2172031 -1739725 -1192571 -1194738 -1531601 -1386699 -525341 302458 305153
32840 305153 -401517 -1055663 -1159427 -783410 -155041 621754 1403049 1908890 1975422 1761682
32830 1761682 1583305 1615313 1805197 1961485 1860060 1399869 781717 426794 549499 881318
32820 881318 1022975 1019433 1269797 1780628 1893931 1112966 -30355 -448852 128231 763182
32810 763182 542110 -214311 -422418 291081 1137345 1260799 813048 625501 1062599 1593242
32800 1593242 1511635 784858 23356 -235259 4580 414831 789551 1132018 1439564 1618446
32790 1618446 1605247 1413164 1060069 614900 310734 386091 738485 953592 817665 623175
32780 623175 797984 1368441 1956493 2181568 1888389 1113586 85065 -766822 -1014553
32771 -1014553 -525810 477135 1568275 2274005 2271293 1647119 888279 440267 331911
32762 331911 343397 386294 526697 785962 1151081 1633881 2057470 1968937 1159535 188847
32752 188847 -53203 635070 1543202 1897761 1581787 951152 365621 109875 418137 1247538
32742 1247538 2173126 2720728 2720447 2283179 1658931 1215697 1258398 1644495 1808242 1430712
32732 1430712 927429 991330 1723208 2465478 2503429 1755979 742655 -3833 -397213 -674956
32722 -674956 -931370 -1004096 -923039 -1152858 -1967778 -2712505 -2268750 -449068 1539792 2371350
32712 2371350 2045571 1697022 2139445 2999940 3318745 2729104 1881232 1706840 2336766
32703 2336766 2928613 2709496 1957110 1548010 1653048 1484832 500191 -730415 -1243534
32694 -1243534 -870757 -270303 -30656 -156662 -303554 -198477 80725 89999 -499264 -1292470
32684 -1292470 -1447376 -775946 -70129 40056 -4000 493326 1251732 1404024 835614 283891
32674 283891 204015 376996 663913 1282919 2122305 2554077 2285261 1781391 1489835 1209542
32664 1209542 647031 90012 -2782 236259 248945 -166991 -656347 -842801 -776259 -833567
32654 -833567 -1305666 -2049671 -2519568 -2256465 -1349949 -272875 647303 1324488 1602200
32645 1602200 1300356 617492 48445 -201933 -316206 -321841 5840 513494 523732 -305934
32635 -305934 -1407765 -1950153 -1683742 -843959 287276 1254731 1338998 263748 -1215460
32626 -1215460 -2004975 -1820653 -1170715 -441295 346305 970402 960327 326651 -206236 -14206
32616 -14206 682152 1118451 836491 88814 -465786 -414223 -53951 -151061 -1056858 -2183179
32606 -2183179 -2632028 -2229487 -1569272 -1127985 -845046 -631743 -715272 -1167674 -1534095 -1370905
32596 -1370905 -902639 -695493 -814815 -790675 -431011 -159602 -309125 -498260 -162217 523273
32586 523273 842512 688015 824205 1630445 2205773 1491034 -37645 -770268 -118457
32577 -118457 721328 547734 -242299 -552285 -313243 -275382 -513686 -337852 335639 664334
32567 664334 224715 -306235 -318165 -294473 -961989 -1973639 -2259692 -1474389 -381836 175924
32557 175924 126155 -86952 -128832 36471 291946 497696 566844 486023 246805 -148546
32547 -148546 -534109 -623528 -419479 -400156 -957217 -1734114 -1937812 -1351928 -605228 -256978
32537 -256978 -65304 440384 997225 841562 -108400 -913395 -736243 124984 728701 729756
32527 729756 613972 770439 876770 408740 -587174 -1494107 -1731711 -1201670 -296272 378323
32517 378323 441654 80547 -134070 121376 579499 733575 370044 -324600 -980978 -1255311
32507 -1255311 -1040164 -625166 -467666 -682396 -958623 -1044505 -982153 -747618 -118205 806414
32497 806414 1388336 1177234 506415 -54885 -466995 -938915 -1281090 -1191926 -894953 -792573
32487 -792573 -742200 -440722 -269114 -802765 -1599402 -1566697 -653355 -67700 -491993 -1144281
32477 -1144281 -1099286 -527650 8238 523940 1073926 1105516 323697 -463188 -376653 186345
32467 186345 275320 -28544 83748 590901 677099 254919 171591 731552 1201936 1096878
32457 1096878 825314 621473 -55993 -1390015 -2452337 -2448510 -1951397 -1928865 -2125912 -1520968
32447 -1520968 -108272 909256 764812 -3815 -566251 -825883 -1005855 -919842 -331981
32438 -331981 317855 265691 -506853 -1100039 -756975 275216 1155475 1406235 1133016 510217
32428 510217 -440656 -1489843 -2093554 -1963268 -1464352 -1118507 -935686 -641064 -387937
32419 -387937 -693674 -1622195 -2552613 -2974876 -3103249 -3405158 -3831546 -3876669 -3260589 -2254288
32409 -2254288 -1369922 -910269 -785595 -680646 -463250 -407618 -802628 -1351802 -1340376 -548219
32399 -548219 393609 814161 781259 711829 620396 338172 206447 785567 1838658 2327131
32389 2327131 1695534 612517 73149 198318 362967 205716 -6024 77380 407824
32380 407824 629613 369017 -521743 -1691448 -2286453 -1631393 -77566 1132065 1079417
32371 1079417 70057 -872169 -1185828 -1134067 -1120871 -1090080 -757545 -155482 315546 317097
32361 317097 -74172 -399782 -174665 639078 1432916 1430717 542773 -446077 -772299 -571814
32351 -571814 -518420 -783490 -914727 -749350 -772620 -1261746 -1654373 -1286478 -351405 473276
32341 473276 1038359 1623913 1995385 1488687 248518 -487378 106986 1258077 1582429
32332 1582429 884199 230131 403329 1055825 1485722 1547084 1444212 1124099 369190 -690155
32322 -690155 -1557512 -1861292 -1649782 -1222204 -844234 -639045 -623224 -766426 -989035 -1102477
32312 -1102477 -873372 -315236 140938 19717 -609411 -1159798 -1225700 -980639 -743266 -472032
32302 -472032 12639 545760 746102 528431 140596 -239426 -580986 -727481 -497316 -147077
32292 -147077 -286522 -1079088 -1841660 -1737275 -689409 603437 1368579 1280445 554128
32283 554128 -158108 -172277 526559 1102951 806525 15461 -160983 622140 1419574 1243886
32273 1243886 332843 -311526 -304686 -174065 -372423 -649093 -575330 -187502 191514 416771
32263 416771 488412 337444 530 -207996 -99375 -40266 -523894 -1348954 -1719229 -1285049
32253 -1285049 -644050 -546554 -923020 -1026913 -377262 732491 1601592 1785856 1411007
32244 1411007 942436 645455 309318 -361631 -1166839 -1538328 -1280373 -800245 -484626
32235 -484626 -282822 -130659 -290954 -860397 -1362631 -1360002 -1141438 -1219256 -1418281 -1141343
32225 -1141343 -378439 250665 378224 101693 -614189 -1898251 -3228558 -3612433 -2840465
32216 -2840465 -1815825 -1276508 -929827 -298530 332719 456448 229236 127754 181831
32207 181831 217428 426305 964323 1346892 1033112 362435 119877 345641 395837 103548
32197 103548 13131 358795 608218 279260 -418154 -1028745 -1421110 -1648971 -1690594 -1593588
32187 -1593588 -1537618 -1548557 -1430951 -1089809 -629198 -123726 322802 322704 -431317 -1432783
32177 -1432783 -1605030 -597741 651635 1054167 691452 543187 1117455 1826071 1722805
32168 1722805 547516 -1056175 -2215771 -2602452 -2505063 -2239290 -1750110 -922324 21609
32159 21609 753714 1259708 1669669 1868182 1685107 1287213 922687 487184 -111117 -397022
32149 -397022 128572 1013734 1248377 645430 -8296 -248387 -448678 -840648 -1007929 -756721
32139 -756721 -564011 -666719 -605066 -241220 -288743 -1074715 -1682551 -1291805 -594606 -735585
32129 -735585 -1420890 -1364111 -328729 556764 522822 49068 -159729 -106425 -73428 -10854
32119 -10854 253063 635034 867231 687536 21786 -700939 -688512 221491 1000689 567823
32109 567823 -740398 -1643076 -1681142 -1566050 -1802385 -2000496 -1766236 -1331058 -964366 -562737
32099 -562737 -147544 -14560 -77570 175922 757890 1007331 702651 492672 751869 881258
32089 881258 366985 -285392 -406612 -213258 -199551 -179786 142350 278778 -298151 -995648
32079 -995648 -856683 -160955 -8082 -423993 -254596 850196 1692640 1317109 395302
32070 395302 32803 101420 -260409 -1081520 -1546414 -1293530 -761755 -275550 344519 1104225
32060 1104225 1527036 1357546 1024617 1025008 1230584 1149123 554495 -438460 -1555590 -2254479
32050 -2254479 -1875505 -516107 545222 98332 -1358092 -2033675 -1048016 609714 1622607
32041 1622607 1912819 1999709 1656009 355654 -1300951 -1853323 -819882 682865 1425106
32032 1425106 1355018 1077672 833438 541774 297109 210559 77822 -300361 -713228 -872858
32022 -872858 -906456 -1082531 -1237223 -940609 -184338 492725 626047 321265 50614 92062
32012 92062 268113 258263 101230 163042 504611 638116 268522 -100020 74736 317151
32002 317151 -219363 -1105493 -805618 1121095 3087677 3457265 2549920 1791229 1610319
31993 1610319 1276201 377728 -653981 -1351703 -1611151 -1378832 -760409 -318138 -449206
31984 -449206 -609929 -18688 1017027 1456886 1140591 937485 1189987 1215993 731532 579486
31974 579486 1355371 2281590 2311227 1644679 1257620 1434394 1674947 1738209 1888019 2189451
31964 2189451 2297896 1995023 1423787 802097 316713 193866 423749 523710 63236 -644335
31954 -644335 -883362 -558906 -348826 -731481 -1352141 -1582423 -1337361 -1044192 -1012508 -1116884
31944 -1116884 -1062438 -810951 -698662 -1081611 -1808238 -2182092 -1672014 -604714 127765
31935 127765 89927 -245722 -196289 239776 457407 115192 -381084 -404879 37770 239284
31925 239284 -338715 -1319272 -1799587 -1461332 -953791 -978097 -1274081 -924616 380395 1815102
31915 1815102 2333020 1811651 1004750 548952 407040 285731 164450 140137 24869 -475571
31905 -475571 -1203895 -1562277 -1234808 -638543 -465600 -953169 -1754924 -2313602 -2164344 -1150758
31895 -1150758 283246 1187265 963062 135052 -172024 384936 929906 505792 -724182
31886 -724182 -1712657 -1704793 -846257 210243 914332 1029203 573003 -242199 -1073548 -1576537
31876 -1576537 -1570573 -1164144 -716227 -563359 -713732 -849461 -657097 -133449 397967 524781
31866 524781 96818 -543951 -803211 -489228 -102917 -212824 -665407 -799213 -400937 21491
31856 21491 11716 -265166 -432535 -433041 -344564 -78935 311215 336626 -400930 -1510848 -2111459
31845 -2111459 -1827740 -1152749 -818638 -1091142 -1661302 -1959960 -1598762 -753627 -81826
31836 -81826 -24181 -270342 -205948 206970 413301 166451 -1856 523925 1530210 2073033
31826 2073033 1489546 162177 -800864 -665478 198333 809753 743381 468216 430260 330044
31816 330044 -211107 -714946 -400178 455786 669184 -101907 -694689 -102461 970525
31807 970525 1071282 41571 -886597 -880892 -406937 -220073 -370146 -558534 -716353 -734939
31797 -734939 -261779 630707 1092600 520615 -443989 -721102 -333915 -257278 -814547 -1230607
31787 -1230607 -987728 -637453 -754278 -918475 -474415 302688 633538 444975 299096
31778 299096 328246 123683 -319295 -378906 271960 1168709 1709414 1786928 1583209 1238185
31768 1238185 927020 800361 649608 78539 -821127 -1452643 -1566844 -1611440 -1981823 -2460326
31758 -2460326 -2714949 -2819696 -2890198 -2710713 -2180007 -1681694 -1542070 -1533743 -1371048 -1235853
31748 -1235853 -1295107 -1197694 -699747 -328926 -656352 -1278120 -1371654 -982684 -825622 -985974
31738 -985974 -869760 -455994 -489608 -1134378 -1448946 -741704 332073 646056 26042 -779547
31728 -779547 -1132854 -963112 -489299 4227 248038 171379 -92030 -481422 -1012471 -1443707
31718 -1443707 -1412174 -1080347 -1093978 -1570934 -1699810 -842279 438276 1053233 763221 258748
31708 258748 95968 175976 166529 -140070 -837108 -1737715 -2236540 -1869270 -1008122 -464782
31698 -464782 -379594 -105646 675185 1376672 1397117 1035094 989565 1284382 1297330 772071
31688 772071 233310 250586 696390 1003251 934845 795172 907732 1143745 1088779 579772
31678 579772 -52737 -298934 15680 550957 783412 506979 -14467 -378454 -433917 -281144
31668 -281144 -31031 200616 110013 -624409 -1825019 -2755229 -2834632 -2214169 -1395548 -539704
31658 -539704 462744 1448486 2037086 2176777 2105926 1753568 777975 -628156 -1585891
31649 -1585891 -1554158 -1020458 -729152 -653027 -306487 239704 407676 152361 207931 997657
31639 997657 1850140 1823007 1057248 707835 1422628 2401408 2381364 1285045 277983 144493
31629 144493 293812 -192669 -1095527 -1396422 -824921 -182297 -44464 17447 571876 1350750
31619 1350750 1637919 1216155 488822 -52624 -174538 -24691 -133691 -888544 -1803426
31610 -1803426 -1879968 -1007991 -326121 -659010 -1274982 -955510 255740 1276654 1555118
31601 1555118 1420030 1114587 563881 100039 373959 1333809 2149891 2370726 2361371 2414001
31591 2414001 2295424 1961269 1813408 1812166 1225066 -112693 -1078963 -626213 687008
31582 687008 1385412 956904 216573 -12907 239977 573315 826514 989559 950445 583744
31572 583744 -89017 -888720 -1504866 -1627558 -1248717 -731041 -403212 -244859 -141332 -171906
31562 -171906 -342226 -306579 210318 877136 1082432 703757 137552 -336975 -748577 -1030236
31552 -1030236 -959389 -607591 -381412 -441789 -487701 -312594 -173620 -323718 -522308 -388856
31542 -388856 -25707 107241 -164244 -587807 -959457 -1343124 -1698456 -1646371 -914767 130088
31532 130088 736496 603574 228266 299314 925593 1633664 1969087 1823878 1247877 345876
31522 345876 -474444 -525602 457842 1722677 2033159 956517 -661172 -1685183 -1883580
31513 -1883580 -1794536 -1624626 -927390 395247 1377901 952398 -572877 -1729922 -1671778
31504 -1671778 -1021524 -678594 -566170 -190014 214697 53035 -430965 -387276 212946 444222
31494 444222 -13049 -195047 700579 2014428 2510202 1975144 1150023 489994 -131657
31485 -131657 -670570 -728971 -238116 286994 340256 -109705 -771528 -1273973 -1280537 -766977
31475 -766977 -185628 24935 59972 446571 1119951 1301261 479110 -840638 -1582810 -1125199
31465 -1125199 211331 1531400 2180733 2284238 2396221 2588399 2246661 1028208 -435158
31456 -435158 -1311376 -1660051 -2050437 -2401650 -2135368 -1391254 -1015960 -1132601 -801475 384204
31446 384204 1341676 933953 -347021 -1052369 -701553 -114952 -22974 -217668 -127852 450407
31436 450407 1320490 2067661 2183874 1461737 373858 -292366 -246912 134746 407603 462303
31426 462303 369834 233057 237822 489082 754152 718437 509968 559989 886935 982968 571131
31415 571131 20228 -247922 -335406 -482818 -468143 83843 933819 1317472 913552 330548
31405 330548 398690 1185361 1945536 1970648 1293523 550589 300671 554921 899491 978032
31395 978032 831824 783170 990428 1177534 937834 330676 -42975 235092 756921 711514
31385 711514 -46952 -716827 -490673 495436 1358704 1413567 714239 -172542 -696994 -698990
31375 -698990 -420261 -153215 59598 201559 -71252 -1043440 -2188195 -2528915 -2055658
31366 -2055658 -1964604 -2837526 -3392878 -2161271 108179 1157062 307389 -676505 -280739
31357 -280739 640031 420581 -817774 -1460645 -774350 324416 781061 565874 180916
31348 180916 -64044 20283 576767 1324977 1601755 1096570 205115 -501344 -758671 -475990
31338 -475990 307168 1062216 933539 -279842 -1685688 -2300343 -2173482 -2025765 -2061671
31329 -2061671 -1806729 -1078623 -456961 -551057 -1224439 -1820437 -1898462 -1520699 -1011515 -663102
31319 -663102 -567331 -562761 -409272 -84640 236635 561692 1165214 2072154 2698482 2392066
31309 2392066 1250499 10155 -874080 -1594514 -2317746 -2650182 -2176011 -1224910 -598930
31300 -598930 -603379 -785471 -664993 -316047 -79422 -33003 6214 136138 262176 286987
31290 286987 275065 432020 928818 1682876 2344089 2603934 2461148 2055341 1395498 541062
31280 541062 -85802 -37985 460397 627448 101420 -611477 -857534 -568893 -47498 478159
31270 478159 713679 235071 -864414 -1631462 -1210310 43786 991171 1076313 668321
31261 668321 201713 -284565 -724436 -859560 -716991 -731662 -1180506 -1861603 -2393757 -2444453
31251 -2444453 -1744504 -464998 452451 95114 -1128363 -1738278 -1013866 134184 491897
31242 491897 45915 -349280 -217213 216608 525197 385970 -261933 -961161 -1043348 -541159
31232 -541159 -269790 -633148 -1032997 -964789 -870804 -1130831 -1058766 -32718 1040328 787292
31222 787292 -432542 -870682 72896 1090054 991898 147501 -568962 -1040468 -1450899
31213 -1450899 -1588650 -1367507 -1247900 -1433951 -1377197 -779754 -370015 -862482 -1744462 -1977410
31203 -1977410 -1453243 -864845 -459931 158370 1117160 1967063 2292249 2027866 1244220
31194 1244220 175899 -659289 -964169 -1167650 -1801197 -2475625 -2216822 -886375 464859
31185 464859 929951 844710 1153104 2044324 2683462 2258354 1023705 156235 524491 1684563
31175 1684563 2328036 1751930 540196 -350984 -734147 -1075686 -1641196 -2230805 -2503213
31166 -2503213 -2130853 -921724 731635 1815838 1667537 769272 78747 -125354 -144857
31157 -144857 -11930 426419 817843 627748 76058 -148996 -70530 -348264 -981561 -1134793
31147 -1134793 -472826 336850 747390 947548 997280 439051 -654262 -1252699 -712642
31138 -712642 294767 870862 1024503 997901 454783 -662627 -1361847 -892401 -113253
31129 -113253 -278450 -1023690 -991007 -97438 360072 -191309 -877213 -941807 -685378 -510970
31119 -510970 -269205 7715 -173535 -807693 -1122172 -755557 -302186 -246043 -308709 -326613
31109 -326613 -715187 -1412922 -1434812 -362614 641259 322409 -908034 -1738890 -1807129
31100 -1807129 -1646341 -1357284 -627042 206659 371866 -106618 -469947 -472200 -529040 -685789
31090 -685789 -561471 -352898 -693455 -1325582 -1173896 -154265 344197 -511713 -1589470
31081 -1589470 -1364796 -80139 765207 592991 306650 790248 1755466 2229549 1646261
31072 1646261 334035 -783478 -993551 -476739 -21103 19594 57513 394141 653012
31063 653012 523584 421531 730694 920310 251894 -984325 -1798525 -1835884 -1533831 -1133040
31053 -1133040 -458517 355592 843353 998197 1266219 1668952 1751615 1476517 1282925 1156521
31043 1156521 634429 -62180 -20887 816455 1227116 460628 -640097 -1052405 -1057826 -1280021
31033 -1280021 -1202312 -38651 1487110 1749539 515218 -671794 -521341 649065 1736847
31024 1736847 2050193 1471362 331234 -568269 -544137 70430 232930 -450299 -1338522
31015 -1338522 -1835684 -2049593 -2134678 -1824592 -1082203 -538851 -750191 -1467992 -2060961 -2259886
31005 -2259886 -2180649 -2022505 -1987939 -2085518 -1901554 -1127867 -361066 -549500 -1456930 -1705034
30995 -1705034 -806300 -39328 -484272 -1236067 -788325 536588 997097 8317 -1099201
30986 -1099201 -1018229 27818 1048351 1580924 1726211 1570236 1115535 477968 -141688
30977 -141688 -496437 -314902 363107 946977 892426 529898 727864 1633499 2325728 1969619
30967 1969619 880111 152827 494925 1600372 2504326 2493067 1797965 1300121 1412501
30958 1412501 1572902 1166286 506194 292070 468568 444551 213039 296964 639245 571009
30948 571009 6757 -349737 -241025 -276566 -755591 -1106988 -1013056 -1051221 -1522466 -1642082
30938 -1642082 -812930 149792 141215 -540821 -769039 -356834 -28069 87050 619963 1598353
30928 1598353 2100434 1564892 543263 -161421 -377223 -326838 -166427 -22544 37348 210864
30918 210864 619497 777092 117085 -902330 -1106012 -278974 364222 -131838 -1126478
30909 -1126478 -1409166 -895102 -458972 -495293 -547312 -264806 58980 39192 -258251 -516420
30899 -516420 -582186 -556600 -679650 -1151984 -1881076 -2423226 -2376853 -1830200 -1269590 -1075648
30889 -1075648 -1224145 -1394851 -1243135 -678266 -33207 150302 -319148 -1014609 -1317639
30880 -1317639 -1023009 -419043 73957 192760 -89004 -588039 -1094118 -1573682 -2004033
30871 -2004033 -2022037 -1185089 220275 1140979 954780 269654 -19965 -38788 -490105 -1188585
30861 -1188585 -1101636 4859 996818 927495 311890 165231 445780 341965 -284939 -730372
30851 -730372 -659185 -572968 -841704 -1003674 -445108 683606 1635954 1873311 1392886 510923
30841 510923 -341187 -750806 -569573 -30914 479817 683804 426830 -277477 -1074750 -1444520
30831 -1444520 -1303950 -1172251 -1426244 -1666875 -1269893 -392080 106021 -256591 -1057480
30822 -1057480 -1611110 -1695965 -1519185 -1376021 -1516551 -1954367 -2211611 -1675590 -479022
30813 -479022 405459 329169 -160547 -81727 685193 1436472 1718632 1653126 1295405 500258
30803 500258 -397135 -558877 241933 1071627 972405 243858 -51134 374730 703756 256129
30793 256129 -573113 -880837 -339381 599889 1323347 1548332 1318287 810195 201997 -394095
30783 -394095 -909791 -1231629 -1218359 -860211 -324388 228968 759242 1174961 1216933 750338
30773 750338 115043 -96727 314607 951169 1359588 1552068 1788294 2016542 1854150 1138550
30763 1138550 231048 -361413 -526596 -571274 -768980 -1025128 -1044280 -773502 -555102 -735716
30753 -735716 -1196899 -1493941 -1487197 -1520779 -1775636 -1785220 -1034417 143557 828805 688782
30743 688782 336198 368770 603818 556499 175188 -306720 -827571 -1322323 -1443709 -1021367
30733 -1021367 -558186 -682922 -1260326 -1626795 -1592539 -1571038 -1737466 -1724481 -1257895 -497038
30723 -497038 382723 1354800 2144172 2301127 1903481 1560503 1445581 1011558 68225 -578784
30713 -578784 -192589 759053 1240019 979186 443386 -116190 -736802 -1121564 -869905 -279305
30703 -279305 -60848 -232079 -147735 279838 334443 -237139 -638845 -239573 408191 463723
30693 463723 115054 180439 751503 1098275 856774 552765 791526 1464102 1974936 1922711
30683 1922711 1384761 741345 333097 195548 157081 247813 742119 1538823 1833520 956598
30673 956598 -591312 -1568187 -1504312 -1152516 -1243253 -1481122 -1233028 -634107 -325098 -425130
30663 -425130 -526653 -581542 -968716 -1556938 -1517267 -500983 624733 826467 279408 3134
30653 3134 345734 604615 207445 -458072 -694238 -432481 -127840 -80500 -251213 -488840
30643 -488840 -588221 -361936 -4495 -118283 -933667 -1727250 -1573192 -590003 141622 -53777
30633 -53777 -729564 -1115980 -1078273 -972946 -1003266 -1136724 -1384111 -1737066 -1950519 -1731446
30623 -1731446 -1116902 -451733 -36793 58048 -69105 -243276 -306174 -221394 -36252 231995
30613 231995 489002 400156 -309819 -1328449 -1916873 -1744023 -1175442 -608801 -61319 321182
30603 321182 9726 -1087299 -2086634 -2146746 -1654841 -1618081 -2166435 -2568974 -2576736 -2687420
30593 -2687420 -2961958 -2670103 -1563135 -580912 -622631 -1264914 -1420486 -820908 -112031
30584 -112031 262151 540971 1020019 1495354 1494440 825414 -164841 -810367 -703775 -101510
30574 -101510 417138 651732 797100 815527 391534 -335790 -667547 -316158 160904 332484
30564 332484 600587 1319820 1917027 1767130 1379902 1630974 2162905 1793123 485174
30555 485174 -335463 251732 1429723 1867784 1345249 592657 156580 22491 -31266 -183654
30545 -183654 -439410 -529700 -253437 48099 -103986 -412811 -77757 812006 1087777 202335
30535 202335 -787136 -696589 92157 353011 -174293 -781949 -1204589 -1814409 -2481354 -2431013
30525 -2431013 -1489165 -489410 -67113 125771 550727 874200 569730 -60519 -173274
30516 -173274 463957 1148701 1077659 170631 -951035 -1569123 -1409815 -732476 9502 517518
30506 517518 632731 185883 -820703 -1910434 -2383756 -2031297 -1358257 -953449 -856180
30497 -856180 -723786 -425705 -213475 -349492 -743748 -970546 -592484 450368 1659928
30488 1659928 2233878 1667981 237389 -1112311 -1479433 -782481 152947 420651 -25519
30479 -25519 -435100 -293167 30968 -115117 -712159 -1108337 -888843 -306039 149127 245954
30469 245954 34029 -309618 -538592 -485815 -262496 -115792 -20997 356418 1164668 2019831
30459 2019831 2345442 1999859 1427572 1170706 1312660 1493505 1461364 1399811 1513265 1493709
30449 1493709 843533 -294999 -1167778 -1386293 -1282511 -1070159 -432418 517359 687370
30440 687370 -591695 -2145405 -2154161 -617037 617902 394624 -430388 -624698 -352393
30431 -352393 -519223 -1208985 -1742842 -1844076 -1854945 -1966676 -1940504 -1580054 -1006701 -469769
30421 -469769 -171177 -194122 -421724 -699652 -1161156 -2013047 -2859592 -2806635 -1633040 -360310
30411 -360310 -122554 -827392 -1472401 -1475076 -1103121 -812258 -768677 -935487 -1107391 -916325
30401 -916325 -255880 382973 451253 133899 128783 678413 1313424 1590834 1594737 1537166 1253653
30390 1253653 392746 -1010553 -2337940 -2827161 -2268335 -1254037 -590773 -467975 -454792
30381 -454792 -300527 -283355 -593143 -870724 -739662 -411900 -336362 -548226 -782801 -937676
30371 -937676 -978640 -683466 3929 582812 485145 -176070 -796456 -1063805 -1112841 -1066365
30361 -1066365 -890388 -597886 -207428 345524 906956 983474 362848 -410207 -656605 -413283
30351 -413283 -211868 -333795 -775920 -1531216 -2269980 -2193091 -1013354 287227 587232
30342 587232 198806 285110 935952 1028278 41900 -1177284 -1730840 -1700755 -1537506 -1362565
30332 -1362565 -1250199 -1339158 -1304391 -558880 670129 1343364 1076405 683900 777412 795948
30322 795948 146292 -549237 -265010 901016 1857837 1855649 1034159 -46179 -819845 -918400
30312 -918400 -469708 -5886 237237 593283 1254279 1747109 1518775 671658 -209163 -587929
30302 -587929 -148603 1003508 2055148 2050075 1082570 273187 234713 358405 46969 -275436
30292 -275436 -43511 452296 771419 1204040 1991837 2413731 1763233 665251 240880
30283 240880 382517 86701 -753941 -1152900 -603164 293400 889489 1177159 1204908 707760
30273 707760 -335864 -1397615 -1944309 -1937368 -1752947 -1917383 -2743801 -3850035 -4340075
30264 -4340075 -3897704 -3247615 -2999145 -2687215 -1784292 -960789 -1138561 -1784604 -1570636
30255 -1570636 -531095 -66926 -708869 -1340927 -1023330 -297795 -138306 -656317 -1398414
30246 -1398414 -2053647 -2378599 -2179970 -1738536 -1527771 -1320709 -452793 859834 1512350
30237 1512350 1095931 382609 -109618 -797024 -1766055 -2152492 -1581810 -1027374 -1281364
30228 -1281364 -1664728 -1321598 -763815 -876454 -1256999 -949234 -209301 -94586 -673510
30219 -673510 -1049006 -971980 -1085527 -1574299 -1803799 -1440702 -897019 -533102 -339169 -458298
30209 -458298 -1081651 -1769581 -1847876 -1549913 -1730673 -2326426 -2267591 -1248753 -381390 -489536
30199 -489536 -854304 -477815 316459 538775 129691 -151404 -26036 141269 257760 587109
30189 587109 969871 889522 415805 247751 638943 1063272 1185947 1351745 1712431 1672655
30179 1672655 823326 -239987 -783015 -1060502 -1673531 -2229842 -1782938 -500541 303338
30170 303338 19434 -487818 -375853 -10837 -11722 -97733 220295 600926 549656 492663 1041944
30159 1041944 1693106 1513905 790977 607621 926792 620360 -442526 -942825 -292175
30150 -292175 241653 -488100 -1657278 -1789922 -1015629 -659371 -1077805 -1258766 -517841
30141 -517841 537198 981221 743959 471835 620447 944519 811965 27534 -724084
30132 -724084 -597367 235203 697794 310101 -126447 209222 900996 992648 403337 -175059
30122 -175059 -443367 -677370 -866983 -505333 620012 1970943 2760398 2648852 1964839
30113 1964839 1406166 1347163 1340455 699700 -317692 -617438 87485 619855 60291 -704202
30103 -704202 -248663 1154280 1881206 1307473 466038 282632 446034 428438 509329 1090529
30093 1090529 1722658 1568487 531054 -612873 -1096730 -871428 -442192 -128532 378889
30084 378889 1482705 2751173 3121970 2328053 1454122 1498006 2013156 1970695 1394588 1128316
$$ [...]
##END NTUPLES=NMR SPECTRUM
##END=
