##TITLE=31Pdec_PR164_pH1
 D2O, 24 sc
 5.2.2020
##JCAMPDX= 6.0         $$ Bruker NMR JCAMP-DX V2.0
##DATA TYPE= NMR SPECTRUM
##DATA CLASS= NTUPLES
##ORIGIN= UXNMR, Bruker Analytische Messtechnik GmbH
##OWNER= root
$$ XWIN-NMR		Version 3.5
$$ Wed Feb  5 14:18:08 2020 Russian Standard Time (UT+4h)  she@DPX200
##.OBSERVE FREQUENCY= 81.013821
##.OBSERVE NUCLEUS= ^31P
##.ACQUISITION MODE= SIMULTANEOUS
##.ACQUISITION SCHEME= undefined
##.AVERAGES= 24
##.DIGITISER RES= 17
##SPECTROMETER/DATA SYSTEM= spect
##.PULSE SEQUENCE= zgpg30
##.SOLVENT NAME= CDCl3
##.SHIFT REFERENCE= (INTERNAL, CDCl3, 0, 182.463)
##AUDIT TRAIL= $$ (NUMBER, WHEN, WHO, WHERE, WHAT)
$$ ##TITLE= Audit trail, XWIN-NMR		Version 3.5
$$ ##JCAMPDX= 5.01
$$ ##ORIGIN= Bruker BioSpin GmbH
$$ ##OWNER= she
$$ F:/spectra/data/she/nmr/P31/1/pdata/1/auditp.txt
$$ ##AUDIT TRAIL=  $$ (NUMBER, WHEN, WHO, WHERE, WHAT)
(   1,<2020-02-05 14:16:52.35 +0400>,<she>,<DPX200>,
      <created by zg, POWCHK disabled, PULCHK disabled
       configuration hash MD5:
       00 E9 B6 7A A2 85 ED C7 34 08 36 98 17 FE 4E 26
       data hash MD5: 32K
       8F 8A 4C 87 FB BE B3 3F 1D 64 1A 63 28 0B 8C 86>)
(   2,<2020-02-05 14:16:54.71 +0400>,<she>,<DPX200>,
      <Start of raw data processing
       efp BC_mod = 2 LB = 1 FT_mod = 6 PKNL = 1 PHC0 = -1278.164 PHC1 = 20.80132 SI = 64K 
       data hash MD5: 64K
       0D 0A 9B D4 05 C8 5E C0 34 BC 2A 34 6B 68 74 86>)
(   3,<2020-02-05 14:17:32.40 +0400>,<she>,<DPX200>,
      <pk PHC0 = -55.05268 PHC1 = 73.99999 
       data hash MD5: 64K
       96 1D 2E 06 FA 98 0B F3 73 E4 12 5F FC ED A9 62>)
(   4,<2020-02-05 14:17:34.78 +0400>,<she>,<DPX200>,
      <abs ABSG = 5 
       data hash MD5: 64K
       15 47 05 67 6C DC 08 BF 3E F8 DE B6 65 E6 DB DD>)
$$ ##END=
$$ 
$$ hash MD5
$$ D8 99 6D FC FC E4 22 1C 45 17 45 33 58 BE 10 DC
##$RELAX= 
##$RELAX= 
##$RELAX= 
##$RELAX= 
##$RELAX= 
##$RELAX= 
##$RELAX= 
##$RELAX= 
$$ Bruker specific parameters
$$ --------------------------
##$DU= <F:/spectra>
##$EXPNO= 1
##$NAME= <P31>
##$PROCNO= 1
##$TYPE= <nmr>
##$USER= <she>
##$AMP= (0..31)
100 100 100 100 100 100 100 100 100 100 100 100 100 100 100 100 100 100 
100 100 100 100 100 100 100 100 100 100 100 100 100 100 
##$AQSEQ= 0
##$AQ_mod= 1
##$AUNM= <au_zg>
##$AUTOPOS= <>
##$BF1= 81.014009
##$BF2= 200.13
##$BF3= 200.13
##$BF4= 200.13
##$BF5= 200.13
##$BF6= 200.13
##$BF7= 200.13
##$BF8= 200.13
##$BYTORDA= 1
##$CFDGTYP= 0
##$CFRGTYP= 5
##$CHEMSTR= <none>
##$CNST= (0..31)
1 1 145 1 1 1 1 1 1 1 1 1 1 1 1 1 1 1 1 1 1 1 1 1 1 1 1 1 1 1 1 1 
##$CPDPRG= <waltz16>
##$CPDPRG1= <>
##$CPDPRG2= <waltz16>
##$CPDPRG3= <>
##$CPDPRG4= <mlev>
##$CPDPRG5= <mlev>
##$CPDPRG6= <mlev>
##$CPDPRG7= <mlev>
##$CPDPRG8= <mlev>
##$CPDPRGB= <>
##$CPDPRGT= <>
##$D= (0..31)
0 1 0 0 0 0 0 0 0 0 0 0.03 2e-05 3e-06 0 0 0 0 0 0 0 0 0 0 0 0 0 0 0 0 
0 0 
##$DATE= 1580897811
##$DBL= (0..7)
120 120 120 11 120 120 24 19 
##$DBP= (0..7)
150 150 150 150 150 150 150 150 
##$DBP07= 0
##$DBPNAM0= <>
##$DBPNAM1= <>
##$DBPNAM2= <>
$$ [...]
##$SUBNAM3= <"">
##$SUBNAM4= <"">
##$SUBNAM5= <"">
##$SUBNAM6= <"">
##$SUBNAM7= <"">
##$SUBNAM8= <"">
##$SUBNAM9= <"">
##$SW= 369.568048894756
##$SWIBOX= (0..15)
0 1 3 0 0 0 0 0 0 0 0 0 0 0 0 0 
##$SW_h= 29940.119760479
##$TD= 32768
##$TD0= 1
##$TE= 0
##$TE2= 300
##$TE3= 300
##$TEG= 300
##$TL= (0..7)
0 120 53 12 22 120 120 120 
##$TP= (0..7)
150 150 150 150 150 150 150 150 
##$TP07= 0
##$TPNAME0= <>
##$TPNAME1= <>
##$TPNAME2= <>
##$TPNAME3= <>
##$TPNAME4= <>
##$TPNAME5= <>
##$TPNAME6= <>
##$TPNAME7= <>
##$TPOAL= (0..7)
0.5 0.5 0.5 0.5 0.5 0.5 0.5 0.5 
##$TPOFFS= (0..7)
0 0 0 0 0 0 0 0 
##$TUNHIN= 0
##$TUNHOUT= 0
##$TUNXOUT= 0
##$USERA1= <user>
##$USERA2= <user>
##$USERA3= <user>
##$USERA4= <user>
##$USERA5= <user>
##$V9= 5
##$VALIST= <valist>
##$VCLIST= <CCCCCCCCCCCCCCC>
##$VD= 0
##$VDLIST= <DDDDDDDDDDDDDDD>
##$VPLIST= <PPPPPPPPPPPPPPP>
##$VTLIST= <TTTTTTTTTTTTTTT>
##$WBST= 1024
##$WBSW= 4
##$XGAIN= (0..3)
0 0 0 0 
##$XL= 0
##$YL= 0
##$YMAX_a= 38948
##$YMIN_a= -44683
##$ZGOPTNS= <>
##$ZL1= 120
##$ZL2= 120
##$ZL3= 120
##$ZL4= 120
##$ABSF1= 182.463
##$ABSF2= -187.1042
##$ABSG= 5
##$ABSL= 3
##$ALPHA= 0
##$AQORDER= 0
##$ASSFAC= 0
##$ASSFACI= 0
##$ASSFACX= 0
##$ASSWID= 0
##$AUNMP= <proc_1d>
##$AZFE= 0.1
##$AZFW= 0.5
##$BCFW= 0
##$BC_mod= 2
##$BYTORDP= 0
##$COROFFS= 0
##$CY= -3
##$DATMOD= 1
##$DC= 0
##$DFILT= <>
##$DTYPP= 0
##$F1P= 0
##$F2P= 0
##$FCOR= 1
##$FTSIZE= 65536
##$FT_mod= 6
##$GAMMA= 0
##$GB= 0
##$INTBC= 1
##$INTSCL= 5.30512e-09
##$ISEN= 30
##$LB= 1
##$LEV0= 0
##$LPBIN= 0
##$MAXI= 10000
##$MC2= 0
##$MEAN= 0
##$ME_mod= 0
##$MI= 50
##$NCOEF= 0
##$NC_proc= -3
##$NLEV= 6
##$NOISF1= 182.463
##$NOISF2= 159.3651
##$NSP= 0
##$NTH_PI= 0
##$NZP= 0
##$OFFSET= 182.463
##$PC= 4
##$PHC0= -1333.217
##$PHC1= 94.80132
##$PH_mod= 1
##$PKNL= yes
##$PPARMOD= 0
##$PSCAL= 0
##$PSIGN= 0
##$REVERSE= no
##$SF= 81.0140089999434
##$SI= 65536
##$SIGF1= 159.3651
##$SIGF2= -187.1042
##$SINO= 113.3802
##$SIOLD= 16384
##$SREGLST= <1H.CDCl3>
##$SSB= 0
##$STSI= 65536
##$STSR= 0
##$SW_p= 29940.119760479
##$SYMM= 0
##$S_DEV= 0
##$TDeff= 32768
##$TDoff= 0
##$TI= <>
##$TILT= no
##$TM1= 0
##$TM2= 0
##$TOPLEV= 0
##$USERP1= <user>
##$USERP2= <user>
##$USERP3= <user>
##$USERP4= <user>
##$USERP5= <user>
##$WDW= 1
##$XDIM= 65536
##$YMAX_p= 456170040
##$YMIN_p= -4539461
$$ End of Bruker specific parameters
$$ ---------------------------------
##NTUPLES= NMR SPECTRUM
##VAR_NAME=  FREQUENCY,     SPECTRUM/REAL,   SPECTRUM/IMAG
##SYMBOL=    X,             R,               I
##VAR_TYPE=  INDEPENDENT,   DEPENDENT,       DEPENDENT
##VAR_FORM=  AFFN,          ASDF,            ASDF
##VAR_DIM=   65536,         65536,           65536
##UNITS=     HZ,            ARBITRARY UNITS, ARBITRARY UNITS
##FACTOR=    0.456856943014862, 1,           1
##FIRST=     14782.0589164792, 0,            0
##LAST=      -15158.0608439998, 0,           0
##MIN=       -15158.0608439998, -4539461,    0
##MAX=       14782.0589164792, 456170040,    0
$$ Real data points
##PAGE= N=1
##DATA TABLE= (X++(R..R)), XYDATA
$$ [...]
37327a34213m0265Q8654O3781q2589j34016m7404J9036J5919Q2116K64461L78648
37316D74128K57073r879j92713j96991j23065r6750j20343r9344J1713J24489
37306B8318J21085K8477r999L4594J4409j30888j98994l4K95396L28110N2230
37295E62704j85362j23692Q1849J25453l4815j93090k15242j66590j51601j66200
37285d66586j34316k0154J22436J95472J55426O4419J6612K6830M2344M6463O7099
37274A16045Q2819K3831j00882j73164j15132O166P2745M6338l5025j13303j19646
37263c09208j5622J19495J37629K7383l4785O4162J79593J07752j02921k13969
37253d0491j35008j5018J3029l313J8533M6413J9019l9108q0111j11589j27763
$$ y = [-134213, -174478, -85824, -22043, -104632, -238648, -286052, -267016, -251097, -168981, 95480, 474128, 731201, 721322, 528609, 331618, 208553, 111803, -8540, -107884, -96171, 28318, 149403, 177880, 167881, 202475, 216884, 85996, -112998, -113032, 182364, 510474, 562704, 377342, 253650, 335499, 460952, 426137, 233047, 17805, -148785, -300386, -466586, -600902, -621056, -498620, -303148, -147722, -83303, -66691, -39861, 2483, 48946, 116045, 198864, 222695, 121813, -51351, -166483, -160317, -87572, -41234, -76259, -189562, -309208, -324830, -205335, -67706, -40323, -75108, -10946, 168647, 276399, 173478, -40491, -175499, -190517, -177488, -180801, -162268, -115855, -96836, -135944, -216055, -327644, -455407]
37242d55407o3938Q1934J81325J42344M9116O969m0715j65076k27091n0938K23806
37231c17671K60055K8161j18884J1301J51083L0490j57308p3275J87700K29160
37221B30812j9394k11989j38921J5616O2541R3657K06527K55039J08751p6142
37211E26497r6422k7697n3001j19463n2605Q6639O5441j25469k29502j14664M7748
37200i2498P5395K8170M7128J06596Q1129l3712j17568j13163r3251j18865j22258
37189c52897k431J92794K73811J41587o0415j14480J176J26855J67360J65085
37179E38445J37220L7283q3139q6210M187p153j43034j62495J6118Q5828j81570
37168A55480m91922m18948o0119J19256L629o6181R4773K56367K29190J57227
$$ y = [-455407, -519345, -437411, -256086, -113742, -64626, -57657, -98372, -263448, -490539, -541477, -317671, -57616, -29455, -148339, -137038, 14045, 44535, -112773, -186048, 1652, 230812, 211418, -571, -139492, -123876, -61335, 32322, 238849, 493888, 602639, 526497, 430075, 402378, 349377, 229914, 177309, 263948, 329389, 203920, -25582, -140246, -92498, -17103, 11067, 58195, 164791, 245920, 212208, 94640, -18523, -111774, -230639, -352897, -355328, -162534, 111277, 252864, 192449, 77969, 79145, 206000, 373360, 538445, 675665, 712948, 629809, 543599, 547786, 540633, 397599, 235104, 251222, 337050, 155480, -336442, -755390, -815509, -696253, -692624, -758805, -664032, -407665, -178475, -21248]
37158b1248J74020J30860r4752l07119k64553l3247J55400K17458J85204N3908
37148A95931j21220j49572L7053J98126R6293j33830j83485l0735P3562K1023
37138C146l9363l865L5340J136k8418J4874N3348M361n7593J884J68220K63999
37126D17069J52503r0131k40260j71655K410Q2216L7567M932M1678L8914p0571
37115B04672j76286j62439q1336l5800j3758K2681O136j05721j69740l1861J94421
37104c49031K37964M7951j39696j35369n609J02405J67753K25897K25399R2931
37094D70595j10331k17965j56080l9835l0524j25883j59462l5157J13418R2899
37084a98325o8127j53648p3915L2345N4138O6648J29449J32221J4631m4907J03194
$$ y = [-21248, 152772, 283632, 188880, -118239, -382792, -416039, -260639, -43181, 142023, 195931, 74711, -74861, -37808, 160318, 256611, 122781, -60704, -91439, -17877, 3146, -36217, -40082, -4742, -3606, -32024, -17150, 36198, 40559, -17034, -15150, 153070, 417069, 569572, 479441, 239181, 67526, 69936, 152152, 189719, 194651, 236329, 275243, 204672, 28386, -134053, -215389, -251189, -264947, -242266, -236130, -341851, -511591, -543452, -349031, -111067, -63116, -202812, -338181, -343790, -241385, -73632, 152265, 377664, 470595, 360264, 142299, -13781, -53616, -84140, -210023, -369485, -404642, -291224, -198325, -266452, -420100, -494015, -461670, -407532, -340884, -211435, -79214, -64583, -109490, -6296]
37073f296K64110J39752j84479l07420q0855J87624J84832j4084j39303j09221
37063f5340m6476m0531o3511o3370j8517O6177J40035J26737K5442n8546m3044
37052d0944J9920K1943n2148j11803p9892J7462P9870M4004l3081l4699M5838
37041a23530O3301p1362k09046j33705J06991K24330Q8717p5432j5498J75410
37031C0176J99520M028j32030p692J94347J62330q7300k18089n8144J35673M4731
37020B67550k27218k78406J1605K91310K14023j16521l34547k80187q7398P8911
37010d60878J59143J31576J6628o4697j1182Q9121P1199m5236q7081j2229M2832
36999a70804K5732N7917J79113K10073J8704k25502k43952k5096J61123J17681
$$ y = [-6296, 257814, 397566, 213087, -94333, -175188, 12436, 197268, 183184, 43881, -65340, -111816, -152347, -215858, -279228, -297745, -231568, -91533, 35204, 60646, 2100, -40944, -21024, 919, -51229, -163032, -242924, -225462, -145592, -101588, -134669, -169368, -123530, -60229, -131591, -340637, -474342, -367351, -143021, -54304, -129736, -145234, 30176, 229696, 233724, 101694, 94002, 288349, 450679, 363379, 145290, 87146, 222819, 267550, 40332, -238074, -226469, 64841, 278864, 162343, -172204, -452391, -539789, -460878, -301735, -170159, -153531, -218228, -229410, -140289, -69090, -114326, -201407, -213636, -170804, -145072, -87155, 91958, 302031, 320735, 95233, -148719, -173815, -12692, 104989]
36989A04989m8753r7193L4238J68355J32355k1035r9007l2016N5555M4032l5490
36978B06030r8899j24644r9854R268J31545R0717j23022k42999q9030J11064L0175
36967a99649k36935k83912O142L03291L21253J58976N2353M9053O3538M8936j4766
36956B68280j42742k60804k46600j15738j1364K1431O5858J24590J07737N0845
36946a38507Q3132J46190M8346j46479j41888P4062J37032q6320k25568k0765
36936b70765K09478J00490j31415p7580J43600J18596j00641q4462J87086K54096
36926C48483k6811k11068P96K74794J93056j16827k58222j68089o5072l251J29135
36915I6924K63698J82248r1411k41264r1381J42043J60561j6334j25077m9316
$$ y = [104989, 56236, -40957, -6719, 161636, 293991, 272956, 173949, 141933, 197488, 241520, 206030, 107131, -17513, -117367, -108099, 23446, 114163, -8859, -251858, -340888, -229824, -199649, -436584, -720496, -714354, -411063, -89810, 69166, 121519, 170572, 234110, 283046, 268280, 125538, -135266, -381866, -497604, -508968, -487537, -421679, -297089, -189352, -138507, -55375, 90815, 139161, -7318, -149206, -75144, 61888, -24432, -250000, -270765, -61287, 39203, -92212, -169792, -26192, 92404, -8237, -92699, 94387, 348483, 321672, 110604, 111400, 386194, 579250, 462423, 204201, 36112, -28960, -32211, 96924, 360622, 542870, 451459, 210195, 118814, 260857, 421418, 405084, 280007, 230691]
36905B30691M9448J0461q5932p2665J5865q288j70259k65591j69222j9880K2677
36894d62695K9375J35970K66109K40423Q0225k4644j2916j085n1313r7930j06372
36883d853j10045q8243j889O1478J67n7916R9544L51923L01152j31041m80743
36872f0466l37588R3801L02771J54981m4733o3341J3254L6214R470j5365m4856
36861D4142o3052r238Q6397Q6930m7527j64000j22169N798N2776o36k9601K2161
36849a38019O4770J3141r1878j56554j46754p4079N6654K06969K64687J48915
36839A47852n5086j63659j09777k611M5398N0191O6784O5183j5401j38454j81913
36828b91493p0579J41805L06092K86295Q5629j27502j87330j24125r1960j12286
$$ y = [230691, 280139, 290600, 204668, 132003, 147868, 139580, -30679, -296270, -465492, -485372, -462695, -433320, -297350, -31241, 209182, 289407, 264763, 251847, 250762, 199449, 101519, -4853, -114898, -203141, -205030, -143552, -143385, -201301, -101757, 250166, 551318, 420277, -60466, -398054, -304253, -1482, 153499, 108766, 45425, 58679, 94893, 104363, 88998, 44142, -18910, -28148, 58249, 145179, 97652, -66348, -188517, -182719, -129943, -130579, -160180, -138019, -73249, -60108, -151986, -308540, -455294, -529373, -472719, -265750, -1063, 147852, 92766, -70893, -180670, -183281, -137883, -87692, -20908, 44275, 28874, -109580, -291493, -362072, -220267, 85825, 372120, 457749, 330247, 142917, 18792, -73168, -185454]
36818a85454n3543R6831J49094J5497j06498l6766Q0546Q242j83278k22261n9768
36807d97358J01030J59869K05049K41637J42030p0842j76526q9783J7051K8266
36797F0423N7844J71170J98907K5801j60368j40546o095J7096n9834o1616P614
36786A10396j7761j39037j66266m2763N5933K0008j6799Q6709K35757K38135P7830
36775D42142r5218j86433k26101k38911j80805l6935J19811K20064K70030K73912
36765C61556J70277m7841k13792j48394O4116J41468k887j24412k6708J13503
36755B86886J1027k69647l89436k23648n60P5634P7103J33826J87717J12936o5914
36744f4076k13422k41917j32439R6241L38612M18234K59206j7438k30535k97212
$$ y = [-185454, -238997, -142166, 6928, 22425, -84073, -120839, -40293, -32051, -215329, -437590, -497358, -396328, -236459, -31410, 210227, 352257, 281415, 104889, 15106, 32157, 60423, 118267, 289437, 488344, 514145, 353777, 213231, 207136, 224232, 164398, 102782, 110396, 92635, -46402, -212668, -255431, -199498, -179490, -196289, -109580, 126177, 364312, 442142, 346924, 160491, -65610, -304521, -485326, -522261, -402450, -182386, 87644, 361556, 531833, 483992, 270200, 121806, 185922, 327390, 324503, 200091, 173383, 286886, 297913, 28266, -361170, -584818, -585378, -509744, -432641, -298815, -111098, 1838, -64076, -277498, -519415, -651854, -555613, -217001, 201233, 460439, 443001, 212466, -84746]
36734h4746k20761m5728J07504R8559m0313q5133Q8439K96016K61151k6961l00503
36723D7524l19048q8205J89793K95385J54974r5352k26122j38458N4831J79432
36713E4754J60856K8671j32266j99911r8594Q3601J66082J04613K7362R903k1583
36702A83488r8822j13797k7251R575j01886k07450j32904K0637L2518q2440j08704
36691f27036K2811J45719J21859M859r0102j25172j04289k1185R8820J79767J69936
36680b24013J10292J02760J94984K82778J81932j18483l38697k14712J03093J94553
36670B74487m7789k58544j43210J08290J67543O7713N8478J47458J30715j1940
36660D93201q8022l8705j9253j12910k10447k07429j21078M702J30062J61013
$$ y = [-84746, -305507, -351235, -243731, -145172, -185485, -270618, -182179, 113837, 374988, 348027, 47524, -271524, -359729, -169936, 125449, 280423, 185071, -41051, -179509, -124678, 54754, 215610, 244281, 112015, -87896, -186490, -102889, 63193, 167806, 195168, 205071, 183488, 84666, -29131, -56382, -46807, -148693, -356143, -489047, -468410, -435892, -518332, -627036, -604225, -458506, -336647, -331788, -421890, -547062, -651351, -672536, -573716, -393949, -224013, -113721, -10961, 184023, 466801, 648733, 530250, 191553, -23159, 79934, 274487, 226698, -31846, -175056, -66766, 100777, 168490, 226968, 374426, 505141, 493201, 405179, 366474, 347221, 234311, 23864, -183565, -304643, -299941, -169879, -8866]
36650h866M0869j13292j38797n7714J771M9417J66815K48897R6391k17327l53043
36639b84879j57394J26536J99486O5676n5140l1492O7387Q7419k8770j44183o7415
36628b22769J49410K00058l8666k45543r3806K12746K08795j15357k95464j08675
36618c49271J32300J17792l2487p8994n4565r9691j64571j26108k0826M7822Q7023
36607e41576J35064J48409J04381P2747P8343N0669q299K833O9406M4637o8592
36596H8022q1717L1536N0417q9115j37400K0140J01838j00180l10310j90221R2341
36585e24649J30137o7311j22924Q5046K67292J94411k7248j90765k18263j20830
36575e95104L2751Q8455m0297j94277j42061R2222K75813K97958K34344J32426
$$ y = [-8866, 32003, -81289, -220086, -277800, -276029, -226612, -59797, 189100, 285491, 68164, -284879, -442273, -315737, -116251, -50575, -105715, -137207, -69820, 17599, -11171, -155354, -222769, -73359, 126699, 88033, -157510, -251316, -38570, 170225, 54868, -240596, -349271, -216971, -99179, -131666, -210660, -265225, -364916, -529487, -655595, -676421, -628599, -541576, -406512, -258103, -153722, -80975, -2632, 48037, 39738, 42571, 111977, 156614, 88022, 6305, 37841, 88258, -857, -138257, -118117, -16279, -116459, -426769, -616990, -524649, -394512, -461823, -584747, -499701, -232409, -37998, -65246, -256011, -474274, -595104, -562353, -473898, -514195, -708472, -850533, -758311, -482498, -184540, 49804, 182230]
36565A82230j6332j17789n3861P5153M1587j52330k50199j12940J08503K12327
36555h3651J51934k2850k18860k70798q2391J71537K08616L5099o3694L1514J13154
36544c0390J6272j30360j61262j30438j38884j25706k3878O1278L0359j3688M5522
36533f01175R7440j6126j93055j93732j2363J22962J06078O7119J00034J05595
36523d17223j590j13926r1613J8876O6256J9730k5107k6714m2023q5267p8343
36512g76944N984O4512J5272n4643q863J17204J47298J4040j45989j73517n7018
36501h52664J11313K47161K95428K33871J13407K8693J6845M8722J09155J77353
36491E29284J55928p568j40210k2184K22576K13575r8382k70402j4248L31355
$$ y = [182230, 165898, 48109, -5752, 69401, 110988, -41342, -291541, -404481, -295978, -83651, 68283, 45433, -173427, -444225, -526616, -355079, -146463, -111364, -175058, -143544, -30390, -14118, -144478, -305740, -436178, -575062, -700768, -724646, -663368, -633009, -646697, -601175, -503735, -519861, -712916, -906648, -919011, -796049, -689971, -622852, -522818, -417223, -418813, -532739, -624352, -605476, -539220, -519490, -544597, -571311, -613334, -698601, -776944, -770960, -706448, -691176, -745819, -754682, -637478, -490180, -476140, -622129, -795646, -852664, -741351, -494190, -198762, 35109, 148516, 177209, 194054, 242776, 351931, 529284, 685212, 677644, 537434, 515250, 737826, 951401, 853019, 582617, 568369, 899724]
36481H99724L07102K1852r4524q176l1741j64659o0672L01365M76551K55010J24
36470A901956L2608J31680r540k17885j54976P3472Q4857j51634k99571k15286
36460A175681j06524j06442p3381P6420J61098L4115j44479j43114j2503P229
36450H68100j39915k47296j50469M8098J30649M7147n2291l8354M5982Q1751L7683
36439F31085k8076p3496r3200o2867M0812J64604K06112J27146k0810j69720k59567
36428D62023k22309n4506J05056R9635l0679q8346K859R7896N8991n2040q9264
36417B89316k3146N8074O9962o712j15551j40921k3253J19759J04118n9986j63006
36406A08654r8663j327O115J7402J45080K70264J90576o4474k61007k69720j76497
$$ y = [899724, 1206826, 1228678, 1134154, 1125978, 1094237, 929578, 868906, 1170271, 1646822, 1901832, 1901956, 1934564, 2066244, 2056704, 1838819, 1683843, 1757315, 1842172, 1690538, 1390967, 1175681, 1069157, 962715, 889334, 965754, 1126852, 1160967, 1016488, 873374, 860871, 868100, 728185, 480889, 330420, 378518, 509167, 556314, 504023, 465669, 511651, 593402, 631085, 603009, 529513, 436313, 373446, 414258, 578862, 784974, 912120, 891310, 721590, 462023, 239714, 185208, 290264, 389899, 359220, 270874, 273733, 371629, 430620, 378580, 289316, 266170, 324244, 394206, 387494, 271943, 131022, 107769, 227528, 331646, 271660, 108654, 9991, 8664, 14779, 32181, 177261, 447525, 638101, 573627, 312620, 42900, -133597]
36395a33597r4688k8182M9564J07741J07250O6979L3348J7163p287m6004m8592
36384B3695L7601J60125J72151K5186j10862m8649J33656J79997K5402j20059
36374D78243j00872k3039l7970j13409j50147j59534j77563j47243l8288M7603
36364d22219M0648L9831J29887K02324J40112M5829P4962J56269J12022k6078
36354D93587o6388K4320R2678P1271M9511O4649L6681n5968j20848j11054q7536
36343C90903r4303j04995j02821q8170k1296J07551J80005P4421j38031k77075
36333g3811k93539k57050j62930L2496K20417K27712R5624K9096O3836M7184l0035
36322a01000J2694J83703K24456J9054j87746j65377l1147N602p103O6019J25779
$$ y = [-133597, -228285, -256467, -206903, -99162, 8088, 75067, 108415, 125578, 118291, 72287, 23695, 61296, 221421, 393572, 418758, 307896, 259247, 392903, 572900, 598302, 478243, 377371, 354332, 316362, 202953, 52806, -106728, -284291, -431534, -469822, -422219, -381571, -341740, -211853, -9529, 130583, 176412, 251374, 407643, 519665, 493587, 427199, 451519, 544197, 615468, 664979, 729628, 766309, 710341, 589493, 478439, 390903, 296600, 191605, 88784, 614, -20682, 86869, 266874, 341295, 203264, -73811, -367350, -624400, -787330, -754834, -534417, -306705, -211081, -181985, -118149, -70965, -101000, -88306, 95397, 319853, 338907, 151161, -14216, -45363, -39761, -46864, 19155, 144934]
36311A44934r94j96846j69851R9320L10671K60506O0387r7681j71756j90373j31931
36300h3614J934J16066J34254J04336J02452R5644l087j69498k53601j56518L5578
36289g6054J44277J06666L2078L9385J02852J11125K7662q2227j46780j26085
36279A32899L428J88883K58278R0589j68155k28637l8943J33694P6774r1113j37210
36268B20487m1170N8518J07820J31041P9088r6586k64532k27984k0729J12020
36258E7973N2642o1969r8381j09520j60663j57004n424J75026J90932O4848M265
36247d7275Q7290J56545P5797n9791o9646N7611J72435J68769O5112p9593k04670
36236C22584k19248p8741R0545R0235p5701j74379p3362O2895L9447n8539k2297
$$ y = [144934, 143940, -52906, -222757, -123437, 187234, 447740, 508127, 410446, 238690, 48317, -83614, -81680, 34386, 168640, 272976, 375428, 471072, 467985, 298487, 44886, -111632, -76054, 68223, 174889, 206967, 246352, 349204, 460329, 487991, 405764, 258984, 132899, 136327, 325210, 583488, 674077, 505922, 277285, 238342, 372036, 448810, 357697, 220487, 179317, 237835, 345655, 476696, 555784, 459198, 194666, -33318, -54047, 57973, 110615, 48646, -49735, -159255, -319918, -476922, -482346, -307320, -116388, -51540, -47275, 40015, 196560, 272357, 212566, 142920, 200531, 372966, 541735, 606847, 527254, 322584, 103336, 24595, 115140, 205375, 129674, -44705, -118067, -55172, -15725, -74264, -96561]
36225i6561J18839J41074N53r1519q174J08123Q5514m2080j44893j82249j61395
36214b72768m6190J62926L47332L77542K43233K3051j83506k55580j20339J06984
36204C82685J95900R7824J4500O9935J03909m2357k15978j67389M1300J14307
36194E94636l1476j64003j08197J6135J7670q3735j23113l9422O1507O3215k5412
36183A77805j04748j13172p4906j5936Q8216K06073J80072p2752l38109l12364
36173c79821m3140J08849J3302m4198J29959K92370J90593J3253M9865J69831
36163E00863P8176j16017q8036P9056J3616k45616k60277L6741J80490m6255k50408
36152a17667j13362R7232N1721q3599l0030P3546j2266j26599j8614J33585L9200
$$ y = [-96561, 22278, 163352, 163905, 72386, 64212, 172335, 257849, 215769, 70876, -111373, -272768, -318958, -156032, 191300, 568842, 812075, 835126, 651620, 396040, 275701, 382685, 578585, 676409, 690909, 760844, 864753, 822396, 606418, 439029, 480329, 594636, 563160, 399157, 290960, 307095, 324765, 241030, 117917, 78495, 140002, 203217, 177805, 73057, -40115, -115021, -130957, -42741, 163332, 343404, 270652, -67457, -379821, -422961, -314112, -300810, -345008, -215049, 77321, 267914, 281167, 331032, 500863, 579039, 463022, 374986, 454042, 467658, 222042, -38235, -1494, 178996, 132741, -117667, -231029, -133797, -82076, -165675, -195705, -122159, -134425, -261024, -279638, -146053, -106853]
36141a06853j14452M1637L47187L14016m0691j94604K1450J87442M3720j12897
36131C85955j2889J24873K5629j63416j65025k6127L5807j1294q5728j84965k59859
36120c37039j42365J47646K79806P9979j35693k0217K48058K53992P181j16578
36110B64770J083R5241J1682p9141l3908L7884J1830n1511n4741j2271K6910M3166
36098B60994N279p5657p3720P8246J94069O2052j78694j96340J1496J08241k4748
36087A71218j11313J4131J17397j69j29145j1332K00561J73458r7586l21839l27350
36076c21969j71098M9893K37641K46570N0806j27086q2290P8245J32000R6351
36066A89063J17075J32652k0770k46213k73854q7709O5788Q7288J05998J42385
$$ y = [-106853, -221305, -179668, 167519, 481535, 440844, 246240, 267690, 455132, 498852, 385955, 373066, 497939, 523568, 360152, 195127, 169000, 204807, 193513, 107785, -77180, -337039, -479404, -331758, -51952, 28027, -107666, -127883, 120175, 374167, 381348, 264770, 265853, 361094, 372776, 293635, 259727, 297611, 309441, 257930, 203189, 190918, 217828, 260994, 266273, 190616, 116896, 195142, 389211, 451263, 272569, 76229, 87725, 195966, 171218, 59905, 74036, 191433, 191264, 62119, 50787, 251348, 424806, 327220, 5381, -321969, -493067, -443174, -205533, 41037, 91843, -35243, -117533, -39288, 92712, 189063, 306138, 438790, 418020, 171807, -102047, -189756, -123968, -36680, 69318, 211703]
36056B11703N2074j30866j54859L2155J61538P6933l7038k4687l0955j79439k73312
36045b96753r5765K13699L61802L03543J79617K1429j93996l26979k21854p134
36035f2391L1701j44789l01521l02411k91181m61978p95832j043820q99129k68110
36025d539461N21869R17198P12298L06025J93031L51100L99771K28122R8329J56373
36015f55345K19768J27239k1301q8414r4941p6702R567J19987J02867k8815m7606
36004d33696J13196J84401l1177k99384k69210J0453J77921P9572q0042r2738
35994f40704P207R5805J46697J77642J54127M7314q5191j48988j12022k4840L0013
35983c52940Q54q7564j43002q5106P1731K13661K07896K1884k04979k57904q8075
$$ y = [211703, 263777, 132911, -21948, 10207, 171745, 248678, 211640, 186953, 155998, -23441, -296753, -392518, -178819, 182983, 486526, 666143, 687572, 493576, 166597, -55257, -62391, -30690, -175479, -477000, -779411, -1070592, -1532570, -2328402, -3372222, -4271351, -4539461, -4017592, -3100394, -2388096, -2082071, -1889040, -1537940, -1138169, -910047, -811718, -655345, -435577, -308338, -329639, -418053, -512994, -589696, -580129, -460142, -357275, -386090, -433696, -320500, -136099, -167276, -466660, -735870, -725417, -547496, -467924, -547966, -640704, -633497, -537692, -390995, -213353, -59226, -11912, -97103, -246091, -358113, -382953, -352940, -352086, -439650, -582652, -667758, -596027, -382366, -174470, -152586, -357565, -615469, -703544]
35972g03544R4201Q1744k8084K6454K48591L42423J59108p0980r7153o175j2252
35961C4333q7409o7262J3248j3134j14939r4144O8430J76139J35476N1570j5538
35950H6770j21170k18716j54171L5169R3300n6947j53771K464K35599K82017J70637
35939B01181Q4131L7375m2598p9544J6344R6497l3413k49708k61545q0812J513
35928c10579q7317r3154R7518K40787J48111Q83L2158J50278J32487n667j00138
35917B05367j42215k18738k66978j74039m1573n6989j41645l6556K48365L86280
35907b38721K19204K953J6787J63927J57118n6883k59390k59632p1117J53195
35897a72559K37709R6447j59483k83536j60190N4422J45592J01538M7208J6616
$$ y = [-703544, -609343, -527599, -555683, -529229, -280638, 61785, 220893, 149913, 52760, 46585, 34333, -53076, -120338, -107090, -120224, -235163, -329307, -260877, -84738, 50738, 102308, 86770, -34400, -253116, -407287, -372118, -278818, -335765, -489536, -487072, -251473, 30544, 201181, 285312, 322687, 280089, 200545, 216889, 313386, 279973, 30265, -231280, -312092, -310579, -397896, -491050, -393532, -152745, -4634, -3751, 28407, 178685, 311172, 305505, 205367, 63152, -155586, -422564, -596603, -638176, -695165, -836810, -873366, -625001, -238721, -19517, -16564, 223, 164150, 321268, 264385, 4995, -254637, -325754, -172559, 65150, 161597, 2114, -281422, -441612, -387190, -241598, -140060, -92852, -76236]
35887g6236m5112j12760r5344q207L3238M709Q346Q6328J38006P7442l8630j03139
35875a31359r3368n6803l2663l7211o6773p4747o947J01281J30149L0926q2816
35864c20331o8981N2887J20133L2682j21816j72872o0861J12341K15083K16855
35854E120J63745P9187l6982j37304j54362j05078o2726j3442J19373K66301K13157
35843C36989o7155k64493j15618J92792K55539J0194k09233j69257m037O8329
35833C4050L1793l0747r8771j39486o1697J14663K02444R5095p4003j39968j17200
35822a83827p5080J8616J62434J96632J9725j98028k23583p4532P4566J75933
35812a07144K67860K66179P3589j69272k26058j23415q3987j26812n6362J27701
$$ y = [-76236, -121348, -234108, -329452, -337659, -304421, -299712, -291366, -205038, -67032, 10410, -28220, -131359, -224727, -281530, -314193, -351404, -418177, -492924, -499871, -398590, -268441, -237515, -320331, -389312, -336425, -216292, -183610, -305426, -478298, -539159, -426818, -211735, 5120, 168865, 248052, 211070, 73766, -80596, -185674, -248400, -261842, -142469, 123832, 336989, 269834, 5341, -110277, 82515, 338054, 348248, 139015, -30242, -34279, 34050, 65843, 35096, -63675, -203161, -264858, -150195, 52249, 147344, 73341, -66627, -183827, -258907, -240291, -77857, 118775, 138500, -59528, -283111, -357643, -283077, -107144, 160716, 426895, 500484, 331212, 105154, -18261, -102248, -229060, -285422, -157721]
35802a57721J60601m1879j95604p9276J23549J24141n2658j73182j42410k8836
35792d63275J08924K07813J48116o9815k20766j42743j016k5484j19245k8777
35782f06268J89950K27748K9788j11748l0624Q9525P7208L5252P2899P2999n0376
35771c647j16688L3489K20622J89149K9472J8541J48749J62936J5923n7897K9064
35760F69713O7539o9773k05996j69791o7233o1243r8054n7703K389k6702p6363
35749i3217j9649Q6880R7468K8210K185K0202L534n613P6357J52547O9298p1020
35737C47182k3879J55005J20168k06905m27730k21253J64755K54587m104k33990
35727g6164j85052j165P2280k216j02170j26609m9018R9026K28272K42495J31077
$$ y = [-157721, 2880, -38999, -234603, -313879, -190330, -66189, -118847, -292029, -434439, -463275, -354351, -146538, 1578, -68237, -289003, -431746, -432762, -458246, -577491, -606268, -416318, -188570, -158782, -270530, -301154, -211629, -134421, -99169, -26270, 46729, -3647, -120335, -86846, 133776, 322925, 352397, 370938, 519687, 682623, 698546, 640649, 669713, 737252, 667479, 461483, 291692, 224459, 163216, 65162, 7459, 9848, -16854, -93217, -112866, -25986, 71482, 99692, 101877, 122079, 125613, 120000, 196357, 348904, 418202, 347182, 323303, 478308, 598476, 391571, -36159, -257412, -92657, 161930, 157826, -76164, -261216, -262381, -190101, -192317, -294487, -421096, -470114, -371088, -142816, 99679, 230756]
35716B30756k6978j51825k06823j72023m8965J00620J81471J50270N0239l4291
35706G2451m3447R158L6373l0054j34370j52436o9635k712m288K2276J25263J64246
35694g175K0416j60685j34872P8992K05718R0887j09714j63726l9446J15340J65844
35683F1579R6268j2252o6168n3119m4961p5712p5872o74N8492J2147n8443l5096
35671a93811O315q2292k03486r1630K44503M34299K35973j15527k34476q1213
35661h1345P7408Q1396K0604R690K7042J358p5059j50281j59804p6638L6187O7963
35649b21479J0974l011J05503K20230J87647M4125n0435n2140n4635r5470r8374
35638g065k4156N5405O8418K5040l3429p2934m6016N8918J37728O7831q5439j05335
$$ y = [230756, 203778, 51953, -154870, -326893, -375858, -275238, -93767, 56503, 106742, 72451, 29004, 38162, 74535, 44481, -89889, -242325, -311960, -314672, -318960, -296684, -171421, -7175, 13241, -147444, -282316, -203324, 2394, 93281, -16433, -180159, -219605, -104265, 61579, 157847, 145595, 79427, 26308, -18653, -94365, -170237, -170911, -112419, -100272, -158715, -193811, -187496, -269788, -473274, -564904, -320401, 113898, 349871, 234344, -132, -81345, -3937, 77459, 98063, 107753, 134795, 136153, 61094, -89187, -248991, -325629, -289442, -221479, -210505, -213516, -108013, 112217, 299864, 343989, 293554, 241414, 186779, 91309, -7065, -31221, 24184, 92602, 117642, 84213, 11279, -34737, 24181, 161909, 229740, 144301, 38966]
35626C8966O6741K06760J11328j01217j62102m6005J5760q6520j71172o6993R8292
35615i6162Q7117p0074j00792J02869L00724K16488r7834l27707k59715K1500
35605b23586K57834K55012L3583j81736j65946M6320J77240O9716p6086P005K27185
35594D26541K51923K9361j11136L4865K35911K07050N5322P1470K38279K65808
35584A705394O3702j31757j36270n1660k7890j9821O9375J62298J03568q8077
35574A648862k14123j32461R2119K70087K64914J01258o5162r9302k2740L7170
35564A880622L4974O1030J67009K36384J34597o9868j74216j31530j26405k94525
35554A718072m89774m61222k01190L9920Q7847L2223K2856L9777n220o7252n5065
$$ y = [38966, 105707, 312467, 423795, 322578, 160476, 114471, 130231, 43711, -127461, -194454, -96162, -9045, -79119, -179911, -77042, 223682, 440170, 342336, 14629, -245086, -223586, 34248, 289260, 322843, 141107, -24839, 21481, 198721, 268437, 192351, 199356, 426541, 678464, 707825, 596689, 631554, 867465, 1074515, 1129837, 1201307, 1439586, 1705394, 1769096, 1637339, 1501069, 1449409, 1421519, 1401698, 1471073, 1633371, 1736939, 1648862, 1434739, 1302278, 1394397, 1664484, 1929398, 2030656, 1965494, 1866192, 1843452, 1880622, 1915596, 1976626, 2143635, 2380019, 2514616, 2444748, 2270532, 2139002, 2012597, 1718072, 1228298, 767076, 565886, 605806, 693653, 725876, 748732, 788509, 783289, 716037, 660972]
35543F60972m0237j55042l04844k38061M8459K36116J34777m3404m0470N2135
35533C10401R437j09462q5228L8530K0838j25007j26477N8843J31529m5961j95852
35522a18409p8638J21987J33846M0384O6102J35579K5440j77455j75924K3132
35512c956R6751n8198j65362m8661R5726Q1821N3649J73490K67794J00888j82771
35501D11171k32195j5936J51049Q4140o8602j28420j12391q4090k3025M7544J1826
35490D1071j28386j74997j7918J52850R7661j18635k17165r4502O9528R4400K4044
35479b72049J8229J26412K38451K24124Q5158l7216k5209N4525K5280j44977k69362
35468B3366j90383L235J12666Q7971K0189m3912j16558j48620p0959N6330R8443
$$ y = [660972, 620735, 465693, 160849, -77212, -28753, 207363, 342140, 298736, 258266, 310401, 319838, 210376, 125148, 163678, 184516, 59509, -66968, -8125, 123404, 77443, -118409, -197047, -75060, 58786, 99170, 165272, 300851, 326291, 148836, -27088, -3956, 92795, 34597, -130765, -179426, -83700, -1879, 51770, 225260, 493054, 593942, 411171, 178976, 163040, 314089, 398229, 329627, 201207, 88816, 4726, -18299, 29245, 41071, -87315, -262312, -280230, -127380, -29719, -148354, -365519, -460021, -390493, -296093, -272049, -253820, -127408, 111043, 335167, 420325, 383109, 357900, 412425, 437705, 292728, 23366, -167017, -163782, -51116, 36855, 57044, 13132, -103426, -252046, -323005, -266675, -168232]
35457a68232M7241J2755K0170j2295q6125r8032k9352K5371N0414J26258K11344
35446I9517J42157o2725j50039k0192Q5032k4698j53640m2051J81592J97340J1562
35435B63855p9082J0718N3214o2368j41684l5630J08574J01793n02l3068J8184
35424B04004M7795J0589n8541j15943j09998j0273R1344L4445j67963k80494j53916
35413e08951N1739R7415Q36l3427O0350J45777J21081M3335J680N772K6948M1179
35401E3734R902q4595j66799j25307L1322J59075J48038L8034n6117o4915P872
35390d9756R8771R9663n2455k51778k76884m7686K35430L08319J57666L129j8757
35379B05662n504p4327j43032n8018J40877K50853J88832Q0443L7913J8081k0878
$$ y = [-168232, -120991, -108236, -88066, -100361, -186486, -284518, -313870, -288499, -238085, -111827, 99517, 241674, 178949, 28910, 8718, 93750, 69052, -84588, -126639, 54953, 252293, 263855, 184773, 195491, 248705, 186337, 44653, 9023, 117597, 219390, 218888, 185820, 204004, 251799, 262388, 203847, 87904, -22094, -32367, 58977, 93422, -74541, -355035, -508951, -457212, -359797, -358961, -392388, -332038, -186261, -65180, -21845, -20165, -14393, 12555, 53734, 63636, -20959, -187758, -313065, -281743, -122668, 25370, 63404, 7287, -57628, -49756, 49015, 148678, 96223, -155555, -432439, -480125, -244695, 63624, 221290, 224419, 205662, 200158, 125831, -17201, -75219, 65658, 316511, 505343, 585786, 623699, 641780, 620902]
35368F20902M935J23130J42455j05867m34204m60960j23596K15376K53544J07490
35358C43205M4470O8400N536j28867j37683m366K5752j77170l79488k82330N1028
35347e71513K61978J65152l7943p2896L7063O0865n9267j19376J4322J74205J33358
35336a4052m5805j03626K5772J39135J04606N0588J09760J70818N7390j73303
35326C21283k98720k27261n6885J04647K03290J69310j4627j82672j30346P9306
35316c2675J60209J6551j05936l860J58405J10590q7766j39811J4946J05978l1159
35305A65472j79919o9878J94228K64346N6282j18844L636K68770L31923J43302
35295A059318j8958J3399O6587o6205k80752l20122j62582k3027r151j4959K6480
$$ y = [620902, 625837, 748967, 891422, 785555, 351351, -109609, -233205, -17829, 235715, 343205, 387675, 456075, 461611, 332744, 195061, 190695, 216447, 39277, -340211, -622541, -571513, -309535, -144383, -182326, -255222, -218159, -157294, -216561, -335937, -321615, -147410, -14052, -59857, -163483, -137711, 1424, 106030, 156618, 266378, 437196, 494586, 321283, 22563, -204698, -261583, -156936, 46354, 215664, 201037, 18365, -111981, -32675, 127534, 144085, 38149, 34289, 192694, 303284, 215518, 75707, 90653, 196631, 165472, -14447, -84325, 109903, 374249, 430531, 311687, 315323, 584093, 916016, 1059318, 1040360, 1053759, 1120346, 1054141, 773389, 453267, 290685, 267658, 258507, 243548, 270028]
35284B70028K9527k8250j6366Q9261Q5018j28832l00120j68633R8546J31221p5099
35273a3699j69017q845J55465J38502Q6483J32135J30266k7467j38741k9051R1847
35262C47878l5936k34676j46117J51490K40978M9381m8666J08896J86274o6563
35252E52939l61721l15294k8398J26992P9896M3843P2350K2128q8017n7298J18558
35241A65978J78382N459j70282j23276L7318O7897l7074p6952K4711J15134M8079
35230B35374j12843j86215j04354J3540K0501o9834j00824K0069J90267K32438
35220A38119J08874m3931q4757k1593J4314o8968j94852j82403J7692K02479J52546
35209C7520l4943m4491J73440K60284k9796l84622l11893J47627M42486K63885
$$ y = [270028, 299555, 271305, 254939, 344200, 429218, 300386, 266, -168367, -69821, 61400, -13699, -182716, -191561, -36096, 102406, 188889, 321024, 451290, 423823, 285082, 256031, 347878, 311942, 77266, -68851, 82639, 323617, 372998, 324332, 433228, 619502, 552939, 191218, -124076, -152474, -25482, 54414, 98257, 170607, 192735, 104718, 47420, 165978, 344360, 349819, 179537, 56261, 93579, 161476, 124402, 47450, 72161, 187295, 235374, 122531, -63684, -168038, -154498, -133997, -203831, -304655, -284586, -94319, 138119, 246993, 203062, 118305, 96712, 111026, 42058, -152794, -335197, -317505, -115026, 37520, 2577, -41914, 131526, 391810, 362014, -22608, -334501, -186874, 255612, 519497]
35199E19497p3023j32090O2444J78800J00964L192j4066o1292j90273k36670p5623
35188H1860J20962Q1231j60029k61861m1592K48946K63970M3735q0450m121K5935
35177C18586j32680k48613r9109J27969J03561j21589j90371J7174K29352K03310
35167B07590K5558r1421r2534n2541k7706l5473o7108n7204N0939J73780J49600
35156A83480k4925j51796q5959P8932J43569L9074j20984j69154m3931J41886
35146i808K14070J46804P7351O7186O348j32894j53191M6655K09075P4613j67497
35135C78712j55541M4034N4660j45348j75701P3588K30360O5675j30664m1574
35125A98201J96409K70983J36569o8681k60946l40813j72973J43144K67937R3343
$$ y = [519497, 446474, 314384, 376828, 555628, 656592, 659784, 645718, 584426, 394153, 157483, 81860, 202822, 284053, 124024, -137837, -179429, 69517, 333487, 377222, 296772, 292651, 318586, 185906, -62707, -161816, -33847, 69714, -51875, -242246, -225072, 4280, 207590, 233148, 141727, 49193, -3348, -31054, -66527, -133635, -190839, -139900, 33880, 183480, 158555, 6759, -79200, -268, 143301, 182375, 61391, -107763, -151694, -9808, 204262, 351066, 428417, 495603, 501951, 369057, 215866, 262521, 471596, 546209, 378712, 223171, 267205, 321865, 176517, 816, 74404, 304764, 370439, 239775, 198201, 394610, 665593, 802162, 733481, 472535, 131722, -41251, 101893, 369830, 463173]
35115D63173q4648o0409k1576j18580j39215O0951J99315L3391j73309r2991R1665
35104A57767M3175r9526Q824K54314K49089K0821o8317J1067m1730k30214k22504
35093H2766K9697J83698R4989Q921O2158O6072q1035j89955j28081m458R4389
35082B19161K03113K49451R9309j16566j11180P3182J01090q3906j73949n6085
35072D03620K9589J967R1857L13449L15225K387k09103o6619Q5780q2619l09264
35061E76269k15317K9398K3670j73106j89135L905Q7407l8771j38831p5033J7064
35050i2480J3648l2115m3453j5008N9374J76598K49898J91244M8507m8778l9746
35039D67689M2594J18310Q7387o9766j90536j01539Q3889P4953j41438k46530
$$ y = [463173, 378525, 318116, 296540, 177960, 38745, 99696, 299011, 332402, 159093, 66102, 157767, 200942, 101416, 110240, 364554, 613643, 634464, 566147, 577214, 535484, 305270, 82766, 112463, 296161, 391150, 400071, 462229, 528301, 447266, 257311, 129230, 124772, 219161, 422274, 671725, 771034, 654468, 543288, 616470, 717560, 633654, 459705, 403620, 433209, 435176, 527033, 840482, 1155707, 1158094, 948991, 882372, 968152, 885533, 576269, 360952, 390350, 414020, 240914, 51779, 55684, 143091, 104320, -34511, -109544, -92480, -78832, -110947, -154400, -169408, -110034, 66564, 316462, 507706, 556213, 507435, 467689, 510283, 628593, 715980, 646214, 455678, 354139, 438028, 512981, 371543, 125013]
35029A25013q9985Q0735N3310k0785M0150R9319k5067j98143j91899o4501j4309
35018b06162l0427J6220P9331K0065j20011j67691n8587J32631K87115K66969
35008B19453L5724j68770n7334K31456K47522n1371j74277Q4529K54964p838k95431
34997C18627j46367J40922N4461k02905r7912K33368K06019j68047l06335p3340
34987d1509O7357m1407k3951K09446K27922q4654k12543J29954M84604L92741
34977A107960P0724p6767r6254j86732k15688j7141J82897J04897j02199j38748
34967F32949n7780q3918j60607r0483N0150L1052j23508j93829j29449m9392K1937
34956a52878J37190K36124K27619J73443J68743J46161J1688j42635j71425j00773
$$ y = [125013, 35028, 115763, 169073, 148288, 188438, 287757, 262690, 64547, -127352, -191853, -206162, -236589, -220369, -141038, -120973, -240984, -408675, -467262, -334631, -47516, 219453, 255177, 86407, 29073, 260529, 508051, 456680, 282403, 366932, 621896, 614058, 318627, 172260, 313182, 367643, 164738, 66826, 300194, 506213, 338166, 31831, -41509, 25848, -15559, -39510, 169936, 397858, 313204, 100661, 230615, 715219, 1107960, 1178684, 1101917, 1005663, 818931, 603243, 586102, 768999, 873896, 771697, 632949, 575169, 491251, 330644, 240161, 290311, 321363, 197855, 4026, -125423, -174815, -152878, -15688, 220436, 448055, 621498, 790241, 936402, 948090, 805455, 634030, 533257]
34946E33257k8428N2615J34188Q0296j26196k12506J6900L02932K55347n6527
34936I51878j93547J4980K72155K75619O4538j64120l12069l42151k04371N3313
34926D16225K30506J64254p6202k59593k36911q2226R851l7064q5688P458J45436
34915A96046J13421n9051q8268J28822L11794J96972p1259j79140j10336r9749
34905C39252k13381k64064j42461J7254N6888J908j5453P0748K05645K65572J64640
34894D86548l9013j78187j63694o7976K2543J17646K00584J43290j00867l29737
34884I1137k97371k7097K30122K92285J68997l2468j72956j29850N8561J62302
34874C43662K9771j85968k37616j31876o1218o0031J9755J98168K82670J54224
$$ y = [533257, 504829, 557444, 691632, 771928, 645732, 433226, 450126, 753058, 1008405, 951878, 758331, 773311, 1045466, 1321085, 1385623, 1221503, 909434, 567283, 362912, 416225, 646731, 810985, 734783, 475190, 238279, 156053, 165904, 128840, 43152, 50610, 196046, 309467, 250416, 162148, 290970, 602764, 799736, 728477, 549337, 439001, 339252, 125871, -138193, -280654, -263400, -206512, -204604, -220057, -149309, 56336, 321908, 486548, 447535, 269348, 105654, 37678, 60221, 177867, 378451, 521741, 420874, 91137, -206234, -233331, -3209, 289076, 458073, 425605, 252649, 122799, 181360, 343662, 373433, 187465, -50151, -182027, -243245, -303276, -283521, -85353, 197317, 351541]
34864C51541n6470j56582j13283k4037K1633k789o1065q0897l7758P139J4900
34853a37668M7182J36813J73002O7002n6640l1697N7645k498j76827k02342j8070
34842a44098J15943K8190j04476o3885P2420J02432K8873j1523k3012j10355k26925
34831c36416k05466l7708R3207R5246Q5515J52934J82483M6005j56218k04021
34821b84439n2432J27277J83469J27374L6567m7674q5836k9526Q0207J04353j6991
34810A42349j60232j78522q5385J5673R0724J41544J10809j2324p2654O0131K31640
34799B83753J70446r5927k53824j67225m8096o5658p0255J10585L37762L61494
34789E63055J95517M5574k7258j25087k52310k76120j56362k5528o8m2739m9882
$$ y = [351541, 295071, 138489, 25206, 1169, 22802, 20013, -41052, -121949, -159707, -152568, -137668, -90486, 46327, 219329, 286331, 229691, 197994, 255639, 253141, 76314, -126028, -144098, -28155, 35, -104441, -168326, -95906, 6526, 35399, 23876, 864, -109491, -336416, -541882, -579590, -486383, -391137, -305622, -152688, 29795, 75800, -80418, -284439, -336871, -209594, -26125, 101249, 137816, 90142, 4306, -25220, 54987, 159340, 142349, -17883, -196405, -281790, -266117, -175393, -33849, 76960, 64636, -8018, 52113, 283753, 454199, 358272, 104448, -62777, -110873, -176531, -246786, -136201, 201561, 563055, 758572, 804146, 776888, 651801, 399491, 123371, -32991, -58519, -58587, -101326, -151208]
34778a51208J2340Q7059R6178K7740l6393k1175J9215k8370j41245j72044q0100
34767c88003J4465N6874J37087K52024K13779m6661k88081k68202p0835P9353
34757c08200J52507K26908K35921R0850o1888j0891J63878J96977M7135q9842
34747F43355j34600j80234k10431r3024J06516J28174p7915k40558j73162k3095
34737b54974J7364l75N0767J25799J16502N6619M3343O5286N4626J4117k9440
34726B59634r7732j73848j53827j1029R9552M7105n9503l2077Q8251Q4242q0254
34715b9486j64595N011K56732K84223N4928j61460j66614o3712m3823r5404p4936
34704a99136K7913Q6310O7110O7540J04148O4465p1437j50890q2222K0687L0377
$$ y = [-151208, -138868, -51809, 44369, 72109, 35716, 14541, 33756, 5386, -135859, -307903, -388003, -373538, -316664, -179577, 72447, 286226, 239565, -48516, -316718, -387553, -308200, -155693, 71215, 307136, 397986, 336098, 325207, 489085, 686062, 733197, 643355, 508755, 328521, 118090, 25066, 131582, 259756, 181841, -58717, -231879, -254974, -237610, -237985, -187218, -61419, 55083, 111702, 155045, 220331, 274957, 289074, 259634, 161902, -11946, -165773, -176802, -77250, -30145, -89648, -121725, -33474, 50768, -29486, -194081, -189070, 67662, 351885, 406813, 245353, 78739, 15027, -28796, -124200, -199136, -171223, -84913, -17803, 49737, 153885, 218350, 146913, -3977, -86199, -65512, -35135]
34693c5135j6613m0362n2695n6973J5890J43542J67129N4813R860J40647K41749
34682E71852J32337n625P7743K50254J93904o5332j98899j03387j7055q3441j39599
34671F12752l0028J42953K01717J33770N0883L7041Q9359J21289L6544j21769
34661A274511j79082q7278k9020j13418j57756J606J80446J30687k1827J7575
34651A016444K04206K46273J14224M2630P4311K7564r8525j14107m0945r3209
34641A378866k33485j96162k74L1188j53161k25082p1184K591j53687k45872p1962
34630F1776J11170N1435q2022o5297k3062j19977j87866l0289J82232J86072N5574
34619A39746J4073L2297l7149j13385k8305J21851R5025j10502k58166j97069
$$ y = [-35135, -51748, -92110, -144805, -201778, -185888, -42346, 124783, 179596, 189456, 330103, 571852, 704189, 698564, 776307, 1026561, 1220465, 1155133, 956234, 852847, 835792, 752351, 612752, 582724, 725677, 927394, 1061164, 1112047, 1149088, 1238447, 1359736, 1396280, 1274511, 1095429, 1008151, 979131, 865713, 707957, 709563, 890009, 1020696, 998869, 1016444, 1220650, 1466923, 1581147, 1623777, 1698088, 1725652, 1627127, 1513020, 1472075, 1378866, 1145381, 949219, 948945, 980133, 826972, 601890, 530706, 533297, 379610, 133738, 61776, 172946, 224381, 142359, 77062, 54000, -65977, -253843, -284132, -101900, 84172, 139746, 153819, 186116, 148967, 35582, 7277, 129128, 224153, 113651, -144515, -341584]
34609c41584J3807K17311K49139N4585j62815j00709K08439L67462J71599r0430
34599E86804r9589K8829J7263j05250j24992l2504J7911j3902p1171j42127j76598
34588a15326n4457J67732K19888L4778q7463K9610J18411n3898k38170j29881
34578a08776P9455M1284j29508q4791J14354J30511q756L7387K78241L41815J06169
34567G97385j07507o5425O9246O9548n3998j88676k74182k46936p0044J40785
34557G0196K25874J99013J59491P4436j05600k25197j16729P9406J01660j5545
34547D47005m1798K4592n865j22951j42308p3880q4175j30357k6727J50408J38711
34536A32655l0072n1928J17678J85633M1002p4695k0784L1709k0839j8467J05014
$$ y = [-341584, -327777, -110466, 138673, 193258, 30443, -70266, 138173, 505635, 677234, 586804, 487215, 516044, 533307, 428057, 303065, 270561, 288472, 274570, 203399, 61272, -115326, -169783, -2051, 217837, 252615, 165152, 194762, 313173, 259275, 21105, -108776, -29321, 11963, -117545, -202336, -87982, 42529, 33773, 71160, 349401, 691216, 797385, 689878, 624453, 693699, 763247, 709249, 520573, 246391, -545, -70589, 70196, 296070, 495083, 654574, 729010, 623410, 398213, 281484, 360890, 462550, 447005, 405207, 429799, 423934, 300983, 158675, 84795, 620, -129737, -156464, -6056, 132655, 102583, 50655, 168333, 353966, 394968, 320273, 299489, 331198, 310359, 291892, 396906]
34525C96906J26732r4312l43372l50854j36119J08240K59882K65297J10198q5570
34515B57028j32797k2834O4517M0577j3528o0680j46434k00398q0942J32233J77575
34504A4317J1951j11161m2002O8574O6977K1843M1019J00306J50781J86757J52952
34493F62314N148j16507l2917J41554J07645j46770l01226j86864M245O9230L7987
34482B43839j5642r2103j11014M6072K55365K38270P575j21546m8445k6214j64425
34471B11732k09319r606J90939J58623J6108n2313j02087j82636j22611J49192
34461D8022L58912K63996K6181p5332o1534r2114j17211j4086J07405O1784p0454
34450D35569n6827J08678K01724J00655q4017j89640j64496p6790m5143j11726
$$ y = [396906, 523638, 429326, 85954, -264900, -401019, -292779, -32897, 232400, 342598, 257028, 124231, 101397, 165914, 206491, 192963, 132283, -14151, -214549, -295491, -163258, 14317, 26268, -84893, -126895, -58321, 8656, 30499, 71518, 171824, 322605, 509362, 662314, 667462, 550955, 518038, 659592, 767237, 620467, 319241, 132377, 136622, 205852, 243839, 228197, 136094, 25080, 71152, 326517, 564787, 572362, 450816, 402371, 376157, 211732, 2413, -7193, 183746, 342369, 358477, 306164, 204077, 21441, -101170, 48022, 406934, 670930, 697111, 621779, 560245, 468131, 350920, 336834, 444239, 506023, 435569, 378742, 487420, 689144, 789799, 705782, 516142, 351646, 274856, 229713, 117987]
34440A17987j61298o7305R6340J58643J40483J95597K66843J18088k22583l87615
34430B55180j81462J30272K11550P2617p2125j18581p7433J9429P5492m148j13971
34419A96820n4407J05901Q2704j33232k04568M144J95720J42536K7516M6215M9761
34408D59110j18358k65469j60468O8492J61027J13282N2766l9443j90467k40163
34398a59691p7832J16027J37208Q5104J60405L06337L11212J37707o3846j52870
34388G99761o0771J92951M33288M62389L39977K99402L30899J65953k31236n18853
34378B213760m71197k67819j39338q3936q2959k06728l41829k24339Q2797J80462
34368F58874k6845j62797l9606N3206m1187l3866K00813K99976P0729j20828l5913
$$ y = [117987, -43311, -110616, -14276, 144367, 284850, 480447, 747290, 865378, 642795, 255180, 73718, 203990, 415540, 488157, 416032, 297451, 220018, 239447, 314939, 310791, 196820, 142413, 248314, 331018, 197786, -6782, -2638, 193082, 335618, 363134, 409349, 459110, 340752, 75283, -85185, -16693, 144334, 257616, 310382, 270939, 80472, -159691, -237523, -121496, 15712, 100816, 261221, 567558, 878770, 1016477, 952631, 799761, 738990, 931941, 1365229, 1827618, 2167595, 2466997, 2797896, 2963849, 2732613, 2213760, 1742563, 1474744, 1335406, 1251470, 1168511, 961783, 619954, 395615, 478412, 658874, 632029, 469232, 429626, 482832, 441645, 407779, 608592, 908568, 979297, 858469, 822556]
34357H22556k3720l14100m79568j80288J57670O4972j35921N0605L54186K29556
34347E45948j34935j55580J16241J59353n0658q4273Q2546O7415j38114j52942
34337B55001N4984J17429m8045j42484p6712o5176j34468q9851M3460N3101l1029
34326f3790j1507O4150K3579l8651M8079J34547K7062p1240Q9261K72904J38093
34315F12487j24156j30456J625n4764j45575N4023L12777J87194j40194j51003
34305D21958Q4961Q4345j27694j07342J24880J32102r1459j37396K3400N8874
34295D66629J078J48428L36616J39526k74768l29005k1073J12022l9830o7713
34285D71910J26433K27075J77700J71874R6471k18007m01829p2839L12624J11030
$$ y = [822556, 798836, 484736, 5168, -175120, -17450, 47522, -88399, -37794, 316392, 545948, 411013, 255433, 371674, 531027, 480369, 396096, 478642, 546057, 407943, 255001, 309985, 427414, 379369, 236885, 160173, 94997, -39471, -129322, -85862, -32761, -63790, -75297, -11147, 12432, -26219, 21860, 156407, 183469, 112229, 201490, 474394, 612487, 488331, 357875, 359500, 304736, 159161, 213184, 525961, 713155, 572961, 421958, 506919, 591264, 463570, 356228, 481108, 613210, 521751, 384355, 407755, 466629, 467707, 616135, 952751, 1092277, 817509, 488504, 467431, 579453, 539623, 471910, 598343, 825418, 1003118, 1174992, 1271463, 1053456, 651627, 578788, 891412, 1002442]
34275A002442l13653j58930L49210L22357j75513k59460J36281K01586j54978
34266I49342j48639L10206L84337j04176l17066N3194K95625Q7028q285J92117
34256A693683J14029k93978l01240J83536L28758p9293k31290J61884L71022J10499
34246B057610J7872K60125J88296k14760j41774L94358M22416r8565r3329N18919
34236C311168N43875j64086k81427M57038O38963j35099l86325M66435R90040
34227E440582M89130K68516R37825J180306N36635N36999J616460J997757J217554
34218A4221764J359863L023622L888636L345416M208022P346952R628403J0301940
34210E7324618J3602019K1091723K8811811L7796845N7349897Q5729869R5718875
$$ y = [1002442, 688789, 529859, 879069, 1201426, 1025913, 766453, 902734, 1104320, 949342, 800703, 1110909, 1495246, 1391070, 1074004, 1127198, 1422823, 1509851, 1501566, 1693683, 1807712, 1513734, 1212494, 1396030, 1724788, 1645495, 1414205, 1576089, 1947111, 2057610, 2075482, 2335607, 2523903, 2309143, 2167369, 2561727, 2984143, 2885578, 2792249, 3311168, 3855043, 3690957, 3409530, 3866568, 4505531, 4370432, 3984107, 4450542, 5440582, 5929712, 6198228, 7136053, 8316359, 8852994, 9389993, 11006453, 13004210, 14221764, 15581627, 18605249, 22493885, 25839301, 30047323, 37394275, 47022678, 57324618, 70926637, 92018360, 120830171, 158627016, 215976913, 301706782, 397425657]
34203C97425657N8744383j5148030p8648470r5361799p3935734m7493959l3337423
34196A12244625k5616287j7219917j0834641r182925q607947o082895l837059
34189C0862954l805553l928773k610917j595865k072313k330479j334516p43467
34181A2441071j502722j912150q86432L528m96616j130638o39214M2947k02555
34172E717219o54276l68581N5684j68993n19407l36284n5227j40526j49537J80498
34162C560570K60537q9476r0301M75557O09680j82288r07466p27951k63791l13095
34152B331976n12918k66199J03096R7782j8205Q2032O5568k75841m15972n0464
34142A140855K13345j06283m82382l01022J29281K42738J46490J59635J24494
$$ y = [397425657, 456170040, 441022010, 362373540, 267011741, 193076007, 145582048, 112244625, 86628338, 69408421, 58573780, 49390855, 40782908, 34700013, 30862954, 27057401, 23128628, 20517711, 18921846, 16849533, 14519054, 13184538, 12441071, 10938349, 9026199, 8139767, 8143295, 7646679, 6516041, 5876827, 5919774, 5717219, 5062943, 4694362, 4750046, 4581053, 4061646, 3725362, 3670135, 3529609, 3380072, 3560570, 3821107, 3731631, 3641330, 4116887, 4726567, 4544279, 3636813, 2908862, 2645071, 2331976, 1819058, 1552859, 1655955, 1753737, 1735532, 1817564, 1883132, 1607291, 1191319, 1140855, 1354200, 1247917, 765535, 464513, 593794, 836532, 983022, 1142657, 1267151]
34133A267151j20935k36260J36J83503r471k29148j23104M5775p649l6978J51383
34122H84403K17948n0742k44445m4043J91019R1302q8736m3220m42j90867l32394
34111C89783j83780k3822p2204m7146J98661K61287n6749k53291J9938K93012
34101E25689J07899j66036n7627J17523j09331m14946k32841K14295K96477L2413
34091C13515p2854L8347J5507j35128r1940J10139J39841K025o984J17529J15434
34080E45431j6812m8440K7271K2947m8431k8378M7904M0602p344n981m9177j88262
34068B91330k19177k9678J22437L0267q0071K5540J26383m4300k57413j51272
34058a85954J43636K43794J30879M5769L012j05779j53599m511J24517J178j56019
$$ y = [1267151, 1146216, 909956, 910092, 1093595, 1084124, 854976, 731872, 777647, 769998, 733020, 884403, 1102351, 1051609, 807164, 763121, 954140, 1045442, 956706, 913486, 913044, 722177, 389783, 206003, 182181, 109977, 62831, 261492, 522779, 466030, 212739, 232677, 525689, 633588, 467552, 409925, 527448, 418117, 3171, -229670, -15375, 281102, 313515, 240661, 279008, 294515, 159387, 67447, 177586, 317427, 319452, 312468, 429997, 545431, 528619, 480179, 507450, 530397, 481966, 453588, 501492, 542094, 534750, 528769, 479592, 291330, 72153, 42475, 164912, 195179, 115108, 140648, 267031, 222731, -34682, -185954, -42318, 201476, 332355, 378124, 381136, 275357, 121758, 117247, 241764, 242942, 86923]
34047H6923l2394K02761J80859k8167r2367k3428o0135j32529n554J90496J33921
34036D20386r9203j60572l7336J132m1543N9317K20583J39899j19191j78710J8145
34025B22907J47157R3768Q8607K04737K10589J2382j85357k43017k33121j82554
34015A36098l4826J10607Q5443k0792J3217J17422L7455j58984j32416J41289
34005B94513K87015J23603p9540p2266K0319k4002j84329k93892k66732j20717
33995c16028O6311J84070K02554K11391K19136O7835k49075l95738j30814K56347
33985A15989L18411R6475k0155N4662N5660j01753k09779j77498j19443l4969
33975b2400J81817M01194L39654J8354k33912k56798j85934j20904l6454l87r5792
$$ y = [86923, 54529, 257290, 438149, 409982, 317615, 294187, 234052, 101523, 95969, 286465, 420386, 321183, 160611, 123275, 124407, 82864, 142181, 362764, 502663, 383472, 204762, 222907, 370064, 463832, 552439, 757176, 967765, 980147, 794790, 551773, 318652, 136098, 101272, 211879, 297322, 276530, 289747, 407169, 444624, 285640, 153224, 294513, 581528, 705131, 625591, 553325, 573644, 549642, 365313, 71421, -195311, -316028, -249717, -65647, 136907, 348298, 567434, 635269, 386194, -9544, -140358, 115989, 434400, 530875, 510720, 565382, 621042, 519289, 309510, 132012, 12569, -22400, 159417, 560611, 900265, 918619, 684707, 427909, 241975, 121071, 84617, 84230, -11562]
33964a1562j55718L1460K97802K96294P0783l0305M1218J6351j28314j30202J6817
33953C14624L0591r5520n7747J49069J67956n4064j30073O8248J75572J7576o7768
33942E18464J19285K42834L9182j92359r5467J90900L62281M13544M04221J77300
33932B180185k78316n61384l83517m1368M0496p2670p5723J1612k1037j18965
33922F79313r0388j0250q1618k35706k40813q7309N3741J20858J35725O0276o2576
33911B41253m7637R4434M9765k56775l67913K3938M46611K71604k83104m37246
33901b65070k3581L20910J83135q7568p1707Q4967N8156q7909j07489l7975p2682
33890a06813j61467r4268J17061K49998K22967J64029J28204P636k03190k84449
$$ y = [-11562, -167280, -135820, 161982, 458276, 529059, 498754, 539972, 556323, 428009, 297807, 314624, 345215, 249695, 191948, 341017, 508973, 454909, 324836, 393084, 568656, 586232, 518464, 637749, 880583, 919765, 727406, 631939, 822839, 1185120, 1598664, 2002885, 2180185, 1901869, 1340485, 956968, 915600, 956096, 883426, 807703, 819315, 798278, 679313, 588925, 578675, 497057, 261351, 20538, -66771, -13030, 107828, 243553, 303829, 241253, 193616, 288050, 337815, 81040, -286873, -262935, 183676, 455280, 172176, -265070, -288651, 32259, 215394, 127826, 56119, 141086, 199242, 111333, 3844, -34131, -106813, -268280, -362548, -245487, 4511, 227478, 391507, 519711, 527347, 324157, 39708]
33880C9708r5730J48539J26128j30504k61351r6647J08931Q8618l1360K4253K04723
33869A25308K10941k5222k48286k59576j11781Q1533K53048K85694J00529j30510
33859B81678j54361l8804p1535k34133j86436J27708L03745R7133j99700k51120
33849c25825j54845j28903r3295Q2270K26750J42883j3792J0668J52063J95001
33839I2975J37167P4627l3160j66465r4291K22500L81608J11122k19198j52549
33829C54336Q6679k3777l81317m07284k1489K40889J21722k4010P8796K07184
33819B31729J25455l3287j00638j37919j58971j8797K14929K09445q5380k58153
33809a1587o2133J89792J52695j9202k0420P0424N202j45195j31461K0004Q0651
$$ y = [39708, -56022, 92517, 218645, 88141, -173210, -269857, -160926, -72308, -103668, -79415, 125308, 336249, 311027, 62741, -196835, -308616, -227083, 25965, 311659, 412188, 281678, 127317, 88513, 16978, -217155, -403591, -275883, 27862, 124995, -74705, -325825, -480670, -609573, -702868, -620598, -393848, -250965, -264757, -254089, -102026, 92975, 230142, 304769, 271609, 105144, 10853, 233353, 614961, 726083, 506885, 354336, 441015, 417238, 35921, -371363, -392852, -151963, -30241, -54251, 24545, 231729, 357184, 323897, 223259, 85340, -73631, -92428, 122501, 331946, 246566, -11587, -73720, 116072, 268767, 249565, 229145, 299569, 304771, 159576, 28115, 48119, 128770]
33798A28770K9127L2468R7211O7354o6880j45780j12798o7340n3440j0796O3732
33787c8372R1845N4866Q713k9361p5331q9211k4102O7048R8144Q2863P8816N5575
33775B81493l5824j07767k0575J82469K85925J81925R415l9005M9177J34934J32504
33764A054671J06060J54510K49356K47349Q2462j18266j82365j12240n3366o3546
33754A364625m9890M2616J20948Q9015p807o0701l7424K1014O9021O7690K238
33743A621345o7363n4068K3246N1810L026k4501R896M907r4318j65568r3300L1805
33731A246917M0759p0424j70361k01229k10211k13072j72981j03002o0368l7069
33721D8959K9515J26822J54915P3774k0871j0835J03274K02522J64218k9586k65438
$$ y = [128770, 157897, 190365, 287576, 354930, 288050, 142270, 29472, -37868, -91308, -102104, -38372, 53473, 108339, 117052, 87691, 12360, -76851, -100953, -33905, 64239, 147102, 225918, 281493, 245669, 137902, 117327, 299796, 585721, 767646, 777061, 738056, 787233, 922167, 1054671, 1160731, 1315241, 1564597, 1811946, 1894408, 1776142, 1593777, 1481537, 1428171, 1364625, 1314735, 1357351, 1478299, 1567314, 1559507, 1498806, 1461382, 1482396, 1551417, 1619107, 1621345, 1553982, 1499914, 1523160, 1574970, 1577996, 1553495, 1563391, 1568298, 1473980, 1308412, 1215112, 1246917, 1287676, 1217252, 1046891, 845662, 635451, 422379, 249398, 146396, 86028, 48959, 78474, 205296, 360211, 433985, 413114, 402279, 505553, 708075, 872293, 842707, 577269]
33710E77269l73265k59274J0776K54450L05164J36407j06576k14564j06108Q5576
33700C09855J55738M5115j29002k21635j67047J8319K27332K86411J29081o5193
33690E88974o7187O6938O2303j34091k35068o5977J21304K5017k11992k03881
33680e3660P4130K36946P7788j23316k9956K52838L32114O2312k85748l76575
33670A66873j75000P8459J64835R5893M1604Q9789J27607K406k33868l40447j82033
33659a63882Q1577J81035O0974q0245o0540P6715J50611O2073j20562k44497k01346
33648b58087j9987J33120J04133n2369j03438O1949K51330K14974Q52j18153m3584
33637A70740M2182J746o1273l2997J0612o133K5016J75392K48780M0439k84882
$$ y = [577269, 204004, -55270, -44494, 209956, 515120, 651527, 544951, 330387, 224279, 309855, 465593, 510708, 381706, 160071, -6976, 11343, 238675, 525086, 654167, 588974, 521787, 588725, 651028, 516937, 281869, 215892, 337196, 362213, 150221, -53660, 20470, 257416, 335204, 211888, 181932, 434770, 766884, 829196, 543448, 166873, -8127, 70332, 235167, 331060, 372664, 462453, 590060, 592466, 358598, 18151, -163882, -82305, 98730, 159704, 79459, 18919, 95634, 246245, 308318, 187756, -56741, -258087, -278074, -144954, -40821, -93190, -196628, -134679, 116651, 331625, 332477, 214324, 170740, 212922, 214668, 153395, 120398, 131010, 124877, 149893, 325285, 574065, 614504, 329622]
33626C29622l63304j29394J35323K27062K06076J49930K4779j25171j39451p292
33616C08180O4033l5228j51323j35249n8422k3938K2634J29510J80243Q0977n8141
33605C23276j04954j12382j67673j92980q8661O9042J66414K39840L22765K71981
33595G26668j725k75129k73512q2363L893m5660j8596R5108O2679j40084k11585
33584a60306M798K48070K25362K4438o7703J9813J14376P5863p1637k13460k33641
33573c4027j02484N1319N6514n7033p5063O8599J61167M0215j32662j15723M6408
33562i2770J26504Q0481O0555J12872J14722K1052n7623o6765q6429j28646n8072
33551B5881J67521L42600K55764j4192j95744j62781m0453j620q0489j88970k19107
$$ y = [329622, -33682, -163076, -27753, 199309, 405385, 555315, 580094, 454923, 315472, 308180, 372213, 336985, 185662, 50413, -8009, -31947, -9313, 120197, 300440, 381417, 323276, 218322, 105940, -61733, -254713, -343374, -274332, -107918, 131922, 454687, 726668, 724943, 449814, 176302, 93939, 97832, 52172, 33576, 128684, 191363, 51279, -160306, -155508, 92562, 317924, 342362, 274659, 294472, 408848, 484711, 413074, 199614, -34027, -136511, -85192, -28678, -85711, -160774, -92175, 68992, 109207, -23455, -139178, -92770, 33734, 114215, 174770, 287642, 402364, 423416, 365793, 299028, 212599, 83953, 25881, 193402, 536002, 791766, 777574, 581830, 419049, 378596, 376976, 296487, 107517, -111590]
33540a11590j15244Q0691K39985K57489J55173L1752o5847j45171j65927n6487
33530A04824J34497K21716J05162o9964q2229P6574J92303J04755j10267k58663
33520D18708k38215q8267R0639J96010J55297j1417j69373j84799p3712K4460
33510A19331L1931J6585N4428R2974M4900l5201o446J15607J23780q7582l18198
33499A52109k93827l3811J77502J63413K3293q9359j65659k31852k08987l0211
33489e37389J98731L02355K47944J38988M9676j2523k4264L6805J04503P9726
33479E84552j1962k1127J34581L43857L96070J87665j52236l46417k44772j7695
33469H52516L5297j16228k00729p2492N9473q840j23551m2793J29926J18918l9047
$$ y = [-111590, -226834, -146143, 93842, 351331, 506504, 538256, 472409, 327238, 161311, 104824, 239321, 461037, 566199, 496235, 414006, 490580, 682883, 787638, 677371, 418708, 180493, 92226, 182865, 378875, 534172, 522755, 353382, 168583, 94871, 119331, 151262, 167847, 222275, 315249, 360149, 324948, 318502, 434109, 557889, 470307, 152109, -141718, -175529, 1973, 165386, 188679, 99320, -66339, -298191, -507178, -537389, -338658, -36303, 211641, 350629, 400305, 387782, 363518, 400323, 504826, 584552, 572590, 551463, 686044, 1029901, 1425971, 1613636, 1461400, 1114983, 870211, 852516, 887813, 771585, 570856, 498364, 557837, 548997, 425446, 382653, 512579, 631497, 592450]
33458E92450o6160M8973K8384j72327k33846l80K33699J66016q2407j96957r5501
33447B21944P8330J86129J42176p1714k79154k10613J06354K90928J21772j44862
33437D41290j81398n1054J796k1237K5697R4355M2175o4056o0054J2064M864m6374
33425A98068k7281p004q9873j41159n98J61594Q1594j15579q9198J36653K17842
33414C25059Q3816L765L6691o8790l17273l30261J9968L09942J83677j25969k11867
33403i1242q4143K322K3520J04888J68162M5177j71148k28933j01029K1095N4820
33392b56511Q0189J16340J00245O2247R0309J36962P8692m5590p0654K0849Q0500
33381C93578Q0137J88148M59097O31664M09177j26360n39372n07028j65427P7401
$$ y = [592450, 526290, 575263, 603647, 431320, 197474, 197094, 430793, 596809, 514402, 317445, 221944, 300274, 486403, 628579, 556865, 277711, 67098, 173452, 464380, 586152, 441290, 259892, 208838, 210634, 189397, 215094, 309449, 351624, 287568, 227514, 239578, 244442, 198068, 170787, 163783, 73910, -67249, -67847, 93747, 175341, 59762, -29436, 107217, 325059, 408875, 412640, 449331, 380541, 63268, -266993, -247025, 62917, 246594, 120625, -91242, -175385, -173063, -149543, -44655, 123507, 168684, -2464, -231397, -332426, -311331, -256511, -176322, -59982, 40263, 102510, 192819, 329781, 408473, 362883, 292229, 313078, 393578, 473715, 661863, 1120960, 1752624, 2161801, 2035441, 1496069, 989041, 823614, 901015]
33371I01015K2264j42859j59936m4390J0598m3866q3752n8481m7453o4152k1723
33360B67265O6619O9299j9909m0606M6761O0527r6054k50498k31771j18778n3727
33349c00872p720Q1517J27827O0480j2N6480J15204M5125m5847j1686M0968n2206
33337A09258j73285r9382Q9604J27762J8570O192J14977J04274p3564j51888q01
33326G1717J44973P3920q2293j10429m6352k8423k5781N2177J24851N8106p6177
33315A56289q1061N9893J48694N5758j04658j23951M8901K42408K39504J9212
33305F60989k02317k13148m6914R8729J30977J07826N0887q5053k27671j93124
33295H1181K7459J85479J13040l2639k6355Q3309R4322p139o1698l1611l9677
$$ y = [901015, 923279, 780420, 620484, 576094, 586692, 542826, 459074, 400593, 353140, 288988, 267265, 333884, 403183, 383274, 342668, 389429, 449956, 353902, 103404, -128367, -247145, -300872, -308592, -227075, -99248, -38768, -38780, 17700, 132904, 178029, 132182, 120496, 161464, 109258, -64027, -163409, -73805, 53957, 72527, 78719, 193696, 297970, 224406, 72518, 71717, 216690, 290610, 208317, 97888, 51536, 23113, -2668, 49509, 174360, 232466, 156289, 75228, 135121, 283815, 339573, 234915, 110964, 159865, 402273, 641777, 660989, 458672, 245524, 198610, 297339, 428316, 536142, 587029, 501976, 274305, 81181, 108640, 294119, 407159, 374520, 348165, 431474, 525796, 518657, 456959, 425348, 385671]
33284C85671j17957j40319m5902N9513Q4782P0124N4002j5367j37979j78239n7781
33273c9452P7721M2464j05990j39175M121J28305P1624o8778r8972m678O6641
33262f6169M6494K0138M8813N4815l6822j32925p3521J17054K08538N5513j78171
33251F3757j98797L7024K52688K05710j0064j21094m2132O8281P9373K7687l3080
33240C29353j24313k10453j67400m071O8206m9084j37805N581K00173J33164j30378
33229h7027k32503p3614Q6484R6482R7252J51884R0076j06889j45602J05533L17850
33218B99926J82004j02956j64958l7341j3737j13632j14090O06M4668K7575J27782
33207A35847K80580K07177r7912k97918k18851o5164k4827o625Q6326J43441Q0973
$$ y = [385671, 267714, 127395, 81493, 141006, 225788, 295912, 349914, 334547, 196568, 18329, -39452, 38269, 80733, -25257, -164432, -160311, -32006, 39618, -29160, -128132, -132810, -66169, -19675, 463, 49276, 104091, 67269, -65656, -139177, -22123, 186415, 241928, 63757, -135040, -98016, 154672, 360382, 350318, 229224, 187092, 255373, 334746, 362433, 329353, 205040, -5413, -172813, -176884, -108678, -157762, -295567, -289986, -89813, 43351, -87027, -319530, -393144, -306660, -210178, -112926, 38958, 129034, 22145, -123457, -17924, 299926, 481930, 378974, 214016, 176675, 162938, 49306, -64784, -64178, -19510, 8065, 135847, 416427, 623604, 525692, 227774, 8923, -56241, -81068, -87693, -1367, 142074, 223047]
33196B23047J0348m18p0957k35778k87002r9592J15899J14041k4744o3917K3397
33185b95676R0835Q9482P7967O0763J4420r391K5481L9719k0044n5615R441O1163
33173H8545k1090j39731j35254n0963l1504o3196l9637O457k3209o0691L2704
33162d37569J84745J85639K7936q1527n6992k8475o9799q4289k7012j042l7255
33151d25640j718J53655K52535J62147K6085M3189J45351J08822q3117k07051
33141A74258j28122L1136J02881R6551J10946J36046Q0727m3022j06296n6019
33131C99086l4l7326j07299j06184o8119r3753j52487j20786j053P8649R7526
33120a11780J71836K94948K70875L4924j65061r7004J06293J50065J4534o3233
$$ y = [223047, 233395, 232977, 162020, -73758, -360760, -460352, -344453, -230412, -255156, -319073, -295676, -204841, -115359, -37392, 23371, 37791, 28400, 53881, 93600, 73556, 17941, 27382, 88545, 67455, -72276, -207530, -258493, -289997, -353193, -392830, -386373, -409582, -470273, -437569, -252824, -67185, -39249, -120776, -177768, -206243, -276042, -360331, -387343, -388385, -425640, -427358, -273703, -21168, 140979, 167064, 210253, 355604, 464426, 381309, 174258, 46136, 77272, 180153, 276704, 387650, 523696, 604423, 561401, 455105, 399086, 399052, 361726, 254427, 148243, 80124, -13629, -166116, -286902, -287955, -209306, -111780, 60056, 355004, 625879, 660803, 495742, 398738, 505031, 655096, 669630, 606397]
33110F06397R117N5749o4943k49156l06160j81785K9449J84037J72485O312j57906
33099A03596j69659n7939K8529J8049n2270j44505k12296j36858J35966M06376
33089h1011L82599P4623j72078j09921J23332K45490J89185Q5302J6252m8614
33079G05159j24528j59975j19306l7168K2695L0220P966p542k4204q2112j62328
33068D8877j72618q1409J1236K2829J7136O1048O1536o7686j71325m1660J97728
33057a14308K01940o3608k20719l2198K39196K29842o477j37206m9218O4083L9249
33046A50576p8190j77637k14448j83141r5239L329P4995J27366J47695P6390o6943
33035b35247j27403j2725J32790J03863o7823j51043l4490J39334J76978N5683
$$ y = [606397, 615514, 671263, 606320, 357164, 51004, -130781, -101332, 82705, 255190, 261502, 103596, -66063, -124002, -95473, -77424, -129694, -274199, -486495, -623353, -487387, -81011, 301588, 376211, 204133, 94212, 217544, 463034, 652219, 737521, 753773, 705159, 580631, 420656, 301350, 264182, 286877, 317097, 325063, 317521, 293317, 211205, 48877, -123741, -205150, -193914, -171085, -153949, -92901, -31365, -99051, -270376, -312036, -114308, 87632, 24024, -196695, -228893, 10303, 240145, 233668, 96462, 47244, 111327, 150576, 72386, -105251, -319699, -502840, -598079, -594750, -519755, -392389, -244694, -168304, -235247, -362650, -375375, -242585, -138722, -206545, -357588, -392078, -252744, -75766, -20083]
33025b0083r0809j36374q4140m6965r6963j42828l4256J97496L25407K17649K3171
33014A11305k7539R5037K31999K34006O1650j97615l30398j63603J67215K92250
33004D74307Q1292j65186j72743r0501j66497k77124j59407P4979J11916R138
32994b79826Q7477K77809J53616k76187m04038O5295N64961M42341j14663m11097
32984A05688k30810K9378P0168J9326M7195Q9264N0282k8287j00853j80955k13357
32973c42961j03807P4332J16884j2355j16119n2042R6880J91498J98222J30456
32963A80988L503r7510p2986J7941R254j07244j63074j07746r4210j77427j69042
32952g77553N1990K97556L33700K09821J13926N6200n8402j63659j17029J0384
$$ y = [-20083, -110892, -247266, -331406, -378371, -475334, -618162, -652418, -454922, -129515, 88134, 111305, 83766, 178803, 410802, 644808, 706458, 508843, 178445, 14842, 182057, 474307, 555599, 390413, 217670, 127169, -39328, -316452, -475859, -400880, -288964, -279826, -192349, 85460, 239076, -37111, -441149, -375854, 189107, 631448, 516785, 105688, -125122, -95744, -25576, -6250, 40945, 130209, 180491, 152204, 51351, -129604, -342961, -446768, -372436, -255552, -267907, -384026, -436068, -339188, -147690, 50532, 180988, 184491, 86981, 13995, 31936, 41190, -66054, -229128, -336874, -431084, -608511, -777553, -725563, -428007, -94307, 115514, 229440, 285640, 227238, 63579, -53450, -43066]
32942d3066J2849q8882m9198J86453L35310J72190j36357k53294r0713J46220
32932A91512K46296J78789L7637p9226j34700j56058j69641j35153j3379J04998
32922G1075O8770r1887j47049J1306J83919J52284R036j4851N1982k1529k35750
32911C7306l00681r8793Q5529j3253k21193j82796R9450K73975J54457m7251n6341
32900b69591J12972K45664K20852J00401o21l5520m2223p9799j36892j24859j3079
32889b2695P9005L1207p7571o8597N6239J20003P1265N5751J17147P2996j56925
32878B77825l24517j84256J16726K42253J45541N7928O7619K7611j03201j39725
32868A83804J0529J63839J35154M536l7468L2382Q8206N4359k8754p6724l3877
$$ y = [-43066, -30217, -119099, -168297, 18156, 353466, 525656, 389299, 136005, 45292, 191512, 437808, 616597, 654234, 575008, 440308, 284250, 114609, -20544, -33923, 71075, 139845, 47958, -99091, -87785, 96134, 248418, 257454, 242603, 294585, 273056, 37306, -263375, -362168, -276639, -289892, -511085, -693881, -594431, -320456, -165999, -213250, -269591, -156619, 89045, 309897, 410298, 409677, 374157, 331934, 252135, 115243, -9616, -22695, 56310, 87517, 9946, -58651, -2412, 117591, 188856, 244607, 361754, 434750, 277825, -46692, -230948, -114222, 128031, 273572, 331500, 399119, 426730, 323529, 183804, 194333, 358172, 493326, 497862, 460394, 492776, 580982, 635341, 606587, 529863, 495986]
32857D95986O6248J02344K2667k5375J15027L16318L00293Q5209M400J83708L23915
32846A990740J91093O180O2211K23977J71284n2328j40025n9216o1983j84753
32836B147180j66170O7886K29084J17451q0841j24522p4356j14414k22492k31359
32826A547447r2115Q9546J89083J30348p4038k68293k68781j08871k1903j05245
32816A017178j77021p3176R2845J11702k7884j75742k31107j84500o2157N2956
32806C43094N8888q057P896J14277J04816j09198l02271k46647l6578R7971J22991
32795A47182J23390P1219o8784j54786o7474M5415J7039j425J89036L64586J34569
32784G99967l66712n42522j83208K14782J70952j53295l15609k24758p8254O5671
$$ y = [495986, 562234, 664578, 687245, 661870, 776897, 1093215, 1393508, 1478717, 1483117, 1666825, 1990740, 2181833, 2188013, 2250224, 2474201, 2645485, 2593157, 2453132, 2393916, 2331933, 2147180, 1981010, 2048896, 2277980, 2395431, 2314590, 2190068, 2115712, 2001298, 1778806, 1547447, 1455332, 1544878, 1733961, 1864309, 1790271, 1521978, 1253197, 1144326, 1122423, 1017178, 840157, 766981, 859826, 971528, 943644, 767902, 536795, 352295, 290138, 343094, 401982, 393925, 401821, 516098, 620914, 511716, 209445, -37202, -73780, 24191, 147182, 270572, 341791, 273007, 118221, 50747, 96162, 113201, 111776, 300812, 665398, 799967, 433255, -109267, -292475, -77693, 93259, -60036, -375645, -600403, -678657, -612986]
32774f12986K70203M12747K62807j46363m87949m99679k02626K00451M72579M36552
32764A05736J22034j79886j78203Q1016K69194J73846q2380k33872j64323K5985
32754f0853J55597J26740M370n7300L281P5304K6268j10289j72810p3390J09726
32743B6644K23531J64812n5420l00003l82692k33562K2245K04624K62755K52575
32733A85509J86767L2980j44716j82807k0002J87856K33600R0118r7710k15788
32723B55807k76834l03732k28347k047K46796L05977J58512L6280J07492K25063
32713E24967J32331j52080l43054k76956r8897j1067j0225K3502J14108J90773
32703I3402K09571J60872L1859j28105j74875k6951J85215K44185J00783r3969
$$ y = [-612986, -342783, 69964, 332771, 186408, -301541, -801220, -1003846, -803395, -330816, 105736, 227770, 47884, -130319, -49303, 219891, 393737, 311357, 77485, -86838, -60853, 94744, 221484, 225854, 168554, 171835, 247139, 273407, 163118, -9692, -83082, 26644, 250175, 414987, 359567, 59564, -323128, -556690, -534445, -329821, -67066, 185509, 372276, 405256, 260540, 77733, 57731, 245587, 479187, 569305, 471595, 255807, -21027, -324759, -553106, -555153, -308357, -2380, 156132, 192412, 299904, 524967, 657298, 505218, 162164, -114792, -213689, -224756, -234981, -211479, -97371, 93402, 302973, 463845, 495704, 367599, 192724, 165773, 350988, 595173, 695956, 601987]
32693F01987j94703k00078j82990j72816j42003o8337J7839N3817K6650J9621
32683b41013J20074K81003L53954K77381J40660L1578o6332j64991j83031p0775
32673D78508O8256R9800L9510j311M258q659o0560j01153j06612j04928j05760
32662B01349q1515j9718N5581J04319Q6198n452j03884j24624q1949o6258q7546
32651a23499o3411L232l185q5698o7261J22934K78864K11029M2040j1180o94j17437
32639A85734k96075k66561N954K23707J57266q1904k32099j62605P4798L03422
32629h8363L07892L9469k49716k62110m9409N9667o0588j74877p3669J31454K17938
32618b02312J49331K6576q6574j53245j15436K1390J58029K26991K33331J45002
$$ y = [601987, 407284, 207206, 24216, -148600, -290603, -358940, -341101, -287284, -260634, -241013, -120939, 160064, 514018, 791399, 932059, 963637, 897305, 732314, 549283, 478508, 546764, 646564, 686074, 684763, 689021, 680362, 619802, 518649, 412037, 307109, 201349, 119834, 100116, 155697, 260016, 346214, 340762, 236878, 112254, 30305, -35953, -123499, -186910, -183678, -186863, -272561, -339822, -216888, 61976, 273005, 315045, 303865, 303171, 185734, -110341, -376902, -370948, -147241, 10025, -71879, -303978, -466583, -391785, -88363, 219529, 258998, 9282, -252828, -302237, -242570, -303158, -478035, -551704, -420250, -202312, -52981, -26405, -112979, -266224, -381660, -360270, -202241, 24750, 258081, 403083]
32608D03083p7072k94963k65268P464K11802J52130R795K5738J43062J65633P7470
32597E58874k2773j38303k81635l11799j31647O3900K1593j58014j37925J41763
32587c95966L56617K52092l8534k13345j52124L9282J91375J93163M7608j33078
32577A47090k37272k57900k33325j45540J3681J39181J26864N0594N8630J24244
32567b13753R1876l2687n5640R0997K14700J41402l5491j06526k7860O7027N4928
32556A88973p4939k36582k85507j18069J78343L41740K03054j01564k75351j90625
32546c70527J0892J28188J11562L9505k6494q3808j12047n2881Q4127J63661P1836
32535c5986r9108j34132J3367J43677Q8233o9191j56855j68435j85042j46927
$$ y = [403083, 326011, 31048, -234220, -226756, -14954, 137176, 146971, 172709, 315771, 481404, 558874, 536101, 397798, 116163, -195636, -327283, -263383, -241790, -399804, -537729, -395966, -39349, 212743, 174209, -39136, -191260, -151978, 39397, 232560, 280168, 147090, -90182, -348082, -581407, -726947, -713266, -574085, -447221, -396627, -337997, -213753, -121877, -154564, -210204, -119207, 95493, 236895, 201404, 94878, 67018, 134045, 188973, 114034, -122548, -408055, -526124, -347781, -6041, 197013, 95449, -179902, -370527, -359635, -231447, -119885, -80380, -106874, -190682, -302729, -355610, -271483, -107822, -35986, -135094, -269226, -255859, -112182, -23949, -93140, -249995, -418430, -603472, -750399]
32525g50399O7004L52752M13047J42749j99209k97751j30285Q0366J48074O2408
32515a11244o9581j26208o3837L4775N1644k350K538J06755J72256P6404r7001
32504b5849j60193n9373Q2612J31098P1636o353o567P9527J52769J15374O487
32493C81168m0405P299K6825o7851j80576j66067l0001R9726J39142R0237j9982
32482B39515j31489j36982o547J07942L7496j45274j90689k0674J51911J27381
32472C2590q332m3224L9837P2574j2448q8279n6014J650j9540n3034K9757J75137
32460G0674J77276k2154k08471j56338P7341K38298J99538O6171l4090j09433
32450B98812j90459j94008l4830J88916K69666J51461r029o9084o3624q2106j02860
$$ y = [-750399, -683395, -330643, 82404, 225153, 25944, -271807, -402092, -321726, -173652, -111244, -180825, -307033, -370870, -336095, -284451, -286801, -284263, -177508, -5252, 71152, -25849, -186042, -245415, -162803, -31705, 39931, 33578, 27011, 106538, 259307, 374681, 381168, 340763, 348062, 374887, 307036, 126460, -39607, -69608, 30118, 169260, 259497, 239515, 108026, -28956, -35503, 72439, 109935, -35339, -226028, -246702, -94791, 32590, 24258, -18966, 20871, 93445, 80997, -7282, -63296, -61646, -81186, -134220, -104463, 70674, 247950, 225796, 17325, -139013, -61672, 176626, 376164, 442335, 408245, 298812, 108353, -85655, -120485, 68431, 338097, 489558, 480529, 411445, 347821, 265715, 162855]
32439A62855o1775K48J4k7381J0376O2464j5242j82435k00063M407J63705M2018
32427d0809j88176j85367M6984J72083K7373j68617j75788l7902Q2922J53563
32417c13734K04931J96243R9181j5322r9784j99255k85059k01489O3355K42791
32407c08142J41157m7852k6782J41538J58909p346r1231P933O7617p1500k51964
32396b87663k63054j34243k8155j3357o4445j41170j66185o6292P4144N2546j61944
32385a199818l38772l12892k48635m01516p08030q01593m38008K13207P29024
32376c507033Q35436O33629M29521L64254L07960J61039Q5889K46367M53924L77696
32366C88682O4512r8353K1027J14473k7470j72895p8865P4756K707j95294k24417
$$ y = [162855, 101080, 101328, 101342, 73961, 84337, 146801, 131559, -50876, -250939, -246532, -82827, -40809, -228985, -414352, -367368, -195285, -167912, -336529, -512317, -550219, -467297, -313734, -108803, 87440, 186621, 171299, 71515, -127740, -412799, -614288, -550933, -308142, -166985, -214837, -241619, -100081, 58828, 51482, -39749, -31816, 35801, -35699, -287663, -550717, -684960, -713115, -726472, -790917, -932087, -1098272, -1164564, -1090420, -1037874, -1199818, -1538590, -1851482, -2100117, -2501633, -3209663, -4011256, -4449264, -4236057, -3507033, -2671597, -2037968, -1608447, -1244193, -936233, -775194, -689305, -442938, 10986, 388682, 453194, 354841, 375868, 490341, 462871, 289976, 211111, 285867, 288574, 93280, -131137]
32355a31137q9937k5754n1057J6380J62676J71548J9394o7277J2456J10329J27880
32344B55501J39532J57159P4119o8027n9142J07880J39789j08111l51280k64458
32334B2962O0320K80427K62630J35260Q201j06675j67140j27679o5956q7771j35667
32323G8912p8572L8158L7196r5238j65887o9251O3650Q6117M0046L7326O9869
32312D2326N9886J0135j5976j0746j6742m1292n8816o4185n4652n288O5072O5495
32300b4783l1768r0643K1021K02840K19036J9426j98877k66503k04914q0386J01213
32289c34338K67982K61142Q3579k2620P6057J68546L6129j60919j36382K5580
32279B64756K841j99654k37271j3241J49531N7182m1364Q7065K45814J52082q2659
$$ y = [-131137, -221074, -246828, -297885, -281505, -118829, 52719, 72113, 4836, 17292, 127621, 255501, 395033, 552192, 626311, 558284, 499142, 607022, 746811, 638700, 287420, 22962, 83282, 363709, 626339, 761599, 769800, 663125, 495985, 368306, 302350, 214579, 78912, 340, 38498, 75694, -19544, -185431, -254682, -191032, -104915, -64869, -27543, 42326, 102212, 112347, 96371, 85625, 68883, 27591, -31225, -95410, -150062, -155350, -90278, -24783, -56551, -147194, -126173, 76667, 295703, 315129, 116252, -150251, -355165, -435551, -334338, -66356, 194786, 278365, 255745, 331802, 500348, 536477, 375558, 239176, 264756, 267597, 67943, -169328, -182569, -33038, 24144, -17220, 69845, 315659, 467741, 385082]
32268C85082j48900j9985Q8831R7747Q4601L8475j03411k44440k32781j15864
32258a70645l9182K1473J53063K28766O6719j88867j98831N3351K18416J02351
32248B46614r3252j25622k800J64887L10460L08503K7551l79924n20511k54926
32238c19020R8006K07528J24665N1744j2608j48447k47417j54789N1619J77040
32228a71679K03650K36555K46204J09896j29530k68458k08600n2631O2683R0681
32218A18771M4937k6051l9543M1278J36773J43459P4616L1695N7377Q0128o059
32207F57381k22180m27200l92563o3085K87152L33603J29826K6073J29646J51545
32197F10198p9741k83125j60584J08249J49562j9073p4790M2345N9068j27155
$$ y = [385082, 236182, 216197, 305028, 402775, 487376, 525851, 422440, 178000, -54781, -170645, -209827, -188354, -35291, 193475, 260194, 71327, -127504, -74153, 144263, 246614, 153362, 27740, 24940, 189827, 500287, 808790, 836341, 456417, -64094, -319020, -221014, -13486, 111179, 162923, 150315, 1868, -245549, -400338, -348719, -171679, 31971, 268526, 514730, 624626, 495096, 226638, 18038, -34593, 28090, 118771, 163708, 137657, 98114, 139392, 276165, 419624, 494240, 525935, 583312, 663440, 657381, 435201, 8001, -384562, -447647, -160495, 173108, 302934, 329007, 458653, 610198, 530457, 247332, 86748, 194997, 344559, 325486, 250696, 293041, 352109, 224954]
32187B24954k59399j41991N7383Q3463m4307j11118k0516J08826J08555m2640
32177c6790j69169p1026K06943L67360K28639j2630n9090N7458O1981j15010k53685
32166B04981k07590p7290J6102P5521R3023K1091n6014K0499J73715J14997j97604
32155A81431m08862k58865L5303J27647M7846O5931K11969K59644J28194o742
32145C83496j6262K6156L8122N4164Q3308L3169j14679k01109r4646R1957J31839
32134D15515o171j17592n5007O5288M5412q1917q4425J09057K57315J38922j05265
32123E81132j63275q909Q5580n488q6963j1748N1995p4955k26999j22175J68251
32112A86446K81933Q5533j44643j28451N9638J55976O5397q9590j73927j51609
$$ y = [224954, -34445, -176436, -119053, -35590, -79897, -191015, -211531, -102705, 5850, -36790, -205959, -276985, -70042, 297318, 525957, 513327, 454237, 511695, 573676, 458666, 204981, -2609, -79899, -63797, 11724, 104747, 125838, 69824, 90323, 264038, 379035, 181431, -227431, -486296, -450993, -323346, -275500, -209569, 2400, 262044, 390238, 383496, 367234, 393390, 431512, 485676, 568984, 602153, 487474, 286365, 191719, 283676, 415515, 409344, 291752, 236745, 302033, 347445, 265528, 181103, 290160, 547475, 686397, 581132, 417857, 408948, 494528, 489040, 402077, 390329, 442324, 367369, 140370, 18195, 186446, 468379, 553912, 409269, 280818, 340456, 496432, 561829, 472239, 298312, 146703]
32102A46703m5292Q3513J24561L887j92264k59338r2079J78690L11839J99244
32092D59464n0056k41307k56383j06129R1814J69525M0388j66516j93043L6878
32082b15365K75934K48635J5335j31224r1761n7743j51139k11227p2466J38199
32072b52822J68903r777k04370k62683j70248L7415K67075L28875J25075j29640
32062a02197j03446J92253L58176J26205k69670m01069j87656O2941R4239k0970
32052b51194o0288N2857K08236K67423J81635j037j75346k43104j89806r6312
32042c06936m8403m9931n2925m3049l8186j7152P0541K02136K65658J99860R1922
32031B73535O3350R7190O6091p6705k21812k41277j37797k4242P226l0157m4023
$$ y = [146703, 101411, 184924, 309485, 313372, 121108, -138230, -230309, -51619, 260220, 459464, 409408, 168101, -88282, -194411, -102597, 66928, 107316, -59200, -252243, -215365, 60569, 309204, 324539, 193315, 101554, 43811, -107328, -318555, -391021, -252822, -83919, -93696, -298066, -560749, -730997, -693582, -426507, -97632, 27443, -102197, -205643, -13390, 344786, 470991, 201321, -199748, -387404, -324463, -230224, -251194, -311482, -258625, -50389, 217034, 398669, 397632, 222286, -20818, -210624, -306936, -355339, -405270, -458195, -501244, -539430, -556582, -486041, -283905, -18247, 181613, 273535, 336885, 434075, 500166, 423461, 201649, -39628, -177425, -201667, -194441, -224598, -268621]
32020b68621L3520J57253K04853J25146Q654l7246l0100m8292p5272k9116O9164
32009A09943R5200J2639o3425m1020K4762M0448L793m0647q1306j03390n8487
31998a01490N2031J33781J10701J7036p5185j40313j55093p2828P4112J45117
31988a2131P1623j9066J8732J23914J26174K1039j7154R6081K20546J80305q668
31977H01395j70551j87486j21539j08813j68536j79177o9400M9129L8493l9670
31967a56155j4882J01201J22353J5985j6311J13816J99959Q0676o5968p684J47380
31956E20370J33850k0482n4236P5952J39663L9826m4688R897R0963J02868J31432
31945A125415K11975J80623m2507k12513m9077L25247M75241J87433k62894m41167
$$ y = [-268621, -235101, -77848, 127005, 252151, 260805, 223559, 193459, 145167, 69895, 40779, 109943, 205143, 217782, 154357, 113337, 138099, 178547, 182340, 141693, 60387, -43003, -101490, -49459, 84322, 195023, 212059, 136874, -3439, -158532, -231360, -157248, -12131, 59492, 40426, 59158, 183072, 309246, 330285, 313131, 409212, 629758, 810063, 801395, 630844, 443358, 321819, 213006, 44470, -134707, -204107, -154978, -116485, -156155, -171037, -69836, 52517, 68502, 52191, 166007, 365966, 446642, 380674, 372990, 520370, 654220, 633738, 579502, 655454, 795117, 834943, 790255, 800152, 891115, 993983, 1125415, 1337390, 1518013, 1475506, 1262993, 1213916, 1539163, 2014404, 2201837, 1938943, 1497776]
31935A497776k47305R902J0275k01512l13165j69379N4417J41626J14555R1273
31925I88463L4433j34876k89567k34920m1936M1131m978L8498J97149J99814o9527
31914G23684l22669k65230q858J23433K3119j69227k99266k80816q4906J66317
31904c94419K24217J5638k02736j74164M072O1525l3190q4686j7647M6729M3528
31893e11133N6827J30742J79865J36271M0317n4586j45364k12447j95730q0613
31883f55851O0007J37611J24275O0534J6832K5516L5769j6798r3748r4017j7698
31872d17568L3303L9853R2591J85448J68623p56j49760j49139r1160p5653l0776
31861c94994Q1866J06373m2587j64440p7600N8749J5242j07024p6915L9025K4705
$$ y = [1497776, 1250471, 1260373, 1270648, 1069136, 755971, 586592, 641009, 782635, 897190, 988463, 1022896, 888020, 598453, 363533, 321597, 362728, 357750, 396248, 593397, 793211, 723684, 401015, 135785, 126927, 250360, 273479, 104252, -195014, -475830, -560736, -394419, -170202, -154564, -357300, -531464, -527392, -465867, -499057, -583743, -601390, -554661, -511133, -454306, -323564, -143699, -7428, 32889, -21697, -167061, -379508, -575238, -655851, -595844, -458233, -333958, -273424, -256592, -231076, -195307, -212105, -305853, -399870, -417568, -384265, -344412, -251821, -66373, 102250, 101494, -48266, -197405, -288565, -364218, -394994, -313128, -206755, -249342, -413782, -491382, -432633, -417391, -524415, -601330, -562305, -537600]
31850e37600n3549J9461J49251O6880j33874r4626J60743K05894o2127k08317
31840d87864L1388L20747K81722N3416l5250Q301n593n8569l7144k160k9734q222
31828C1038J07586R0818j75382l67537j70305J67215J76059r5372j85606K1206
31818d00280J63136M6628q2597l2112L2150l4909o6968P9667K20484J45427k0262
31807E0364m2113K7439j9356j42016r8282J32320K63706J09465j48074k16917
31797h3464p9792K9622l1944j54915j66449m9201R4951J92721K04540P3638j65975
31786a36268k86160r2598K31992K70175n5487l22861k00649P2282Q0854j13737
31776e52457j04183J82928L68905K22876j5937n5689L5036L2847o9510j29949
$$ y = [-537600, -591149, -571688, -422437, -355557, -489431, -584057, -423314, -217420, -279547, -487864, -456476, -135729, 145993, 199409, 164159, 172460, 166867, 108298, 71154, 68994, 39260, 31038, 138624, 229442, 54060, -313477, -483782, -316567, -140508, -235880, -421486, -400280, -237144, -190516, -273113, -305225, -273075, -307984, -374952, -295285, -74801, 70626, 50364, 8251, 35690, 16334, -125682, -223964, -91644, 172062, 281527, 133453, -83464, -163256, -133634, -165578, -320493, -486942, -536143, -441192, -248471, -43931, 29707, -136268, -422428, -515026, -283034, -12859, -68346, -391207, -591856, -519574, -438720, -552457, -656640, -473712, -104807, 118069, 102132, 46443, 81479, 114326, 44816, -85133]
31766h5133j30895j57116j89330j20474N1279J92256J95369Q6952k1996m5126
31756b24214N721M9466O1012J14144K20674K18272p732k58159k26640L2923J40439
31745A25906m5528k20545j38685Q763l0151j13079J8733K23941J54389j30308
31735a46564j96134Q6886L29379K23116k0927o2048M6880K8620j25270j72985
31725i047n7189R116q1223j54915o6409N2610K1458q0846n4062P1539P8196n1734
31713c22506o6098J41684L07356J89772j9015K1955K33495K14813q7890k38852
31703C74714l176K22350j03m24004m38640J2678L31031J32283k36442k55441M8101
31692b36649K43056J34071p6962j72086j47600o8989L7348R8039J9702j19318
$$ y = [-85133, -216028, -373144, -562474, -682948, -631669, -439413, -244044, -157092, -179088, -224214, -218493, -169027, -108015, 6129, 226803, 445075, 437343, 179184, -47456, -14533, 125906, 80378, -140167, -278852, -270089, -300240, -413319, -394586, -170645, -16256, -146564, -342698, -255812, 73567, 296683, 275756, 213708, 260588, 289208, 163938, -9047, -66236, -57120, -138343, -293258, -359667, -307057, -285599, -366445, -420507, -348968, -270772, -322506, -388604, -246920, 60436, 250208, 231193, 253148, 486643, 701456, 613566, 374714, 371538, 593888, 593785, 169781, -268859, -256181, 74850, 207133, -29309, -284750, -236649, 6407, 140478, 63516, -108570, -256170, -325159, -287811, -189772, -170070, -289388]
31682b89388r5692J35147L12308K07656m9222j59773o8461K2816Q03l6680k5572
31671d6058o2584j86441k37809r7403Q8085J03683j8222p8348k8905P147n257
31660e62112K6843R6237O7038o5578j13000R444J29126R3098J2505O3054J95295
31649d8050K36934J70276J04785N3211n3838j71687j71427o7525k3177r5142j42261
31638b07901m7290J07646J62721Q0260m5414j08627o7870M4697J40344J35633
31628A94199L3682p2437r1899k2623N0766M3070k7789l8711P7590J88421R7905
31617D32174j51309k73543j22132R0463J01071k8306n1260N6323Q7246l4591j42716
31606c6580j14320m4669o1344j37565j70302j14882J3704J59723K19683J38168
$$ y = [-289388, -385080, -249933, 62375, 270031, 220809, 61036, -7425, 15391, 16194, -20486, -46058, -108642, -295083, -532892, -630295, -542210, -438527, -456749, -535097, -564002, -556855, -562112, -535269, -439032, -371994, -437572, -550572, -541128, -412002, -318904, -306399, -243345, -48050, 188884, 359160, 463945, 517156, 463318, 291631, 120204, 52679, 29502, -65640, -207901, -255191, -147545, 15176, 95436, 50022, -58605, -126475, -81778, 58566, 194199, 227881, 155444, 63545, 40922, 91688, 134758, 106969, 68258, 145848, 334269, 432174, 280865, 7322, -114810, -24347, 76724, 48418, -2842, 53481, 140727, 106136, -36580, -150900, -195569, -256913, -394478, -564780, -679662, -665958, -506235, -286552, -148384]
31596a48384K1850K3262J13986J34849O3377K8358M5190k1127j68516j92924l2302
31585a32381P0923p1514k80151k64740l6422J58241J97307J54780R4009J0485
31575i9463n7410n4602l0616p2154j32261q1364P9849K03895J97541J11912K1501
31564H6828o9022j65177k12402j28878J04591L76648M79598K95473l0148k10028
31554E27483j55522o3539j00940j73652j32985l6552j7371l6149J2344N3389n4700
31543a78194k23021k12700m882J61437J47889P6014P4257R2921O5465N7480J27385
31532A84051J82439J05648o5701j97416k31965k18381k07160j77214o2081J51152
31522e36628L34809K98194L2170j97112j37797J09424K11940N0969j44363j42472
$$ y = [-148384, -126534, -103272, 10714, 145563, 208940, 237298, 282488, 261361, 92845, -100079, -132381, -61458, -132972, -413123, -677863, -714285, -556044, -358737, -203957, -109948, -99463, -156873, -211475, -242091, -314245, -446506, -527870, -448021, -244126, -46585, 65327, 86828, 17806, -147371, -359773, -488651, -384060, -7412, 472186, 767659, 737511, 527483, 371961, 308422, 207482, 33830, -99155, -135707, -153078, -189227, -176883, -123494, -178194, -401215, -613915, -618797, -457360, -309471, -233457, -159200, -66279, -814, 56666, 184051, 366490, 472138, 406437, 209021, -22944, -241325, -448485, -625699, -687780, -536628, -201819, 96375, 128545, -68567, -206364, -96940, 115000, 165969, 21606, -120866]
31512a20866n03P4703P063j15070j85897j63698o5586M6934J10482J16755R6626
31501a99057O5335M0342O8306J42964J54355M5769m5384K4154J33375M3887j98064
31490B75982k72807n6030J82672J64352l9344j74097j45499l7851O1749J06036
31480F5163O7659N84J6072J04318J09909k2598j32733q8457J0615J1767n5164
31469H7135p2774l9192k2777k5262l1625q3959j70466j64303j6792J14368Q2463
31458c43184k6589m6064K4673Q7649J30104J66676J28671l672q6435k0437N9402
31447G0794L329r3103p5232j9244o7732j20199K367J97999K23643J08983P3000
31436C04605Q6707q1580l77932m33936j22585K20633K72613J12779o516p850M6413
$$ y = [-120866, -121369, -46666, -39603, -154673, -340570, -504268, -569854, -522920, -412438, -295683, -199057, -133722, -93380, -25074, 117890, 272245, 318014, 272630, 296784, 430159, 474046, 275982, 3175, -52855, 129817, 294169, 254825, 80728, -64771, -102622, -40873, 65163, 132822, 133406, 149478, 253796, 363705, 341107, 208374, 119917, 130532, 142299, 87135, 14361, -24831, -47608, -72870, -104495, -188454, -358920, -523223, -540015, -425647, -343184, -369773, -415837, -391164, -303515, -173411, -6735, 121936, 118264, 31829, 11392, 70794, 74123, -18980, -94212, -113456, -181188, -301387, -299020, -101021, 122622, 231605, 304605, 391312, 309732, -68200, -502136, -624721, -404088, -131475, -18696, -25212, -33062, 13351]
31425A3351J07973J20944L4498p1659o4793l040o3238j97944j67355K9345J06140
31414a55778j5775m6599J58868L09077J52354j05725j69593j21595j68391j98740
31404c61897m665K59083K65879M4577q8331m2278j0460o3474o5208J0376K7105
31393b9293l0737l6003P867l0413j28315j29676m5194k0342j3772J34232L00884
31382b0762J66153k13525l56191o1957K48119J67713r7566j21304N7387O5405
31372a66528j61586l03201j74388N2185J66313J59766J00634K4075M170J12813
31362a85747K48356K09082J378j24205k8421J16785J00247k7280p7915k3821R748
31351B18207k3085m2987j3493M386j7163k0849K1337N6352N8265P9649J32864
$$ y = [13351, 121324, 242268, 276766, 205107, 140314, 137274, 74036, -123908, -291263, -261918, -155778, -171553, -218152, -59284, 249793, 402147, 296422, 126829, 5234, -163157, -361897, -366562, -107479, 158400, 202977, 114646, 72368, 61908, -1566, -66774, -56398, -29293, -60030, -96033, -88166, -118579, -246894, -376570, -421764, -442106, -455878, -321646, -20762, 145391, -68134, -424325, -486282, -238163, -70450, -168016, -289320, -231933, -166528, -328114, -631315, -805703, -753518, -587205, -427439, -326805, -302730, -298560, -185747, 62609, 271691, 273069, 148864, 120443, 237228, 337475, 310195, 232280, 208459, 218207, 195122, 152135, 138642, 143028, 125865, 105016, 126353, 182705, 240970, 320619, 453483]
31340D53483J26956J2949j04510j19609j05497j84719k76522j77454R8430K76069
31330d24J90508N568n3632l103K4128L6151R8379J14457m4827k45958k06400P2417
31318a2736K50798J17846j17173j40204M0712J63118R7980j7996j8284O9154P7713
31307E10928p4719k64881k88424j04325J03352J52889P5825Q633l4261j19345
31297c4328j91928j27680K6225Q5252K2983R68O5578P5624P614M3475K17206K72021
31285D63010P5935j03232r891J64149Q9756j55388k35421j13821m9808j02809
31275B2480o7652Q5631J27974L168n4205M3041O2514j04354j94832j6685J87983
31264I5063J26737n9078m4979J30825J52588l8783j73255j08130j9251o8859j57669
$$ y = [453483, 580439, 593388, 488878, 369269, 263772, 79053, -197469, -374923, -276493, -424, 190084, 195652, 142020, 138917, 163045, 199196, 297575, 412032, 367205, 121247, -85153, -12736, 238062, 355908, 238735, 98531, 139243, 302361, 400341, 382345, 364061, 433215, 510928, 436209, 171328, -117096, -221421, -118069, 34820, 110645, 119278, 85017, -34328, -226256, -353936, -327711, -242459, -219476, -218508, -152930, -77306, -69692, -26217, 190989, 463010, 538945, 435713, 425822, 589971, 679727, 524339, 288918, 175097, 125289, 22480, -45172, 40459, 168433, 171601, 117396, 160437, 222951, 118597, -76235, -92920, 95063, 221800, 162722, 117743, 248568, 401156, 362373, 189118, 80988, 61737, -7122, -164791]
31253a64791j21096K2906J36438J41202N2175o4260j06659q535J56543K21069
31243B64992J16026m9941j27454p8532K0169O4890J2032p3073p7705m63J7662
31232H8603r5216j90232r9074R1495J54620O4192J143L4040M1280j6635j1340
31221F2876Q2454R3229l6499j01644J8647J08008m7261k68141k31106L3040K08179
31210g8218J76520J01684O2260m9419k23450k58021r0146Q2241J22963J32968
31200b0618J74842J07629j14076k42984r1565J36450J50485L0255N5487K06502
31190C92407K01587p947j50850q7535n546n7428j13045l7247M6218k5975j72133
31179a7494k15535j66219j37910j11508j3406O5499j6133j59032j06843J60539
$$ y = [-164791, -285887, -262981, -126543, 14659, 66834, 2574, -104085, -112620, 43923, 264992, 381018, 331077, 203623, 125091, 145260, 210150, 222182, 149109, 71404, 70941, 88603, -6613, -196845, -295919, -204424, -49804, 14388, 15531, 49571, 90851, 74216, 62876, 145330, 238559, 202060, 100416, 119063, 227071, 179810, -88331, -319437, -286397, -78218, 98302, 199986, 262246, 212827, -10623, -268644, -358790, -276549, -153586, -20618, 154224, 261853, 147777, -95207, -186772, -50322, 100163, 130418, 185905, 392407, 593994, 586047, 435197, 347662, 342116, 284688, 171643, 134396, 180614, 154639, -17494, -233029, -399248, -537158, -648666, -662072, -596573, -612706, -771738, -878581, -718042]
31169g18042L60232L01376J29131O1442P1157j636j45886j87005o1395Q9382J20331
31158A9087M8866k7643p6815j15675j14312k1334J14353J45385Q901j52174j42109
31147c13470L0518J55070J00934j8654l5842L0061M5913N59J071O4131R2176O6532
31135B18999P3359R5238q144k12878k54918k5324J66995K102l25509l35504K8937
31124e76647L04534J91533m8213o4748N3053K8262q5031k5847J61002J57148q6271
31113H775k33940r0854J09861J10667J4427L1720R3123J1354j32228r4691R7152
31102g4634J48063m1977k04487j01329J29772J90827M1306q1943j1570J41923
31092A35951J59189k372j64170j60100m4018R106k2997K3615K08287L23640J70534
$$ y = [-718042, -357810, -56434, 72697, 134139, 205296, 203660, 57774, -129231, -190626, -101244, 19087, 67953, 40310, -36505, -152180, -266492, -287826, -173473, -28088, -19187, -171361, -313470, -282952, -127882, -26948, -45602, -81444, -51383, -5470, -4911, -3840, 60291, 152467, 218999, 292358, 387596, 379452, 166574, -88344, -113668, 53327, 55429, -270080, -605584, -576647, -272113, -80580, -128793, -193541, -140488, -112226, -197257, -223104, -62102, 95046, 8775, -225165, -316019, -206158, -95491, -81064, -49344, 43779, 55133, -77095, -171786, -74634, 73429, 31452, -173035, -274364, -144592, 46235, 87541, 5598, -5972, 135951, 295140, 292768, 128598, -31502, -75520, -66414, -89411, -65796, 142491, 466131, 636665]
31081F36665j26209k76126k21586j48212j35374o6973P8680J31611K8096m6155
$$ y = [636665, 510456, 234330, 12744, -135468, -270842, -337815, -259135, -127524, -99428, -145583]
$$ [...]
##END NTUPLES=NMR SPECTRUM
##END=
