##TITLE=31Pdec_PR164_chr
 D2O, 124 sc
 4.2.2020
##JCAMPDX= 6.0         $$ Bruker NMR JCAMP-DX V2.0
##DATA TYPE= NMR SPECTRUM
##DATA CLASS= NTUPLES
##ORIGIN= UXNMR, Bruker Analytische Messtechnik GmbH
##OWNER= root
$$ XWIN-NMR		Version 3.5
$$ Tue Feb  4 14:18:41 2020 Russian Standard Time (UT+4h)  she@DPX200
##.OBSERVE FREQUENCY= 81.013821
##.OBSERVE NUCLEUS= ^31P
##.ACQUISITION MODE= SIMULTANEOUS
##.ACQUISITION SCHEME= undefined
##.AVERAGES= 124
##.DIGITISER RES= 17
##SPECTROMETER/DATA SYSTEM= spect
##.PULSE SEQUENCE= zgpg30
##.SOLVENT NAME= CDCl3
##.SHIFT REFERENCE= (INTERNAL, CDCl3, 0, 182.463)
##AUDIT TRAIL= $$ (NUMBER, WHEN, WHO, WHERE, WHAT)
$$ ##TITLE= Audit trail, XWIN-NMR		Version 3.5
$$ ##JCAMPDX= 5.01
$$ ##ORIGIN= Bruker BioSpin GmbH
$$ ##OWNER= she
$$ F:/spectra/data/she/nmr/P31/1/pdata/1/auditp.txt
$$ ##AUDIT TRAIL=  $$ (NUMBER, WHEN, WHO, WHERE, WHAT)
(   1,<2020-02-04 14:17:37.98 +0400>,<she>,<DPX200>,
      <continue with go, POWCHK disabled, PULCHK disabled
       configuration hash MD5:
       00 E9 B6 7A A2 85 ED C7 34 08 36 98 17 FE 4E 26
       data hash MD5: 32K
       8D 9D F9 1E 4D B5 63 0A B8 6A C7 11 B7 C3 AA 36>)
(   2,<2020-02-04 14:17:41.68 +0400>,<she>,<DPX200>,
      <Start of raw data processing
       efp BC_mod = 2 LB = 1 FT_mod = 6 PKNL = 1 PHC0 = -1648.82 PHC1 = 60.00131 SI = 64K 
       data hash MD5: 64K
       1C 8C 6D 3F 17 AF CC 9B AA 73 1F 17 0B 5D 83 20>)
(   3,<2020-02-04 14:18:12.76 +0400>,<she>,<DPX200>,
      <pk PHC0 = 216.7241 PHC1 = -39.19999 
       data hash MD5: 64K
       DF 86 A2 F5 0E 28 27 F9 F4 28 BA D6 66 6E 23 65>)
(   4,<2020-02-04 14:18:16.62 +0400>,<she>,<DPX200>,
      <abs ABSG = 5 
       data hash MD5: 64K
       B6 3E 0E 76 18 2C 05 B9 C5 DB 64 54 5C 25 F7 43>)
$$ ##END=
$$ 
$$ hash MD5
$$ D3 4F DD AB 34 FB 4E 32 BB 2F 8B F9 C9 E4 2F BC
##$RELAX= 
##$RELAX= 
##$RELAX= 
##$RELAX= 
##$RELAX= 
##$RELAX= 
##$RELAX= 
##$RELAX= 
$$ Bruker specific parameters
$$ --------------------------
##$DU= <F:/spectra>
##$EXPNO= 1
##$NAME= <P31>
##$PROCNO= 1
##$TYPE= <nmr>
##$USER= <she>
##$AMP= (0..31)
100 100 100 100 100 100 100 100 100 100 100 100 100 100 100 100 100 100 
100 100 100 100 100 100 100 100 100 100 100 100 100 100 
##$AQSEQ= 0
##$AQ_mod= 1
##$AUNM= <au_zg>
##$AUTOPOS= <>
##$BF1= 81.014009
##$BF2= 200.13
##$BF3= 200.13
##$BF4= 200.13
##$BF5= 200.13
##$BF6= 200.13
##$BF7= 200.13
##$BF8= 200.13
##$BYTORDA= 1
##$CFDGTYP= 0
##$CFRGTYP= 5
##$CHEMSTR= <none>
##$CNST= (0..31)
1 1 145 1 1 1 1 1 1 1 1 1 1 1 1 1 1 1 1 1 1 1 1 1 1 1 1 1 1 1 1 1 
##$CPDPRG= <waltz16>
##$CPDPRG1= <>
##$CPDPRG2= <waltz16>
##$CPDPRG3= <>
##$CPDPRG4= <mlev>
##$CPDPRG5= <mlev>
##$CPDPRG6= <mlev>
##$CPDPRG7= <mlev>
##$CPDPRG8= <mlev>
##$CPDPRGB= <>
##$CPDPRGT= <>
##$D= (0..31)
0 1 0 0 0 0 0 0 0 0 0 0.03 2e-05 3e-06 0 0 0 0 0 0 0 0 0 0 0 0 0 0 0 0 
0 0 
##$DATE= 1580811280
##$DBL= (0..7)
120 120 120 11 120 120 24 19 
##$DBP= (0..7)
150 150 150 150 150 150 150 150 
##$DBP07= 0
##$DBPNAM0= <>
##$DBPNAM1= <>
$$ [...]
##$SUBNAM3= <"">
##$SUBNAM4= <"">
##$SUBNAM5= <"">
##$SUBNAM6= <"">
##$SUBNAM7= <"">
##$SUBNAM8= <"">
##$SUBNAM9= <"">
##$SW= 369.568048894756
##$SWIBOX= (0..15)
0 1 3 0 0 0 0 0 0 0 0 0 0 0 0 0 
##$SW_h= 29940.119760479
##$TD= 32768
##$TD0= 1
##$TE= 0
##$TE2= 300
##$TE3= 300
##$TEG= 300
##$TL= (0..7)
0 120 53 12 22 120 120 120 
##$TP= (0..7)
150 150 150 150 150 150 150 150 
##$TP07= 0
##$TPNAME0= <>
##$TPNAME1= <>
##$TPNAME2= <>
##$TPNAME3= <>
##$TPNAME4= <>
##$TPNAME5= <>
##$TPNAME6= <>
##$TPNAME7= <>
##$TPOAL= (0..7)
0.5 0.5 0.5 0.5 0.5 0.5 0.5 0.5 
##$TPOFFS= (0..7)
0 0 0 0 0 0 0 0 
##$TUNHIN= 0
##$TUNHOUT= 0
##$TUNXOUT= 0
##$USERA1= <user>
##$USERA2= <user>
##$USERA3= <user>
##$USERA4= <user>
##$USERA5= <user>
##$V9= 5
##$VALIST= <valist>
##$VCLIST= <CCCCCCCCCCCCCCC>
##$VD= 0
##$VDLIST= <DDDDDDDDDDDDDDD>
##$VPLIST= <PPPPPPPPPPPPPPP>
##$VTLIST= <TTTTTTTTTTTTTTT>
##$WBST= 1024
##$WBSW= 4
##$XGAIN= (0..3)
0 0 0 0 
##$XL= 0
##$YL= 0
##$YMAX_a= 21836
##$YMIN_a= -10187
##$ZGOPTNS= <>
##$ZL1= 120
##$ZL2= 120
##$ZL3= 120
##$ZL4= 120
##$ABSF1= 182.463
##$ABSF2= -187.1042
##$ABSG= 5
##$ABSL= 3
##$ALPHA= 0
##$AQORDER= 0
##$ASSFAC= 0
##$ASSFACI= 0
##$ASSFACX= 0
##$ASSWID= 0
##$AUNMP= <proc_1d>
##$AZFE= 0.1
##$AZFW= 0.5
##$BCFW= 0
##$BC_mod= 2
##$BYTORDP= 0
##$COROFFS= 0
##$CY= -3
##$DATMOD= 1
##$DC= 0
##$DFILT= <>
##$DTYPP= 0
##$F1P= 0
##$F2P= 0
##$FCOR= 1
##$FTSIZE= 65536
##$FT_mod= 6
##$GAMMA= 0
##$GB= 0
##$INTBC= 1
##$INTSCL= 5.30512e-09
##$ISEN= 30
##$LB= 1
##$LEV0= 0
##$LPBIN= 0
##$MAXI= 10000
##$MC2= 0
##$MEAN= 0
##$ME_mod= 0
##$MI= 50
##$NCOEF= 0
##$NC_proc= -8
##$NLEV= 6
##$NOISF1= 182.463
##$NOISF2= 159.3651
##$NSP= 0
##$NTH_PI= 0
##$NZP= 0
##$OFFSET= 182.463
##$PC= 4
##$PHC0= -1432.096
##$PHC1= 20.80132
##$PH_mod= 1
##$PKNL= yes
##$PPARMOD= 0
##$PSCAL= 0
##$PSIGN= 0
##$REVERSE= no
##$SF= 81.0140089999434
##$SI= 65536
##$SIGF1= 159.3651
##$SIGF2= -187.1042
##$SINO= 113.3802
##$SIOLD= 16384
##$SREGLST= <1H.CDCl3>
##$SSB= 0
##$STSI= 65536
##$STSR= 0
##$SW_p= 29940.119760479
##$SYMM= 0
##$S_DEV= 0
##$TDeff= 32768
##$TDoff= 0
##$TI= <>
##$TILT= no
##$TM1= 0
##$TM2= 0
##$TOPLEV= 0
##$USERP1= <user>
##$USERP2= <user>
##$USERP3= <user>
##$USERP4= <user>
##$USERP5= <user>
##$WDW= 1
##$XDIM= 65536
##$YMAX_p= 312045556
##$YMIN_p= -116092688
$$ End of Bruker specific parameters
$$ ---------------------------------
##NTUPLES= NMR SPECTRUM
##VAR_NAME=  FREQUENCY,     SPECTRUM/REAL,   SPECTRUM/IMAG
##SYMBOL=    X,             R,               I
##VAR_TYPE=  INDEPENDENT,   DEPENDENT,       DEPENDENT
##VAR_FORM=  AFFN,          ASDF,            ASDF
##VAR_DIM=   65536,         65536,           65536
##UNITS=     HZ,            ARBITRARY UNITS, ARBITRARY UNITS
##FACTOR=    0.456856943014862, 1,           1
##FIRST=     14782.0589164792, 0,            0
##LAST=      -15158.0608439998, 0,           0
##MIN=       -15158.0608439998, -116092688,  0
##MAX=       14782.0589164792, 312045556,    0
$$ Real data points
##PAGE= N=1
##DATA TABLE= (X++(R..R)), XYDATA
$$ [...]
##PAGE= N=2
##DATA TABLE= (X++(I..I)), XYDATA
4813c1752699J1215278l186970k224631J2841715J7960212N638681k816929P847391
4805A5522048K2678584K0011951K096394j2106358j3506313q912198p143017j0075245
4797H565846j4213773j3971441n961902N646474J1198946N969260m530506j0993926
4789a8291022q676275L93688Q981838R340077J486131n000364l156784R70544
4781a3952167j940056q685925q554912j082960M206206M197803L971394K896678
4773a8943939m299946j1046252k803374J6687783K3002873N747032j2895618r568542
4765a4119983O442565J0339795O71993k323646Q072144J5697473R543025l9842
4757C4283524p64565K469658j359836j0595054j5186714j3320222j1771952j1614484
$$ y = [-31752699, -20537421, -23724391, -25949022, -13107307, 4852905, 10491586, 7674657, 15522048, 38200632, 58212583, 60308977, 48202619, 34696306, 25784108, 18641091, 8565846, -5647927, -19619368, -25581270, -19934796, -8735850, -2766590, -7297096, -18291022, -26967297, -26573609, -17591771, -8251694, -6765563, -11765927, -14922711, -13952167, -15892223, -24578148, -33133060, -34216020, -30009814, -25812011, -21840617, -18943939, -23243885, -34290137, -37093511, -20405728, 2597145, 8344177, -4551441, -14119983, -7677418, 2662377, 3334370, 1010724, 9082868, 24780341, 34323366, 34283524, 33518959, 35988617, 34628781, 24033727, 8847013, -4473209, -16245161, -27859645]
4749b7859645m892552J1079750K4241774K0256350K177475j0614424n852687O391766
4741A4927807Q607346M75929k646890M927054R139338k250864j9055005k0733058
4733f608343l846509J3792665J5579897L524404q379402j1147915p438624m439196
4725h963023m176575k575868K308508N082869N37130o345010n765613J778436
4717a8119146N443561J221373j852230K283753O071164K171106k836257j29070
4709e745746M919790J892429n522865n034484K930313N218126l076178j2309387
4701a6728002j4143450j0001789k031145J0270280K1075853J9727499O415244
4694A4584490n750041r045429q897370q620621j731375J1842277J7184764N212399
$$ y = [-27859645, -32752197, -21672447, 2569327, 22825677, 25003152, 14388728, 8536041, 14927807, 23535153, 24011082, 21364192, 26291246, 35430584, 33179720, 14124715, -6608343, -10454852, 3337813, 18917710, 22442114, 14062712, 2914797, -4523827, -8963023, -13139598, -15715466, -13406958, -8324089, -7786959, -14131969, -19897582, -18119146, -12675585, -11454212, -13306442, -11022689, -4951525, -2780419, -5616676, -5745746, -825956, 1066473, -4456392, -9490876, -6560563, -1342437, -4418615, -16728002, -30871452, -40873241, -42904386, -32634106, -11558253, 8169246, 14584490, 8834449, -210980, -9108350, -17728971, -19460346, -7618069, 9566695, 14779094]
4686A4779094j0205401j1153375j933168L57818o155697q654322l978838j666112
4678b8610001k523655M141998J6541896J5075084p067444k5796698j5961449J2225954
4670c1974315K5833607J2526745q112198j5463469j0485000k911938N912208J6333361
4662h340999J9471971P595968j0569129j8108877j1172678p04834N506296J0212977
4654f109305J4744376J2370134O6950j2117313j2005627r23052R026899J0368599
4646A5421661O074145J809931m38648m51661K294478N958033N325940k798791
4638C3195088j3873707j8002843r525467O363624J8171844J9337523J2613677
4631D8279739L101473p774063j7574860j8426585o371524P860898Q866195k192503
$$ y = [14779094, 4573693, -6579682, -8512850, -8155032, -14310729, -22965051, -26943889, -28610001, -31133656, -26991658, -10449762, 4625322, -2442122, -28238820, -44200269, -31974315, -6140708, 6386037, -1726161, -17189630, -27674630, -30586568, -24674360, -8340999, 11130972, 18726940, 8157811, -9951066, -21123744, -21828578, -16322282, -6109305, 8635071, 21005205, 21072155, 8954842, -3050785, -3973837, 5053062, 15421661, 21495806, 23305737, 22867089, 22415428, 24709906, 30667939, 35993879, 33195088, 19321381, 1318538, -8206929, -1843305, 16328539, 35666062, 48279739, 51381212, 43607149, 26032289, 7605704, 1234180, 9095078, 17961273, 15768770]
4623A5768770q435974k236359M114561m93788p727274m434282M978974N761240
4615G295868l762134j1474917j1418302r328944q231432k938684P960716J6506865
4607a5390964J6223782R914109L384945j158857l433522l852539m918191p050189
4599f281426m326294O724085J6152390J0503021o437265j6100374j0068663R23233
4591h911293N346847L663857r18808q490694j3345364n582463R981784J3832593
4583d423541J374157n981112N674703J6837761L658296k1983240k7965241r200012
4575d2008229Q476555R359050N041160P148186R137825M432369O97164L757313
4567F041393M667218l998653j2774428r577810J249562O716039L683605j589833
$$ y = [15768770, 7332796, 5096437, 9210998, 8717210, 989936, -3444346, 1534628, 7295868, 3533734, -7941183, -19359485, -28688429, -36919861, -39858545, -31897829, -15390964, 832818, 10746927, 14131872, 12973015, 9539493, 5686954, 768763, -6281426, -10607720, -3883635, 12268755, 22771776, 16334511, 234137, -9834526, -8911293, -3564446, 99411, -819397, -9310091, -22655455, -28237918, -18256134, -4423541, -3049384, -9030496, -3355793, 13481968, 17140264, -4842976, -32808217, -42008229, -33531674, -24172624, -19131464, -11983278, -2845453, 1586916, 2284080, 6041393, 10708611, 6709958, -6064470, -15642280, -14392718, -7676679, -3993074, -5582907]
4559e582907n119861o109372k928204K186115J116389p988761j3640560o280684
4551d4347845O443242J1013737P866519O823509Q557747N986669R54142K785042
4543F082762R875207R252015k005922j0307464o400669J382790K558969K1185
4535A0458873j43890k334280j0971869j5280457j978721J9871775K4931957N989469
4527C0542857j3554846j0311755P814176J3784155r98879j6187507j1669789N399820
4519D818232J1999280J491488q403821k531714Q245481J651217k2180708l6286606
4511d1197151k1427607P143973J9143417Q359093l239918M13255Q772275N271043
4503a6761620o272212r794614k777429K788651K477693N156909J3668644J6126575
$$ y = [-5582907, -10702768, -16812140, -19740344, -17554229, -16437840, -24426601, -38067161, -44347845, -37904603, -26890866, -19024347, -12200838, -3643091, 2343578, 3297720, 6082762, 15957969, 25209984, 23204062, 12896598, 6495929, 7878719, 10437688, 10458873, 10314983, 7980703, -2991166, -18271623, -20250344, -378569, 24553388, 30542857, 16988011, 6676256, 14490432, 28274587, 27275708, 11088201, -581588, 4818232, 16817512, 18309000, 9905179, 7373465, 15618946, 17270163, -4910545, -41197151, -62624758, -55480785, -36337368, -27978275, -31218193, -30804938, -22032663, -16761620, -23033832, -32828446, -35605875, -32817224, -30339531, -25182622, -11513978, 4612597]
4495D612597N185399o884475m886375N970498P869849k459146r719227m117193
4487d428073N000905N191855j029400l036538N68713J634758l559973q895133
4479h552886p149274J617452J0857178J3154888N934452n242799j0750570p284773
4471g416332j286471J369892L892840J0281966J4092350O396875p462011j2146094
4463G723015m679022R59839l838969r143725m284735L734319K615092l568233
4455a0482419q99953J0587670J6021760Q734283o34241j361630L403736M753718
4447C0122924L15077o293193j0370145p341152K593440Q872330L31936j5869089
4439B362128j7798043J611272K1051901J7989409j208924j2324313p144287N7221
$$ y = [4612597, 9797996, 2913521, -1972854, 3997644, 11867493, 9408347, -310880, -4428073, 572832, 5764687, 4735287, 1698749, 2267462, 3902220, 342247, -8552886, -15702160, -14084708, -3227530, 9927358, 15861810, 10619011, -131559, -7416332, -8702803, -7332911, -3440071, 6841895, 20934245, 27331120, 19869109, 7723015, 3043993, 4003832, 164863, -8978862, -13263597, -9529278, -6914186, -10482419, -11382372, -794702, 15227058, 23961341, 23327100, 21965470, 25369206, 30122924, 30438001, 24144808, 13774663, 6433511, 9026951, 17899281, 18231217, 2362128, -15435915, -13824643, 7227258, 25216667, 24007743, 11683430, 4539143, 4596364]
4431D596364k565550r379932r995399m005326K509637O124435O020135J369782
4423e325854n619966q524885l803592L531640N815625K714172O71648K255892
4415h285320J438704o268315j2791372n573156J2137484K0426575R570053l618798
4407G035855M7306J1553486P870425r002039j4037030j655012M313879p172053
4399a045183j3941270o06522J1846764L050929q355914J824230J5172839p80881
4391G164992l1285924l0912097L298239K5665138J3528165m535967m575969k476868
4383b4130291j1884561j2496664R194605K5723898J0684849j5281054j7065825
4376c5255043J076329J1241838J0294745J3793847J7921396P497155q549387q335872
$$ y = [4596364, 2030814, -7349118, -17344517, -21349843, -18840206, -12715771, -6695636, -5325854, -10945820, -19470705, -23274297, -19742657, -13927032, -11212860, -10541212, -8285320, -6846616, -13114931, -25906303, -31479459, -19341975, 1084600, 10654653, 7035855, 7083161, 18636647, 26507072, 17505033, 3468003, 1812991, 6126870, -1045183, -14986453, -15592975, -3746211, -695282, -9051196, -7226966, 7945873, 7164992, -24120932, -55033029, -51734790, -26069652, -12541487, -17077454, -21653423, -24130291, -36014852, -48511516, -39316911, -13593013, -2908164, -18189218, -35255043, -34178714, -22936876, -12642131, 1151716, 19073112, 26570267, 18020880, 9685008]
4368I685008L174120K497777r257171r073345M092466O199909q209133j5893913
4360a6784282n663194M517718J132609m969714l907493l553030p718445l807015
4352d0752846J2428188K2729029J3382296k496962n542405K667188P375550K688887
4344A2478925o231164j2170481q708930M837135J6267131J1448410m381365j1914034
4336A625627o328078j265325j989421J700235J0111952P545524q072202j5469404
4328a2141092l960695P670701K723377o639143l160985O818977R379691Q067044
4320H757875J1076471J1153661N70595r921731q759815m081340n293171k580131
4312I22414J0742055J5010592o263198l0253761k3367404N075271J5155937k394888
$$ y = [9685008, 12859128, 15356905, 6099734, -2973611, 1118855, 7318764, -890369, -16784282, -22447476, -17929758, -16797149, -21766863, -25674356, -29227386, -36945831, -40752846, -28324658, -5595629, 7786667, 5289705, -252700, 2414488, 9790038, 12478925, 6247761, -5922720, -14631650, -9794515, 6472616, 17921026, 13539661, 1625627, -4702451, -5967776, -7957197, -6256962, 3854990, 11400514, 3328312, -12141092, -16101787, -8431086, -5707709, -12346852, -15507837, -8688860, 690831, 8757875, 19834346, 30988007, 31558602, 21636871, 12877056, 8795716, 3502545, 922414, 11664469, 26675061, 20411863, -9841898, -33209302, -28134031, -12978094, -15372982]
4304a5372982j5148722j497087K0846887K6980827J6125725P98878j1123955j3936655
4296G672916m252363Q128008P247184n739482j3681857j0327246o253536n577093
4288b2783469N20511J1822213J3843756K792974n598691j301532O013710P039899
4280A2349371O295903N811872k856838j7690087j8926587P36972J7782171R153513
4272A2656290j3285053k0236174n792808R846122J1398360K958593n086545p143966
4264a4685181j672093P827440J2195160O706685j000701j581417K257729K074845
4256A2122467j606304j961877Q60538Q64058j597159k05069M954793N864397q73167
4247A8422677q350171q970807l659265J437007L177732L223857L702553M093876
$$ y = [-15372982, -30521704, -32018791, -11171904, 15808923, 31934648, 32733526, 21609571, 7672916, 3420553, 11548561, 18795745, 13056263, -625594, -10952840, -17206376, -22783469, -22262958, -10440745, 3403011, 6195985, 597294, -704238, 5309472, 12349371, 18645274, 24457146, 21600308, 3910221, -15016366, -14279394, 3502777, 12656290, -628763, -20864937, -26657745, -16811623, -5413263, -2454670, -7541215, -14685181, -16357274, -8529834, 3665326, 10372011, 9371310, 7789893, 10047622, 12122467, 10516163, 8554286, 9414824, 10278882, 8681723, 8476654, 13431447, 19295844, 18422677, 10072506, 1101699, -2557566, -1120559, 2057173, 5281030, 8983583, 13077459]
4239A3077459K960299J034768J84219m15625l250281o698918n859669j639824
4231f07572j412925n625719l453619R049099J6806227N978423j1888607j3880780
4223e035473J197291J3379491J2423776O827363K352665n334588j3527439j1385804
4215H97282j716759p66775r219736p787012Q707838J8619303Q398776n170423
4207A1962494m619783J021104j107919k018503P610531J2363122k782241k0693054
4199A735751j6601355O91865N087220j966077Q97357J1185286O352428j0443504
4191c061029r692703J3085235K4850555P564083j2410752p187649J0379018J1724031
4183C5250789k954386j1825985p923112k650882j421925O86281K428513l912801
$$ y = [13077459, 16037758, 17072526, 17256745, 16841120, 13590839, 6891921, 1032252, -607572, -2020497, -7646216, -11099835, -2050736, 14755491, 20733914, 8845307, -5035473, -3838182, 9541309, 21965085, 28792448, 31145113, 25810525, 12283086, 897282, -819477, -1586252, -10805988, -18593000, -9885162, 8734141, 17132917, 11962494, 7342711, 8363815, 7255896, 5237393, 12847924, 25211046, 22428805, 1735751, -14865604, -14173739, -9086519, -11052596, -10155239, 1030047, 7382475, -3061029, -12753732, 331503, 25182058, 32746141, 20335389, 13147740, 23526758, 35250789, 32296403, 20470418, 12547306, 9896424, 8474499, 9160780, 11589293, 7676492]
4175G676492j5419584j7387245l178322J5617428K2837393J4710276M59100q959149
4167A6356389r859744o290501m227363n608609p410311n536395N57436N918785
4159a6100313L829517n061152r297870r506J3015397J1031680n002608j1701902
4151a9296757K161258J6461173J0783777k856375j541246Q392922K954957j4839777
4143B219932j6470937L785901J6677638M914314r276788j799890J3922233R107519
4135B3079922j5523510l1362805k0572614O128116K6383794K7041674J1554125
4128B6728702l547025l724587O190322P795668k936974p320397O622880K1164068
4120E0972657J1671881j6942524l4489717k3039853M454446K2501909J8709112
$$ y = [7676492, -7743092, -25130337, -28308659, -12691231, 10146162, 24856438, 25315538, 16356389, 6496645, 206144, -4021219, -9629828, -17040139, -22576534, -22019098, -16100313, -12270796, -17331948, -26629818, -26639324, -13623927, -2592247, -7594855, -19296757, -17135499, -674326, 10109451, 7253076, 5711830, 14104752, 17059709, 2219932, -14251005, -10465104, 6212534, 11126848, 1850060, 50170, 13972403, 23079922, 7556412, -23806393, -44379007, -38250891, -11867097, 15174577, 26728702, 23181677, 19457090, 25647412, 33443080, 30506106, 23185709, 29808589, 50972657, 62644538, 45702014, 11212297, -11827556, -7373110, 15128799, 33837911]
4113C3837911N69618j4984031j7117860r523535k954641n73567K879486Q065741
4105A99122Q194880J815616l264817l220289l563001o453362n417548J553818
4097a0155581O969174P788950R638556J0999729J276924j6270464j9934590j779144
4089a1466446J5141908R408388o975147j0058418j000967K197820k714233l501797
4081h968892J125748K027409j25139K071542M651287o62646o715611q70554J0389136
4072B922280J0359400J239773l91358N877157M284100p350592j3897476j0114346
4064g071062o462000o184771j863357L420926j778238j1065968m581757J5231717
4056b0354510K1987686P660825l996556J913570Q140639j083190j2281968r089362
$$ y = [33837911, 34407529, 19423498, 2305638, -7217897, -10172538, -10746105, -7866619, 199122, 8394002, 10209618, 6944801, 3724512, 161511, -6291851, -11709399, -10155581, -3186407, 4602543, 14241099, 25240828, 26517752, 10247288, -9687302, -11466446, 3675462, 13083850, 6108703, -3949715, -4950682, -2752862, -5467095, -8968892, -7843144, -5815735, -5940874, -3869332, 781955, 119309, -6596302, -7466856, 2922280, 13281680, 14521453, 14130095, 20007252, 24291352, 16940760, 3043284, -7071062, -13533062, -19717833, -21581190, -18160264, -19938502, -31004470, -35586227, -20354510, 1633176, 9294001, 5297445, 7211015, 15351654, 14268464, 1986496, -7102866]
4048g102866n23919k41724o39748P849959J2469385O0040j4196972q567552Q266155
4039b627242J1230655j86672m815280K301678M627168m214174j1028652q290941
4031a3003460m801428o047052m633503L288590R354559P242258J488278k800924
4023i912682n869899n179414M647359J8365739J9841037L037499j6669646k0382121
4015a2122128q398504K169511j000704j1862813j3991327m45819J6171683J7519072
4007a1961029L321483p086055j124642R525363O824834p623519j7173697j4096074
3999c9393336n033244K979054P811659O807731J94277k768255M643466J2178294
3991a2580354O178115n371675j691170J6205367K2662114N787088j3523284j3312244
$$ y = [-7102866, -7626785, -7868509, -8508257, -658298, 11811087, 11871127, -2325845, -10893397, -2627242, 8603413, 8416741, 3601461, 5903139, 10530307, 6316133, -4712519, -13003460, -17804888, -23851940, -28485443, -25196853, -15842294, -8600036, -7111758, -9912682, -15782581, -20961995, -16314636, 2051103, 21892140, 24929639, 8259993, -12122128, -20520632, -18351121, -19351825, -31214638, -45205965, -45651784, -29480101, -11961029, -8639546, -15725601, -16850243, -7324880, -500046, -8123565, -25297262, -39393336, -44426580, -41447526, -33635867, -26828136, -26633859, -29402114, -24758648, -12580354, -6402239, -11773914, -13465084, 2740283, 25402397, 31189485, 17666201, 4353957]
3983D353957k008756j015602j0323076j2034414p44561R957858J0208934N708602
3975D102942M072312L468490L37361k354070j889569l326475j1418727j8803385
3967b5811121j2356158P084440K0336581J2075198p800192j5145869l326847Q135614
3959a6808354K001853j1316961q999776J0309970K3790915J6137175q61758o633840
3951G619224J353033Q566691N092970l998890r122150q474900o570080n236528
3943a0770630j594575M970587Q808917M885916k922501n964257k574415O66512
3935d494446L8136l51670L011853P288624R310701R632709P039058j757960j2232353
3926A7484652j2722428j959600N552537M93716p347590p085314m679192p831542
$$ y = [4353957, 2345201, 1329599, -8993477, -21027891, -21772452, -11814594, -1605660, 4102942, 8175254, 11643744, 11981105, 9627035, 7737466, 4410991, -7007736, -25811121, -38167279, -31082839, -10746258, 1328940, -6471252, -21617121, -24943968, -16808354, -14806501, -26123462, -35123238, -24813268, -1022353, 15114822, 14253064, 7619224, 8972257, 17538948, 22631918, 18633028, 9510878, 1035978, -5534102, -10770630, -12365205, -7394618, 1414299, 6300215, 3377714, -2586543, -5160958, -4494446, -4456310, -4807980, -1796127, 5492497, 14803198, 24435907, 31474965, 29717005, 17484652, 4762224, 2802624, 8355161, 8848877, 1501287, -5584027, -10263219, -18094761]
3918a8094761p307566O237231J8889111J1900516m797669n495297R103351J3179249
3910B3614165M7506p397499K239374R493940n4879r575562o94622J4017655J1419842
3901D3109920o211389j8445692j8019805j3549421r290983j822940P578902J2745650
3893c905758J1811090O646561j062797n909641q88879R143118R370289j208123
3885B3995860m852297M728974P713145q947622k4752670j5898093N049045Q427470
3877d536188o050391j3112178m493829M275462O400500J1003945J6737720R797072
3869B0022113o266377q570548Q134514J9627529Q904476r663520j5949146j1572478
3861D666563o949906q58911R852947J5792133P642142p563754j6750362j7614515
$$ y = [-18094761, -25402327, -19165096, -275985, 11624531, 6826862, 1331565, 10434916, 23614165, 23661671, 16264172, 18503546, 27997486, 27942607, 18367045, 17672423, 31690078, 43109920, 36898531, 18452839, 433034, -13116387, -22407370, -24230310, -16651408, -3905758, 7905332, 14551893, 13489096, 7579455, 6690576, 15833694, 25203983, 23995860, 19143563, 23872537, 31585682, 22638060, -2114610, -18012703, -12963658, -4536188, -10586579, -23698757, -28192586, -23917124, -17516624, -6512679, 10225041, 20022113, 13755736, 5185188, 13319702, 32947231, 41851707, 32188187, 16239041, 4666563, -2283343, -3142254, 6710693, 22502826, 30144968, 22581214, 5830852, -11783663]
3853a1783663j3990986n789557M840462Q725067L251049o8677O281255J1429072
3845B894022L468906r437447j0826024n32247Q239870J0049498R694475Q319886
3837B1870939K872959k991812k166508K609946J830567m876615q357059n378130
3829E414287k137692j425942J330687O387251N750614l681238j2181756r155810
3821i699599K652229J1029531R042726Q63357n418721o509298n073964m598889
3813g712628m884860l258804O58136L566455K449332j939187o147824o768945
3805b4038325k186339N563398J0557207Q169889J074516l598463l440342k584803
3797a0483262l636666l276601J619431P887392R176800K979078o392685j0102899
$$ y = [-11783663, -25774649, -31564206, -26723744, -17998677, -14747628, -14816305, -8535050, 2894022, 6362928, -3074519, -13900543, -14432790, -6192920, 3856578, 13551053, 21870939, 24743898, 21752086, 19585578, 22195524, 24026091, 19149476, 10792417, 5414287, 3276595, 1850653, 3181340, 9568591, 15319205, 11637967, -543789, -9699599, -7047370, 3982161, 13024887, 13888244, 8469523, 1960225, -3113739, -7712628, -12597488, -15856292, -15198156, -11631701, -9182369, -11121556, -17269380, -24038325, -26224664, -20661266, -10104059, -1934170, -859654, -4458117, -7898459, -10483262, -14119928, -17396529, -15777098, -7889706, 1287094, 4266172, -2126513, -12229412]
3789a2229412k112521J1965771J6956339N811167q634890r256564J350500N541742
3781I392132j766592o155447K280841J3912008J5650226Q382876L35727m509440
3773C7522331l463078O261926J6944964J2269993q853336k4150462j7378663k749928
3765A6403747l431102j7000463k1813296j0274290M411674J0868752R900583L806539
3757g127856o830034j5211034j2749879k482422M890136P195250R589049J0001417
3749a2725373K356271o637384k340750J3506626K0928557R601975o966351j2130293
3741E593278p362571m358112o553540p753751l096418N315790J0710774P626970
3733A22420j043917m923942M38820N437660J57577r286104r890815k050942L488829
$$ y = [-12229412, -14341933, -2376162, 14580177, 20391344, 11756454, 2499890, 3850390, 9392132, 7625540, 1470093, 3750934, 17662942, 33313168, 41696044, 42031771, 37522331, 34059253, 40321179, 57266143, 69536136, 60682800, 36532338, 19153675, 16403747, 12972645, -4027818, -25841114, -36115404, -31703730, -20834978, -10934395, -7127856, -13957890, -29168924, -41918803, -44401225, -39511089, -32315839, -22726790, -12725373, -10369102, -17006486, -19347236, -5840610, 15087947, 24689922, 17723571, 5593278, -1769293, -6127405, -12680945, -20434696, -23531114, -18215324, -7504550, 122420, -921497, -5845439, -5406619, 31041, 188618, -9097486, -18988301, -21039243, -17550414]
3724a7550414M335697N668262M814172m106666j2523026o179188Q546624J0880027
3716f114512M19689q26547J2595647J7302431M12626j6545662j1844186K345528
3708b254986K899091o704836p191082K370526P139807L977704K022957J947988
3700D207169k735714p640424j933848J1057927J6390699R586294M4846n564640
3692B3412309q168878p638829m339681n458041j4489903j9448935q410446Q564348
3684c5978056J2074452L297083O7163O210834Q396144L456249L703231J0936023
3676A2163123J0019267l485646j2242707m754646O234098N643648j561276l772770
3668H243091k866041o045138j0260866r130834m971669j465985M898180J4102064
$$ y = [-17550414, -13214717, -7546455, -2732283, -6838949, -19361975, -25541163, -16994539, -6114512, -5694823, -6521370, 6074277, 23376708, 23789334, 7243672, -4600514, -2254986, 644105, -6060731, -13251813, -10881287, -3741480, 236224, 2259181, 4207169, 1471455, -6168969, -8102817, 2955110, 19345809, 28932103, 28976949, 23412309, 15243431, 7604602, 3264921, -2193120, -16683023, -36131958, -44542404, -35978056, -23903604, -20606521, -20539358, -14328524, -5932380, -2476131, 1227100, 12163123, 22182390, 18696744, 6454037, 1699391, 7933489, 13577137, 12015861, 8243091, 5377050, -668088, -10928954, -20059788, -25031457, -26497442, -21599262, -7497198]
3660g497198J5468323M952556k868838L645688J1451875K297135j5480681j7816173
3652e847313k877457O700226L72378o449388j873200K502280n581656j4981242
3644b8035372q189290R320289J6572258Q667376J607512N326537R924872M567495
3636A9761677m892181p264184m210800m454601o515660j796221P198289P174578
3628E000897m304767j1765848l920457Q846149R459571k079375j1819916j2586520
3620b3170266q662255l513351L608643R838457J0198676P128340O672826N646669
3612G747739l736135j6045655j5778484j923818P919769M813950J616057P684659
3604g701918R232667o683245k3416704j4592400J3944950K8117420J3058831p526661
$$ y = [-7497198, 7971125, 12923681, 10054843, 13700531, 25152406, 27449541, 11968860, -5847313, -8724770, -2024544, -1652166, -8101554, -9974754, -7472474, -13054130, -28035372, -36224662, -26904373, -10332115, -1664739, -57227, 5269310, 15194182, 19761677, 14869496, 7605312, 3394512, -1060089, -7575749, -9371970, -2173681, 5000897, 696130, -11069718, -14990175, -6144026, 3315545, 1236170, -10583746, -23170266, -31832521, -35345872, -31737229, -21898772, -11700096, -4571756, 2101070, 7747739, 4011604, -12034051, -27812535, -29736353, -21816584, -17002634, -15386577, -7701918, 1530749, -5152496, -28569200, -43161600, -29216650, -1099230, 11959601, 4432940]
3596D432940p565357O250773R455040m017162j7333296j6188327l745530Q592887
3588b0118032J3416983R181771m37430o306922q82032J0574147J2652659p49752
3580A7331392j5461527j3742577J541428J0444496M224316k849609L161713J2751327
3572A7400959P143986j1023355j9192874p878848N754361M542536m063785k638990
3564i956010Q152118J2216775L681359o265028q190434n833505n269008m685157
3556a6148890j286123M81920m159987r932960o334098P626651J9714593J7880225
3548G841331M534280n804928l272285O041367Q556164R56590o418398m893399
3540G540722J004671K164157j030806j284249K078151J756855m519365q395184
$$ y = [4432940, -3132417, 3118356, 12573396, 8556234, -8777062, -24965389, -28710919, -20118032, -6701049, 2480722, 2043292, -4263630, -5145662, 5428485, 18081144, 17331392, 1869865, -11872712, -10331284, 113212, 4337528, 1487919, 4649632, 17400959, 24544945, 13521590, -5671284, -13550132, -7795771, -3253235, -7317020, -9956010, -1803892, 10412883, 14094242, 7829214, -361220, -6194725, -11463733, -16148890, -17435013, -16953093, -21113080, -31046040, -37380138, -29753487, -10038894, 7841331, 12375611, 6570683, 3298398, 9339765, 17895929, 18852519, 12434121, 7540722, 8545393, 10709550, 9678744, 8394495, 10472646, 12229501, 7710136, -685048]
3532f85048k544377P944009J1605494N447153k039231l151197j092107l721337
3524A1763359r812151q988167J940339J0433664M452079q038284q589141L864812
3516b973490J0551220K474608n046276J528684R913404K367681j2094277j0078033
3508c356479O721061J1858796k559717j0663062N908119K5204813J5354528j7086903
3500C1381156l4913718k1438728J078467P171533q3586l344654N00574K379311
3492a7269645J794580O989197J6005502J4872935m00484j3959129j1231366M10577
3484b787833L703962l194918p655270m962404l324840n662685l367513O305094
3476b0946407J2569146R566566P392638J2792238J3364600k522149k1766907k2553640
$$ y = [-685048, -3229425, 4714584, 16320078, 21767231, 19728000, 16576803, 15484696, 11763359, 1951208, -7036959, -5096620, 5337044, 9789123, 1750839, -6838302, -2973490, 7577730, 10052338, 5006062, 6534746, 16448150, 18815831, 6721554, -3356479, 3364582, 15223378, 12663661, 2000599, 7908718, 33113531, 48468059, 31381156, -3532562, -24971290, -23892823, -16721290, -16804876, -20149530, -19648956, -17269645, -15475065, -8485868, 7519634, 22392569, 21992085, 8032956, -3198410, -2787833, 916129, -2278789, -9934059, -14896463, -18221303, -23883988, -27251501, -20946407, -8377261, 1189305, 8581943, 21374181, 34738781, 32216632, 10449725, -12103915]
3468a2103915p034017L206020K38648m058427l939112p615202j4958904j1323792
3460e7588701O541321J8966667J0660713p037086j4604327j0570361n205126r14319
3452e9751219N411392J0441479J0319804J0739844J6505765J8336410N632235
3445A7635710j2875458j7114500k246521J6135617K2060985J3254438k441301
3438C4408970j3690351j1258941K164362J0340497K119483j1818606j2333318
3431f7904J580976J2496146Q839364l603245j3804816j6508714j0807261M71018
3423b1404436Q782456P249772L33254k524285o81889R3786j01139K214844L010980
3414c026657l015473q209446p09187J3541384J5366173J72064j6355735k2167926
$$ y = [-12103915, -19137932, -15931912, -15693264, -19751691, -23690803, -31306005, -46264909, -57588701, -51047380, -32080713, -21420000, -28457086, -43061413, -53631774, -58836900, -59751219, -54339827, -43898348, -33578544, -22838700, -6332935, 12003475, 17635710, 4760252, -12354248, -14600769, 1534848, 23595833, 36850271, 34408970, 20718619, 9459678, 11624040, 21964537, 24084020, 12265414, -67904, 1513072, 14009218, 22848582, 19245337, 5440521, -11068193, -21875454, -21404436, -12621980, -5372208, -5038954, -7563239, -8245128, -8151342, -8252481, -6037637, -3026657, -6042130, -14251576, -14960763, -1419379, 13946794, 14118858, -2236877, -24404803]
3406b4404803k0052093j2594412K971270J9024087J8388754R63922j0040509j50032
3398b5893816J6298822K0511542J5045260J0325954L666704r302171j7366435
3391A3285860r096163N264407P689499l37490l937128n77624K12914l091919l903057
3382E509299k935748n068629n441366K351416R149284K022593j0934918j0372026
3374a5720095J953130N341208m390984p902019L658001J3416513P873337j947022
3366B282069j958973K374877N10319k818563J330816P714276O428885P03652q27717
3357A5739641j032048p364570j4768775j1900340o14599O226507M898172M464809
3349d351203R585477J2630413O781369k501498m825962P33240L556026n535356
$$ y = [-24404803, -44456896, -57051308, -54080038, -35055951, -16667197, -15703275, -25743784, -25893816, -9594994, 10916548, 25961808, 36287762, 39954466, 30652295, 13285860, 4189697, 9454104, 17143603, 16806113, 12868985, 12291361, 12504275, 9412356, 5509299, 2573551, -2495078, -7936444, -5585028, 3564256, 5586849, -5348069, -15720095, -13766965, -8425757, -12816741, -20718760, -17060759, -3644246, 4229091, 2282069, 323096, 2697973, 3208292, 389729, 1720545, 9434821, 15863706, 16567358, 15739641, 14707593, 7343023, -7425752, -19326092, -19940691, -13714184, -8816012, -4351203, 5234274, 17864687, 24646056, 22144558, 17318596, 18051836, 21607862, 16072506]
3341A6072506k0565653k3624998o156049J6555488K1336175O535957o664987m316838
3333h28399L490503K382925m462403n572875m84909L509061M983486N535400J353301
3324I906090q603401j3528790m847920P367262Q353593K790522N875048J4352206
3316B1664610R080826j1642686k3849464j1135990J1969683K0645677J0252843
3309B6985499m585333j0881071o873558J680821O110249J359547o654829p027651
3301A13674n33965J50528q188438j1104371Q02369J4003164J1224358j282773
3293E184546l250425P928034J4062148N121100o853252q301003l158688j978246
3285H754214l918572j905636J563450k173744j0569450r562220N704634K0669703
$$ y = [16072506, -4493147, -28118145, -34274194, -17718706, 3617469, 10153426, 3488439, -828399, 2662104, 5045029, 582626, -4990249, -5475158, -1966097, 3017389, 8552789, 9906090, 1302689, -12226101, -17074021, -9706759, -1353166, 1437356, 7312404, 21664610, 30745436, 19102750, -4746714, -15882704, -3913021, 16732656, 26985499, 22400166, 11519095, 4645537, 6326358, 12436607, 13796154, 7141325, 113674, -420291, -269763, -8458201, -19562572, -18760203, -4757039, 6467319, 5184546, 1934121, 9862155, 23924303, 29045403, 22192151, 13891148, 10732460, 8754214, 4835642, 2930006, 4493456, 2319712, -8249738, -17811958, -12107324, 8562379]
3277H562379J9102018L870914r033364j2740244j4263174j7161575j2678799M540021
3269b9801824K1486500J9843366J460623j1188038k910824J4981887J9556245
3262C3427935M943182j1897275j3484408k219105N911397L350435j700680q97310
3254A7434171Q83548m464847j1465723o702193R698625K1234826J6710228K910109
3246D6238744q734599j5678374j8165306j3160340m023971l162602j2779619j5780826
3238d5246893r00490J5831204J3769707M99763j373368P989136Q501735k559763
3230c488969o105709L116141O668782k998729o981340O606728J8964593R298174
3222B5079671j2593313k2244498j4085366r00799P452831Q089071j10465j0114223
$$ y = [8562379, 27664397, 31535311, 22501947, 9761703, -4501471, -21663046, -34341845, -29801824, -8315324, 11528042, 12988665, 1800627, -1110197, 13871690, 33427935, 38371117, 26473842, 12989434, 10770329, 16681726, 20032161, 18331481, 17434171, 18317719, 13852872, 2387149, -4315044, 5383581, 26618407, 43328635, 46238744, 37504145, 21825771, 3660465, -9499875, -13523846, -16686448, -29466067, -45246893, -46147383, -30316179, -16546472, -16046709, -17420077, -9430941, -929206, -3488969, -9594678, -6478537, 190245, -2808484, -9789824, -3183096, 15781497, 25079671, 12486358, -9758140, -23843506, -24744305, -17291474, -9202403, -9312868, -19427091]
3214a9427091p376689Q197990J4805077l81752j8061096j4235544L578994J0473532
3206b2426579K421022m652279m833819m785009k512472R252322K1329270J6438462
3198A0230918j017248r088179k962271M62788m735652l505259J0366077J9953113
3190A9704287J1841718l942425j2110983j2217523r916394m798982K263177M316667
3182d860458N92363P8763N076108N792999r91028l709311M352797J2529654J0075614
3173B8937501J928986k752913m272033n106280k494348K597427K869408q84027
3165B0823721J554427Q794075M910439j1296281j6068953L223909K2557888J4245669
3157D8744894j1377143k2804432j3546449m159654n480616p701013m834556m636187
$$ y = [-19427091, -26803780, -18605790, -3800713, -4182465, -22243561, -36479105, -32900111, -22426579, -20005557, -24657836, -29491655, -34276664, -36789136, -27536814, -6207544, 10230918, 9213670, 125491, -2836780, -2373992, -7109644, -10614903, -248826, 19704287, 31546005, 27603580, 15492597, 3275074, -6641320, -11440302, -9177125, -4860458, -4268095, -4189332, 886776, 6679775, 5688747, 1979436, 6332233, 18861887, 28937501, 30866487, 28113574, 23841541, 18735261, 16240913, 18838340, 21707748, 20823721, 22378148, 31172223, 36082662, 24786381, 8717428, 11941337, 34499225, 48744894, 37367751, 14563319, 1016870, -3142784, -8623400, -16324413, -21158969, -25795156]
3149b5795156j0389691j2908615n833210N766045J4919923J8725350J4911564
3142f03790M859733j477869L239136R909442M382850r883638j6105422r389534
3134a5069092j088964J635224L196892N001201J130331p109522q461941L30083
3126b0435788P600765M319483l260480n001251q58554K625912J651838l638736
3118a6996811j0221809j1786802m300144P099028J4145306J6928407J9715432
3111A4582607J8368114O111242q966258r395791N054788J3261093K490653j3213544
3103B8292904j4624071m343370O07749n262340j0660778n160991P984952J6903310
3095A3737365J3751594J957392p913935j0051402q467524p149606j727774J0165051
$$ y = [-25795156, -36184847, -49093462, -54926672, -49160627, -34240704, -15515354, -603790, 4255943, 2778074, 6017210, 15926652, 20309502, 10425864, -5679558, -15069092, -16158056, -14522832, -11325940, -6324739, -5194408, -12303930, -20765871, -20435788, -12835023, -8515540, -11776020, -16777271, -17635825, -15009913, -13358075, -16996811, -27218620, -39005422, -43305566, -36206538, -22061232, -5132825, 14582607, 32950721, 39061963, 30095705, 20699914, 25754702, 39015795, 41506448, 28292904, 13668833, 9325463, 9933212, 4670872, -5989906, -11150897, -3165945, 13737365, 27488959, 29446351, 21532416, 11481014, 3013490, -4136116, -5863890, 4301161]
3087D301161J7008725O774130j0981351j4275082o76875R115485L791823l300228
3079A1757788o44059L63445j3105028k8525879k2987098K889276K4584752K4748333
3071i18470R939037l194410o638140m371112m352506q607777r551560J97625J3780474
3062a3716839J5170644K223225p047343M43976J2703939R662145q221199k2198201
3054a0979653k0821886r653832J709213R376535J2607158J2503438J3408507J6821128
3046B4970608J5161605J071736j7868179k4077188j1489038O253144J2020401
3039F043089L497459p584610r988062l381029M208140O782218O130132O177876
3031A1885213N342562K06862n753089n987193k733642m030066p771178k252720
$$ y = [4301161, 21309886, 28084016, 17102665, 2827583, 2150708, 11266193, 15058016, 11757788, 11113729, 11477174, -1627854, -30153733, -53140831, -50251555, -25666803, -918470, 9020567, 5826157, -811983, -5183095, -9535601, -18143378, -27694938, -27497313, -13716839, 1453805, 3677030, -3370313, -2926337, 9777602, 19439747, 11218548, -10979653, -31801539, -41455371, -39746158, -30369623, -17762465, -5259027, 8149480, 24970608, 40132213, 41203949, 23335770, -741418, -12230456, -5977312, 6043089, 9540548, 1955938, -8032124, -11413153, -7205013, -422795, 5707337, 11885213, 17227775, 17434637, 11681548, 5694355, 2960713, -1069353, -8840531, -11093251]
3023a1093251J3016637K1622856J3291575j287843q717996j1843735j7313406
3016b325163j7918200n046979J0999938J2516617P22189p491720n247326n71192
3008a4361836J423622L289359L465936k375598p896351j667911J1750052J3542733
3000G170006k254063j8847730j9454510o752574N897930J0838105Q224514K010721
2992a3167601j160900K731396Q265228P185681J911114K173754Q503296J1095407
2984B7537375N465763l298747j1677207j9061574j8769321m941681J0714468Q849141
2976e181783p346310j3467051j964653M914596p756146k1532456j4554676K833663
2968f4054816O707296o69939K761601J9494736K7023039J3069611o763252j2572489
$$ y = [-11093251, 1923386, 23546242, 36837817, 35549974, 26831978, 14988243, -2325163, -20243363, -25290342, -14290404, -1773787, -1051598, -8543318, -13790644, -14361836, -12938214, -9648855, -6182919, -8558517, -16454868, -18122779, -6372727, 7170006, 4915943, -13931787, -33386297, -40138871, -34240941, -23402836, -15178322, -13167601, -14328501, -11597105, -3331877, 3853804, 5764918, 7938672, 16441968, 27537375, 33003138, 29704391, 18027184, -1034390, -19803711, -24745392, -14030924, -5181783, -12528093, -25995144, -27959797, -23045201, -30801347, -52333803, -66888479, -64054816, -57347520, -58017459, -55255858, -35761122, -8738083, 4331528, -2431724, -15004213]
2960a5004213m213704N408853Q400048N653398Q27979k864027l576263j497979
2952f865908K808689Q777437J2132231O529550n570124j0807537k424049P359596
2944A1939885M205535n811502o141099K032257J106949j1879247j6238523J310606
2936a9475139K3600879K5046753N755518j1669971j3529560p745503n893426o783935
2928a0694384l202341M080779O838379J232778o631338p803823o14230P695598
2920i098582R079032L484066j253623J649926R940192J3989112O412546j0083012
2912B4119657k4254605k5815074j4066728K161778J2689986J4070549J0378263
2905g16174P408746O934521O304274K725613k864854o434465m927087O42060N549206
$$ y = [-15004213, -19217917, -13809064, -5409016, 244382, 1072361, -1791666, -5367929, -6865908, -4057219, 4720218, 16852449, 23381999, 17811875, 7004338, 4580289, 11939885, 16145420, 10333918, 4192819, 6225076, 7332025, -4547222, -20785745, -19475139, 4125740, 29172493, 34928011, 23258040, 9728480, 1982977, -3910449, -10694384, -13896725, -9815946, -2977567, -1744789, -8376127, -16179950, -16794180, -9098582, -19550, 3464516, 2210893, 3860819, 13801011, 27790123, 34202669, 24119657, -134948, -25950022, -40016750, -37854972, -25164986, -11094437, -716174, 6692572, 13627093, 19931367, 22656980, 19792126, 13357661, 8430574, 9072634, 14621840]
2896A4621840M570617l103416j0375461o814621Q425441K0785084J5495651j759360
2888D1845775j0345572l827584K92454j0766558k1110663q890414J6016366K1117657
2880B4331461j491077k1508091j3165699R405991J5484280J407378r554067m353577
2872E56599L997033M35265r016395p711821O179417J5821885P873928r192635
2864H943276j5099849l625761J0383690J2553311P304654N999222O233506j961263
2856C0730786j4273949j5124459l167913M948664P73841m279374p01858L765325
2848B671063R79815k397760M09887J936339m112443p336143K027650J2511129
2840F689537P684395o381550j0472840k541025K261712j596958l486700L357729
$$ y = [14621840, 19192457, 16089041, 5713580, -1101041, 7324400, 28109484, 43605135, 41845775, 31500203, 27672619, 27965073, 17198515, -3912148, -12802562, 3213804, 24331461, 22840384, 1332293, -11833406, -2427415, 13056865, 14464243, 4910176, 556599, 4553632, 4988897, -4027498, -11739319, -5559902, 10261983, 18135911, 8943276, -6156573, -9782334, 601356, 13154667, 20459321, 26458543, 32692049, 30730786, 16456837, 1332378, -1835535, 3113129, 3886970, -392404, -1094262, 2671063, 3650878, 1253118, 1663005, 3599344, -513099, -7849242, -5821592, 6689537, 14373932, 7992382, -2480458, -5021483, -2759771, -4356729, -7843429, -4485700]
2832d485700J2793720J7410677J4832538L965876j0847096j5669673l291960J0408740
2824B5117122N181011j2121295j6634209m684435J231506r518281j8377259q452834
2816c8258674R391943J5200322P924781O26371K05844M515107R870761J1257612
2808B0734067L837814p996754j2358863o514317q39104j107451n45434L938990
2800h51052L340370n858242j1016109k747457Q467159Q708786J602182j493842
2792A51795j058447l368954m632167J380916O851146o88933j5919939k0010372
2784c7294955p013608R037319J4906580J3108909J2699238J4793546J2134049
2777C2371078p36397j8631523k6953937j5900444N367422J6423807J0703524L065058
$$ y = [-4485700, 8308020, 25718697, 40551235, 44517111, 33670015, 18000342, 14708382, 25117122, 30298133, 18176838, 1542629, -3141806, -1910300, -11428581, -29805840, -38258674, -28866731, -13666409, -5741628, -5115257, -4909413, -394306, 9476455, 20734067, 24571881, 16575127, 4216264, -2298053, -3137157, -4244608, -4790042, -851052, 2489318, -3368924, -14385033, -17132490, -8665331, 43455, 1645637, 151795, -906652, -4275606, -8907773, -7526857, -675711, -1364644, -17284583, -37294955, -44308563, -35271244, -20364664, -7255755, 5443483, 20237029, 32371078, 31634681, 13003158, -13950779, -29851223, -24483801, -8059994, 2643530, 5708588]
2769E708588O738961J4598130J2987414L094847m137719n724558n882595m782141
2761B2600927j527748j814202q764844j2454377l479433Q675323P124273o555901
2753C804018j4728576r595480k5396O047864Q863007O575281m233391j5130151
2745a8422824j0226604J0304784K5350737J8023471m941289k3350322k3665061
2738b6927108p118681J1743659J3947289m547057k2367247j5793441P610279J6272252
2730b7180055j176250j9227295j2270606J0558913K1655432J2351397k202244
2723a7490708p222875k007902O561762J1697005R229501R98711n634403o713132
2715a0582041o305128p913153p529990j301812O083941P936924N540330M400779
$$ y = [5708588, 12447549, 27045679, 40033093, 43127940, 38990221, 33265663, 27383068, 22600927, 21073179, 19258977, 10494133, -1960244, -5439677, 3235646, 10359919, 3804018, -10924558, -20520038, -20545434, -14497570, -5634563, 940718, -3292673, -18422824, -28649428, -18344644, 7006093, 25029564, 20088275, -3262047, -26927108, -34045789, -22302130, -8354841, -12901898, -35269145, -51062586, -43452307, -27180055, -28356305, -47583600, -59854206, -49295293, -27639861, -15288464, -17490708, -24713583, -26721485, -20159723, -8462718, 766783, 1765494, -3868909, -10582041, -16887169, -24800322, -32330312, -33632124, -27548183, -19611259, -14070929, -9670150]
2707i670150M609129K043013l526431p676413p318287l623066l51749n84347k489735
2698b8588036O29387J0767029J8057270J2318730r1134l830664J059537r07900
2690I414219j2444768j4920748J327436J6980181J1112308o019994q573143N604020
2682B479511J3816341L426214j3463964k1525132j9379422j0878678M045432K1862102
2674a9617596L0857562K3355055O358608o270911q520947n739750o538245j2919365
2666I64411j7056822r881629N119881J2559388N027669n073908k967502O379975
2658d928537P037203j894283n972537o26542J366876p675265j6620055j2707323
2650d2020463Q1215R302990J0957918Q801638N026468J303564K501394R476697
$$ y = [-9670150, -5061021, -3018008, -6544439, -14220852, -21539139, -25162205, -25513954, -26098301, -28588036, -27958649, -17191620, 865650, 13184380, 13093246, 9262582, 10322119, 9414219, -3030549, -17951297, -16623861, 356320, 11468628, 5448634, -3124509, 2479511, 16295852, 19722066, 6258102, -15267030, -34646452, -45525130, -41479698, -19617596, 11239966, 34595021, 40953629, 34682718, 26161771, 20422021, 13883776, 964411, -16092411, -25974040, -20854159, -8294771, -3267102, -8341010, -11308512, -4928537, 2108666, 214383, -5758154, -6384696, -5017820, -12693085, -29313140, -42020463, -41939248, -32636258, -21678340, -12876702, -7850234, -6546670, -4045276, 5431421]
2642E431421J3050033M839276r384777j6485315j3452500q252269m351145M205902
2634b4399374J8765570K6944958J6142755p500671k2673213j7181376j963924
2627a1865275L923665k646428q143936m114940J588877l99165n572985m348353
2619c1578540J305261K244350r81909P20551P712351R418390J915621n269063
2611a4512988m699306j476783j691918j395188M293442R910258P286300j544973
2603c831156p894343p883643k579577P450753J8445993J9687579M994338j4334295
2595A4055649j9628395q247901L572443L174905l329558l050958M774257R719101
2587A039543O317486Q98552Q16000L032502q45198r863764j1898172o13389J2525447
$$ y = [5431421, 18481454, 23320730, 13935953, -2549362, -16001862, -24254131, -28605276, -24399374, -5633804, 21311154, 37453909, 29953238, 7280025, -9901351, -11865275, -7941610, -10588038, -18731974, -22846914, -21258037, -21657202, -27230187, -31578540, -30273279, -28028929, -29010838, -28290287, -20577936, -11159546, -9243925, -14512988, -19212294, -20689077, -22380995, -23776183, -19482741, -9572483, -2286183, -3831156, -11725499, -19609142, -22188719, -14737966, 3708027, 23395606, 28389944, 14055649, -5572746, -13820647, -10248204, -7073299, -10402857, -13453815, -8679558, 1039543, 7357029, 8255581, 9071581, 12104083, 11258885, 1395121, -10503051, -11116440, 1409007]
2578A409007J2195879J492448k112038O431860J1383863M82568j6310809k2864868
2570g892090j9813592j7224020j3648451o48563J6117990K0215909J0288980L966324
2562h637513J0326284J5465752N254984j1545970j6144258o676949J775875M9493
2554a0132302n292114n278119j403931j397654p035634j0127952j628596J4783041
2546b7513261K1746637P710048j3948643j6794469M142179K3080838J7688798
2539A6112127p79314o579688K203742N673058k602435p402264j756932M14373
2531E282667q273608j2337581j133713Q065802k363941j6563597q097802J3746968
2523b1674805J4980432p753451k0669880r709781m216622k2610520l1586505L804103
$$ y = [1409007, 13604886, 15097334, 12985296, 19417156, 30801019, 31283587, 14972778, -7892090, -27705682, -44929702, -58578153, -59226716, -43108726, -22892817, -12603837, -8637513, 1688771, 17154523, 22409507, 10863537, -5280721, -11957670, -10181795, -10132302, -15424416, -20702535, -22106466, -23504120, -30539754, -40667706, -42296302, -27513261, -5766624, 1943424, -12005219, -28799688, -24657509, -1576671, 16112127, 15332813, 8753125, 10956867, 16629925, 14027490, 6625226, 4868294, 5282667, -2990941, -15328522, -16462235, -8396433, -10760374, -27323971, -35421773, -21674805, -6694373, -14447824, -35117704, -44827485, -49044107, -71654627, -103241132, -99437029]
2515i9437029N5007816O1445270J7587472j9362157j2816275Q608507O574599
2508A7608203r124344q282568N558739O897422l599648k430329J1490120J2690545
2500C0808140o356889k0263578j1150904M092113L341769o071417l114422J0685681
2492A970493J3769350j199998j5938677j2706250K259764Q941839K29022j0101893
2484a2776350o575056O948346J2356017L249988m356508M746314J9593471J5958840
2476C9145062p818986k5847432j9861271k291876N421239K526752K455863P419685
2468A149036P469637O79692l159687L2282K240240j818369n739072l164161J336591
2459i73811P00046k341593l11812N384324N525513j813265o164999N20210J0352731
$$ y = [-99437029, -44429213, 17016057, 34603529, 15241372, 2425097, 11033604, 17608203, 8483859, 201291, 5760030, 12657452, 9057804, 6627475, 18117595, 30808140, 24451251, 4187673, -6963231, -2871118, 470651, -5600766, -8715188, 1970493, 15739843, 14539845, -1398832, -14105082, -11845318, -2903479, -2674457, -12776350, -19351406, -12403060, -47043, 3202945, -1153563, 3592751, 23186222, 39145062, 31326076, 5478644, -14382627, -16674503, -11253264, -8726512, -6270649, 1149036, 8618673, 9298365, 6138678, 6170960, 8411200, 6592831, 853759, -2310402, -973811, -273765, -2615358, -2927170, 2457154, 7982667, 6169402, 4403, 524613, 10877344]
2450A0877344R093658l130287j1000787n995671J809684P91272l971855j632168
2442c158810L531609o56720r862592o754532Q660604J4147555k14468j3353145
2434g660499m615040J3143161J2547101o952541j9318913r645072Q988137J7060299
2426C546633J0095922l654003j3223420j0388807L499891J5049370J2815721K041791
2418A9783098m752123o882405j0954766j2585102k141513J2812709J2673804l391306
2410D562396j3035082l472863J1384221J4676880Q087922j35979r267027j6045309
2402c244841r327883J0196948K1624811J1477999n347544q972398l404388k876871
2394A0125833m548747J843685R255910M344377n046000p25178J2248609J1184151
$$ y = [10877344, 19971002, 16840715, 5839928, -155743, 1653941, 2445213, -1526642, -3158810, 372799, -283921, -10146513, -16901045, -8240441, 5907114, 5692646, -7660499, -12275539, 867622, 13414723, 6462182, -12856731, -22501803, -13513666, 3546633, 13642555, 9988552, -3234868, -13623675, -10123784, 4925586, 17741307, 19783098, 15030975, 8148570, -2806196, -15391298, -17532811, -4720102, 7953702, 4562396, -8472686, -11945549, -561328, 14115552, 22203474, 22067495, 12800468, -3244841, -12572724, -2375776, 19249035, 30727034, 25379490, 16407092, 13002704, 10125833, 5577086, 7420771, 16676681, 21021058, 15975058, 15249880, 27498489, 38682640]
2386C8682640n875967j6210928j0134706m006859p807054p563554O611944J9416875
2378A3112391J4601746Q99960m785820m284233q635478j4138929r038313L132385
2370i136291O992587p14317p684810n810703J61082L889183M768466L319207J19506
2361d096090k35095N813386J1839865Q210149j631059l399604O434328J2930319
2353C5866199L212742j4405546k1190811j2912588l787152n765931j3019581j1520736
2345d3523404J306882J3381434J3645452M576835l264908l945073Q02900O963148
2337a0056734J0736044Q435071N91970n419886l556202J849361K788485R25829
2329F293938L819905R019911N473297o829642j3153833n979706L287111L231290
$$ y = [38682640, 32806673, 16595745, 6461039, 2454180, -5352874, -12916428, -6304484, 13112391, 27714137, 28614097, 23828277, 19544044, 10908566, -3230363, -12268676, -9136291, -2143704, -2858021, -10542831, -16353534, -16192452, -12303269, -7534803, -4215596, -4096090, -4331185, 1482201, 13322066, 21532215, 19901156, 16501552, 22935880, 35866199, 39078941, 24673395, 3482584, -9430004, -13217156, -18983087, -32002668, -43523404, -42216522, -28835088, -15189636, -10612801, -13877709, -17822782, -17019882, -10056734, 679310, 9114381, 9706351, 4286465, 730263, 2579624, 5368109, 6293938, 10113843, 19133754, 24607051, 17777409, 4623576, -1356130, 1930981, 5162271]
2321E162271m42670J652531M435519j249362r526807p872895J248714M285254
2313b307445j319141n825526n920635p237272q434187j186641J1334552J4381697
2305f514598N493433P84627R404554J8618072J5234185O145957L122929O10812
2297E2899971j2749853k8717744k6329644l473918J6423332J3614263n186592
2290F479815j8765495j6117254k751319J0304980J5961200J2385188J651310j1116077
2282a967652j9113684j6811803m665059Q125423J0065425J042232m199391O700774
2274b0823735K5109306K9536553J3698472m094957n519253L248494K544816j0657884
2266C3041812j8475259r764338K546449Q90800j0509000j2485937q0616J0485383
$$ y = [5162271, 4719601, 6372132, 10807651, 9558289, 31482, -7841413, -6592699, -2307445, -3626586, -9452112, -15372747, -22610019, -31044206, -32230847, -20896295, -6514598, -1021165, -236538, 9168016, 27786088, 43020273, 49166230, 52289159, 52899971, 40150118, 11432374, -14897270, -18371188, -1947856, 11666407, 6479815, -12285680, -28402934, -31154253, -20849273, -4888073, 7497115, 9148425, -1967652, -21081336, -37893139, -42558198, -34432775, -24367350, -23325118, -27524509, -20823735, 4285571, 33822124, 47520596, 43425639, 37906386, 41154880, 43699696, 33041812, 14566553, 4802215, 7348664, 8239464, -2269536, -14755473, -14836089, -4350706]
2258d350706O239097m861732p557352r6926P687848R529260N989299j764539j0684809
2249A29440j2213918j415046J2061884J3480777K926297n654450n333603l296697
2241F84684m836914m116464K908252Q420822M459783m091880p115486l144779
2233f831982K435722P014107J0488153J0439107N319343j279298n229736o053966
2225A6301450k467349Q032772J9075169J5379981o827675k8398830k8873469j2290433
2217b0068384J895967O350338Q185230R661621O086424J338876N270126J3497057
2209C2217255R542973p828164j8620033j0971602J394865J787530n458815o461491
2201d397482M09687Q141527J4740851J8834126J2517415n267656j7543905r388655
$$ y = [-4350706, 1888391, -2973341, -10530693, -10627619, -2939771, 6589489, 12578788, 10814249, 129440, -12084478, -13499524, -1437640, 12043137, 14969434, 9314984, 3981381, 684684, -4152230, -8268694, -5360442, 3060380, 7520163, 3428283, -3687203, -6831982, -4396260, 2617847, 13106000, 23545107, 28864450, 27585152, 22355416, 16301450, 13834101, 21866873, 40942042, 56322023, 49494348, 21095518, -7777951, -20068384, -18172417, -11822079, -3636849, 6024772, 12111196, 13450072, 18720198, 32217255, 41760228, 33932064, 15312031, 4340429, 5735294, 7522824, 2064009, -4397482, -3987795, 4153732, 18894583, 37728709, 50246124, 44978468, 27434563, 18045908]
2193A8045908P728978J0663240j253484p487625p4495O156773O19903p134102
2185B7265096o961125n097421r604103j3401463o107664O933732J1720507N964337
2177A0711896l43047j408556j155142l252277n255019l714551R69727N203607
2169A756638M415911k837700r726809n495570R219383J7658247O883620j1981068
2161I892652j5311727K195769K0489805K0304291N209554p395616q073134j379298
2153B5932296L258238k58737j0984993j9340732j3836766L963187J5845347P173145
2145A1750985j2067992j7332523j499196J4655403R694577j0116357j9640425
2138b4555528p326682J2755659K1539644J6362949O896235j072817q571277j4529042
$$ y = [18045908, 25774886, 36438126, 35184642, 27697017, 27622522, 33779295, 34399198, 27265096, 20303971, 15206550, 5602447, -7799016, -13906680, -6972948, 4747559, 10711896, 10368849, 8960293, 7805151, 4552874, -702145, -4416696, -3446969, 1756638, 6172549, 3334849, -6391960, -11887530, -2668147, 14990100, 21873720, 9892652, -5419075, -3223306, 17266499, 37570790, 42780344, 35384728, 27311594, 25932296, 29190534, 28931797, 17946804, -1393928, -15230694, -11267507, 4577840, 11750985, -317007, -17649530, -19148726, -4493323, 5201254, -4915103, -24555528, -31882210, -19126551, 2413093, 18776042, 25672277, 24599460, 16028183, 1499141]
2130A499141j4125559o591685K719022R269077J2213924J0166478K343213m273049
2122A3220562O70164J3523786J4362134o805371k9576794k4881865M963226K5797207
2114A1273049J5985909n686309q329023P849535J5160142Q96824j4597358q763111
2106A3789658J0679240J8256166P375580l140651K49490N654114m188521k3564520
2098B5110556l0634957j8167865j276256O588528R033159J2001412R815191j476512
2090A0993256r467240j433348J2434093J1164453m440122j1872494j441163J0068919
2082A6006354P329237j414814k119734J640806j106698o998235m449506N320511
2074A4207921J0052535N750493l80033l908288o547914p304383l295719J690775
$$ y = [1499141, -12626418, -19218103, -16499081, -7230004, 4983920, 15150398, 17493611, 13220562, 13890726, 27414512, 41776646, 34971275, 5394481, -19487384, -14524158, 11273049, 27258958, 21572649, 13243626, 21093161, 36253303, 37150127, 22552769, 13789658, 24468898, 42725064, 50100644, 46959993, 47209483, 52863597, 48675076, 25110556, -5524401, -23692266, -24968522, -18379994, -9346835, 2654577, 12469768, 10993256, 1526016, 92668, 12526761, 23691214, 19251092, 7378598, 5937435, 16006354, 23335591, 21920777, 19801043, 21441849, 20335151, 13336916, 8887410, 14207921, 24260456, 30010949, 29630916, 25722628, 19174714, 11870331, 8574612, 10265387]
2066A0265387J780503M62484M294907P191478k902137k0876563k5667702r913289
2058c5364932P670533Q063912l260927p690920M59659J0201207J0045614p99198
2050a0675052j3097617j4081697R19482J9156017K0766058L555925j1714245p617398
2042a2788527P952992J5032344P987916k357518o322321l338383L405735R443198
2034A9015436R149334K660052j021345L176152N815284l426334j6511001j6033385
2026B824193j834050P195533N06496r811000q573416J105315N733501K542689
2018c10739J134568O549317J1154120O439248l525215o865808j244400J131490
2010A4462581q662972j9185521j1179222J2674456K5171583R318470j6949878
$$ y = [10265387, 12045890, 12508374, 16803281, 23994759, 21092622, 216059, -25451643, -35364932, -27694399, -19630487, -22891414, -30582334, -30122675, -19921468, -9875854, -10675052, -23772669, -37854366, -36934884, -17778867, 2987191, 6543116, -5171129, -12788527, -4835535, 10196809, 18184725, 15827207, 9504886, 6166503, 9572238, 19015436, 28164770, 30824822, 29803477, 32979629, 38794913, 35368579, 18857578, 2824193, 990143, 8185676, 8692172, -1118828, -9692244, -8586929, -2853428, -310739, 823829, 7373146, 18527266, 24966514, 21441299, 14575491, 13331091, 14462581, 5799609, -13385912, -24565134, -11890678, 13280905, 22599375, 5649497]
2003E649497k3234201m958905J5437142J9866717J1170559O87452m660017j960769
1995A7997475O637957J0411710M42261j4975925j8559873q788411j061603j722278
1987i618687P35963J1525031J5575704R67897j8493040k0706660n916070O555897
1979a9373965O674091K861857M433484Q956281R437967M662607p57729j961087
1971A4933506J518824M781052L146097r02675j760776j642694p519719j5020218
1963b466603r498609R689432K1471484J2253715j769644Q26969J2349831R282481
1955E2139056p937520j5864689q024091m788171j5632628j9374325J033231K5586603
1947G137466K2367470o239706k6350294j8158087K732156J2215524P611464K147794
$$ y = [5649497, -17584704, -22543609, -7106467, 12760250, 23930809, 24618261, 19958244, 17997475, 24635432, 35047142, 35489403, 20513478, 1953605, -6834806, -7896409, -9618687, -8882724, 2642307, 18218011, 19185908, 692868, -20013792, -25929862, -19373965, -12699874, -9838017, -5404533, 3551748, 12989715, 17652322, 16894593, 14933506, 16452330, 21233382, 24379479, 23476804, 21716028, 20073334, 12553615, -2466603, -11965212, -2275780, 19195704, 31449419, 29679775, 30506744, 42856575, 52139056, 44201536, 28336847, 20312756, 15524585, -108043, -19482368, -18449137, 7137466, 29504936, 23265230, -3085064, -21243151, -18510995, -6295471, 1315993, 3463787]
1939C463787K227821K629139l99165l023351k266376j958016n407178p901580
1931a2634919l679950L039482L534400K42408M578782J5771297J6532334m88190
1923B6895644j6199265j1179997L111375J207421j4851101j7773048K83238J4242864
1915a4262869O731098n658163l741814J432184q260386k0872493j0993608J5981528
1907c9644523K8046596J4354202r83438J151618P987741M58892j5414035j9593387
1899b3636334p597701O933496J2338869R052981L705047K299903O342357J0061438
1891A9500056N709599m595693r082009k736294M785017L618817k579939m955737
1883I663817l228152k206842j928319r08120k288471o414504m547614P645043
$$ y = [3463787, 5691608, 8320747, 7921582, 4898231, 2631855, 673839, -4733339, -12634919, -16314869, -13275387, -9740987, -9498579, -4919797, 10851500, 27383834, 26895644, 10696379, -483618, 2627757, 3835178, -11015923, -28788971, -28505733, -14262869, -7531771, -13189934, -16931748, -15499564, -23759950, -44632443, -55626051, -39644523, -11597927, 2756275, 1772837, 2924455, 10912196, 11371088, -4042947, -23636334, -31234035, -24300539, -11961670, -2908689, 796358, 3096261, 9438618, 19500056, 25209655, 20613962, 11531953, 8795659, 13580676, 17199493, 14619554, 9663817, 6435665, 4228823, 2300504, 1392384, -896087, -7310591, -11858205, -4213162]
1875d213162J7238336J0217270m103995l317255J3593363K1816444O508795j5192080
1867D2547716j9275364q192673l997305j5228360k6070657j8919719L023031J9851271
1859b6262060J7429294K484964n472987K727230J4581176J2678105q15713o817115
1851A0532894L119031J4581384J1187424l890477j6219744k0139564j8844471
1844a9673523j1838998L194456J8337470J9316026M077869j2279894j4607914
1837a3474508l415437Q658064J1193150N372404J827125Q181522J7266541J3485330
1829D9094191m779655j8129451j1434148K493254J06105j7166819k4257203j0287993
1821c4361719N997742N976319k820680l083673M894394Q154068L597454q51541
$$ y = [-4213162, 13025174, 23242444, 19138449, 15821194, 29414557, 51231001, 57739796, 42547716, 23272352, 15079679, 11082374, -4145986, -30216643, -49136362, -46113331, -26262060, -8832766, -6347802, -11820789, -9093559, 5487617, 18165722, 17350009, 10532894, 13651925, 28233309, 39420733, 35530256, 19310512, -829052, -19673523, -31512521, -28318065, -9980595, 9335431, 13413300, 1133406, -13474508, -16889945, -8231881, 2961269, 8333673, 10160798, 18342320, 35608861, 49094191, 44314536, 26185085, 14750937, 17244191, 17350296, 183477, -24073726, -34361719, -28363977, -22387658, -25208338, -28292011, -23397617, -15243549, -11646095, -12497636]
1813a2497636k297254m892159q152501o766829j672750L91928j052223R00874
1805c6038550Q138191J3200572R910252J480929m104001k111621N567426J0816630
1797F859828N433259p618134j3212979k471280J2330374J2620062l0474p077748
1789F832908k238505J74411q740566j6196372q965885L836346N080773l256943
1781b3473833n366336J218809L082280l887407n407664Q299069K4665462K3893571
1773B3023951L741217j9455673k9117516k1087000l298107J0446454J0722146
1766b5024528K518583O08327R797308J6789741R421738m148860p655800j692637
1758F13872k09014m823168k200446R888485J4468922L036641p172008J102066
$$ y = [-12497636, -14794890, -19687049, -27839550, -34606379, -36279129, -35887201, -36939424, -36038550, -27900359, -14699787, -4789535, -3308606, -7412607, -9524228, -3956802, 6859828, 12293087, 4674953, -8538026, -11009306, 1321068, 13941130, 13910656, 6832908, 4594403, 4768814, -3971752, -20168124, -29134009, -25297663, -20216890, -23473833, -28840169, -27621360, -24539080, -28426487, -33834151, -25535082, -869620, 23023951, 26765168, 7309495, -21808021, -42895021, -46193128, -35746674, -25024528, -22505945, -21897618, -12100310, 4689431, 14111169, 9962309, 2306509, 613872, 404858, -4418310, -6618756, 3269729, 17738651, 20775292, 13603284, 14705350]
1750A4705350J6530196J5283661l543996j8882119j9174449j2466810o298922
1743a3847089J899405J1359389J3730832Q166178M702275O557052M501925m360055
1735C2709912q297612q11855O329378J617605p944157j0181253p436963q242638
1727b257583r397117k807395O833700Q083218K419385J719176P801507R749142
1719B2144033K303514o473065q190168l889132J756967O990436J0793952J0854628
1711C6291165O524940L97110l709146l081292J062990K673451j768856n355452
1703C3034910M05062R151596O514131m913546o983451K254123K830735r834164
1695C2459396j0713726J2366037L3019235L1019527K8975165M3024824L0682591
$$ y = [14705350, 31235546, 46519207, 42975211, 24093092, 4918643, -7548167, -13847089, -11947684, -588295, 13142537, 21308715, 26010990, 32568042, 37069967, 32709912, 24412300, 23600445, 29929823, 31547428, 23603271, 13422018, 5985055, -2257583, -11654700, -14462095, -7628395, 454823, 2874208, 4593384, 12394891, 22144033, 24447547, 17974482, 9784314, 5895182, 7652149, 14642585, 25436537, 36291165, 42816105, 43213215, 39504069, 36422777, 37485767, 40159218, 38390362, 33034910, 33439972, 42591568, 49105699, 44192153, 37208702, 39462825, 42293560, 32459396, 21745670, 34111707, 67130942, 98150469, 127125634, 170150458, 200833049]
1688B00833049m9364983j43798328j47955094m9344904M6441871N6701356J8174182
1681f8312851N073346J8033561J3855781m626251n79817K1492954K2022583j952518
1673E006788j3106397k43901P601116k252198p180623L253525P673188m985441
1665d233943j4791728q382690o68703k550714j233546R611465J2762638K35760
1657i251461p554802K809512J2011600K068475j0329766k450298J4618038J4934132
1649A6855430P924q102534m327213k099576m991429m189381l0316j301062n393711
1640a3571868j461572Q227798J0680001M470974J08681j24572k821980n587715
1632h0253N2869P737931J146632j6684319k1989076n743683J1237252R777556
$$ y = [200833049, 151468066, 7669738, -140285356, -189630260, -143188389, -86487033, -68312851, -63239505, -45205944, -31350163, -35976414, -36556231, -15063277, 6959306, 5006788, -8099609, -8343510, -742394, -2994592, -10175215, -6921690, 751498, -4233943, -19025671, -27408361, -28077064, -30627778, -31861324, -22249859, -9487221, -9251461, -16806263, -13996751, -1985151, 83324, -10246442, -12696740, 1921298, 16855430, 16863354, 8760820, 4433607, 2334031, -2657398, -6846779, -6877095, -8178157, -13571868, -15033440, -6805642, 3874359, 8345333, 8454014, 8329442, 5507462, -80253, -27384, 7710547, 8857179, -7827140, -29816216, -35559899, -24322647, -14545091]
1624a4545091r55762l090109P08774l064721j1313031q503911N662179J3519236
1616b1582436O686477j850685l2923L766051l908333j6064715j2230178R311289
1608c5905453K3434435J1295881j1386027j4926455K238785J2952908M325536
1601g970390k675006J0302867K4382998J0173745k2636167l3461140r340654J5552652
1593a5671095J0620309p979786o339198J4299706K2296248N804958j1329999p897028
1585C804115N362216O627922m602339j1925614q776530m303795n577450p796339
1577b7187814m006108M713688J1809183J2697084P984905K817277K866890P399943
1569A9095048P880862j522403j3632509j5145999l819276Q240580R908741K919349
$$ y = [-14545091, -15500853, -18590962, -17882188, -20946909, -32259940, -40763851, -35101672, -21582436, -14895959, -16746644, -16779567, -13013516, -16921849, -32986564, -45216742, -35905453, -12471018, -1175137, -12561164, -27487619, -25248834, -12295926, -7970390, -10645396, -342529, 24040469, 34214214, 11578047, -21883093, -31223747, -15671095, -5050786, -13030572, -19369770, -5070064, 17226184, 23031142, 11701143, 3804115, 9166331, 15794253, 11191914, -733700, -9510230, -13814025, -19391475, -27187814, -31193922, -26480234, -14671051, -1973967, 6010938, 8828215, 11695105, 19095048, 26975910, 25453507, 11820998, -3325001, -7144277, 1096303, 11005044, 13924393]
1561A3924393m121223p029001o981482m959006n69041N043019Q145794M457550
1553G911003o464137j6764764j4220831K865138J8237509J5172686n66942q081171
1545a911509j486603L569235k754961r481068o599326l167842q580273j2235053
1537d2647400j470630J3178999J3109730K688344R81821Q644746R063312J19194
1529C668116k352636N460288R039637M342961N709212J5877391J4909251o858984
1521D9795236k8622219k8935203j5273559n741665n37911P435190J0390793j567769
1513a3057107j7009107j6759599l641643L833469J854488K954753J0463399J3678251
1505a7683096R004372N636265P320928O196478r66865n694365k283083K781557
$$ y = [13924393, 9803170, 2774169, -4207313, -9166319, -9735360, -4692341, 3453453, 7911003, 1446866, -15317898, -29538729, -26673591, -8436082, 6736604, 6169662, -1911509, -3398112, 171123, -2583838, -12064906, -18664232, -21832074, -30412347, -42647400, -44118030, -30939031, -17829301, -15140957, -14159136, -5514390, 3548922, 3668116, 1315480, 6775768, 15815405, 20158366, 25867578, 41744969, 56654220, 49795236, 21173017, -7762186, -23035745, -28777410, -29315321, -21880131, -11489338, -13057107, -30066214, -46825813, -50467456, -46633987, -44779499, -41824746, -31361347, -17683096, -8678724, -3042459, 4278469, 10474947, 9508082, 3813717, 1530634, 4312191]
1497D312191J072476o845522j3910697j3435947l405437R715824J3997906O106484
1489b392722k200141j67361N966800M255731l223345o378088n754523p613988
1481a7507637o277310P375946K2482541J7350121n469056j7547975n613492Q556008
1473C349146J680949j6916318k1392003o537256Q561608P889014m522497j3208652
1465d1096009q182162O004397J4671443R077220k323553m985015J415879M710576
1457b0707224J465449J755643R783672J5269747J0742459L414060J676578K293402
1449B5693786j81589k701893j649736j239447n159178r068630q940233p118950
1441a0365870l773539N573980J6790693J5710713R081j1966118o797562L422354
$$ y = [4312191, 5384667, -1460855, -15371552, -28807499, -32212936, -22497112, -8499206, -2392722, -4592863, -4760224, 1206576, 5462307, 2238962, -4139126, -9893649, -17507637, -23784947, -16409001, 6073540, 23423661, 17954605, 406630, -5206862, 3349146, 5030095, -11886223, -33278226, -39815482, -31253874, -23364860, -27887357, -41096009, -49278171, -43273774, -28602331, -19525111, -21848664, -26833679, -25417800, -20707224, -19241775, -17486132, -7702460, 7567287, 18309746, 21723806, 23400384, 25693786, 25512197, 22810304, 21160568, 19921121, 14761943, 5693313, -3246920, -10365870, -14139409, -8565429, 8225264, 23935977, 23945058, 11978940, 5181378, 8603732]
1433H603732J005047r469215j0365659J881825J6202095K4919417K5224811J1536599
1425F9538652j4119283l1318998k2326168P7938P249708n294571j4937209q797276
1417a9927207P85165K274826K687113R076942J2385105L784561p546198p846788
1409d326481k5970K580032k634773n752211j259899M066299J583341o918390r990827
1400b2678879L80878J6338082J8806121J82240k1431859k0895039J831954K0614109
1392f852393J7065997K367485k194676N172554Q698606K74375j0489072j1436086
1384B606790l123361M493931N077188J489177n3636J717016K283750j683101p184358
1375E623396q744997n576344k187336k977160q226327j3577391j2026591m43896
$$ y = [8603732, 9608779, 139564, -10226095, -8344270, 7857825, 32777242, 58002053, 69538652, 55419369, 24100371, 1774203, 1852141, 9101849, 3807278, -11129931, -19927207, -19142042, -16867216, -14180103, -5103161, 7281944, 11066505, 3520307, -4326481, -4352451, -1772419, -4407192, -10159403, -11419302, -7353003, -5769662, -12688052, -22678879, -22298001, -5959919, 12846202, 13028442, -8403417, -29298456, -27466502, -6852393, 10213604, 12581089, 10386413, 15558967, 24257573, 24531948, 14042876, 2606790, -516571, 3977360, 9054548, 10543725, 10490089, 12207105, 14490855, 12807754, 5623396, -3121601, -8697945, -10885281, -13862441, -22088768, -35666159, -47692750, -48136646]
1367d8136646J3370864J5982405N166394n470033n171785p19753k231553l726167
1359c0936274N788478J8019703J3416414o278995j5767030k979155J2366497Q206991
1351A836629r296210j9017346j4955711p022536j757319J454741J684401q10008
1343d7883359J659245J3464651K3610480J9201089O687501L555939J1343787J4214247
1335D5853580M465173q193298j5346187j9880619k1841543j2586738O825613J7686432
1327c017587Q190529o750309o690172L200945K056469j0675338j2458431N442290
1319b0701604K0504273J0965669j0952353j6070960j31716J1940455L842160r700035
1311a0304111o899344R398238J8049778J0064396k745830q157604p818821p374058
$$ y = [-48136646, -34765782, -18783377, -13616983, -19087016, -24258801, -24978554, -27210107, -30936274, -25147796, -7128093, 6288321, 9326, -15757704, -18736859, -6370362, 1836629, -7459581, -26476927, -41432638, -48455174, -50212493, -48757752, -47073351, -47883359, -46224114, -32759463, -9148983, 10052106, 16739607, 20295546, 31639333, 45853580, 50318753, 42125455, 26779268, 6898649, -14942894, -27529632, -20704019, -3017587, 5172942, -1577367, -8267539, -5066594, -3010125, -13685463, -26143894, -20701604, -197331, 10768338, -184015, -16254975, -16386691, -4446236, -604076, -10304111, -17203455, -7805217, 10244561, 20308957, 17563127, 9405523, 1586702, -5787356]
1303e787356m879408K917659J1205796J3317457J0938967Q902925M320497p646067
1295C3290470j9187711j5115955L681742J5489367N510066j1890552j1770094
1288G333O267931J7426943O821574j0674359j2977127o51092P794016L217514
1280A7232733n510313q558323p500150p492243p670924n250056k114796r62547
1272b7826619N53728N750602J1732712J1838050M454601m355420o929519j147913
1264e929778P475734J0528068N750780P26936L400329R917456Q913146j528605
1256C9254066j0337540j0180202p769309j1015047j5270729j1783840k559071
1249b9661672L866757N964199P479530O928728J088782m308313o52250Q035913
$$ y = [-5787356, -10666764, -7749105, 3456691, 16774148, 27713115, 36616040, 40936537, 33290470, 14102759, -1013196, 2668546, 18157913, 23667979, 11777427, 7333, 6275264, 23702207, 30523781, 19849422, 6872295, 6221203, 14015219, 17232733, 11722420, 3164097, -4336053, -11828296, -19499220, -24749276, -26864072, -27826619, -27272891, -21522289, -9789577, 2048473, 6503074, 2147654, -4781865, -5929778, 1545956, 12074024, 17824804, 18551740, 21952069, 31869525, 40782671, 39254066, 28916526, 18736324, 10967015, -48032, -15318761, -27102601, -29661672, -25794915, -19830716, -12351186, -5422458, -4333676, -8641989, -9294239, -1258326]
1241a258326R113092J254255l246822J407181N457370k21171j0156322j3052730
1233a0703473o250683M172259J1084927J0152486K484751l862165j660534N101265
1225A0518833O471586J769184j276808k288230q429022j6523430j2608663L729247
1217a8637303J2854826M523259l740291N773833K0286919J5237881o232573j7196026
1209A2870525p277342N237917M383222k884399m936914m998354r996391j4088378
1201b1690114q075789L159086P062407L098757K523162R139654J2951261O357412
1193A4525836l691228o175735j327342K712572L602865M986775N203804j660853
1185A8176694j1615688j1591044r59964K392739j0315047j9391561m509858J8682183
$$ y = [-1258326, 7854766, 9109021, 5862199, 7269380, 12726750, 12505579, 2349257, -10703473, -16954156, -12781897, -1696970, 8455516, 10940267, 7078102, 5417568, 10518833, 16990419, 18759603, 17482795, 15194565, 6765543, -9757887, -22366550, -18637303, -5782477, -1259218, -4999509, 774324, 21061243, 36299124, 30066551, 12870525, 5593183, 10831100, 15214322, 12329923, 7393009, 2394655, -7601736, -21690114, -29765903, -26606817, -19544410, -16445653, -13922491, -4782837, 8168424, 14525836, 10834608, 4658873, 3331531, 6044103, 9646968, 14633743, 19837547, 18176694, 6561006, -5030038, -5990002, -3597263, -13912310, -33303871, -37813729, -19131546]
1177a9131546J6561904j0601395k5176883p169896J7390003J8203636L611888
1170f312289j041016L953102O87785r204881o690416R625457J8858088R884395
1162A9760225n085922j1955192r964006k824474O785140J1096631L341930p573954
1154C580378o068776M936859P450715j011233l453670M370489L587510j3588182
1146a95910k4103853q126912J6647671J8700498j687924j5335076o839124R205754
1138a1734876J4570574R373507L106271o13347l298524n382027o567086o658793
1130g204301l495487M551314J2832653J3035475L346880q510059j3722534j0431825
1122i597884l183450K042062K093215r75340j892767J222202L644089K81816o558969
$$ y = [-19131546, -2569642, -13171037, -38347920, -45517816, -28127813, -9924177, -6312289, -7353305, -3400203, -2712418, -11917299, -18607715, -8982258, 9875830, 19760225, 14674303, 2719111, -7244895, -10069369, -3284229, 7812402, 11154332, 3580378, -2488398, 2448461, 9899176, 8887943, 5434273, 9804762, 13392272, -195910, -24299763, -32426675, -15779004, 2921494, 1233570, -14101506, -20940630, -11734876, 2835698, 12209205, 15315476, 14702129, 11403605, 6021578, -545508, -7204301, -10699788, -6148474, 6684179, 19719654, 23066534, 14556475, 833941, -9597884, -12781334, -10739272, -8646057, -9621397, -11514164, -10291962, -6647873, -6366057, -12925026]
1113a2925026r275708l955831N905153J3965205J6446389J3399554O979758j150292
1105B9389202j0835160k0473913k3774652j4001403O287500K3646068K5784977
1098A6022619J3605233j239819q650031p201651j250228M664619P767847O212600
1090B9931189p60214j0475946j6038259j1768210j095165M762276m99487r864919
1082a5808735j1402552k449374Q842337J3276200P608586m394616j2840281q508965
1074b5677400N044747J2233800N952293p42760N137183J3596221O280133j1952874
1066I871343j7724915m699180Q414905R218001P759125J2803398J4193541K413182
1058D2249400j2462150j6628478j2820335j0170962p275415k70479M598564J856954
$$ y = [-12925026, -22200734, -26156565, -20251412, -6286207, 10160182, 23559736, 30539494, 29389202, 18554042, -1919871, -25694523, -39695926, -33408426, -9762358, 16022619, 29627852, 28388033, 19738002, 12536351, 11286123, 15950742, 23718589, 29931189, 29170975, 18695029, 2656770, -9111440, -10206605, -5444329, -5943816, -15808735, -27211287, -29660661, -20818324, -7542124, 66462, -4328154, -17168435, -25677400, -20632653, -8398853, -2446560, -3189320, 1947863, 15544084, 21824217, 9871343, -7853572, -12552752, -4137847, 5080154, 12839279, 25642677, 39836218, 42249400, 29787250, 13158772, 338437, -9832525, -17107940, -17378419, -12779855, -10922901]
1050a0922901q73930L790151Q758636O652870N535856J2728825J5391439j130641
1042C9930305k4650272k9069291j1085842P945403J3664068J0776010N293680
1035A2804061l430254j1503669j0969972m345526k128713m544987k182421M769675
1027b1531806N549991j364529m933675n75039L897363L620237J967193r32949
1019a4303214q130714j3043251m800218J1529368J8638219J3152985Q393573Q591254
1011B0028002K794001j0429277j5893909p728013O79034K428910Q633715K1330923
1003B1843386K0155709m873722k8986378k4195518N57304J3777738M345901j1432538
995h808118j6659803p960285R750207K4901444K2964860M355279j0048655o333333
$$ y = [-10922901, -11796831, -8006680, 751956, 7404826, 12940682, 25669507, 41060946, 39930305, 15280033, -13789258, -24875100, -16929697, -3265629, 7510381, 12804061, 9373807, -2129862, -13099834, -17445360, -19574073, -24119060, -26301481, -21531806, -15981815, -17346344, -22280019, -22855058, -18957695, -15337458, -13370265, -14303214, -22433928, -35477179, -40277397, -28748029, -10109810, 3043175, 11436748, 20028002, 22822003, 12392726, -3501183, -11229196, -10550162, -8121252, 512463, 21843386, 41999095, 37125373, 8138995, -16056523, -15499219, -1721481, 2624420, -8808118, -25467921, -33428206, -23677999, 1223445, 24188305, 28543584, 18494929, 12161596]
987A2161596J401271m786344j5326955r628402P216572J2134072K496579k430726
979C237663K727712J910513j0000161j5554582m908001O796940M500100m715952
971a6005768p991193p482183r952039j0055465m20605J1404609J2045743K914205
963b5542696k058879L106824R626271P865693q0967m145656O39875P116335M162631
954F89431p166212j1590575k83627J2921296Q712942p979361j2896494J127442
946a6465158J2298892L336546j1358175p880146J0406272J8200997N703617q880981
938E361864o858895O800857J4371924R867920K375529o77679k786445q496044
930A9959031j2227021m948935R822481J6085794N261707j1666495j8721652j4974253
$$ y = [12161596, 13562867, 8776523, -6550432, -16178834, -8962262, 3171810, 5668389, 3237663, 5965375, 7875888, -2124273, -17678855, -22586856, -15789916, -11289816, -16005768, -23996961, -31479144, -41431183, -51486648, -51907253, -40502644, -28456901, -25542696, -27601575, -24494751, -14868480, -7002787, -7083754, -11229410, -10589535, -3473200, 689431, -6476781, -18067356, -18350983, -5429687, 3283255, -4696106, -17592600, -16465158, -4166266, -829720, -12187895, -20068041, -9661769, 8539228, 14242845, 5361864, -1497031, 5303826, 19675750, 29543670, 31919199, 31241520, 28455075, 19959031, 7732010, 2783075, 12605556, 28691350, 33953057, 22286562, 3564910, -11409343]
922a1409343j0328537o904300J374018J1937489J2381918N38247q455973k981550
914a3848031Q654245J1850972O039740P91922n05412j049604L8860N962067J1682482
905B9617241P115268p743534k0074708j9062870p071471N469193J0629387P153828
897F032334m91854n136093k752656L142549N708182L671661K459375N565388Q447574
888B6646460L795904q143263j7007076j2158490M258452J6694494J2346233l421233
880B3011481j3410243j0321988m367192o237314j1366383q834263M47216N182762
872b5895924J529127j028306O075773J8129101K3152674J5802174J565926j0441344
864B8889201j5736946j6070433j4700203j1652825n181248K985973P947905Q426348
$$ y = [-11409343, -21737880, -28642180, -27268162, -15330673, -2948755, -2410508, -10866481, -13848031, -5193786, 6657186, 12696926, 13488848, 12983436, 11933832, 11972692, 17934759, 29617241, 36732509, 28988975, 8914267, -10148603, -17220074, -11750881, -1121494, 6032334, 5540480, 404387, -2348269, 794280, 6502462, 10174123, 12633498, 18198886, 26646460, 30442364, 22299101, 5292025, -6866465, -2608013, 14086481, 26432714, 23011481, 9601238, -720750, -5087942, -11325256, -22691639, -31525902, -31078686, -25895924, -24366797, -25395103, -19319330, -1190229, 21962445, 37764619, 39330545, 28889201, 13152255, -2918178, -17618381, -29271206, -34452454, -31466481, -23518576, -15092228]
856a5092228Q401409R205431N980055k514057o744438J551935J3736070J2605776
848B7129953l014222j4350373q296713M088686L955847q068985j3583504l713694
840a5853005Q057495N182608q847375j5572756o388536P451711J1819228Q349146
832e801484Q791763J4824701J3880605k252758k3097398l0800564k1762984r192568
824e5410687m850216n810499j849955R660066K0946573K3745437J7773266Q934981
816A3138966J835109l777885r347498j2796292j0218019j951149O351986R969614
808f795168R443528P004269K252013n406751j2922405j6113525j4154858q521845
800d5214742l82836P327989R379353N430248L561595Q924632J2880788M384295
$$ y = [-15092228, -6690819, 2514612, 8494667, 5980610, -763828, 788107, 14524177, 27129953, 24115731, 9765358, 1468645, 5557331, 9513178, 1444193, -12139311, -15853005, -7795510, -2612902, -11460277, -27033033, -33421569, -25969858, -14150630, -5801484, 2990279, 17814980, 31695585, 29442827, 6345429, -24455135, -46218119, -55410687, -60260903, -66071402, -67921357, -58261291, -37314718, -13569281, 4203985, 13138966, 14974075, 11196190, 1848692, -10947600, -21165619, -23116768, -16764782, -6795168, 2648360, 9652629, 11904642, 6497891, -6424514, -22538039, -36692897, -45214742, -45597578, -38269589, -28890236, -23459988, -19898393, -10973761, 1907027, 6291322]
792F291322r869209j0920977M289473J5494774P765692o143589m897761J0080288
784A2090013J8390448J0593741k491420r646195j1853710j1824713o274443M157622
776C141343R483247L818077m900725p346940o360352q100123p793648K389139
768a5669982J5876458J7004064L896657p455427n031582N010770J0638842R640097
760C3909897N850248j287096j3298932k3483342k1488195p130124P573556J1730648
752g623340O494802J223641J709492M342417J901880n772112r613700k659857
744i996777R053677J3047486P094336J189220J363738J479167l784838p913350
736A1532659l690762K599065r7871r427174j2667560n729940L291591Q887296
$$ y = [6291322, -3577887, -14498864, -10209391, 5285383, 13051075, 6907486, 2009725, 12090013, 30480461, 41074202, 38582782, 28936587, 17082877, 5258164, -1016279, 3141343, 12624590, 16442667, 11541942, 4195002, -2165350, -10265473, -18059121, -15669982, 206476, 17210540, 21107197, 13651770, 8620188, 13630958, 24269800, 33909897, 39760145, 38473049, 25174117, 1690775, -19797420, -26927544, -19353988, -7623340, -1128538, 95103, 1804595, 6147012, 8048892, 2276780, -7336920, -9996777, -943100, 12104386, 19198722, 20387942, 21751680, 23230847, 19446009, 11532659, 7841897, 10440962, 10343091, 915917, -11751643, -17481583, -14189992, -5302696]
728e302696J3442915J6268993J0712664k890321j2919156j1800764o275411n384115
720d147891o836754l645339K731439N215897K383828j878045o344560j1260081
712b3781506j1857387k805957J0825927J5964774P370730n501727j0517567o416019
704b6718732m88869L017415O256324J0477344J1694674O909191N93191o51475
696A1089063J644767j56257p019338j1045917r242673r286915j4410033j3521761
688e1949064J037881J5339272J1289180l362782m191110J1136794J7617643K712539
680c69647j3040059q464319O598880J0443374L365222Q96496N117027N342872
672I889846L31251j858689j957484o896785j1806777n097733Q988074J3001698
$$ y = [-5302696, 8140219, 24409212, 35121876, 32231555, 19312399, 7511635, 1236224, -4147891, -10984645, -14629984, -11898545, -6682648, -4298820, -6176865, -12521425, -23781506, -35638893, -38444850, -27618923, -11654149, -4283419, -9785146, -20302713, -26718732, -27207601, -24190186, -17933862, -7456518, 4238156, 11147347, 11740538, 11089063, 12733830, 12577573, 5558235, -5487682, -14730355, -24017270, -38427303, -51949064, -50911183, -35571911, -24282731, -27645513, -31836623, -20699829, -3082186, -369647, -13409706, -21874025, -15275145, -4831771, -1466549, -570053, 4546974, 9889846, 10221097, 8362408, 6404924, -491861, -12298638, -17396371, -8408297, 4593401]
664D593401L195966n141625k546893K329699R9018n946200r372838r399875n580134
655b7769481K712389Q375358L069260n754048j708487J2717673J5326776j215109
647E754331j5058622p735533Q588371J2609513N645995K594457M427312J213221
639A8039045n641277n364637J725216M457434m4857l770445l415365l288081k750060
630e3027M395313J6058852K0407541J1723109j949953r704519q943015m619374
622B7314927l487977q537219j4316956j1573457j753137J029754q490617j3368890
614c3183572K254262K4619701K5344792J997719j8097684j6408792l778070L428305
606a3823339O274921J1173281J3263619P086741O53680L041756P356356J583931
$$ y = [4593401, 7789367, 2647742, 100849, 2430548, 2529566, -3416634, -12789472, -22189347, -27769481, -25057092, -16681734, -13612474, -19366522, -21075009, -8357336, 6969440, 5754331, -9304291, -17039824, -8451453, 4158060, 9804055, 12398512, 16825824, 18039045, 12397768, 7033131, 8758347, 13215781, 13170924, 9400479, 5985114, 2697033, -53027, 4342286, 20401138, 40808679, 52531788, 50581835, 40877316, 31934301, 27314927, 23826950, 15289731, 972775, -10600682, -12353819, -11324065, -19814682, -33183572, -30929310, -6309609, 19035183, 21032902, 2935218, -13473574, -17251644, -13823339, -7548418, 3624863, 16888482, 23975223, 24628903, 27670659, 35027015, 36610946]
598C6610946j0274970j3369541m569426M531728N745680K295712j467307n951899
590A3550923r499925o541642K708059Q679077M126570n609789r105990k765987
582d458704O043796Q539611L677671k732281n819979o290155o928218p128962
574a5097221m257808M95302K438584O95030K77072M126248P682797N544411j83018
565A721397l293203k627437k113705k958389j879711K188661M892412K292116
557a777859l288662n671334j680779N735857J0379153Q290604J293813m672181
549H608612n348512k052306O90252M24887j433995k240950j194050j19045j756139
540d421246o211139q745514l594331Q036364J6157854J1815051j923242j2357506
$$ y = [36610946, 26335976, 12966435, 8397009, 12928737, 18674417, 20970129, 19502822, 13550923, 4050998, -2490644, 217415, 8896492, 13023062, 7413273, -1692717, -4458704, 1585092, 10124703, 13802374, 11070093, 5250114, -1040041, -7968259, -15097221, -19355029, -18859727, -16421143, -15726113, -15449041, -11322793, -3639996, 1904415, 1721397, -1571806, -4199243, -6312948, -9271337, -11151048, -8962387, -4069975, -1777859, -5066521, -10737855, -12418634, -6682777, 3696376, 11986980, 13280793, 8608612, 3260100, 1207794, 1898046, 2322933, 888938, -1352012, -2546062, -2665107, -4421246, -10632385, -19377899, -22972230, -14935866, 1221988, 13037039, 11113797, -1243709]
532a243709j1056527k270710L743038K853858j51707N79790M735410P310335N099978
523I599756j68730m374032m819776j783802J714831J528702l732774r577740r433280
514b1046845l463283L3443m215584r421058n202940O547093J2463900N963226
506a8342048l403511l381808M933681J1068698J0211704O074096J455909m511703
498D105018r056823n045298P952150J8417707J4988826Q05235r768136p703709
490A4694970J745140O406444j1409j2719637k0765254j6869514m409564N488420
482b6440404N522192j69807k511241R0482P84172m015997p969011l421431P226824
473c0904221J3422612Q438704l712673j2490480j0150998J278866J0752032Q818450
$$ y = [-1243709, -12300236, -14570946, -10827908, -7974050, -8125757, -7545967, -2810557, 4499778, 9599756, 9431026, 5056994, 237218, -1546584, 168247, 1696949, -2035825, -11613565, -21046845, -24510128, -24476685, -28692269, -38113327, -43316267, -36769174, -24305274, -18342048, -21745559, -25127367, -20193686, -9124988, 1086716, 7160812, 8616721, 4105018, -4951805, -9997103, -2044953, 16372754, 31361580, 32166815, 22398679, 14694970, 16440110, 22846554, 22835145, 10115508, -10649746, -27519260, -31928824, -26440404, -20918212, -21088019, -23599260, -23508778, -22724606, -26740603, -34709614, -38131045, -30904221, -17481609, -9042905, -12755578, -25246058, -35397056, -34118190, -23366158, -14547708]
465a4547708p02478m022578M698293J4589968J2723880J447078p266021r527826
457b607392j0393961j0302190m455315L940923M323692l456470n526013N587059
449b2889667J8914606K0686648J0995465k311751j4231650j8504645o793350J5358369
441A224025K4705869Q754438j2526610j1931866O684743J6424836P563111m310838
433C6587708q641112j2419426j8081650j4164906J695031J1939459M710098p190995
425e565793p352973m38715L85106k121215L786917J5262277J7188778N701974
417B6846356o636244r716750o983253n470816m980834j239728N878623J0850701
409H548055Q057491j256787q232419n954512J091865L131114l40019j411530P73742
$$ y = [-14547708, -15250186, -19272764, -14574471, 15497, 12739377, 14186455, 6920434, -2607392, -13001353, -23303543, -27758858, -23817935, -19494243, -22950713, -28476726, -22889667, -3975061, 16711587, 27707052, 25395301, 11163651, -7340994, -14134344, 1224025, 25929894, 34684332, 22157722, 10225856, 16910599, 33335435, 40898546, 36587708, 27946596, 15527170, -2554480, -16719386, -15024355, -3084896, 1625202, -5565793, -12918766, -13357481, -12972375, -15093590, -11306673, 3955604, 21144382, 26846356, 20210112, 10493362, 3510109, -1960707, -6941541, -8181269, -2302646, 8548055, 16605546, 15348759, 7116340, 1161828, 2253693, 5384807, 5044788, 3633258, 4407000]
400D407000j712544q766868q815397P09547N211454l482964j0528610o65891J5362580
391h281693J6238548L103070m011700J505864N707767j13839o384368k959970
383D803679N817223J0188288P648963J203024o033128j0465548r549369n966067
375b352935m255602l782277j779685p69750m159631p454861m175692K325394M159374
366b2245665K735466M532163O433212N14776q518415p760460J823970N561401
358a6923552n53180l953459J850417P286396N845199M934126Q898818Q735267
350A6120032j74173o149718k08326O860172R58480j2679030j7921349j0748546
342b3942458o49243M488933L603683j171261l768149K939622J4780955J6060821
$$ y = [4407000, 2694456, -6072412, -14887809, -14178262, -8966808, -12449772, -22978382, -23644273, -8281693, 7956855, 11059925, 7048225, 8554089, 14261856, 14148017, 7763649, 4803679, 10620902, 20809190, 28458153, 29661177, 23628049, 13162501, 3613132, -2352935, -6608537, -10390814, -12170499, -12940249, -17099880, -24554741, -28730433, -26405039, -22245665, -19510199, -14978036, -8544824, -8030048, -16548463, -24308923, -22484953, -16923552, -17476732, -21430191, -19579774, -12293378, -6448179, -1514053, 7384765, 16120032, 15945859, 9796141, 9587815, 16447987, 17406467, 4727437, -13193912, -23942458, -24591701, -20102768, -16499085, -17670346, -21438495, -18498873, -3717918, 12342903]
334A2342903J529510j2113644r072917J788185J513413r123669j2248556j102031
326b6486806J1709464J3747403O313282k194434n385591j500135M127414J621989
318A952586r847392j6041400n730741J1068276J5903026P752037J213235K586862
310H856489M214984J478890j088337j744699m256497o786426k690511N339994
302C323887O538453K94973j765689M209158P556236K112963l086227k23053L699166
293B2659867n30700r203548j3319076j2210738r689448m574955M663632J1809685
285a0395281R326828n62400q488051q494390j278199Q245617J2476438O688613
277G519175k552047k478489P153954J0372128j836809j5089433j0803734N969749
$$ y = [12342903, 13872413, 1758769, -7314148, -5525963, -4012550, -13136219, -25384775, -26486806, -14777342, -1029939, 5283343, 3088909, -2296682, -3796817, 330597, 1952586, -7894806, -23936206, -29666947, -18598671, -2695645, 5056392, 6269627, 8856489, 13071473, 14550363, 13462026, 11717327, 7460830, 674404, -2016107, 3323887, 9862340, 10157313, 8391624, 12600782, 20157018, 22269981, 19183754, 18960701, 22659867, 22129167, 12925619, -393457, -12604195, -22293643, -26868598, -22204966, -10395281, -1068453, -1630853, -10118904, -18613294, -19891493, -11645876, 830562, 7519175, 4967128, 2488639, 9642593, 20014721, 18177912, 3088479, -7715255, -1745506]
269a745506J3290651L496202q352304q243959n56678L557098K910765K887312
261G243581L207222q96515q075972j0272044l833282M836912P582948M503723
253D296573J688710J362493J23616k587374j270721N957329J0428715L475751
245B3475092r406570j4460337q980613m204131o884853r109840k331944P970979
237b3932217J0425288M217167k000276l795609l984882l522640J090176R574675
229a1928318J4425141R592746j051211p374180m106230L612061O230447P82426
221A0182882n854167o053241j226316J540411N63230O05634K952281K584078k206164
212C088628n394816k857649Q40795P18841m65610J151338K248863j487177o287713
$$ y = [-1745506, 11545145, 15041347, 6689043, -1554916, -2111594, 1445504, 4356269, 7243581, 10450803, 9554288, 1478316, -8793728, -12627010, -7790098, -207150, 4296573, 5985283, 7347776, 7471392, 4884018, 3613297, 9570626, 19999341, 23475092, 14068522, -391815, -9372428, -13576559, -20461412, -29571252, -31903196, -23932217, -13506929, -9289762, -11290038, -15085647, -19070529, -22593169, -21502993, -11928318, 2496823, 12089569, 11038358, 3664178, -442052, 3170009, 9400456, 10182882, 4328715, -1724526, -2950842, -1410431, -847201, -241567, 2710714, 5294792, 3088628, -2306188, -5163837, -4323042, -3604201, -4069811, -2918473, -669610, -2156787, -8444500]
203h444500n913491j930453K17270J100937L894208N342478J264605k284536L413206
194c340276J2254636Q585063p626379j6730987p578538M842317J723128j0857376
186a8728412j1435719L936822J5632244R060551n611722r449705J09071R979669
178f507201J1180475O620882Q74466o149073j2155659r326130M256305J6707940
170E502005J5243566L444602m172895k887801j650296n711868q478516n425593
162d136796l398658p411503r201935o16608J0278741J0388429K841709J474094
154B17473P326519P849808K4886l649769K759263P340535Q9612j0362993j1524921
145G0413p019905p797912j1591371o857771O562401J6112778J5750787J2625901
$$ y = [-8444500, -14357991, -16288444, -16071174, -14970237, -11076029, -5733551, -4468946, -6753482, -3340276, 8914360, 17499423, 9873044, -6857943, -14436481, -9594164, -7871036, -18728412, -30164131, -26227309, -10595065, -1534514, -7146236, -16595941, -16486870, -6507201, 4673274, 11294156, 12168622, 6019549, -6136110, -15462240, -11205935, 5502005, 20745571, 24190173, 20017278, 17129477, 15479181, 9767313, 1288797, -4136796, -7535454, -14946957, -24148892, -24765500, -14486759, -4098330, -1256621, 217473, 7543992, 15393800, 15418686, 11768917, 14528180, 21868715, 21958327, 11595334, 70413, -6949492, -14747404, -26338775, -33196546, -26634145, -10521367, 5229420, 17855321]
137A7855321J2210897R574397P33617p817917q356046l565770j445153l421519
129A5767827m770184l726403l155967m443332n622268n111615k505851L396731
121a0171062J1918054J6380863R379368o015232j6487533j3590369l811317J009806
113a1387422p47916p43364N434463J1814166J0972774L961160k091564l479517
105A3732780l433797o374174j0986689j0923059l171536N998073P257210Q17537
97g083655k646119L075891R889484P070551k297278o207268k253189M57233k078449
88b072799l279643m37360j162985q368316j1352067k260040Q984897Q767871N67668
79a0612774k431411Q69483J174043j398986K791163J2557832J3569237J675391
$$ y = [17855321, 30066218, 39640615, 40374232, 32556315, 24200269, 20634499, 19189346, 15767827, 10997643, 7271240, 4115273, -328059, -5950327, -11061942, -13567793, -10171062, 1746992, 18127855, 27507223, 21491991, 5004458, -8585911, -12397228, -11387422, -12135338, -12878702, -7444239, 4369927, 15342701, 19303861, 17212297, 13732780, 10298983, 3924809, -7061880, -17984939, -21156475, -15158402, -7901192, -7083655, -9729774, -6653883, 3235601, 10306152, 8008874, 1801606, -451583, 5650, -2072799, -5352442, -5789802, -6952787, -15321103, -26673170, -28933210, -19948313, -11180442, -10612774, -13044185, -12174702, -11000659, -12399645, -9608482, 2949350, 16518587, 18193978]
71A8193978p584449j604262J0154265J0490032j579287j2615576j4085546q737094
63g367939j579991M920978P939894N352086j1659l250221l943365m510890l762872
54f213979J129258O698272M804918n493892j3918585j1239207j785075K009420
46b4008870l188999o252136K776052J6291554J6691503P94316j3147490r117915
38a9161985M454279P331814k909570q940381j444480P622482N705309j167877
30h510409q00308M769279N005019M9652m38720N298722Q584582N084447M7515
21A9089779k430612m306716n626089k341088M377574O500076J457327k836639
13A3883612n62307L197224K786005K226007N877652O518422m594344j9684843
$$ y = [18193978, 10609529, 9005267, 19159532, 29649564, 28070277, 15454701, 1369155, -7367939, -8947930, -4026952, 3912942, 9265028, 9253369, 6003148, 2059783, -2451107, -6213979, -5084721, 1613551, 6418469, 924577, -12994008, -24233215, -26018290, -24008870, -27197869, -33450005, -30673953, -14382399, 2309104, 3103420, -10044070, -19161985, -14707706, -7375892, -10285462, -19225843, -20670323, -13047841, -7342532, -8510409, -9310717, -4541438, 463581, 513233, 74513, 5373235, 13957817, 19042264, 19089779, 16659167, 12352451, 6726362, 4385274, 8762848, 15262924, 16720251, 13883612, 13321305, 16518529, 19304534, 21530541, 27408193, 33926615, 29332271, 9647428]
5I647428k0891539n707071P737826N868647k030096
0e374805
$$ y = [9647428, -11244111, -16951182, -9213356, -3344709, -5374805]
##END NTUPLES=NMR SPECTRUM
##END=
