##TITLE=31Pdec_PR164_S37
 D2O, 24 sc
 31.1.2020
##JCAMPDX= 6.0         $$ Bruker NMR JCAMP-DX V2.0
##DATA TYPE= NMR SPECTRUM
##DATA CLASS= NTUPLES
##ORIGIN= UXNMR, Bruker Analytische Messtechnik GmbH
##OWNER= root
$$ XWIN-NMR		Version 3.5
$$ Fri Jan 31 14:44:14 2020 Russian Standard Time (UT+4h)  she@DPX200
##.OBSERVE FREQUENCY= 81.013821
##.OBSERVE NUCLEUS= ^31P
##.ACQUISITION MODE= SIMULTANEOUS
##.ACQUISITION SCHEME= undefined
##.AVERAGES= 24
##.DIGITISER RES= 17
##SPECTROMETER/DATA SYSTEM= spect
##.PULSE SEQUENCE= zgpg30
##.SOLVENT NAME= DMSO
##.SHIFT REFERENCE= (INTERNAL, DMSO, 0, 182.463)
##AUDIT TRAIL= $$ (NUMBER, WHEN, WHO, WHERE, WHAT)
$$ ##TITLE= Audit trail, XWIN-NMR		Version 3.5
$$ ##JCAMPDX= 5.01
$$ ##ORIGIN= Bruker BioSpin GmbH
$$ ##OWNER= she
$$ F:/spectra/data/she/nmr/P31/1/pdata/1/auditp.txt
$$ ##AUDIT TRAIL=  $$ (NUMBER, WHEN, WHO, WHERE, WHAT)
(   1,<2020-01-31 14:43:14.28 +0400>,<she>,<DPX200>,
      <created by zg, POWCHK disabled, PULCHK disabled
       configuration hash MD5:
       00 E9 B6 7A A2 85 ED C7 34 08 36 98 17 FE 4E 26
       data hash MD5: 32K
       BF 96 99 1B 66 B1 B5 65 C7 EF 29 16 13 02 6F AB>)
(   2,<2020-01-31 14:43:20.50 +0400>,<she>,<DPX200>,
      <Start of raw data processing
       efp BC_mod = 2 LB = 1 FT_mod = 6 PKNL = 1 PHC0 = -1705.486 PHC1 = 185.2013 SI = 64K 
       data hash MD5: 64K
       56 39 9C DC F8 67 79 DA 3F B1 EB AE B2 5A C9 82>)
(   3,<2020-01-31 14:43:35.00 +0400>,<she>,<DPX200>,
      <pk PHC0 = 27.60411 PHC1 = -125.2 
       data hash MD5: 64K
       51 1A 09 80 BD A7 B5 3E 83 73 2A 84 E0 87 05 21>)
(   4,<2020-01-31 14:43:38.29 +0400>,<she>,<DPX200>,
      <abs ABSG = 5 
       data hash MD5: 64K
       37 BD BB 2E 58 A2 10 CA B6 53 D9 63 CE 77 2F 1C>)
$$ ##END=
$$ 
$$ hash MD5
$$ B8 AA DF 0E 80 AA BC 14 2B D8 1B 8B 5F 7E CB 75
##$RELAX= 
##$RELAX= 
##$RELAX= 
##$RELAX= 
##$RELAX= 
##$RELAX= 
##$RELAX= 
##$RELAX= 
$$ Bruker specific parameters
$$ --------------------------
##$DU= <F:/spectra>
##$EXPNO= 1
##$NAME= <P31>
##$PROCNO= 1
##$TYPE= <nmr>
##$USER= <she>
##$AMP= (0..31)
100 100 100 100 100 100 100 100 100 100 100 100 100 100 100 100 100 100 
100 100 100 100 100 100 100 100 100 100 100 100 100 100 
##$AQSEQ= 0
##$AQ_mod= 1
##$AUNM= <au_zg>
##$AUTOPOS= <>
##$BF1= 81.014009
##$BF2= 200.13
##$BF3= 200.13
##$BF4= 200.13
##$BF5= 200.13
##$BF6= 200.13
##$BF7= 200.13
##$BF8= 200.13
##$BYTORDA= 1
##$CFDGTYP= 0
##$CFRGTYP= 5
##$CHEMSTR= <none>
##$CNST= (0..31)
1 1 145 1 1 1 1 1 1 1 1 1 1 1 1 1 1 1 1 1 1 1 1 1 1 1 1 1 1 1 1 1 
##$CPDPRG= <waltz16>
##$CPDPRG1= <>
##$CPDPRG2= <waltz16>
##$CPDPRG3= <>
##$CPDPRG4= <mlev>
##$CPDPRG5= <mlev>
##$CPDPRG6= <mlev>
##$CPDPRG7= <mlev>
##$CPDPRG8= <mlev>
##$CPDPRGB= <>
##$CPDPRGT= <>
##$D= (0..31)
0 1 0 0 0 0 0 0 0 0 0 0.03 2e-05 3e-06 0 0 0 0 0 0 0 0 0 0 0 0 0 0 0 0 
0 0 
##$DATE= 1580467393
##$DBL= (0..7)
120 120 120 11 120 120 24 19 
##$DBP= (0..7)
150 150 150 150 150 150 150 150 
##$DBP07= 0
##$DBPNAM0= <>
##$DBPNAM1= <>
##$DBPNAM2= <>
$$ [...]
##$SUBNAM3= <"">
##$SUBNAM4= <"">
##$SUBNAM5= <"">
##$SUBNAM6= <"">
##$SUBNAM7= <"">
##$SUBNAM8= <"">
##$SUBNAM9= <"">
##$SW= 369.568048894756
##$SWIBOX= (0..15)
0 1 3 0 0 0 0 0 0 0 0 0 0 0 0 0 
##$SW_h= 29940.119760479
##$TD= 32768
##$TD0= 1
##$TE= 0
##$TE2= 300
##$TE3= 300
##$TEG= 300
##$TL= (0..7)
0 120 53 12 22 120 120 120 
##$TP= (0..7)
150 150 150 150 150 150 150 150 
##$TP07= 0
##$TPNAME0= <>
##$TPNAME1= <>
##$TPNAME2= <>
##$TPNAME3= <>
##$TPNAME4= <>
##$TPNAME5= <>
##$TPNAME6= <>
##$TPNAME7= <>
##$TPOAL= (0..7)
0.5 0.5 0.5 0.5 0.5 0.5 0.5 0.5 
##$TPOFFS= (0..7)
0 0 0 0 0 0 0 0 
##$TUNHIN= 0
##$TUNHOUT= 0
##$TUNXOUT= 0
##$USERA1= <user>
##$USERA2= <user>
##$USERA3= <user>
##$USERA4= <user>
##$USERA5= <user>
##$V9= 5
##$VALIST= <valist>
##$VCLIST= <CCCCCCCCCCCCCCC>
##$VD= 0
##$VDLIST= <DDDDDDDDDDDDDDD>
##$VPLIST= <PPPPPPPPPPPPPPP>
##$VTLIST= <TTTTTTTTTTTTTTT>
##$WBST= 1024
##$WBSW= 4
##$XGAIN= (0..3)
0 0 0 0 
##$XL= 0
##$YL= 0
##$YMAX_a= 57415
##$YMIN_a= -65260
##$ZGOPTNS= <>
##$ZL1= 120
##$ZL2= 120
##$ZL3= 120
##$ZL4= 120
##$ABSF1= 182.463
##$ABSF2= -187.1042
##$ABSG= 5
##$ABSL= 3
##$ALPHA= 0
##$AQORDER= 0
##$ASSFAC= 0
##$ASSFACI= 0
##$ASSFACX= 0
##$ASSWID= 0
##$AUNMP= <proc_1d>
##$AZFE= 0.1
##$AZFW= 0.5
##$BCFW= 0
##$BC_mod= 2
##$BYTORDP= 0
##$COROFFS= 0
##$CY= -3
##$DATMOD= 1
##$DC= 0
##$DFILT= <>
##$DTYPP= 0
##$F1P= 0
##$F2P= 0
##$FCOR= 1
##$FTSIZE= 65536
##$FT_mod= 6
##$GAMMA= 0
##$GB= 0
##$INTBC= 1
##$INTSCL= 5.30512e-09
##$ISEN= 30
##$LB= 1
##$LEV0= 0
##$LPBIN= 0
##$MAXI= 10000
##$MC2= 0
##$MEAN= 0
##$ME_mod= 0
##$MI= 50
##$NCOEF= 0
##$NC_proc= -3
##$NLEV= 6
##$NOISF1= 182.463
##$NOISF2= 159.3651
##$NSP= 0
##$NTH_PI= 0
##$NZP= 0
##$OFFSET= 182.463
##$PC= 4
##$PHC0= -1677.882
##$PHC1= 60.0013
##$PH_mod= 1
##$PKNL= yes
##$PPARMOD= 0
##$PSCAL= 0
##$PSIGN= 0
##$REVERSE= no
##$SF= 81.0140089999434
##$SI= 65536
##$SIGF1= 159.3651
##$SIGF2= -187.1042
##$SINO= 113.3802
##$SIOLD= 16384
##$SREGLST= <1H.CDCl3>
##$SSB= 0
##$STSI= 65536
##$STSR= 0
##$SW_p= 29940.119760479
##$SYMM= 0
##$S_DEV= 0
##$TDeff= 32768
##$TDoff= 0
##$TI= <>
##$TILT= no
##$TM1= 0
##$TM2= 0
##$TOPLEV= 0
##$USERP1= <user>
##$USERP2= <user>
##$USERP3= <user>
##$USERP4= <user>
##$USERP5= <user>
##$WDW= 1
##$XDIM= 65536
##$YMAX_p= 517995241
##$YMIN_p= -5467392
$$ End of Bruker specific parameters
$$ ---------------------------------
##NTUPLES= NMR SPECTRUM
##VAR_NAME=  FREQUENCY,     SPECTRUM/REAL,   SPECTRUM/IMAG
##SYMBOL=    X,             R,               I
##VAR_TYPE=  INDEPENDENT,   DEPENDENT,       DEPENDENT
##VAR_FORM=  AFFN,          ASDF,            ASDF
##VAR_DIM=   65536,         65536,           65536
##UNITS=     HZ,            ARBITRARY UNITS, ARBITRARY UNITS
##FACTOR=    0.456856943014862, 1,           1
##FIRST=     14782.0589164792, 0,            0
##LAST=      -15158.0608439998, 0,           0
##MIN=       -15158.0608439998, -5467392,    0
##MAX=       14782.0589164792, 517995241,    0
$$ Real data points
##PAGE= N=1
##DATA TABLE= (X++(R..R)), XYDATA
$$ [...]
37322C09125K0257k8361P0468J27111k5612k09044j44134Q9717J41849p0246k14927
37311F6203m6526K08844J71888j46366l64174k43533L8188J65891O3969r2631
37301a78247j38987p7016L278O1343J17728J64685J40062K4832q7912r4615k3471
37290h8320J6386J1903N1022J37895J48384K9522r5835j12096o8112m7944k3110
37279d0305L2241K1114j03317j74060m1788J32855Q3626j24246j62335N1858K30080
37268i4277J76176P0782J37879K77671K41249L856k41995l59134l51955k53993
37258c93741r0406P6030J68784J55161N0970p1598q5728N7216J97356J37010n2100
37247A48954j12154j4480k849j37860j44089J00538K75253J08964j53291j48704
$$ plain form
37322 309125 329382 301021 371489 498600 472988 263944 119810 209527 351376 281130 66203
37311 66203 19677 228521 400409 254043 -110131 -353664 -315476 -149585 -85616 -178247
37301 -178247 -317234 -394250 -390972 -329629 -211901 -47216 92846 117678 29766 -64849 -88320
37290 -88320 -71934 -60031 -9009 128886 277270 306792 210957 98861 30749 -17195 -40305
37279 -40305 -8064 13050 -90267 -264327 -306115 -173260 -89634 -213880 -376215 -324357 -94277
37268 -94277 81899 152681 290560 568231 809480 813336 571341 212207 -139748 -393741
37258 -393741 -484147 -408117 -239333 -84172 -33202 -104800 -190528 -133312 64044 201054 148954
37247 148954 36800 22320 19471 -118389 -262478 -161940 113313 222277 68986 -79718
37237g9718Q262k3871j78231j17591J08239J18229q7615o7688K83488M77420K06416
37226F47340j45386j27244P8783L1054k26601k97105j12515K4324L988L4341J76765
37215H7744J96946o536j87933j37158P494J9375o7069p5472L371L8639N987N745
37203a08867O4018Q2238J922r5061q6922M1221J65637J27338r3821k90663k04350
37192c97310J44423M05514L08497K6158o7920N3115M7489k19740m03992j93039
37182b96805J76648K47234K4863o2602J40737K92733J21344j72159k78972k21566
37172b8545j67839r0447P2908J48630j8424k02565q3485K05225K34436m3839k19900
37161a93845q4357P7154M754j21707m1809J31140J26460k3616n7890Q8782K13780
$$ plain form
37237 -79718 -71456 -95327 -273558 -391149 -282910 -164681 -252296 -319984 -36496 440924 647340
37226 647340 501954 374710 453493 484547 257946 -39159 -151674 -127350 -123362 -89021 87744
37215 87744 284690 278154 90221 -46937 -39443 -20068 -87137 -162609 -159238 -120599 -114612 -108867
37203 -108867 -44849 37389 39311 -55750 -142672 -101451 64186 191524 97703 -192960 -397310
37192 -397310 -252887 152627 461124 487282 419362 472477 519966 300226 -103766 -296805
37182 -296805 -120157 127077 151940 89338 230075 522808 644152 471993 193021 -28545
37172 -28545 -196384 -286831 -213923 -65293 -83717 -286282 -369767 -164542 69894 26055 -193845
37161 -193845 -278202 -201048 -196294 -318001 -359810 -228670 -102210 -125826 -183716 -94934 118846
37150A18846J62020k709j32783j46137m7409Q5401J43344Q6376k3913j18216j74214
37139d9394j61684n2754P8215J06187N2704P0018J75469K00835R1496K4467Q5324
37128F20883O6352j95651m79935m50365j37099J19649J34302L4382p027L1273
37118b63236Q5888R4768J7315j05270j51504q8568m4754q8681p7982R1731K36323
37107b93970J23498j46042k59571j22543Q2426J97316J95878O5904j38526j99700
37097d95330N825K21250J23940j33512j06466K22445L77927J44385j00595k0823
37087B39046J56000P0152j76998k45887j19735m6767q6923r6161o1963r2821j21446
37076e83503L5864L12778L97825J68591j33626k43640j71781o9468J5719J17012
$$ plain form
37150 118846 280866 278157 145374 -763 -48172 37229 180573 266949 243036 124820 -49394
37139 -49394 -211078 -263832 -185617 -79430 -26726 43292 218761 419596 511092 535559 620883
37128 620883 687235 491584 11649 -438716 -575815 -456166 -321864 -287482 -294509 -263236
37118 -263236 -177348 -82580 -65265 -170535 -322039 -410607 -455361 -544042 -622024 -530293 -293970
37107 -293970 -170472 -316514 -576085 -698628 -616202 -418886 -223008 -157104 -295630 -495330
37097 -495330 -489505 -268255 -144315 -277827 -384293 -161848 216079 360464 259869 239046
37087 239046 395046 465198 288200 42313 -77422 -124189 -211112 -307273 -369236 -462057 -583503
37076 -583503 -547639 -234861 162964 331555 197929 -45711 -217492 -286960 -271241 -154229
37066a54229J99942J76011L0859j40540k18574j53970m327J06053Q5713m5197
37056a18259j71400j73310k3745J66486K21116Q2940r2254j13598k04Q1029R7261
37045d3938J69508K83093K29439l9222k39631j45849N3687M3935j32088j82921
37035c987o1178Q25p2766q6233M4073J29391O5704M3927K00738L16144J25734
37024G02372k35019l83783k06422M0036J05997j772j42326j91251n4732K47459
37014a19441M68933L28906r4821l75222k63409m442M5233q1551r8595L7168Q9829
37003f7412k9020j32438j15223j20850k16520j96909O6280L14986K31156p4287
36993c40237k00967j7050K14147K48840J23606l0839j74718k74980k54115j28378
$$ plain form
37066 -154229 45713 221724 252583 112043 -106531 -260501 -264828 -158775 -73062 -118259
37056 -118259 -289659 -462969 -486714 -320228 -99112 -16172 -108426 -222024 -222228 -141199 -43938
37045 -43938 125570 408663 638102 598880 359249 213400 267087 311022 178934 -3987
37035 -3987 -65165 -64340 -137106 -223339 -179266 -49875 15829 59756 260494 576638 702372
37024 702372 467353 83570 -122852 -82816 23181 21409 -120917 -312168 -366900 -119441
37014 -119441 349492 678398 583577 208355 -55054 -59496 -14263 -95814 -194409 -157241 -67412
37003 -67412 -96432 -228870 -344093 -464943 -681463 -878372 -812092 -497106 -265950 -340237
36993 -340237 -541204 -558254 -344107 -95267 28339 -2500 -177218 -452198 -706313 -834691
36983h34691k7765J0408J03057K85560L85509K61357L2874o9659o49Q1059L6147
36972B63207j03192j77889o5599J56538K34592K7820k58507k99963r6274M2182
36962b77085k1792o8101O6989J93104J01080n3799M480K11544K59485P0302j24557
36951C61650j50687p1811J213M9404O4467K0916m0093n2791n3473j14283j73271
36940a58759j05058N4017J35799R0424K0853k5689r3521j35313k2453K04918L14053
36929B79271J93541M415p2570n9497m9021l0922J5141J1856p5004j15462j438
36918A00310J44904J24862l9357j40583r4013l1913o8336j24021o1214J01232
36908h8129J98018J16402p1505j77669q3852J31909K49935J18610j68646l36183
$$ plain form
36983 -834691 -862456 -852048 -748991 -463431 -77922 183435 216309 146650 146001 227060 263207
36972 263207 160015 -17874 -83473 73065 307657 335477 76970 -222993 -319267 -277085
36962 -277085 -298877 -366978 -299989 -106885 -5805 -59604 -55124 156420 415905 486207 361650
36951 361650 210963 139152 140365 189769 254236 275152 235059 182268 128795 14512 -158759
36940 -158759 -263817 -209800 -74001 16423 37276 11587 -81934 -217247 -239700 -34782 279271
36929 279271 472812 477227 404657 345160 296139 265217 280358 292214 217210 101748 100310
36918 100310 245214 370076 330719 190136 96123 64210 -4126 -128147 -189361 -88129
36908 -88129 109889 226291 154786 -22883 -106735 25174 275109 393719 225073 -111110
36898a11110k13886N3932J63104K4566j25670o3865R9243R9517o0282j17033J8614
36887b32870J13284M630j22390n1495R5149P0508p1334p2682Q4967J57121M7037
36876B1925o6184n6945k8048o7450q4103j2197L8160j6190n7163L8457J63600
36865a26138J19551q6416k40599j92027l958J58274K06595J77536J35582O8049
36855B16449p3671k27127k27111m3892J08126M9302q6884n9927Q2743Q6909p0034
36844b45117j38501l2871K3921q8020j46893L5715K65061K46406L0939r5031m9764
36833a94155j4142r6629j82426j37984O547J22365J30863O3703K3794P7478J66040
36822c4546J71917P9963j1606m7840o6686p4818j8889Q0768J21101Q6173O1464
$$ plain form
36898 -111110 -324996 -271064 -107960 -83394 -209064 -272929 -173686 -74169 -134451 -251484 -232870
36887 -232870 -119586 -114956 -237346 -288841 -193692 -123184 -194518 -267200 -182233 -25112 21925
36876 21925 -44259 -101204 -129252 -196702 -280805 -293002 -254842 -271032 -328195 -289738 -126138
36865 -126138 -6587 -93003 -333602 -525629 -529587 -371313 -164718 12818 148400 216449
36855 216449 142778 -84349 -311460 -355352 -247226 -197924 -284808 -344735 -261992 -175083 -245117
36844 -245117 -383618 -416489 -392568 -480588 -627481 -591766 -326705 -80299 -49360 -144391 -194155
36833 -194155 -208297 -304926 -487352 -625336 -618789 -496424 -365561 -301858 -278064 -200586 -34546
36822 -34546 137371 217334 205728 157888 91202 16384 -2505 78263 199364 285537 347001
36811C47001L8486q9872k72804k80236n8096J32646R3305k2127J1216J26104J12107
36800A37730l9605j71966k07433j51193O837J88805J88358m1813k23895j18378
36790d32553J13250J76580J00690J06323J65338O4704j63958k50562j12194N2244
36780a80138R4176M9909m1697j63676j85475o346J88157J31194q5801j26894L9634
36769b86957R4645p9536j99918n7709J68690K35161J56777N1960n9973j52403
36759a29263j36317m6886m5873j36862j37209j4194N0695J5179M5732J28283J3037
36748c93678k82630l51657l3729K53042J50258p4953j4119J96320J72325j2291
36738c91112K1160K55164K95249M8544j43889r4664j8561r4166j88004j57066
$$ plain form
36811 347001 385487 295615 22811 -257425 -315521 -182875 -89570 -111697 -100481 25623 137730
36800 137730 98125 -73841 -281274 -432467 -425630 -236825 -48467 -90280 -314175 -432553
36790 -432553 -319303 -142723 -42033 64290 229628 294332 130374 -120188 -232382 -180138
36780 -180138 -85962 -36053 -77750 -241426 -426901 -433247 -245090 -113896 -199697 -326591 -286957
36769 -286957 -192312 -271848 -471766 -529475 -360785 -125624 31153 83113 23140 -129263
36759 -129263 -265580 -312466 -358339 -495201 -632410 -646604 -595909 -580730 -534998 -406715 -393678
36748 -393678 -676308 -1027965 -1061694 -808652 -658394 -733347 -747466 -551146 -378821 -391112
36738 -391112 -369952 -114788 180461 229005 85116 -9548 -28109 -122275 -310279 -467345
36728d67345q6850p4177m9538L9242R5395N1088j7595n0133r1094j39978r6405
36717h87390O0334K01107K29167J85247J23120L5304n5159q3489o0095n2215l9198
36706c43267M7474J42535J04100l7531j03620n9008m4658q5593l5427J10729J31354
36695a72912n7650k18460j50798n69P474n6941J5671J83869K01534R710j64090
36684d03162j22446O1131J66028Q5591p7372j36779l4794Q6937P8762N810M4263
36673b46031J69262J54251n7083k07881r8832J01784J15298m0703j30679p3382
36663c13996M519K3929L0804M0423R714l6877k8892R269j461l5647j1947K7431
36651b82731k5028j20110r5026N2374J46105J21183J09253J71914J74114L5318
$$ plain form
36728 -467345 -554195 -628372 -677910 -638668 -543273 -492185 -509780 -559913 -651007 -790985 -887390
36717 -887390 -827056 -625949 -396782 -211535 -88415 -53111 -108270 -191759 -251854 -304069 -343267
36706 -343267 -295793 -153258 -49158 -86689 -190309 -249317 -293975 -379568 -414995 -304266 -172912
36695 -172912 -230562 -449022 -599820 -600389 -592915 -649856 -634185 -450316 -248782 -239072 -403162
36684 -403162 -525608 -464477 -298449 -212858 -290230 -427009 -461803 -374866 -296104 -290294 -246031
36673 -246031 -76769 77482 20399 -187482 -286314 -184530 -69232 -109935 -240614 -313996
36663 -313996 -309477 -285548 -254744 -214321 -204607 -241484 -270376 -261107 -262568 -298215 -310162 -282731
36651 -282731 -307759 -427869 -522895 -470521 -324416 -203233 -93980 77934 252048 287366
36641B87366r6451p3389J2643p787j00467r2110N1230J80768J80175R2333K6490
36630D60801K2651J5891q9830k78212l59713j66518J69922L01681J08360j21556
36620F3477r6947O8551P2671r8143j92159j20046m6064m9200p473J08922J28728
36609a67683o705r2687K879J01353K7887o4400L3906J71952M0697k91903m15971
36598f60675j73547J19229J44284j2535q2646q692P7861J10330J13959P6329k4360
36587c20463j12723r0425J4040R1703J14165J31350J38099O5047r4641k41257
36577c05105k65698j48235J8454P7889m8504k17231j60944J72163M77388M33662
36567C3839J09503j37960j19723K1332R0076O8742J6135o6226j58685j56973j1522
$$ plain form
36641 287366 190915 117526 130169 122382 21915 -70195 -18965 161803 341978 434311 460801
36630 460801 483452 499343 409513 131301 -228412 -394930 -225008 76673 185033 63477
36620 63477 -33470 35081 107752 9609 -182550 -302596 -348660 -397860 -405333 -296411 -167683
36609 -167683 -174388 -267075 -264196 -162843 -134956 -199356 -165450 6502 47199 -244704 -660675
36598 -660675 -834222 -714993 -570709 -583244 -665890 -674582 -596721 -486391 -372432 -296103 -320463
36587 -320463 -433186 -523611 -509571 -417868 -303703 -172353 -34254 30793 -63848 -305105
36577 -305105 -570803 -719038 -700584 -622695 -671199 -888430 -1049374 -877211 -399823 33839
36567 33839 143342 5382 -114341 -93009 -2933 65809 81944 15718 -142967 -299940 -311462
36556c11462J47928J40971m8048k55832l09723j71443M2222J52698Q8224k3827
36546e48292n764J20238J41833m2634k56242k63270o3256J34687J66980N0259
36536e65461r1427j45126q0813L0607Q9552Q2746P6512Q6301M9642l9623r2645
36525e99735p9848q6915j32533q8943Q3106J82206M2785j68407j70429O884Q5201
36514i26628j6007q7577p643P9601M7650r431K0044Q7725J46760K68866M31433
36503C4793M03523P4771k63344k29773J37035M27877L76857J01934j42882k28859
36493F91932j50651K9942J81680J92478J00469K6810o789n3449p2444K0142J47041
36482A107161J47367P6560J62513L91312M33237J41459j57216j16478J12626J29886
$$ plain form
36556 -311462 -163534 -22563 -70611 -326443 -636166 -807609 -765387 -612689 -524465 -548292
36546 -548292 -554056 -433818 -291985 -334619 -590861 -854131 -917387 -782700 -615720 -565461
36536 -565461 -656888 -802014 -882827 -852220 -762668 -679922 -603410 -517109 -467467 -507090 -599735
36525 -599735 -679583 -766498 -899031 -987974 -904868 -722662 -679877 -848284 -1018713 -1011829 -926628
36514 -926628 -942635 -1030212 -1037855 -958254 -910604 -920035 -899991 -812266 -665506 -396640 34793
36503 34793 438316 513087 249743 19970 157005 584882 961739 1063673 920791 691932
36493 691932 541281 571223 752903 945381 1045850 1072660 1065871 1012422 939978 960120 1107161
36482 1107161 1254528 1331088 1493601 1884913 2318150 2459609 2302393 2185915 2298541 2428427
36472B428427j03028k54325j65406m0305n4954j08415p9671n6957j42426k33768
36462A189172j89964p6478o0721j46346j76344o2755J13090K13706J76514N0128
36452A030002n3335p3435p7823j50555k15422j16281J00942J81743L1780j12959
36442E44657m3645Q9557L3102j38831j42779M3203J43502K3367j34978j56331
36432B60824j03329p9951m1611N9906J32173R1824J4310L812L8926N4644M5399
36421D76927q217j53930k97658k09886J33513L99098K95458k7913k16160k01630
36411A89602j76307j78643n6279J68276K45254R4598m7162o501O5479j9221j61612
36400A17484j50774q61J09374J28519J44803J63070Q3586q9861j95984j24114
$$ plain form
36472 2428427 2325399 2071074 1905668 1865363 1810409 1701994 1622323 1565366 1422940 1189172
36462 1189172 999208 922730 862009 715663 539319 476564 589654 803360 979874 1030002
36452 1030002 976667 903232 825409 674854 459432 343151 444093 625836 657616 544657
36442 544657 501012 590569 623671 484840 342061 385264 528766 552133 417155 260824
36432 260824 157495 77544 35933 95839 228012 319836 334146 337958 376884 431528 476927
36421 476927 468710 314780 17122 -192764 -59251 339847 635305 607392 391232 189602
36411 189602 13295 -165348 -221627 -53351 191903 286501 239339 232838 298317 279096 117484
36400 117484 -33290 -34151 75223 203742 348545 511615 595201 505340 309356 185242
36390A85242K8678O4532r1285k93188k99616l1728K87272L38089Q5459j62325
36380A11130j46373K5896Q8015R788j8295P0601J25783M5347p0414r2552k6529
36369A22397O2456J39339J48975K6316j58807k11961p4301O1888K0425j04672
36359C2055j15006j6861K3587l3913o6029j6359K9327J6306l892o438l8754q4787
36347b80764m5390P3772J11518r719j33048q2391Q4362J78203J44925P7358L1884
36336A50710k134P763J02570J93490J28310p6417k18329j66952r526J01041J14745
36325C25271N5618l7821p9316J7416J73695J72622l6937k09689j34209L7409K002
36314B86061k34615l58898k03008M8992J62078J31322N9833l8547j53896j52709
$$ plain form
36390 185242 213920 278452 187167 -106021 -405637 -437365 -150093 187996 273455 111130
36380 111130 -35243 -9347 78668 88456 70161 140762 266545 311892 241478 148926 122397
36369 122397 184853 324192 473167 499483 340676 128715 54414 116302 136727 32055
36359 32055 -82951 -99812 -76225 -110138 -176167 -192526 -163199 -146893 -150785 -157223 -195977 -280764
36347 -280764 -326154 -252382 -140864 -150583 -283631 -366022 -281660 -103457 41468 118826 150710
36336 150710 148576 156339 258909 452399 580709 504292 285963 119011 109485 210526 325271
36325 325271 380889 343068 263752 281168 454863 627485 590548 380859 246650 284059 286061
36314 286061 51446 -307452 -510460 -461468 -299390 -168068 -108235 -146782 -300678 -453387
36304d53387O0738L29021L79007J59283j09857k16380j48416q576J13625J49798
36294B54856O8487n3370p6988J8278R1062L3073q5946j39921j15815o6654R070
36283f3868J10392J33300l434j64839j22628J08292K46946J29547o6175r9618
36273B07915p755R198p3789j02369l2788K297n4653p4469L6159J64336J57993
36262B32075M9056j0565L6612J11421J23981N4297n6170j26073r1151R27R491
36251C33901j19870k57379k43978q1007J09880K38275K64105J56663l4235j41458
36241B24897o9260L9087q305j45881j40948L2246J48697R2786R867J2617q455
36230A87348j27869j73628Q30K07871J60782p8254j67850J5883K21223K05359
$$ plain form
36304 -453387 -392649 -63628 315379 474662 364805 148425 9 -8567 105058 254856
36294 254856 323343 269973 192985 211263 302325 335398 249452 109531 -6284 -72938 -63868
36283 -63868 46524 179824 176390 11551 -111077 -2785 244161 373708 307533 207915
36273 207915 200160 209358 135569 33200 412 2709 -51944 -126413 -90254 74082 232075
36262 232075 281131 270566 307178 418599 542580 596877 540707 414634 323483 324410 333901
36251 333901 214031 -43348 -287326 -368333 -258453 -20178 243927 400590 366355 224897
36241 224897 155637 194724 186419 40538 -100410 -68164 80533 173319 183186 195803 187348
36230 187348 59479 -114149 -113319 94552 255334 177080 9230 25113 246336 451695
36220D51695M3355m7641j6084K2118j5630r2812j20939m6280Q9252J48341K9501
36209D44876j76339k49875j06240R7170J69209J03949J4696n4614j34483k04214
36199i5865j94358j07971k8670N720M2884J05835J36291R8499O0678R2341J29239
36188B44623M6680j31521k09384o8228J41483J69990K151j14668j3168J57539
36178B25497J44619n1969j88297j13658O0671J56340J42940Q5242J264j10295
36168C52354j77514j21827O423P1016K7770l7143n4571n7977q7083r8314l9630
36157b16496M6661P8770O2275P3191J15546Q9990n2944k03960k16507r6987J6227
36146c04234N0183O7787J17482J29075M2408m9571j4343J01225J09660m1425j69811
$$ plain form
36220 451695 495050 447409 431325 453443 437813 345001 224062 177782 267034 415375 444876
36209 444876 268537 18662 -87578 9592 178801 282750 297446 242832 108349 -95865
36199 -95865 -290223 -398194 -426864 -421144 -378260 -272425 -136134 -37635 23043 115384 244623
36188 244623 291303 159782 -49602 -117830 23653 193643 195794 81126 67958 225497
36178 225497 370116 318147 129850 16192 76863 233203 376143 461385 462649 352354
36168 352354 174840 53013 59436 130452 158222 121079 66508 8531 -78552 -176866 -216496
36157 -216496 -169835 -91065 -28790 44401 159947 249937 196993 -6967 -223474 -320461 -304234
36146 -304234 -254051 -186264 -68782 60293 102701 53130 38787 140012 249672 208247 38436
36135C8436j07531N4429Q4233p2331k13565j43842P5860K05393J19567n0841r4067
36124a04259K4249J41719J17751j3751j29271j63818j17756J538J52069K28224
36114A36695J66505M6779j5245l7432j07502j85327j35751L2493J37975Q9431
36104A28621J2711L4324R2059P2284L286k4984l5496j08032j98732j55098Q1076
36093i7981L56963M10031J03323l81905o31184m13454J1079J95147J02290J07335
36083b38356L43068M38108J32558k24038j72948J39105K14532r401j54737j02953
36073C64938j33614l11950l00841K9063K97750J97933l4803n0620O5503L1283
36063A54642j20304j48137l7644L4836M9008J18611K04750J55664j1625j24563
$$ plain form
36135 38436 -69095 -14666 69567 -2764 -216329 -360171 -284311 -78918 40649 -10192 -104259
36124 -104259 -80010 61709 179460 165709 36438 -127380 -245136 -243598 -91529 136695
36114 136695 303200 349979 334734 297302 189800 4473 -131278 -98785 39190 128621
36104 128621 141332 175656 267715 339999 343285 318301 282805 174773 -23959 -179057 -97981
36093 -97981 258982 669013 772336 390431 -240753 -654207 -643128 -447981 -345691 -238356
36083 -238356 104712 542820 675378 451340 278392 417497 632029 622628 467891 364938
36073 364938 231324 -80626 -381467 -352404 -54654 143279 108476 57856 123359 154642
36063 154642 34338 -113799 -151443 -116607 -67599 51012 255762 411426 399801 275238
36053B75238j10557l1392O4250J20546J3017k60839m35443k79411M4569J85654
36043d14368Q2131n3936j46203l14606n56496p08764p48286q04230q26358n73490
36033e064606l3857M40592N59189M19337K91829K94101L83487M70985M39631K36981
36023a562331K2207J7577J59640J48311p9482k12480l5996K42720L26091K28342
36013g45401J29015N2561n4989j10084j6104J19128J26546L7777l206J2300J538
36002d50919j7925J5174M6107o14n0559L305R8309J08584O1816N0584K7861q4876
35990a93153j79100j00816N7484P2383m6198q2912R224N5360L90L385J13754J38211
35978a51988l5271k21028k10243p4298j4587n0660m6432L8618J04326Q7437M1600
$$ plain form
36053 275238 164681 133289 197539 318085 331102 70263 -365180 -644591 -600022 -414368
36043 -414368 -332237 -386173 -532376 -846982 -1403478 -2112242 -2860528 -3664758 -4491116 -5064606
36033 -5064606 -5098463 -4657871 -4098682 -3679345 -3387516 -3093415 -2709928 -2238943 -1799312 -1562331
36023 -1562331 -1540124 -1522547 -1362907 -1214596 -1294078 -1506558 -1542554 -1299834 -973743 -745401
36013 -745401 -616386 -563825 -618814 -728898 -745002 -625874 -499328 -461551 -464757 -452457 -450919
36002 -450919 -468844 -453670 -407563 -408177 -458736 -455431 -357122 -248538 -186722 -136138 -108277 -193153
35990 -193153 -372253 -473069 -415585 -343202 -389400 -472312 -463088 -407728 -407338 -403953 -290199 -151988
35978 -151988 -187259 -408287 -618530 -692828 -707415 -758075 -804507 -765889 -661563 -574126 -532526
35967e32526L2671N2366N9773N1533O0059R4969J07434L9761q1266j45503r2278
35956c53007K232K6659j8170m3379q826M3724P4629R0828J13955J50935J76881
35945B56461J27933k5789j77805j63249R762J39355J17083P2145J09695J00446
35935E66037o9380k19180j21476R5374J07667j01087k26782j29445k992j0173
35925a11437n9238m3141k6616o9956r7832o5596m9826o4709N863J80443K84912
35914a17133K04836M9554m1962p1290n9035L6678J63683J53002j1334j10354k2488
35903A74157P9119K5221p6270o4012j2857p0172j72598j58815k7200J26453K79823
35892A02849L85342K74855q2843l81068l17641l0385R3001m5322j93127j70557
$$ plain form
35967 -532526 -499855 -447489 -387716 -336183 -276124 -181155 -73721 -33960 -115226 -260729 -353007
35956 -353007 -350775 -324116 -342286 -385665 -394491 -350767 -276138 -185310 -71355 79580 256461
35945 256461 384394 358605 180800 17551 27313 166668 283751 355896 465591 566037
35935 566037 496657 277477 156001 251375 359042 257955 31173 -98272 -101264 -111437
35925 -111437 -170675 -213816 -240432 -310388 -408220 -473816 -523642 -588351 -582488 -402045 -117133
35914 -117133 87703 137257 95295 24005 -35030 1648 165331 318333 306999 196645 174157
35903 174157 253276 278497 202227 138215 125358 55186 -117412 -276227 -303427 -176974 102849
35892 102849 488191 763046 680203 299135 -18506 -48891 44110 -1212 -194339 -364896
35882c64896n9062K0767N5310M6523o473k7867M7508J33693J18763O4306P8655
35871A07227Q7483j9007j12328j0900J38210L3894k42781k79994J4672K36947
35861d6577J08045j27858j59792r9386j92408l20649j81405J81303M03491L22109
35851a13127J44562P3201M5559n8342j72758j61063n0419L041n3679j00360k7136
35840d70521J07325J69696J45758J33340J57003J27563K3933l8055q449j6432
35830C31161j38486k10855p7982J07778R4769o1405j08409n1228j27312l16930
35820e58899k90643L1679K69027J47381p4060m1091J29726R5897j07179j29408
35810e27570J05768K81308J86974P70k9115P6029J32460O1877o8671j59296j44497
$$ plain form
35882 -364896 -423958 -403191 -347881 -301358 -307831 -335698 -288190 -154497 -35734 28572 107227
35871 107227 194710 175703 63375 52475 190685 224579 -18202 -298196 -283524 -46577
35861 -46577 61468 -66390 -226182 -325568 -517976 -838625 -1020030 -838727 -435236 -113127
35851 -113127 31435 104636 150195 91853 -80905 -241968 -292387 -289346 -343025 -443385 -470521
35840 -470521 -363196 -193500 -47742 85598 242601 370164 394097 356042 347593 331161
35830 331161 192675 -18180 -96162 11616 106385 44980 -63429 -114657 -241969 -558899
35820 -558899 -849542 -817863 -548836 -401455 -475515 -516606 -386880 -290983 -398162 -527570
35810 -527570 -421802 -140494 46480 47250 18135 94164 226624 288501 219830 60534 -83963
35799h3963l5066N7850K6199q0303j03352n368P1505K9468k5408M9587J91645
35788I2794J95049M532j80943j53964L4161J48562Q2759k7155l0162L1184M2224
35777B39041L2130R6654J66385P0485j52932k34552n1380J65717J40042p8588
35767C93002k08154j11126P4950J42304L4347j20690j41133Q870J45601Q0327
35757B98298j05570j61065m7014J4910o1408o5960J14503K34378P6262j50434
35747A46900j25342O1284Q0172p1979r4667P4852J65094N2460n7570k7442j943
35736B01819q6308j35620l6790P8835Q0908M9075O7476N2656l9449p6737p246
35725A48619n634j53818k28018n7610J45621J17178j9638O563J13693J1669k50051
$$ plain form
35799 -83963 -119029 -61179 -34980 -115283 -218635 -224003 -152498 -123030 -148438 -98851 92794
35788 92794 287843 292375 111432 -42532 -8371 140191 222950 195795 165633 196817 239041
35777 239041 271171 367825 534210 604695 451763 217211 165831 331548 471590 393002
35767 393002 184848 73722 148672 290976 325323 204633 63500 72370 217971 298298
35757 298298 192728 31663 -15351 -441 -61849 -127809 -13306 221072 297334 146900
35747 146900 21558 82842 163014 91035 -3632 71220 236314 288774 231204 203762 201819
35736 201819 115511 -20109 -56899 21936 102844 151919 219395 272051 232602 155865 148619
35725 148619 142985 -10833 -238851 -296461 -150840 -33662 -53300 -46737 66956 78625 -171426
35714a71426l11773p6153J53525J67228J09997J44962J89193J30949K9396n0684
35704C15214j54521k52289j90174K7605J61376J01290M5120J22923J33628q2494
35694B27678k82669j73123R5530J71263P5825J01469K29249J40286j73547l06233
35684A05728q3847J35657L7713j63457j17031J00007J69292O5927K5989R3492
35674C69470O8660j08217k35127j58631K4025J28657Q6526m5435j45566j01948
35664a17586N4451J28200J975j63764j38425L8299J26671N4247j4153L0006R9916
35653I9837R8484M4888k0186q1680q1788K6174J53879J81114J51111J55801R0418
35642H18052j84164m70214l98817j5286K01781L4650j65507o7289J45501J59872
$$ plain form
35714 -171426 -483199 -559352 -405827 -238599 -128602 16360 205553 336502 365898 315214
35704 315214 160693 -91596 -281770 -254165 -92789 8501 53621 176544 310172 227678
35694 227678 -54991 -228114 -132584 38679 114504 215973 445222 585508 411961 105728
35684 105728 21881 157538 195251 31794 -85237 14770 184062 249989 275978 369470
35674 369470 438130 329913 94786 -63845 -39820 88837 175363 129928 -15638 -117586
35664 -117586 -63135 65065 67040 -96724 -235149 -196850 -70179 -15932 -30085 -79 99837
35653 99837 198321 243209 223023 141343 59555 85729 239608 420722 571833 727634 818052
35642 818052 633888 163674 -235143 -250429 -48648 -13998 -179505 -246794 -101293 58579
35632E8579N6092P5400J49197O3453j15365j75869j49817j69648j09534J86069
35622a31443M48032K62333k35749m60919k15268P3486O2403n0523J6802J65081
35612f5765J90202J61860K03777J82464m4112k81221k43590j805J40361J12231
35602C54402J03270J80526J95395Q8848J3739Q1919K02744K57855K63122K60716
35592B002536J98595M5970p0989l554J77575K26634N2868j22640n4576J65156
35582B617575K14165N316j73453q8707P9477K0831k04847k34200O6691M11533
35572B714381M77779K51027p2011l06953l31167j21550J45386K02751M823k25651
35562B738815l31198l98760n04771n14288l13594n5099L8945j9246p0064p0059
$$ plain form
35632 58579 114671 190071 339268 402721 287356 111487 -38330 -207978 -317512 -131443
35622 -131443 316589 578922 343173 -117746 -333014 -259528 -197125 -247648 -230846 -65765
35612 -65765 124437 286297 490074 672538 628426 347205 103615 101810 242171 354402
35602 354402 457672 638198 833593 922441 936180 1018099 1220843 1478698 1741820 2002536
35592 2002536 2201131 2247101 2176112 2172558 2350133 2576767 2629635 2506995 2452419 2617575
35582 2617575 2831740 2837056 2663603 2574896 2654373 2675204 2470357 2236157 2302848 2714381
35572 2714381 3192160 3443187 3371176 3064223 2733056 2611506 2756892 2959643 2964466 2738815
35562 2738815 2407617 2008857 1504086 989798 676204 621105 660050 640804 570740 500681
35552E00681o5391k2161Q8085J25681m5173k71117k51785K9738K54666J88776
35542E32000n1656k19060k32633j59397n1128O5730J24699P6371j4983l1168M1620
35531H0395R2561M9067j1784J3934O7595q468j92439k29142K2580L27291L56342
35520E67932J39395j8673j8791n0270j70626j64091M5897J87436O5791j01805
35510D82195n3421Q0824M1652q2353l4141J05874K9344k37724l18051o8546K11671
35499A57324K55945J61421J09924P1902l0564j16242r3723l3934l0395m4767k8297
35488C78594l9808j10964j48749j03642q0506j43299j64092k6459J56624J99548
35478h2753J06518Q369n9030j30310j47827k3630J71289K59589J91356P7527L621
$$ plain form
35552 500681 435290 413129 501214 626895 581722 310605 58820 88558 343224 532000
35542 532000 480344 261284 28651 -130746 -181874 -116144 8555 84926 69943 38775 80395
35531 80395 172956 222023 210239 224173 291768 283300 90861 -138281 -115701 211590 567932
35520 567932 707327 688654 669863 619593 448967 284876 330773 518209 584000 482195
35510 482195 428774 509598 551250 468897 434756 540630 569974 332250 14199 -54347 157324
35499 157324 413269 574690 684614 756516 725952 609710 515987 482053 451658 406891 378594
35488 378594 338786 227822 79073 -24569 -105075 -248374 -412466 -438925 -282301 -82753
35478 -82753 23765 32134 -26896 -157206 -305033 -328663 -157374 102215 293571 371098 374719
35467C74719m4828q0472q9208j13749k07571k77394j36778K02290M34457K94179
35457C55645r1616l31495k34810o731O3822j8888j6568J61733L04344J86730r8638
35446B73528k33304p0908J79662K15126L783j90557j38183Q0918J87674O1214
35436C68953j16189j25042j7744j6177j46868j89629l9616J00649L4172j11282
35426b58773q7004Q1303J49478M3916o0071m3693J2799K8780M5868Q9563R8424
35415A00590N9535M3729M6272k9623j64552j88427m6704Q1139M1366q2101j32260
35404b71036r3638j9885Q5368J73625J07633j15037k51280j25310Q4093R2204
35394c33263p0039j36076l1357N4706J1909m1854K764R2540J63003K39259K98694
$$ plain form
35467 374719 329891 249419 160211 46462 -161109 -438503 -575281 -372991 61466 355645
35457 355645 264029 -67466 -302276 -309007 -245185 -264073 -280641 -118908 185436 372166 273528
35446 273528 40224 -30684 148978 364104 367887 177330 39147 120065 307739 368953
35436 368953 252764 127722 109978 93801 -53067 -242696 -282312 -181663 -147491 -258773
35426 -258773 -345777 -264474 -114996 -71080 -131151 -174844 -162045 -133265 -87397 2166 100590
35415 100590 160125 203854 250126 220503 55951 -132476 -179180 -98041 -56675 -138776 -271036
35404 -271036 -364674 -384559 -299191 -125566 -17933 -132970 -384250 -509560 -425467 -333263
35394 -333263 -403302 -539378 -570735 -516029 -504120 -545974 -543210 -450670 -287667 -48408 250286
35383B50286K21165l969j73151j12621P6386J55866O6182l5262k1222N1162N6870
35372E31692j7162o4938p317R8345J13459j9524j94236k44385j19443P1348J78845
35361C26684J42169Q710j21115j58631q5047K5535O6466N209q6082j20219r1668
35350h7989n8341m5099j1809O5674J23723P5123n8720j43346q9224L9739J22462
35339f7807J32138J20133R5380K3645o7886r9369o8419o5533j24770j56678p9284
35328c58450O5924J77119J96852J17000l0895j44659j13611K2091P7092l0800
35318b2337j42631q0115Q8362J47287M1001p4187o5757L4359J35980K05359K34880
35307E02201K02768J17471L6340n68n852Q497N9881J34449J49892L7059j54561
$$ plain form
35383 250286 471451 467482 294331 181710 258096 413962 480144 444882 423660 474822 531692
35372 531692 514530 449592 442275 540620 654079 634555 440319 195934 76491 147839 326684
35361 326684 468853 477563 356448 197817 112770 138305 204771 209980 123898 3679 -87989
35350 -87989 -146330 -191429 -203238 -137564 -13841 61282 2562 -140784 -230008 -190269 -67807
35339 -67807 64331 184464 279844 303489 235603 136234 67815 2282 -122488 -279166 -358450
35328 -358450 -292526 -115407 81445 198445 167550 22891 -90720 -68629 8463 -22337
35318 -22337 -164968 -245083 -156721 -9434 31567 -42620 -108377 -74018 61962 267321 502201
35307 502201 704969 822440 858780 858212 852360 860857 920738 1055187 1205079 1242138 1087577
35296A087577k81107k49669j15336r276J3650Q105J7578K330n6624o6723M7649
35285C98154J80698J61979J9049n4882j3960l2515j85460k71610j16191J24528
35275B09790J74913M3495k3479N7283J00509k0657j59606j14510P4172J71972
35265E13882M8737j68784k54309j43805O130L0669l4220l3041O2389J24758R4578
35254B46984O6188R6296R9814L3639J1650R6211J32359l2581k85305l84733k66094
35243a85572m2387J79723L02430J92717j27757l55549k26652J10990K96593K39055
35233C83591J17782j493j91452l38318j94889J78669L97286K82357P3065j0125
35223F96473o3517j97576k76697j84115n9759m2060k9787P0958J21933K4205m3502
$$ plain form
35296 1087577 806470 556801 441465 432189 445839 453944 471522 473852 417228 350505 398154
35285 398154 578852 740831 759880 704998 691038 658523 473063 201453 85262 209790
35275 209790 384703 428198 404719 462002 562511 541854 382248 267738 341910 513882
35265 513882 562619 393835 139526 -4279 1851 32520 -1700 -34741 27648 152406 246984
35254 246984 313172 409468 509282 542921 554571 650782 783141 750560 465255 80522 -185572
35243 -185572 -227959 -48236 254194 446911 319154 -36395 -263047 -152057 144536 383591
35233 383591 501373 499880 308428 -29890 -224779 -46110 351176 633533 706598 696473
35223 696473 632956 435380 158683 -25432 -85191 -127251 -157038 -86080 35853 60058 16556
35212A6556N9521J30692l6844k32820j28473J68703K68184J04409k4919J3113
35202C38122L9443k9284k6987J10866J90050Q5069o3259j10510j13855j43053
35192B76602j23597j2310P5087M7409l1371j00762j95212k74163j87677N2209
35182d73785J95243J11758j564L4760P7563m6063j66974k8772K39867K79117N2972
35171B74122j19672p7488N855o58M833O3704K2842j37588j64902N1396K16021
35160A38465O6691j68038j02589J85862K75954O5010j15142p6429m0962j78787
35150E0035k64857o6827K09234J99652n0706j56086K2333J88404P2503j85186
35140A8499k51171l6571K29883K94739J32778p2687j33845l3556Q8977J14711
$$ plain form
35212 16556 76077 206769 169925 -62895 -191368 -22665 245519 349928 325009 338122
35202 338122 377565 348281 321294 432160 622210 707279 644020 533510 419655 276602
35192 276602 153005 140695 215782 263191 231820 131058 -64154 -338317 -525994 -473785
35182 -473785 -278542 -166784 -168348 -133588 -56025 -102088 -269062 -297834 -57967 221150 274122
35171 274122 154450 76962 82817 82159 86992 150696 173538 35950 -128952 -77556 138465
35160 138465 205156 37118 -65471 120391 396345 461355 346213 269784 228822 50035
35150 50035 -214822 -281649 -72415 127237 76531 -79555 -57222 131182 203685 18499
35140 18499 -232672 -269243 -39360 255379 388157 315470 181625 148069 237046 351757
35130C51757O0542o573q7323j87212k05189l9709K02536K68397P6968j60601k09241
35119F4352p7067P0603J47607J72557J40353K4637j06288j17739P604J10589L8637
35108D75845j65523l12765k77776j12852L6151P9621M0992O325M7117J65112K72767
35097B55014K45978M9056j94387l08742k47619j12542J550Q9651J53337J52575
35087H3871R9193Q6745J40296J39071k108j68955j98533j15134o3719p0008l9333
35076a08614L8182O2267M722m7436m7170l7515l1696J2483Q2858J16665J19995
35065A64741J39282J24262m239j53530j37874J4631O5585n7502j29828R036J88346
35054B22910J66040k5294j71824j79258j08010k0478M3778L0482m8336p6755M233
$$ plain form
35130 351757 412299 405726 318403 131191 -73998 -113707 88829 357226 434194 273593 64352
35119 64352 -12715 57888 205495 378052 518405 543042 436754 319015 326619 437208 475845
35108 475845 310322 -2443 -280219 -393071 -356920 -277299 -236307 -229982 -182865 -17753 255014
35097 255014 500992 550048 355661 46919 -200700 -313242 -311692 -222041 -68704 83871
35087 83871 183064 269809 410105 549176 547068 378113 179580 64446 727 -69281 -108614
35076 -108614 -70432 -8165 -3443 -50879 -98049 -135564 -167260 -154777 -71919 44746 164741
35065 164741 304023 428285 424046 270516 132642 147273 212858 155356 25528 34564 222910
35054 222910 388950 363656 191832 12574 -95436 -115914 -72136 -41654 -89990 -166745 -162512
35043a62512R4136J00275Q8946J42256J87360J19465q519p2356o5123n8519o1867
35032C03542n2204n4821o9330j8623J05631J69221R8648J5758K0487N426j24755
35021C98980k23824j34416P509j7710j21803m6977J75071K42854O1701j20173
35011B21212j01441K5990R1710O7792j724q8540j32222q0088p953k5795o2845
35000i3904M4567K52634L40514K58355J77617J49938J3948k50907l72125j68187
34990C52450J45416K40566R8411n2618r1117r2026j29387j63966j22062N945J40468
34979C32080J64528M6919r4787j32139r1747o6899k5528J04697K03504O6149k33581
34968B73196l57814j61926J11972K01497J41466Q7460N6469M721l2175l5989p3135
$$ plain form
35043 -162512 -68376 31899 120845 263101 450461 569926 561407 489051 423928 365409 303542
35032 303542 251338 196517 127187 108564 214195 383416 482064 497822 518309 523735 398980
35021 398980 175156 40740 48249 30539 -91264 -138241 36830 279684 341385 221212
35011 221212 119771 145761 237471 305263 303539 214999 82777 2689 -5264 -31059 -93904
35000 -93904 -49337 203297 543811 802166 979783 1129721 1143669 892762 520637 352450
34990 352450 497866 738432 836843 784225 693108 601082 471695 307729 185667 191612 332080
34979 332080 496608 543527 448740 316601 224854 157955 132427 237124 440628 506777 273196
34968 273196 -84618 -246544 -134572 66925 208391 295851 352320 357041 324866 288877 215742
34957B15742j36321j04246K3324P0241k937J2742J93677K69363M4635k16900j53126
34946B16194J45423K96771K08747J31909J92501K29702J14418o5150j77141j76653
34936A116721n5012J25502J64779o8150l68191l84926r6657J54233J34314k0654
34926G01959q1116k2224M8412N9447k9482k26899m05419l62323r0458J54209J61524
34915i2370J5935p0095n1189m6128j15101j72491j13807M5976J76046J64282N3210
34904b05732K868P8324J46054P3546n0199m8066M8562M4697p7668r8783Q0848
34893e549K37827J31622j38299k61941j30841M9055M6491j22248k43691j65402
34883f02976L5559J41550M8061j04377j00903P3506K22727K06558J05849O6249
$$ plain form
34957 215742 79421 -24825 -1501 68740 65803 78545 272222 541585 586220 369320 216194
34946 216194 361617 658388 867135 999044 1191545 1421247 1535665 1470515 1293374 1116721
34936 1116721 1061709 1187211 1351990 1283840 915649 530723 434066 588299 722613 701959
34926 701959 620843 598619 647031 706478 676996 450097 44678 -317645 -408103 -253894 -92370
34915 -92370 -76435 -146530 -197719 -243847 -358948 -531439 -645246 -599270 -423224 -258942 -205732
34904 -205732 -202864 -124540 21514 95060 44861 -3205 45357 90054 12386 -86397 -5549
34893 -5549 232278 363900 225601 -36340 -167181 -118126 -71635 -193883 -437574 -602976
34883 -602976 -567417 -425867 -377806 -482183 -583086 -509580 -286853 -80295 25554 91803
34873I1803P6837J0666j53715k66132j92778m24J16215P6590L292L0521J05904
34862a01221Q8897l930j4465Q6279J31353L7683l5999M8679J54404O7720j61389
34851B98011k89333k16640n6453P5014J36991Q9580m7294j07768K4200J79183
34841H5491J10026j05385j59316k481R4684J6156k2074J04820J79614K6230j54923
34830A72842j00544R4576J51023L0606q6461j22247j32058j10205k0454M8818
34820g4104k926q3053m4311L6213k9981j93094k03760q472J62913J56081R0063
34809a94431J09557J60519J31635M2608l4637j01533j59836j35609J307J39403
34799d1017J61691R8417M3427O195m1648n8399n460L6439k7440j24343r7288M1885
$$ plain form
34873 91803 168640 179306 25591 -240541 -433319 -433743 -317528 -240938 -237646 -207125 -101221
34862 -101221 -12324 -16254 -30719 55560 186913 224596 188597 237276 391680 459400 298011
34851 298011 8678 -207962 -264415 -189401 -52410 37170 -10124 -117892 -93692 85491
34841 85491 195517 90132 -69184 -71665 23019 39175 17101 121921 301535 327765 172842
34830 172842 72298 166874 317897 348503 262042 139795 7737 -102468 -122922 -74104
34820 -74104 -77030 -160083 -204394 -168181 -198162 -391256 -595016 -603488 -440575 -284494 -194431
34809 -194431 -84874 75645 207280 249888 215251 113718 -46118 -181727 -180420 -41017
34799 -41017 120674 219091 262518 268713 227065 168666 163206 199645 172205 47862 -49426 -7541
34787g541J13160M7339j1601M3267R7982J3900j29265j62345j07844j23935k04814
34776d31697j68244K6225J72181J22384L917n62Q5497J44035J78269K27947K00954
34765E60906J2574j96765k14633o8890L9815O0951R7804J32737M2519j08418j02793
34754B55807M6102N9979j51684l09905j87144O9490K10014K15864J74339P7691
34744D60553l8072r375J54817J43819j92597m94936l58074N2802K44023J08758
34734G1718k3807K1678O8756q732r3560j00769r8227q4844K8902J64908J33642
34723G9665L25L4552K17259J99856j00053k77663n2067K76925K88767M8078r4696
34712F20948o3353m5167q7187p1984p337j4478p7043p6772k7952k5238k4176O7533
$$ plain form
34787 -7541 105619 152958 141357 184624 282606 296506 167241 4896 -102948 -226883 -431697
34776 -431697 -599941 -573716 -401535 -279151 -275234 -275796 -190299 -46264 132005 359952 560906
34765 560906 573480 376715 162082 93192 133007 193958 291762 424499 467018 358600 255807
34754 255807 301909 361888 210204 -99701 -286845 -217355 -7341 208523 382862 460553
34744 460553 422481 413106 567923 711742 519145 24209 -333865 -281063 -37040 71718
34734 71718 47911 69589 138345 129613 36053 -64716 -162943 -247787 -218885 -53977 79665
34723 79665 79990 114542 331801 531657 431604 153941 101874 378799 667566 715644 620948
34712 620948 557595 512428 425241 353257 345920 331442 254399 177627 149675 124437 100261 167794
34700A67794J47344M7217j39497j54641J4402J17616N2343r494M0947Q1970L5427
34689D01428L2151J50928K27725J17793k8300L6190K81228M27096L13307Q6247
34679B045793K563J31819K83991K19691o8141l20302l09805j16414J462m8252
34669A822405j33609j52316j36131q6279O3481K46016K56969P9152j3604J40170
34659B086254K88367J22174k13288k81851J1516K75989J93469o3443j44605m8930
34649B225652p9081l31673n08142l39447o588P8786j52437l35717k16673j1260
34639C23420j8600j12986K3029K84504K27085j86784m09978j07290K98206K44477
34629E65083j30691k40381N3429L09596K32275K5652n6200p1595j34576j58131
$$ plain form
34700 167794 315138 362355 222858 68217 82619 200235 252578 243084 284031 366001 401428
34689 401428 433579 584507 812232 930025 901725 937915 1219143 1646239 1959546 2045793
34679 2045793 2048356 2180175 2464166 2683857 2615716 2295414 1985609 1869195 1870657 1822405
34669 1822405 1688796 1536480 1400349 1314070 1377551 1623567 1880536 1959688 1946084 2086254
34659 2086254 2374621 2496795 2283507 2001656 2013172 2289161 2482630 2419187 2274582 2225652
34649 2225652 2146571 1814898 1306756 967309 960721 1039507 887070 551353 334680 323420
34639 323420 304820 191834 214863 499367 726452 539668 129690 22400 320606 565083
34629 565083 434392 194011 247440 557036 789311 814963 758763 687168 552592 394461
34619C94461o9873o118p1364j26430k8210J08319R9744r762n0108k65L3072J4529
34607B87995j5300m9735q3355o1542O603P04j09202j54702k8211J03604N5189
34596d7952n7162j2841J12634O4083j26224j40823J03583K73522J01484k13494
34586E6810k89656p1530J58915J85906P4039k286J7666P1909J00990J12428J26026
34575E41217J04472l538j48293j89514p5681O1861P3117k4369j20366j89636k55540
34564b26270k47281p8949J50951K30562J21555j350k2318j1075l2193k3483M7625
34553i2226Q5690M1337K5356J11639J65939L9745j63417j99788k0900J70378J95765
34542C59518R0663p749m5864p0774j25671j86767j95435j27983k1948O9756J30688
$$ plain form
34619 394461 324588 318470 247106 120676 92466 200785 300529 290767 240659 240394 273466 287995
34607 287995 272695 222960 139605 78063 84666 85370 -23832 -178534 -206745 -103141 -47952
34596 -47952 -105114 -117955 -5321 58762 -67462 -208285 -104702 168820 270304 56810
34586 56810 -232846 -304376 -145461 40445 114484 112198 129864 201773 302763 415191 541217
34575 541217 645689 642151 493858 304344 228663 290524 363641 339272 218906 29270 -226270
34564 -226270 -473551 -552500 -401549 -170987 -49432 -50782 -73100 -84175 -116368 -139851 -92226
34553 -92226 -6536 34801 60157 171796 337735 377480 214063 14275 -6625 163753 359518
34542 359518 450181 442432 396568 325794 200123 13356 -182079 -310062 -332010 -262254 -131566
34531a31566J61784J40021N6041k1753l512Q7936J21219K9756r0552j08619l2760
34520B07995M513p2846j63528q6848J74215L68294K23954j73843m06948k28005
34510a53047J10579K06497M5323p0761l8834n6537j89394k01495L6907K79489
34500c1273K58188P6494O690O5246M9674j01048k28426k02670o0484Q8510J55475
34489G6376J04193n24k7625M4766P4872k2342j19299p7465J6375r123j28950j74197
34477b42943r9705q981M4555J00772J65670K00946K09395J92352Q8430q8536j44989
34466D16966M7110K78383K32135m9975k14548j18505j892o1391j50762o9091R7860
34455D06290J41037O2221J1480m154j06162k66841k76748m9500K07857K37300
$$ plain form
34531 -131566 30218 170239 226280 204527 201015 288951 410170 439926 349374 240755 207995
34520 207995 212508 139662 -23866 -110714 63501 431795 655749 481906 74958 -153047
34510 -153047 -42468 164029 209352 138591 99757 43220 -146174 -347669 -310762 -31273
34500 -31273 226915 303409 310099 375345 425019 323971 95545 -107125 -167609 -79099 76376
34489 76376 180569 180045 152420 197186 272058 249716 130417 52952 69327 60204 -68746 -242943
34477 -242943 -342648 -351629 -307074 -206302 -40632 160314 369709 562061 650491 561955 416966
34466 416966 464076 742459 974594 924619 710071 591566 589674 528283 377521 308430 406290
34455 406290 547327 609548 621028 616874 510712 243871 -32877 -82377 125480 362780
34445C62780N1431j04916p8832L2186P1561M6330N4462P7105R977j14173j22462
34434B85449K5307J36198N6740j07443j69885j19220m7796L8038J48897J70398
34424D16683J5940j51845r4695J33577K32357P5873j40057k08953j48372n5805
34414G4703N7013J72059J80181L3753j21572j00809Q8390K61902K71424J35103
34404A052147j5519o8317j6640O7511J32800J83929K15039J94685J66807K64406
34394B176848N26947P90163Q64001P33754M76261J00359l62102p18158p84926
34385C803147o41739n07436m23270k77332r0842k1289q5766j32458j06992j09164
34375A406859j61187j61751j05779j06103j55291j20137k1960m2590j73455j61864
$$ plain form
34445 362780 414211 309295 230463 262649 334210 380540 435002 512107 522084 407911 285449
34434 285449 310756 446954 503694 396251 226366 107146 59350 97388 246285 416683
34424 416683 432623 280778 186083 319660 552017 627890 487833 278880 130508 74703
34414 74703 131716 303775 483956 517709 396137 295328 383718 645620 917044 1052147
34404 1052147 1036628 968311 951671 1019182 1151982 1335911 1550950 1745635 1912442 2176848
34394 2176848 2703795 3493958 4357959 5091713 5567974 5668333 5306231 4588073 3803147
34385 3803147 3161408 2653972 2230702 1953370 1862528 1841239 1755473 1623015 1516023 1406859
34375 1406859 1245672 1083921 978142 872039 716748 596611 574651 532061 358606 196742
34365A96742O0027J94242K0646k43335k65661o6919R6339J42889J76548J99022
34355E10540J09777m3884q3679J4818P6975J2517n3104r966M4337k2898j27714
34344D27719o9911J35089K17585L3085j82525j20794J34665K10479J239j80527
34334F06104j06442L2107j0407j22304p4329O5338R0809M8367J04487J75358P8695
34323H87783o5379o530J51843R5398j24933j48345O0488J40954l4111j70688j13917
34312F72563q8170k04041k17013l054J79252J48357R4290J61418J62651j0235
34302H96018j07723L3234J56408K7314j60350j57258q0428j08190r9095J01893
34292E01823K89721K25304N8999M8833J18625O8781k8812j6167J9894l7722m5678
$$ plain form
34365 196742 256769 451011 471657 228322 -37339 -104258 -7919 134970 311518 510540
34355 510540 620317 576433 492754 507572 584547 597064 543960 533994 578331 555433 427719
34344 427719 357808 492897 710482 743567 561042 440248 574913 785392 786631 606104
34334 606104 499662 531769 521362 399058 324729 390067 480876 529243 633730 809088 887783
34323 887783 822404 815874 967717 1063115 938182 789837 850325 991279 957168 786480 672563
34312 672563 584393 380352 163339 160285 339537 487894 582184 743602 906253 896018
34302 896018 788295 821529 977937 1005251 844901 687643 607215 499025 399930 501823
34292 501823 791544 1016848 1075847 1124680 1243305 1312086 1283274 1267107 1287001 1249279 1203601
34281A203601J16003K33368J02703q0739n8016M1315j9285j19775k4173J61303
34271A556305J90728J06353O4901o451j73426j98004P7886L32069K14768o5405
34261B099724q5475J27049K59308K71781K89422K09565n7454k23528k7411K67940
34251C130921L05043K44183L88735N47500L98749J58155K16244M20585L96964
34242F207079K68291L60336N29945N01472M97667P84465J012217Q21057O26894
34233A1609423R16939J296349J229679J140462J638551K282676K407536K527799
34225B5049414L451328M684932N400400O261416Q369561J1204611J3895765J7641116
34217I5958543K4110535L2604385M2479044N6649862P5829038Q8320923P4370773
$$ plain form
34281 1203601 1319604 1552972 1655675 1574936 1516920 1558235 1538950 1419175 1395002 1556305
34271 1556305 1747033 1853386 1918287 1911836 1738410 1540406 1618292 1950361 2165129 2099724
34261 2099724 2014249 2141298 2400606 2672387 2961809 3171374 3113920 2890392 2862981 3130921
34251 3130921 3435964 3680147 4068882 4616382 5015131 5173286 5389530 5810115 6207079
34242 6207079 6475370 6835706 7365651 7867123 8364790 9149255 10161472 10982529 11609423
34233 11609423 12526362 13822711 15052390 16192852 17831403 20114079 22521615 25049414
34225 25049414 28500742 33185674 38586074 44847490 53217051 64421662 78317427 95958543
34217 95958543 120069078 152673463 195152507 251802369 327631407 415952330 490323103
34210D90323103K7672138l1622444p2687420q1856831o9830611n3949045m1524906
34203A66523984l1365441k2819483j7230183j4136090j1487041q835236p162905
34196E3487605o351789n344567m161388l623377l575432l182084k526245k299265
34188B2423458k312567j825433j037909q44438j284542j506648j181740q28868
34180A1601313p63317p13363n17930l78776l70592l47781l09933l24041k25265
34171G650315R3888L25345K09307P4737L25330O59650M52155k83445r32992j129530
34161G444760r91612o80086k94322q5443k26907m59891m31243k48000k45353l81905
34151C399998l52189j45559j3981k0274n8799j61461l51164l89009j18757J50861
$$ plain form
34210 490323103 517995241 486372797 413685377 331828546 261997935 208048890 166523984
34203 166523984 135158543 112339060 95108877 80972787 69485746 60650510 53487605
34196 53487605 47135816 41791249 37629861 34006484 30431052 27248968 24722723 22423458
34188 22423458 20110891 18285458 17247549 16403111 15118569 13611921 12430181 11601313
34180 11601313 10837996 10124633 9606703 9227927 8857335 8509554 8199621 7875580 7650315
34171 7650315 7744203 8069548 8278855 8353592 8678922 9338572 9790727 9507282 8574290 7444760
34161 7444760 6453148 5773062 5478740 5393297 5166390 4706499 4275256 4027256 3781903 3399998
34151 3399998 3047809 2902250 2888269 2867995 2809196 2647735 2296571 1907562 1788805 1939666
34141A939666P6445j43870j27379J5624o5383k59662j82615R7621J75221L9709
34131A565377L3304J43507K0574l00473l77827j32573J3307j10150j57490O4872
34121G62428K53013J60666j0314k4852J8237k6455p7356n2437l7379o9896p6215
34110H19440j12613k99634m47370j95208L54285O19663L43872n3686j50064o9743
34100H08942p6816p9771P4362J90575L9542j92825j83549P61M3634j01490j92876
34089C30489j10265L3156J35689K04919K43696K30573J70695M4199j86205m05688
34079F91258l66804m1377K38556J96781q151m8694R5182J87788J30643K2704q0087
34068A017799j89462k28959j15791L9078N3771m1928q5024q4521j67804k54395
$$ plain form
34141 1939666 2016111 1872241 1744862 1760486 1695103 1435441 1252826 1350447 1525668 1565377
34131 1565377 1598681 1742188 1762762 1462289 1084462 951889 965196 855046 697556 762428
34121 762428 1015441 1176107 1165793 1140941 1159178 1132723 1055367 1002930 965551 895655 819440
34110 819440 706827 407193 -40177 -235385 118900 738563 1082435 1028749 878685 808942
34100 808942 732126 652355 726717 917292 956834 764009 580460 581221 624855 523365 330489
34089 330489 220224 253380 389069 593988 837684 1068257 1238952 1283151 1096946 691258
34079 691258 324454 283077 521633 718414 710263 661569 756751 944539 1075182 1097886 1017799
34068 1017799 828337 599378 483587 522665 576436 534508 449484 364963 197159 -57236
34058e7236j16173J89079K86335K7917k31537j21899K15783L57208J91147j2876
34048G27748o4098o5613j34734j84832j08180K5416J03371J53637K29683K37926
34038I20324Q2516r4976n4324J73042K83567J21541j14176j78035r9805o1371
34028I78303j08527j52195j49333j17177m1641P5964J40698P7996k1891j1114
34018F71083J02062J71977J13493k7040j52465j67821k2611J89761K57127R5065
34008A230631j22639k06149j99058k22816k16903o9198J05345R5161n6530j13388
33998B24456k8876K5898J1047P4073K07763J76552r4727l39188l12026j09089
33988a64117L6103P3917R1162J09949J06827J13222J49195J48279O1251m7063
$$ plain form
34058 -57236 -173409 15670 302005 329922 98385 -23514 192269 549477 740624 727748
34048 727748 663650 598037 463303 278471 170291 195707 299078 452715 682398 920324
34038 920324 1002840 907864 853540 1026582 1310149 1431690 1317514 1139479 1039674 978303
34028 978303 869776 717581 568248 451071 409430 485394 626092 704088 682197 671083
34018 671083 773145 945122 1058615 1031575 879110 711289 688678 878439 1135566 1230631
34008 1230631 1107992 901843 702785 479969 263066 193868 299213 394374 337844 224456
33998 224456 195580 221478 232525 306598 514361 690913 596186 256998 -55028 -164117
33988 -164117 -128014 -54097 37065 147014 253841 367063 516258 664537 725788 678725
33978F78725q4407l2253P9588J91251J89882J6592j85420k04997o5415J3186k3198
33967E73534N387J54460K21843R9882k9229k3873k3290j37178j76002K0473K27285
33956I13292J53053o1492m2703K17245L48923J79714m2112n8402O8128J44734
33946A820380J45722J97652L97692P02277Q97080P09776J16531m97931o95838
33937C793341m98695l23415m01360n28217m60101k73230j64754j26294l7323O8864
33927A048816O7384j3039k7502L6403M7869l1098q9259p9186j05016k15836k68460
33916C71076j28867R3858J72145O8777m0063l9763k268K661L9910J42547J67801
33905H47814n600k31283k51955o8882N6649j1771j12429p0824L9940N8383M742
$$ plain form
33978 678725 594318 562065 641653 832904 1022786 1039378 853958 648961 583546 596732 573534
33967 573534 578921 733381 955224 1055106 1025877 1002004 978714 841536 665534 686007 913292
33956 913292 1066345 1004853 962150 1179395 1528318 1708032 1665920 1607518 1675646 1820380
33946 1820380 1966102 2163754 2561446 3263723 4160803 4870579 4987110 4489179 3793341
33937 3793341 3294646 2971231 2569871 2041654 1581553 1308323 1143569 1017275 979952 1048816
33927 1048816 1116200 1103161 1075659 1112062 1159931 1128833 1039574 960388 855372 639536 371076
33916 371076 242209 336067 508212 576989 536926 497163 494895 497556 537466 680013 847814
33905 847814 842214 610931 358976 290094 346743 334972 222543 151719 191659 250042 254784
33894B54784K0894J21374J71000Q9143n1334j29043q8978L9915J67047J90354
33884G85156Q9478m1248j02714j06636j25318j62642j54428q2611o701K9272N2867
33873A74475R7963J32784R8908P674m7069N786J19306J75174J18942L479r9515
33862G87907j61717j61006q1513L678l5797j89438k56493j13060Q6891J28782
33852H234M3441Q448M9808P0637Q5730J54244J48909p9713l34783k46920J37896
33841D5931L44544J62752n3498J9524J83681J17689q5215j50078j14961j80629
33831B89740k65218j43838Q6265J13677o0431j15924N4783J96410J38169M0233
33821C33866P5144J54984J24969J1827o1505n3903M210P4969J02679N0404k6557
$$ plain form
33894 254784 275678 397052 568052 657195 605861 476818 387840 427755 594802 785156
33884 785156 874634 833386 730672 624036 498718 336076 181648 99037 92336 121608 174475
33873 174475 272438 405222 504130 511804 464735 470521 589827 765001 883943 887422 787907
33862 787907 626190 465184 383671 387349 351552 162114 -94379 -207439 -120548 8234
33852 8234 51675 60123 109931 180568 266298 420542 569451 489738 154955 -91965 45931
33841 45931 390475 553227 499729 519253 702934 820623 735408 585330 470369 289740
33831 289740 24522 -119316 -33051 80626 20195 -95729 -40946 155464 293633 333866
33821 333866 409010 563994 688963 700790 639285 585382 589592 664561 767240 817644 791087
33810G91087n5522p9302j71296k51341j73160J8734J23631P8252L878m6314j44808
33799I3839k55473k04422J4899J47782L2931j48307j39593L7377J73139J84899
33789f2929J48768R7109j5780j49406j47306O0459L12750L64743J72925m1307
33779G40026n9837O5664J27398R6976J45123K87722K72531j2623k57159j25156
33769A280665K34728M00819K88850J83303K01792J35397j09825k93425k18084
33760B104220k3353O9847N4045O958r0453k18254k12402m613J99632J85266L3716
33749B104609k4767N5198J38068J51813J40192J20555M9113q2133k11091k59645
33739B181912j91187o3644k0559j28986k42882j78790j3681m16j68494k57280
$$ plain form
33810 791087 735565 656263 484967 233626 60466 79200 202831 281083 284961 238647 93839
33799 93839 -161634 -366056 -351157 -203375 -170444 -318751 -458344 -420967 -247828 -62929
33789 -62929 85839 182948 167168 17762 -129544 -69085 243665 608408 781333 740026
33779 740026 680189 745853 873251 970227 1115350 1403072 1675603 1662980 1405821 1280665
33769 1280665 1515393 1916212 2205062 2388365 2590157 2725554 2615729 2322304 2104220
33760 2104220 2080867 2150714 2204759 2211717 2121264 1903010 1690608 1685995 1885627 2070893 2104609
33749 2104609 2079842 2135040 2273108 2424921 2565113 2685668 2734781 2652648 2441557 2181912
33739 2181912 1990725 1927081 1906522 1777536 1534654 1355864 1342183 1341767 1173273 915993
33729I15993j18707O7730R5732O956o5538r3041n4730J02117K51354J18299k76925
33718I49240m97095k70618Q3246J31353l2606k1760J68837J85697o3737k69211
33708C63346k18169n0285N1689R2376J05270N3541k4347j5421N5664M4084m3849
33697D13899m0390P7280J26684L1838n7460l9381m979j6509Q118P3809K2104j82899
33685D12114l14323k07078j8150L3028k034M7468J41687J15208J782n67J24653
33674C33788J55381k3567k23834k11000j8712J28771J32175J05534J49909J84171
33664G12616Q8257p9053j49043j01988q8373j60756j73898n3599K7851p1603j73399
33653b22988k2677K71444L40451R0545j66491j70880k3267O6462P8380P9288M1706
$$ plain form
33729 915993 797286 865016 960748 967704 902166 809125 754395 856512 1107866 1226165 949240
33718 949240 452145 181527 264773 396126 363520 341760 510597 696294 632557 363346
33708 363346 145177 94892 146581 238957 344227 397768 373421 358000 413664 457748 413899
33697 413899 373509 450789 577473 609311 551851 512470 507491 490982 499100 572909 595013 412114
33685 412114 97791 -109287 -127437 -94409 -96443 -48975 92712 207920 209702 209135 333788
33674 333788 489169 465602 241768 30768 12056 140827 273002 378536 528445 712616
33664 712616 800873 721820 572777 470789 382416 221660 47762 -5837 22014 -49589 -222988
33653 -222988 -245665 25779 366230 456775 290284 119404 96137 162599 240979 320267 361973
33642C61973n0042q3172Q121Q7808J9960r5893q0723L3910P3831J0536k6208O966
33630B67067J1185n2812p9843J6214J74691K64261K03731J181k32936l10991j23902
33619A37846J89738L27828J40938j94482l75496l01609j36549n7544l5595O7250
33609b37675K33918K67011Q1173j19726j07120K7823J6507j33778j17679J56232
33599F6686L32195J02088k95480l72795o7123K10130J73359r903o1130K1668P0128
33588A69823M1736K5378N3129O6405L2232j4102k7901o51L1864J1768o0277p4530
33576B54874N8984K27153K02804l3243k17510j53640J1957J7104j30831j92141
33566D5511n9257J17830J67523P9988o4701j88901k05533p3633Q3633P1920r5244
$$ plain form
33642 361973 311931 228759 236880 324688 344648 248755 168032 201942 275773 286309 260101 267067
33630 267067 278252 225440 145597 161811 336502 600763 804494 805675 572739 261748 137846
33619 137846 327584 655412 796350 601868 226372 -75237 -211786 -269330 -304925 -237675
33609 -237675 -3757 263254 344427 224701 117581 145404 161911 28133 -89546 66686
33599 66686 398881 500969 205489 -167306 -234429 -24299 149060 139157 78027 99695 169823
33588 169823 211559 236937 290066 356471 388703 374601 346700 346049 377913 389681 329404 254874
33576 254874 313858 541011 743815 710572 493062 339422 351379 368483 237652 45511
33566 45511 -13746 104084 271607 351595 286894 97993 -107540 -181173 -97540 -25620 -120864
33555a20864j67615m164K07963K18440O5318j5007N9188J49342J49685J11425
33545F53711R4447N8573m1459j60729k11974j46773R427J39631J03012p4191j49991
33534B73684K3277K11951P4965k91358m02090o9988K88154K42684l9160q9980
33524B22139J46495K82846J04212j57058k17342j04257m876J7471J1859J126j4755
33513B87860j3115Q017J9977L6983R8748J55034R8969m4685j09310k4478Q2076
33502E96076R5709P4455R3700Q4458k5280j30707r1288K3660K1003j09314j61326
33491D71146k0988J52076J38904m1274j59959p7486R3202J56980R3115M5703Q0252
33480I31671Q7320j1898j02521n7347K3026m8147k09587j98557M1896K42564J85101
$$ plain form
33555 -120864 -288479 -292643 -84680 133760 199078 184071 243259 392601 542286 653711
33545 653711 748158 806731 765272 604543 392569 245796 255223 394854 497866 423675 273684
33534 273684 296961 508912 583877 292519 -109571 -179559 108595 351279 312119 222139
33524 222139 368634 651480 755692 598634 381292 277035 272159 289630 301489 302615 287860
33513 287860 274745 282762 302739 339722 438470 593504 692473 647788 538478 514000 596076
33502 596076 691785 766240 859940 944398 919118 788411 697123 720783 741786 632472 471146
33491 471146 450158 602234 741138 699864 539905 462419 555621 712601 805716 851419 931671
33480 931671 1018991 1007093 904572 847225 870251 822104 612517 413960 455856 698420 883521
33469H83521j7065j43678j75712k08267k19818j31929P006Q7608J08425J12771
33459C02862N2000j04108k14020j33238L6870R7096Q6117K02294M08678M13924
33449A148475J11004k35660l55371k92089k22119j60876l4320J09777J58102J12015
33439C38938N2049l043n9898n4760M6524J15722N481j99614k49825o5227J48560
33428G4907J66899P994j35388j38435m5206K7745K6276J19K7152J01017J27411
33417B40491O3583R581P9047K08857K11974L5834j47216j65536p0797m7926j59376
33406B58516k74403k36897l2169K05563K99719J69177p6216k01142q4177J23704
33396A51675J70125J8832j24208j14472m1479k3855L36J17192J96427M2243k48544
$$ plain form
33469 883521 866456 722778 547066 338799 118981 -12948 -5942 81666 190091 302862
33459 302862 354862 250754 36734 -96504 -59634 37462 123579 325873 734551 1148475
33449 1148475 1259479 1023819 668448 376359 154240 -6636 -40956 68821 226923 338938
33439 338938 390987 387944 328046 273286 319810 435532 441013 241399 -8426 -73653 74907
33428 74907 241806 249800 114412 -24023 -69229 -41484 -15208 -15089 12063 113080 240491
33417 240491 304074 313655 392702 601559 813533 849367 702151 536615 465818 417892 258516
33406 258516 -15887 -252784 -284953 -79390 220329 389506 313290 112148 27971 151675
33396 151675 321800 340632 216424 101952 60473 36618 36954 154146 350573 392816 144272
33385A44272l31602p6707K37650L02091J52567J4337m9798j12035j25128K7348
33375A82995K61532L53976L02911L49555N41245N54516J52427m04410o68335n75975
33365A050437m09094k82518m5750K76722L46441J2087l55675l22738O470J68166
33355D44548J3167j52599r8725J5405k4075j31990j09524J4803N5153l2771j25526
33344a32134j38099q2248K9779J76697K60512J99603O1252l3752r0937j73848
33334G6825k13745q7658J32017K22383J30535M2356P9460J30248O6131o1334j45344
33323C71874j79944j76599p9975J02505K22794J80036O8810J2390k6411j24388
33313C71092k11588j75965o0427J1633K5806L1901L118p9372r3962N4107K03685
$$ plain form
33385 144272 -187330 -264037 -26387 275704 428271 442608 392810 280775 155647 182995
33375 182995 444527 798503 1101414 1450969 1992214 2546730 2699157 2294747 1626412 1050437
33365 1050437 641343 358825 313075 589797 936238 948325 592650 269912 276382 444548
33355 444548 457715 305116 206391 221796 197721 65731 -43793 -28990 26163 -6608 -132134
33344 -132134 -270233 -352481 -322702 -146005 114507 314110 375362 341610 250673 76825
33334 76825 -136920 -224578 -92561 129822 260357 302713 382173 512421 578552 517218 371874
33323 371874 191930 15331 -64644 37861 260655 440691 509501 521891 495480 371092
33313 371092 159504 -16461 -76888 -65255 -39449 -7548 -4430 -83802 -177764 -123657 80028
33302H0028J22011j12876j79716J3445J91617J29257m3220q8619j4414J3588k4411
33291H6690M398J27606J85135M5463j95887k97350j35726J39022K41354O0341
33281B61046k01664k49536k8013K33938K96796J50274k7223q0169k0472J2520
33271C47497o7844j66493j22792L9543J09530K073q7081J6843J66568J13673q2265
33260B69252j41154j3072N4186p9131k51527k79652j78882k4572J64710L12953
33250a66889K95048J63506J28431K05514J50571j18885l31731k88510j81380k26670
33240c70995k59775m0559K59613K78708M0027j00808k0051O7550N5871Q9800J92765
33229A92146J41302j34789l44144k23659Q9954K64573J83383m008j08111n0801
$$ plain form
33302 80028 202039 89163 -90553 -77108 114509 243766 200546 111927 97513 111101 86690
33291 86690 91088 218694 403829 449292 253405 -43945 -179671 -40649 200705 261046
33281 261046 59382 -190154 -218167 15771 312567 462841 435618 355449 334977 347497
33271 347497 279653 113160 -9632 29911 139441 141514 54433 71276 237844 351517 269252
33260 269252 128098 115026 169212 90081 -161446 -441098 -619980 -644552 -479842 -166889
33250 -166889 128159 291665 420096 625610 776181 657296 325565 37055 -144325 -370995
33240 -370995 -630770 -671329 -411716 -133008 -92981 -193789 -213840 -146290 -90419 -619 192146
33229 192146 333448 198659 -145485 -369144 -279190 -14617 168766 164758 56647 5846
33219E846J00222J63029K0410j85828j88507L4028K06162J40327k9686r7804n9208
33208A08991k440P3106J65507J64088J3459j49410j82765j35521j09446p8113
33198a32544n887J7634m7291m9248J01799K14437J10331l3422L8099J83573O9699
33187D67180k26661k78754l098J78055J1014j92899p9752K01089K86467J46512
33177E09153L555p3799j43186j24990O4851K32616J32252r5316r5297J13484J45290
33166F68613j01663k41117k3231K36685J44847j61612k53108o3931P7662J56j05872
33155A77429o3751L4249N5324M9880R4972J09306L041j20386j00830J6257M1675
33144B97166o0737j24932n6223K1987j6332p9840l262J66716K09026N4141j02071
$$ plain form
33219 5846 106068 269097 289507 103679 -84828 -50800 155362 295689 266003 168199 108991
33208 108991 106551 179657 345164 509252 522711 373301 190536 55015 -54431 -132544
33198 -132544 -138431 -120797 -168088 -217336 -115537 98900 209231 175809 213908 397481 467180
33187 467180 240519 -38235 -41333 136722 147736 -45163 -124915 76174 362641 509153
33177 509153 512708 438909 295723 170733 235584 468200 600452 505136 409839 523323 668613
33166 668613 566950 325833 302602 539287 684134 522522 269414 205483 283145 283301 177429
33155 177429 113678 147927 203251 253131 348103 457409 460450 340064 239234 255491 297166
33144 297166 236429 111497 55274 77261 60929 -18911 -22173 144543 353569 407710 305639
33133C05639q2123K2070R672j19256j81794r8341J8057P1417J07511J67642J78013
33122C98507R5386L7704J23706K56903K25622l758k33404k86329j96782j15178
33112C02377j14651j46357j34104n7626M7449J38257J93108J88386Q4242j09552
33102C91529k71469k67314j29571l0093l4198j4708J08993J98406J09711m9693
33092A1593p8743p183k4575j25657r6935J07402K42346J35526m8058o0578P5968
33081A31106J47336O6604n7322j11587r0966m2481j1233l1173r6328j55485j71166
33070d22695j41039m6169J30365K98671K97396J12144n0213m172J82559K89904
33060F46751J96619m6686k96075l82460k18198O1060J78556M7196j17165j27597
$$ plain form
33133 305639 223516 245586 255258 136002 -45792 -144133 -126076 -54659 52852 220494 398507
33122 398507 493893 531597 655303 912206 1137828 1134070 900666 614337 417555 302377
33112 302377 187726 41369 -92735 -150361 -102912 35345 228453 416839 501081 391529
33102 391529 120060 -147254 -276825 -306918 -341116 -355824 -246831 -48425 61286 11593
33092 11593 -67150 -74333 -98908 -224565 -321500 -214098 28248 163774 115716 55138 131106
33081 131106 278442 345046 287724 176137 85171 42690 31457 284 -96044 -251529 -422695
33070 -422695 -563734 -609903 -479538 -180867 116529 228673 178460 174288 356847 646751
33060 646751 843370 796684 500609 118149 -100049 -38989 139567 186763 69598 -57999
33050e7999q6189j32725j37592P1246L23287K97375L5579j02842q674L4687j37569
33039I8584k89096j90083P127L9084o0871q3879K60O8125R6948J44048J56309
33028a3444L9105j28795j62491l3830J11200J73313J69034J07739k1428j45498
33018I4905j56650p2013l976J6152L7882M1792l3676j28495j20598n5877j00982
33007d81536k29109j95069P7807L18655K73611N4463o6931n0262m6016p7299k0105
32996d41791J33723K31488J96598J15493N7275j2684r0412p6629N4901J66672
32986C34634J24475m3205k19021l27170l24529j77101N7769K14981J89744O0931
32976a08492l0197m9072l6085K725O4748Q7112L2961k1182j045L1663p468n5088
$$ plain form
33050 -57999 -144188 -276913 -414505 -343259 -19972 277403 312982 210140 201466 236153 98584
33039 98584 -190512 -380595 -373468 -334384 -395255 -479134 -478874 -410749 -313801 -169753 -13444
33028 -13444 25661 -103134 -265625 -299455 -188255 -14942 154092 261831 240403 94905
33018 94905 -61745 -133758 -137734 -121582 -83700 -41908 -75584 -204079 -324677 -380554 -481536
33007 -481536 -710645 -905714 -827907 -509252 -235641 -181178 -248109 -298371 -344387 -421686 -441791
32996 -441791 -308068 -76580 120018 235511 292786 280102 189690 113061 167962 334634
32986 334634 459109 415904 196883 -130287 -454816 -631917 -574148 -359167 -169423 -108492
32976 -108492 -138689 -187761 -223846 -221121 -156373 -69261 -36300 -57482 -58527 -26864 -34332 -89420
32964h9420q435O1817J2246r4729n3682J25437J80733K041j79799j48751k1174
32953b13716j1659p1737j0680J49586K11742J33865N5502J1776j02461k47781
32943i5563k04287O0680K38577Q4884k03269k45237k223K06459J75334M3016L706
32932F2077K4911j6281r0584r0404m1847m7029o5740L4073K03780K16999K1280
32921B11235j26527k4903J49461R4739j54901k70047r2303J80858K96504K16096
32911D80212M2757j16569j53816k1092J34863R5139r1434j13278J34293L24060
32901G15135J42239k44685m20564k70695l3301R7593J35754J15996K3048q0670
32891A79850q6389j9024M299j4465J5461N7495m700j12238q0432P8395J51176
$$ plain form
32964 -89420 -97855 -36038 -23792 -118521 -172203 -46766 133967 136008 -43791 -192542 -213716
32953 -213716 -225375 -297112 -307792 -158206 53536 187401 242903 254679 152218 -95563
32943 -95563 -299850 -239170 -593 84291 -118978 -364215 -366438 -159979 15355 58371 62077
32932 62077 86988 70707 -19877 -110281 -152128 -199157 -264897 -230824 -27044 189955 211235
32921 211235 84708 59805 209266 304005 149104 -120943 -213246 -32388 264116 480212
32911 480212 522969 406400 252584 231492 366355 461494 370060 256782 391075 715135
32901 715135 857374 612689 192125 -78570 -111871 -14278 121476 237472 260520 179850
32891 179850 93461 74437 78736 64271 79732 137227 132527 20289 -60143 18252 169428
32880A69428Q5569O5040J41935J08925j10572k44598p5131J84648J89253l5561
32870D78936j73679r2640M5429R5685R1576R2934R2119J00980J62552K50846K94619
32859A439357L03047L32249L36997K16599K4804l4277J15347K82083K38677Q801
32849C263684j71859j42486J2103P9135l6052k08104k41741r9803O8298J26869
32839B650044J04010R8844J18303R1716L482p8955r3763l2908P5097J60073J13981
32828C209924j10476m02004n67687n26598l75309k52250j90282j25208j2602R6831
32818G44339J01827k8689j88998k24515r9617N8098J06050M5000r458N716J2637
32807E22390r9887k90226l42780j10168K35136L26969N8544k29206j65984J53022
$$ plain form
32880 169428 254997 320037 461972 570897 460325 215727 140596 325244 514497 478936
32870 478936 305257 212617 258046 353731 445307 538241 630360 731340 893892 1144738 1439357
32859 1439357 1742404 2074653 2411650 2628249 2653053 2618776 2734123 3016206 3254883 3263684
32849 3263684 3091825 2949339 2961442 3040577 3004525 2796421 2554680 2454877 2523175 2650044
32839 2650044 2754054 2852898 2971201 3062917 3066399 2987444 2893681 2860773 2935870 3095943 3209924
32828 3209924 3099448 2697444 2129757 1603159 1227850 975600 785318 660110 647508 744339
32818 744339 846166 817477 628479 403964 304347 362445 468495 513495 504037 509753 522390
32807 522390 422503 132277 -210503 -320671 -85535 241434 299978 70772 -95212 57810
32797E7810L10741J43007j03671j95303j86422j77739r6214R6797K17505J10742
32787A77253q4157j46664j09969j47602k46085k41136j01935N6034J77620K61870
32777d04771K20659m367k30030k06756j08O8192j10515k75089j71254J34622L92830
32766e86587M34445K39987o9718k52730j39426J32211K48257J25828j2066q736
32756A11465K7613j1599l7399J2161o653j84176l19926j93060P8252K10501J78993
32745a33828J85856K64629K23252M896j80722j80381j11938j20351j23531Q560
32735a63558J65183J20043j05203k32447j10122R4942J66536J22464R7967R3319
32725B49124K6204n5019l2795L6695j9616j71978j80438J1154J36612J7830j34528
$$ plain form
32797 57810 368551 511558 407887 212584 26162 -151577 -247791 -150994 66511 177253
32787 177253 93096 -53568 -163537 -311139 -557224 -798360 -900295 -844261 -666641 -404771
32777 -404771 -184112 -188479 -418509 -625265 -625373 -557181 -667696 -942785 -1114039 -979417 -586587
32766 -586587 -152142 87845 18127 -234603 -374029 -241818 6439 132267 120201 111465
32756 111465 139078 127479 90080 102241 95588 -88588 -408514 -601574 -523322 -312821 -133828
32745 -133828 52028 316657 539909 544805 364083 183702 71764 -48587 -172118 -163558
32735 -163558 1625 121668 16465 -215982 -326104 -231162 -64626 57838 155805 249124
32725 249124 275328 220309 187514 224209 204593 32615 -147823 -136669 -57 17773 -116755
32714a16755o1272J13037Q8166j07612j61335K3802K05956K07584J33708J13097
32704D38376R5025J7134m9755m7907l9237n7401k6081P1551J11580K9139n8651
32693D83773m4484K441j9228o9084o2427k6982l8895q7993j03216m2016R3634
32682H5523K36682K39896L2087j96271j65943Q8422K25441Q8433p7306l6140Q7799
32671F08623P9799l121n050P776r6049j98933j05365Q2744R5522o1737j24912
32660B79297j0735Q2930M0048j6608N313K0309k0968j9108O0157Q0216k7876j12839
32648C60136l7435R0113P9331n9040j52890j26840p2693p8622j04918n9526N5805
32637a06579J15157O890j93353k48733l2315K70921L47879J42488p0517m5696
$$ plain form
32714 -116755 -178027 -64990 23176 -84436 -245771 -221969 -16013 191571 325279 438376
32704 438376 533401 550535 500780 452873 413636 356235 330154 401705 513285 542424 483773
32693 483773 439289 441730 422502 353418 290991 264009 225114 137121 33905 -8111 85523
32682 85523 322205 562101 594188 397917 231974 320396 545837 634270 556964 520824 608623
32671 608623 688422 685301 680251 688027 591978 393045 287680 370424 465946 404209 279297
32660 279297 268562 351492 391540 374932 380245 400554 379586 360478 420635 500851 472975 360136
32648 360136 322701 412814 492145 433105 280215 153375 80682 2060 -102858 -162384 -106579
32637 -106579 8578 15468 -177885 -426618 -458933 -188012 159867 302355 231838 186142
32627A86142J15507J16777j17412l20322k28423N4441J79621L2505j00016L8416
32617d2764K51164J60190j80537k97339R704L43801K78727n9927k63267k36857
32607c7105j76421j25825K6971J84571R4945j91110k95605n0652K57363L09965
32597b903J47188q002o7957n4417L8638J70900J93638K9139j92586k97422k61117
32586c04901j49143R08J29472J25283k3475j54300j24615J1387J15370J46997
32576b27017J34265P5998j0418m4364n15K0323n1254j22970q8477q190l274m9716
32564c75609l2624M6808P7060K8929o797J4653J9582m8466j18297q1708N2244
32553d24225J54959J29519K7233j4096O1345J63133J73966Q3742k8299q9043o4564
$$ plain form
32627 186142 301649 418426 301014 -19308 -247731 -193290 -13669 18836 -81180 -42764
32617 -42764 208400 368590 188053 -109286 -99582 244219 522946 463019 199752 -37105
32607 -37105 -213526 -339351 -312380 -127809 -32864 -223974 -519579 -570231 -312868 -2903
32597 -2903 144285 136283 68326 13909 52547 223447 417085 446224 253638 -43784 -304901
32586 -304901 -454044 -453136 -323664 -198381 -221856 -376156 -500771 -489384 -374014 -227017
32576 -227017 -92752 -16754 -27172 -71536 -72051 -51728 -102982 -225952 -314429 -322619 -325893 -375609
32564 -375609 -408233 -361425 -284365 -255436 -262233 -247580 -227998 -276464 -394761 -476469 -424225
32553 -424225 -269266 -139747 -112514 -126610 -65265 97868 271834 355576 327277 238234 173670
32542A73670L0050R0685j4941k51824l83791k62734m5931L5729P376L1824P9135
32531e10752R372q2436M2550L19760L93500J56375q6040j16776j02754j96051
32521a73252k09032K6469K81886K51798K3986j07953j15037j67495k45356j78913
32511f12899L563J07174J01472J13634J38352O1582o0363n6929L5128J8162r3426
32500b44550o9407J23747K26741R6805p6425q9843j1089L74n2199p8309o9321
32489b43476n7073k8555J4908K3965l600r183M335k3693n5978J7725J49414J28707
32477h2504r2787k62569j49067J44748L28030K67489O2056j25565j91574j25665
32467b27408k3645j660m1785j7633Q5712J20747J7507q8396p7248l1852n5850
$$ plain form
32542 173670 203720 294405 279464 27640 -356151 -618885 -664816 -629087 -621711 -589887 -510752
32531 -510752 -501380 -583816 -541266 -221506 171994 328369 242329 125553 22799 -173252
32521 -173252 -382284 -355815 -73929 177869 201855 93902 -21135 -188630 -433986 -612899
32511 -612899 -609336 -502162 -400690 -287056 -148704 -87122 -147485 -204414 -169286 -151124 -244550
32500 -244550 -313957 -190210 36531 133336 56911 -32932 -44021 -43647 -95846 -174155 -243476
32489 -243476 -300549 -329104 -314196 -290231 -293831 -303014 -298679 -322372 -378350 -360625 -211211 -82504
32477 -82504 -175291 -437860 -586927 -442179 -114149 153340 215396 89831 -101743 -227408
32467 -227408 -251053 -252713 -294498 -312131 -226419 -105672 -88165 -176561 -253809 -285661 -341511
32456c41511o1147O6103K04990J42699p3064j68918n1431M8646p3523k80427k72872
32445h60455K057K76840K91377P5659j39390k06885j66011r1982K5403J95984
32435e97403L21652K87231J22790k5984p2272m4660K735K9143k2751j67978k90980
32424d58477k50380q8560L886l1538k6327J54215L84059M19850K00288q8804k15818
32413B394j22189L2789L8509j22038k36740j46568J9740M1261m7313l5197P2019
32402e03333L6775j81709k99074j50790K3347m7954k52689l10829k17063j88104
32392b091423k97678m41970n78363p22752p59972n22277n2957M17551P37355Q87986
32382c424500Q41046N99380L42562K74672L30432K77607J08279N6707J94713K91516
$$ plain form
32456 -341511 -402658 -336555 -131565 11134 -61930 -230848 -282279 -233633 -307156 -587583 -860455
32445 -860455 -858398 -581558 -290181 -214522 -353912 -560797 -726808 -818790 -793387 -597403
32435 -597403 -275751 11480 134270 108286 36014 -8646 -5911 23232 481 -167497 -458477
32424 -458477 -708857 -797417 -793531 -825069 -851396 -697181 -313122 106728 307016 218212 2394
32413 2394 -119795 -87006 -48497 -170535 -407275 -553843 -534103 -492842 -540155 -575352 -503333
32402 -503333 -466558 -648267 -947341 -1098131 -1074784 -1122738 -1375427 -1686256 -1903319 -2091423
32392 -2091423 -2389101 -2831071 -3409434 -4132186 -4892158 -5414435 -5467392 -5049841 -4312486 -3424500
32382 -3424500 -2583454 -1984074 -1641512 -1366840 -1036408 -758801 -650522 -593815 -399102 -107586
32372a07586J67273n9208j85001j71788p4655P2759J90209J63734M2476L1757
32362F9970J74518K44635R5324r8747j20986l1968l092j8502J3424J0311j39851
32351A95036k93072k09969M7338J73921P2619l9301o889N8240L4916K407O2209
32340I7455J45355J39006N8106l1672j26444k02752j62368M680J24732O2358o1860
32329D6596m2443R5265J33827p151j54398j18739P5939K37743K04419j1999k17609
32318B41450j97652M1936K34102J44790j36391l12592k44399o1035O2253P6240
32308a51298J0369p9055r4757O295Q9944n93j55031r7409J67192K89696R7234
32297H2587j16666n0075J31048R7846p1486l3311K15382L11293J11455j15183
$$ plain form
32372 -107586 59687 479 -184522 -356310 -430965 -358206 -167997 -4263 38213 69970
32362 69970 244488 489123 584447 485700 364714 332746 329654 311152 324576 334887 195036
32351 195036 -98036 -308005 -260667 -86746 -14127 -53428 -60317 -2077 32839 35246 97455
32340 97455 242810 381816 439922 408250 281806 79054 -83314 -78634 46098 108456 46596
32329 46596 4153 99418 233245 226094 71696 -47043 28896 266639 471058 459059 241450
32318 241450 43798 85734 319836 464626 328235 15643 -228756 -289791 -227538 -151298
32308 -151298 -140929 -219984 -314741 -308446 -218502 -219095 -374126 -471535 -304343 -14647 82587
32297 82587 -34079 -84154 46894 144740 73254 39943 255325 566618 678073 562890
32287E62890j66301j74552k42799j93143P5011K93723J98268m4348j01840K671
32277B09580j6252j93104k50941n3287J96649K71622J90828R4257M1695K4113
32267E15160K8012J3926n6403j30157j14121l5681j7667o6144m3063Q7103J47525
32256C28490M427j91187j75440O3288K41772J27299j75165l40991j90293J28599
32246a79201L23375K63507N5291j30146j97405j16161P6422K16031J13370j78996
32236B46087l42776j76612J25000K44878J70302J23088J59601J25857q446p3973
32226E93006j9708k5196j74575k65709j17469J23094J80524L4562q9465m8511
32216A90553O5544Q2602m5454j96245j88688J2370K00139J41193j04127k38096
$$ plain form
32287 562890 396589 222037 -20762 -213905 -138894 154829 353097 308749 206909 209580
32277 209580 193328 224 -250717 -304004 -107355 164267 355095 449352 491047 515160
32267 515160 543172 557098 500695 370538 256417 220736 203069 136925 93862 180965 328490
32256 328490 332917 141730 -33710 29578 271350 398649 223484 -117507 -307800 -179201
32246 -179201 144174 407681 462972 332826 135421 19260 95682 311713 425083 246087
32236 246087 -96689 -273301 -148301 96577 266879 389967 549568 675425 666979 593006
32226 593006 573298 548102 373527 107818 -9651 113443 293967 328529 239064 190553
32216 190553 256097 338699 293245 97000 -91688 -79318 120821 262014 157887 -80209
32206h0209j41932k4448n2912p5610Q5374K70397J99357o2045j66183R652K12738
32195A74179K11710Q3622J4061K7429M4294M9278O5181O2514J2763l7836l9862
32184F67333k5066m0449n7629l0190M581l3064j42355k31163k24330j32425j4946
32173b59703P9167J23604J02917K2576o7086q7352r428Q7551Q7618j2240p7746
32162a0122n228J37408K00520J42992N3648O269j6185m8613p7168p0821k4735
32151B87965M3199R3717O7415n0193j59993j26651M1337J59419P3032j44697k61068
32140B3482j38603J19629K78843K02690k2762j77469j20196P6602K04688J35152
32130E82056n3776j73742j39189m9444l9739r2223p2257M3674Q7311p0298k90740
$$ plain form
32206 -80209 -222141 -246589 -299501 -375111 -289737 -19340 180017 117972 -48211 -38559 174179
32195 174179 385889 469511 483572 511001 555295 604573 669754 732268 745031 707195 667333
32184 667333 642267 601818 544189 513999 518580 485516 343161 111998 -112332 -244757 -259703
32173 -259703 -180536 -56932 45985 68561 1475 -85877 -95305 -7754 79864 67624 -10122
32162 -10122 -15350 122058 322578 465570 519218 525487 509302 460689 383521 312700 287965
32151 287965 331164 424881 492296 442103 282110 155459 196796 356215 429247 284550 23482
32140 23482 -115121 4508 283351 486041 463279 285810 165614 242216 446904 582056
32130 582056 528280 354538 215349 165905 126166 33943 -38314 5360 92671 22373 -268367
32119b68367l12744r8521J20918J66429J12856J00111R8814k20j58511k06066
32109d45301o3740J57384K79302K25755Q7183M0839J53556K60191J48287j16856
32099G26600k21611l8792J61560R2325j39528k24187j12520j6608k4973j3425
32089A88841O6077R2024J8646l4820j4842k9523j23589j65145p0593L8730L4929
32078G35q833N1991J98252K67522J56494o9971k30703j76206M6012J96689J18312
32067E50294n0282q6305l2591r6160k48622k45688o5392L0131l6424o634K19444
32056f8229L21967P2453k32278k03344M0474J07094l2850p8959M2355R2558k9392
32045C1849j44838j29024n0234M9928J97198K82784J45549j02455j57144J2432
$$ plain form
32119 -268367 -581111 -679632 -558714 -392285 -279429 -179318 -80504 -80724 -239235 -445301
32109 -445301 -509041 -351657 -72355 153400 240583 281422 434978 695169 843456 726600
32099 726600 504989 466197 627757 720082 580554 356367 243847 227239 202266 188841
32089 188841 254918 346942 365588 330768 315926 286403 162814 -2331 -72924 -34194 735
32078 735 -8098 43893 242145 509667 666161 596190 365487 189281 235293 431982 550294
32067 550294 500012 413707 381116 284956 36334 -209354 -274746 -244615 -281039 -287673 -68229
32056 -68229 253738 326191 93913 -109431 -68957 38137 5287 -73672 -31317 61241 31849
32045 31849 -112989 -242013 -292247 -242319 -45121 237663 383212 280757 123613 136045
32035A36045J10719P228o9486L6691J32530L4249j01752o0357O1502L9750r6725
32024B30394j40683m3856O3663J10849J30030J22796O4620j456k0750k0582k9760
32013D65265O735J05460J43558K9581j28473j86040j83350k19579k17467m7364
32003b31674J84065K29335P2624m4399L284O7628J6185n2234p404P8503N9626
31992C75539l6635n7095L8556J32495J31168P7102N8645Q7805J04796O3874j9996
31981I56254r7283j30704j12548n7570m57J2682l3771r1320r4540m2786J5120
31970C23077P5719J77422K77687K40335K4665j98816k32518r7994K0655M3257
31960F53489O3617J49640K17396J65254L3777m5586q101R7016J79540J83203J19611
$$ plain form
32035 136045 246764 253992 184506 221197 353727 387976 286224 225867 287369 327119 230394
32024 230394 89711 45855 109518 220367 350397 473193 537813 536357 515607 495025 465265
32013 465265 472000 577460 721018 750599 622126 436086 252736 33157 -184310 -231674
32003 -231674 -47609 181726 254350 209951 213235 280863 297048 244814 237410 315913 375539
31992 375539 338904 281809 320365 452860 584028 661130 719775 807580 912376 976250 956254
31981 956254 858971 728267 615719 558149 557692 570374 536603 445283 350743 307957 323077
31970 323077 398796 576218 853905 1094240 1118905 920089 687571 589577 610232 653489
31960 653489 717106 866746 1084142 1249396 1283173 1237587 1229486 1326502 1506042 1689245 1808856
31949A808856O3802Q5107J52486J49683K6312j08956j11763L174O9302k1569j93082
31938A923352l00123k93800k08522o0549J24269K19719R5949j58324k64102r3856
31928I84013J42395J74408K1784r4254r8432j09671j71139j61854k6757R6413
31918G56906O5840q7934k46036l35809l20082j83696m127Q0041L4387m5522j02744
31907c88776j65095j93239q3160J05008J40550l1488j54694l7105J46088J33384
31897e28527k4820r2585k3813N0480R5457J61948J84685O2172j12399j53810p3816
31886d55028k2287K772J12679K37164J77229m8358k01219j90827j59289j70288
31876g17452j14985J1609M5796l6721l7343J22593K50616K07616J16544R8400
$$ plain form
31949 1808856 1872658 1957765 2110251 2259934 2286246 2177290 2065527 2068701 2138003 2116434 1923352
31938 1923352 1623229 1329429 1120907 1060358 1184627 1404346 1500295 1341971 1077869 984013
31928 984013 1126408 1300816 1322600 1228346 1129914 1020243 849104 687250 660493 756906
31918 756906 822746 734812 488776 152967 -167115 -350811 -354938 -274897 -240510 -286032 -388776
31907 -388776 -553871 -747110 -830270 -725262 -584712 -616200 -770894 -807999 -661911 -528527
31897 -528527 -553347 -645932 -669745 -619265 -523808 -361860 -177175 -115003 -227402 -381212 -455028
31886 -455028 -477315 -474543 -361864 -124700 52529 4171 -197048 -387875 -547164 -717452
31876 -717452 -832437 -820828 -775032 -811753 -849096 -726503 -475887 -268271 -151727 -53327
31866e3327O3530n8798j32734n6607L3887R275k2020N5602J13703R663j20004
31855a57830p4581N2746K6669j26866j67427k9749J17517J73850J95519J82168
31845A92016M1444j81286k66690j07083J31313K16585J10861m0837r7214m4975
31835d5866J6786o648r1713j29417q0448j6797J6629O1792J17947J04633L9123
31824a3979P0428K03876J91982r7362l89661l50350q4122K5209j05528j79302
31814g28809j5604K04095K55742J56440L2627n9227q0771J0181J31083J13541
31804A9298l7925j10974J490J43727J53749Q2623L2668l1792j50681k09052r9437
31793b06306P2085J21295L9736m9704j03470j48238j35650n875J37292J20506
$$ plain form
31866 -53327 10203 -48595 -181329 -237936 -204049 -194774 -216794 -161192 -47489 -37826 -157830
31855 -157830 -232411 -179665 -152996 -279862 -447289 -477038 -359521 -185671 9848 192016
31845 192016 233460 52174 -214516 -321599 -190286 26299 137160 96323 -891 -45866
31835 -45866 -29080 -35728 -127441 -256858 -337306 -354103 -337474 -275682 -157735 -53102 -13979
31824 -13979 56449 260325 452307 354945 -34716 -385066 -469188 -443979 -549507 -728809
31814 -728809 -744413 -540318 -284576 -128136 -95509 -154736 -235507 -225326 -94243 19298
31804 19298 -18627 -129601 -128111 15616 169365 251988 284656 252864 102183 -106869 -206306
31793 -206306 -134221 -12926 26810 -22894 -126364 -274602 -410252 -416127 -278835 -158329
31783a58329j8103l9818J43996L10380K23051m2885k17880j96347j13093q6617
31773a95645o2989L1452J29365J25978N1976J5328K4592L778n0086p2618q1361
31762h0230j48414k07621q8060J86119L28378J58696j23169k01640n5372Q2202
31752a49111P5908l72n4329p7434o2478J4532J12589J45889R4283J1774m9138
31741F2113n3696Q554N9946j8719j84082k11041q052K06811K15286J08230O5588
31730B50938J9572j59603l05694j66144J19717J65915n5058j73862l1278J03039
31720b32458K7184q6050n0438K7261M503m7704n3955r8034j79015j04713J50033
31709f43386K80306J04027j08295m7556J56793J98840R2787L8903l563j91002
$$ plain form
31783 -158329 -176432 -216250 -72254 238126 461177 418292 200412 4065 -109028 -195645
31773 -195645 -258634 -227182 -97817 28161 80137 95465 120057 123835 73749 1131 -80230
31762 -80230 -228644 -436265 -524325 -338206 -9828 148868 25699 -175941 -231313 -149111
31752 -149111 -73203 -73575 -127904 -205338 -267816 -253284 -140695 5194 99477 111251 62113
31741 62113 8417 16971 76917 58198 -125884 -336925 -344977 -138166 77120 185350 250938
31730 250938 270510 110907 -194787 -360931 -241214 -75299 -130357 -304219 -335497 -232458
31720 -232458 -205274 -291324 -341762 -314501 -309998 -357702 -411657 -509691 -688706 -793419 -643386
31709 -643386 -363080 -259053 -367348 -414904 -258111 -59271 33516 72419 68856 -122146
31699a22146l72211k36664J40624L22284J30837j21492j32445j3073j9081j29218
31689e52585j18390P2002K43002K03276k361j63799j50591l4185M0766M6277O0070
31678c56518J05957J25300J01820P6838K8694j04300k50961k37944n3351R9875
31668d64590Q6302m884n2603n5930k2098P7496J60952Q9595n3888k9721J30061
31657a39308J19288q1227q4312K20319L54845J5965l25448j30014K99741K84145
31647E33994j27590k71806J8403K04143O790j73121k6543J40657m360k47103k34504
31636a81040m8259K9037R426P3580J73919J26957l6976j21852p8259l0935n6717
31625a41119j09101j09911j0720J57106K40174J04870j35192k09382n7857R7511
$$ plain form
31699 -122146 -494357 -731021 -590397 -268113 -137276 -258768 -391213 -404286 -423367 -552585
31689 -552585 -670975 -598973 -355971 -152695 -155056 -318855 -469446 -503631 -462865 -416588 -356518
31678 -356518 -250561 -125261 -23441 53397 82091 -22209 -273170 -511114 -564465 -464590
31668 -464590 -378288 -383172 -435775 -491705 -513803 -436307 -275355 -185760 -239648 -269369 -139308
31657 -139308 -20020 -101247 -185559 34760 389605 405570 80122 -49892 249849 533994
31647 533994 406404 134598 153001 357144 363934 190813 164270 304927 300567 53464 -181040
31636 -181040 -229299 -200262 -190836 -117256 56663 183620 146644 24792 -53467 -84402 -141119
31625 -141119 -250220 -360131 -370851 -213745 26429 131299 -3893 -213275 -271132 -173621
31615a73621J09705Q8827J29120J17853k3111j38969q1119L7871K2805j10108
31605b0747j89313j27593K6409J70098J88446M0950j23892r6081R5128J93127
31595A56532Q3561o8245j16833j15662r9845K0034J99509J95439l6831j68049
31585D9610K7222K72817J73917j99403m31340l27843n9660J64194K68170K07494
31575A45178k5922k82461l44371j62869J07848K80259K51302M3563j66531j70827
31565c24831J4899J42709P4196m0255l9592j86l7461o9780N391Q4812M3668j7637
31553a64067M4579J35729P6353q8836j82090j74751j40106n3336J09007J99237
31543b38281J00374k3090L5025J47210M2139k10033k59464j8935J93947J21740
$$ plain form
31615 -173621 -63916 24911 154031 271884 248773 109804 28685 66556 89361 -20747
31605 -20747 -210060 -337653 -311244 -141146 47300 88250 -35642 -131723 -36595 156532
31595 156532 240093 171848 55015 -60647 -160492 -140458 59051 254490 217659 49610
31585 49610 76832 349649 523566 324163 -107177 -435020 -494680 -330486 -62316 145178
31575 145178 119256 -163205 -507576 -670445 -562597 -282338 -31036 12527 -154004 -324831
31565 -324831 -309932 -167223 -93027 -133282 -172874 -173060 -210521 -280301 -274910 -190098 -146430 -164067
31553 -164067 -119488 16241 92594 3758 -178332 -353083 -493189 -546525 -437518 -238281
31543 -238281 -137907 -160997 -125972 21238 63377 -146656 -406120 -425055 -231108 -109368
31533a09368j01403j83616m7520J28805J39703k4536j50650n2443J44025J38175
31523a18828p4238j45798O5236K21582N6515j48730k8987K21266J63584j32243
31513G9359k05699K5539J78025P5721l0952J7814N5625k1928q4918r8185j95627
31502b05226l14594j88518J60955L50662K12371K9136K6020M3535p3430j64605
31492a23694p8614M8501P9566J05905J66643R0191j40844k24262j2675J92727
31482A03444J20114m2169k3251N1745n7250k28858j95922j7510O4221N2480R3342
31471g9614J18522j2046j59517j02754L8424r078j60564r1939J76097K67841O1931
31460D7303j18834l5546J24486R8218n8458j23128n1784J4366k4177j24813j80876
$$ plain form
31533 -109368 -210771 -394387 -441907 -313102 -173399 -197935 -348585 -401028 -257003 -118828
31523 -118828 -193066 -338864 -273628 -52046 4469 -144261 -173248 48018 211602 79359
31513 79359 -126340 -100801 77224 152945 121993 139807 195432 173504 88586 -9599 -205226
31502 -205226 -519820 -708338 -547383 -196721 15650 44786 70806 114341 40911 -123694
31492 -123694 -202308 -153807 -74241 31664 198307 288498 147654 -76608 -89283 103444
31482 103444 223558 181389 158138 209883 152633 -76225 -272147 -289657 -225436 -172956 -79614
31471 -79614 38908 26862 -132655 -235409 -196985 -206063 -366627 -458566 -282469 -14628 47303
31460 47303 -71531 -107077 17409 115627 57169 -65959 -117743 -103377 -127554 -252367 -433243
31449d33243j41431p1198o2736o6342O8399K97721L23774K5992k37740o8340L57493
31438g651M81469J48722j99471j95331j9147j1397j31680r8848J12708K31292
31428C10666J01454j13148j84867j06863l6035n2368q7014o5759j2757L0257R3218
31417a23216J91236K23855J06358m4696n1003J3536j02487l85379m78971k03041
31407h53808J31950J70669L2771P0668K81986L37346J27288q4346p7091O0545
31397A97978J38943R3881m4765j94161j97646K0427K54910K05097j01533l05385
31387F7746j93115N1441J54556Q5467k8602j20763j80784j78322j13187m4424
31377d99987J235N1461R3898R0477R2168J68715K18089O5723k08919k98883j12114
$$ plain form
31449 -433243 -574674 -645872 -708608 -774950 -706551 -408830 -85056 -59064 -296804 -365144 -7651
31438 -7651 473818 622540 423069 227738 208591 197194 65514 -33334 79374 310666
31428 310666 412120 298972 114105 7242 -28793 -81161 -168175 -233934 -246691 -216434 -123216
31417 -123216 68020 291875 398233 353537 302534 316070 213583 -171796 -650767 -853808
31407 -853808 -721858 -551189 -518418 -447750 -165764 171582 298870 214524 137433 197978
31397 197978 336921 430802 386037 191876 -5770 14657 269567 474664 373131 67746
31387 67746 -125369 -73928 80628 166095 137493 16730 -164054 -342376 -455563 -499987
31377 -499987 -498752 -447291 -353393 -262916 -170748 -2033 216056 281779 72860 -226023 -338137
31366c38137P4003L8470o4838j4281R5550M8560q9046p1606J06666K00106J00660
31355H6107m0287j04308j56903k28588j84688M1056K55825K31803K9500p8487
31345a48970K3135J59715J28411l8693j45895q8721N0182J26383P5863n9139j77490
31334i5219j86820p9864N0161J14350J30256J53775J42789J0229j83611k40000
31324a83954q0671J32030K08623J43089K7403j04742k26231k36313r1507O9578
31314c42695Q6382o508o1889m1477n430L8231J03654J15432Q635j10239q2586
31303b98490O2866J61069J51434R2085j742j30158j78894m6393J37746J58631
31293A08154N0523L2548J29978J40513n414j36996j43528j06729p3862J9916J25027
$$ plain form
31366 -338137 -264134 -225664 -290502 -304783 -209233 -160673 -249719 -321325 -214659 -14553 86107
31355 86107 45820 -58488 -215391 -443979 -628667 -587611 -331786 -99983 -70483 -148970
31345 -148970 -125835 33880 162291 123598 -22297 -111018 -60836 65547 141410 82271 -95219
31334 -95219 -282039 -361903 -311742 -197392 -67136 86639 229428 239657 56046 -183954
31324 -183954 -264625 -132595 76028 219117 246520 141778 -84453 -320766 -412273 -342695
31314 -342695 -256313 -262821 -324710 -366187 -371617 -333386 -229732 -114300 -105665 -215904 -298490
31303 -298490 -235624 -74555 76879 168964 167222 37064 -141830 -188223 -50477 108154
31293 108154 158677 191225 321203 461716 456302 319306 175778 69049 -4813 15103 140130
31282A40130O5103j36690k03157j7345J77122J54843L5141L9668J47404J96225
31272E98444J43377L3409j25201k75057k69238q7467O9859O0116r681k3121o6202
31261D9238j98622k39525m4735J83424J54070p1056j78715n7281J21137K08659
31251g3406K14653J63728M9852p5341j41364j59819j58582r9992K245J9440o8914
31240c27500n1151J94456M16323L07897k0200j97100j26762l5494m3767m2534
31230G4168O213r776q5145o1504P2827J30010L9517m9689n0418m9858o8546O509
31218d5692J43892J12071j48783l58947k78245k9179J34384J67006J45404M6564
31208a11525j46212k59886j09790K04191L88230L06494Q2625j05335j79372j46848
$$ plain form
31282 140130 205233 68543 -134614 -151959 25163 180006 215147 254815 402219 598444
31272 598444 741821 775230 650029 374972 105734 18267 88126 148242 138561 115440 49238
31261 49238 -149384 -388909 -433644 -250220 -96150 -167206 -345921 -403202 -282065 -73406
31251 -73406 141247 304975 354827 279486 138122 -21697 -180279 -280271 -278026 -258586 -327500
31240 -327500 -378651 -184195 232128 540025 519825 322725 195963 160469 116702 74168
31230 74168 80381 70605 -14540 -76044 -3217 126793 166310 116621 66203 16345 -52201 -45692
31218 -45692 98200 210271 61488 -297459 -575704 -604883 -470499 -303493 -158089 -111525
31208 -111525 -257737 -517623 -627413 -423222 -34992 271502 354127 248792 69420 -77428
31198g7428p3337n2934r6796q2843P9094K70967K73203L5456k56732l82936k83178
31187f47464o6783J02138J30677N9592K718J6002O3880J14658J81679K35601J81479
31176C74177M568j46409j26724J0253R4374P2416L7914L9243n590j49769k74182
31165f9729k07355L0354J99305J08839j37385k50773j12076Q8165J19546J8285
31155b12824M30J27756K24359J41504m0748j38212q7259K0485N7246l4925j93312
31144a35500k56656j11708J47862K87165J93765n0r3151k8592J05832J89445J28384
31133D26796q6570l03171k95931l8483K01769J67226o2091j87229q5578Q3085
31123a80177J55653J57159J51276Q1746r1483k18576j23593Q8566J07236j38088
$$ plain form
31198 -77428 -150765 -203699 -300495 -383338 -304244 -33277 239926 275382 18650 -364286 -647464
31187 -647464 -714247 -612109 -481432 -421840 -419122 -403120 -339240 -224582 -42903 192698 374177
31176 374177 378745 232336 105612 115865 210239 282655 320569 359812 354222 204453 -69729
31165 -69729 -277084 -246730 -47425 61414 -75971 -326744 -438820 -350655 -231109 -212824
31155 -212824 -212394 -84638 139721 281225 240477 102265 15006 35491 92737 57812 -135500
31144 -135500 -392156 -503864 -356002 -68837 124928 124878 31727 3135 108967 298412 426796
31133 426796 340226 37055 -258876 -297359 -95590 71636 9545 -177684 -263262 -180177
31123 -180177 -24524 132635 283911 365657 274174 55598 -67995 20571 127807 -10281
31113a0281l12842j22295K32711K98547R181k21593j08789J15432J09789m8449
$$ plain form
31113 -10281 -323123 -445418 -212707 85840 95021 -126572 -235361 -119929 -10140 -58589
$$ [...]
##END NTUPLES=NMR SPECTRUM
##END=
