##TITLE=31Pdec_PR164_E2
 D2O, 24 sc
 5.4.2019
##JCAMPDX= 6.0         $$ Bruker NMR JCAMP-DX V2.0
##DATA TYPE= NMR SPECTRUM
##DATA CLASS= NTUPLES
##ORIGIN= UXNMR, Bruker Analytische Messtechnik GmbH
##OWNER= root
$$ XWIN-NMR		Version 3.5
$$ Fri Apr  5 16:07:22 2019 Russian Standard Time (UT+4h)  she@DPX200
##.OBSERVE FREQUENCY= 81.013821
##.OBSERVE NUCLEUS= ^31P
##.ACQUISITION MODE= SIMULTANEOUS
##.ACQUISITION SCHEME= undefined
##.AVERAGES= 24
##.DIGITISER RES= 17
##SPECTROMETER/DATA SYSTEM= spect
##.PULSE SEQUENCE= zgpg30
##.SOLVENT NAME= DMSO
##.SHIFT REFERENCE= (INTERNAL, DMSO, 0, 182.463)
##AUDIT TRAIL= $$ (NUMBER, WHEN, WHO, WHERE, WHAT)
$$ ##TITLE= Audit trail, XWIN-NMR		Version 3.5
$$ ##JCAMPDX= 5.01
$$ ##ORIGIN= Bruker BioSpin GmbH
$$ ##OWNER= she
$$ F:/spectra/data/she/nmr/P31/1/pdata/1/auditp.txt
$$ ##AUDIT TRAIL=  $$ (NUMBER, WHEN, WHO, WHERE, WHAT)
(   1,<2019-04-05 16:06:26.04 +0400>,<she>,<DPX200>,
      <created by zg, POWCHK disabled, PULCHK disabled
       configuration hash MD5:
       00 E9 B6 7A A2 85 ED C7 34 08 36 98 17 FE 4E 26
       data hash MD5: 32K
       57 75 23 13 5C 9E 80 0D BB 08 EE 95 47 C0 E1 D4>)
(   2,<2019-04-05 16:06:28.90 +0400>,<she>,<DPX200>,
      <Start of raw data processing
       efp BC_mod = 2 LB = 1 FT_mod = 6 PKNL = 1 PHC0 = -1802.038 PHC1 = 56.99897 SI = 64K 
       data hash MD5: 64K
       E4 CC E7 DE A6 67 71 01 C4 51 CE F0 78 F3 10 C8>)
(   3,<2019-04-05 16:06:52.84 +0400>,<she>,<DPX200>,
      <pk PHC0 = -26.01658 PHC1 = 6 
       data hash MD5: 64K
       A5 89 AC 13 4A 0E BE F0 50 47 64 FD 12 B4 1C 28>)
$$ ##END=
$$ 
$$ hash MD5
$$ 1C FE 9D B3 BD AE 83 4B 04 4C A3 FD 3D 1C EE 77
##$RELAX= 
##$RELAX= 
##$RELAX= 
##$RELAX= 
##$RELAX= 
##$RELAX= 
##$RELAX= 
##$RELAX= 
$$ Bruker specific parameters
$$ --------------------------
##$DU= <F:/spectra>
##$EXPNO= 1
##$NAME= <P31>
##$PROCNO= 1
##$TYPE= <nmr>
##$USER= <she>
##$AMP= (0..31)
100 100 100 100 100 100 100 100 100 100 100 100 100 100 100 100 100 100 
100 100 100 100 100 100 100 100 100 100 100 100 100 100 
##$AQSEQ= 0
##$AQ_mod= 1
##$AUNM= <au_zg>
##$AUTOPOS= <>
##$BF1= 81.014009
##$BF2= 200.13
##$BF3= 200.13
##$BF4= 200.13
##$BF5= 200.13
##$BF6= 200.13
##$BF7= 200.13
##$BF8= 200.13
##$BYTORDA= 1
##$CFDGTYP= 0
##$CFRGTYP= 5
##$CHEMSTR= <none>
##$CNST= (0..31)
1 1 145 1 1 1 1 1 1 1 1 1 1 1 1 1 1 1 1 1 1 1 1 1 1 1 1 1 1 1 1 1 
##$CPDPRG= <waltz16>
##$CPDPRG1= <>
##$CPDPRG2= <waltz16>
##$CPDPRG3= <>
##$CPDPRG4= <mlev>
##$CPDPRG5= <mlev>
##$CPDPRG6= <mlev>
##$CPDPRG7= <mlev>
##$CPDPRG8= <mlev>
##$CPDPRGB= <>
##$CPDPRGT= <>
##$D= (0..31)
0 1 0 0 0 0 0 0 0 0 0 0.03 2e-05 3e-06 0 0 0 0 0 0 0 0 0 0 0 0 0 0 0 0 
0 0 
##$DATE= 1554465985
##$DBL= (0..7)
120 120 120 11 120 120 24 19 
##$DBP= (0..7)
150 150 150 150 150 150 150 150 
##$DBP07= 0
##$DBPNAM0= <>
##$DBPNAM1= <>
##$DBPNAM2= <>
##$DBPNAM3= <>
##$DBPNAM4= <>
##$DBPNAM5= <>
##$DBPNAM6= <>
##$DBPNAM7= <>
##$DBPOAL= (0..7)
0.5 0.5 0.5 0.5 0.5 0.5 0.5 0.5 
##$DBPOFFS= (0..7)
0 0 0 0 0 0 0 0 
$$ [...]
##$SUBNAM2= <"">
##$SUBNAM3= <"">
##$SUBNAM4= <"">
##$SUBNAM5= <"">
##$SUBNAM6= <"">
##$SUBNAM7= <"">
##$SUBNAM8= <"">
##$SUBNAM9= <"">
##$SW= 369.568048894756
##$SWIBOX= (0..15)
0 1 3 0 0 0 0 0 0 0 0 0 0 0 0 0 
##$SW_h= 29940.119760479
##$TD= 32768
##$TD0= 1
##$TE= 0
##$TE2= 300
##$TE3= 300
##$TEG= 300
##$TL= (0..7)
0 120 53 12 22 120 120 120 
##$TP= (0..7)
150 150 150 150 150 150 150 150 
##$TP07= 0
##$TPNAME0= <>
##$TPNAME1= <>
##$TPNAME2= <>
##$TPNAME3= <>
##$TPNAME4= <>
##$TPNAME5= <>
##$TPNAME6= <>
##$TPNAME7= <>
##$TPOAL= (0..7)
0.5 0.5 0.5 0.5 0.5 0.5 0.5 0.5 
##$TPOFFS= (0..7)
0 0 0 0 0 0 0 0 
##$TUNHIN= 0
##$TUNHOUT= 0
##$TUNXOUT= 0
##$USERA1= <user>
##$USERA2= <user>
##$USERA3= <user>
##$USERA4= <user>
##$USERA5= <user>
##$V9= 5
##$VALIST= <valist>
##$VCLIST= <CCCCCCCCCCCCCCC>
##$VD= 0
##$VDLIST= <DDDDDDDDDDDDDDD>
##$VPLIST= <PPPPPPPPPPPPPPP>
##$VTLIST= <TTTTTTTTTTTTTTT>
##$WBST= 1024
##$WBSW= 4
##$XGAIN= (0..3)
0 0 0 0 
##$XL= 0
##$YL= 0
##$YMAX_a= 33605
##$YMIN_a= -40860
##$ZGOPTNS= <>
##$ZL1= 120
##$ZL2= 120
##$ZL3= 120
##$ZL4= 120
##$ABSF1= 0
##$ABSF2= 0
##$ABSG= 0
##$ABSL= 0
##$ALPHA= 0
##$AQORDER= 0
##$ASSFAC= 0
##$ASSFACI= 0
##$ASSFACX= 0
##$ASSWID= 0
##$AUNMP= <proc_1d>
##$AZFE= 0.1
##$AZFW= 0.5
##$BCFW= 0
##$BC_mod= 2
##$BYTORDP= 0
##$COROFFS= 0
##$CY= -3
##$DATMOD= 1
##$DC= 0
##$DFILT= <>
##$DTYPP= 0
##$F1P= 0
##$F2P= 0
##$FCOR= 1
##$FTSIZE= 65536
##$FT_mod= 6
##$GAMMA= 0
##$GB= 0
##$INTBC= 1
##$INTSCL= 5.30512e-09
##$ISEN= 30
##$LB= 1
##$LEV0= 0
##$LPBIN= 0
##$MAXI= 10000
##$MC2= 0
##$MEAN= 0
##$ME_mod= 0
##$MI= 50
##$NCOEF= 0
##$NC_proc= -7
##$NLEV= 6
##$NOISF1= 182.463
##$NOISF2= 159.3651
##$NSP= 0
##$NTH_PI= 0
##$NZP= 0
##$OFFSET= 182.463
##$PC= 4
##$PHC0= -1828.055
##$PHC1= 62.99897
##$PH_mod= 1
##$PKNL= yes
##$PPARMOD= 0
##$PSCAL= 0
##$PSIGN= 0
##$REVERSE= no
##$SF= 81.0140089999434
##$SI= 65536
##$SIGF1= 159.3651
##$SIGF2= -187.1042
##$SINO= 113.3802
##$SIOLD= 16384
##$SREGLST= <1H.CDCl3>
##$SSB= 0
##$STSI= 65536
##$STSR= 0
##$SW_p= 29940.119760479
##$SYMM= 0
##$S_DEV= 0
##$TDeff= 32768
##$TDoff= 0
##$TI= <>
##$TILT= no
##$TM1= 0
##$TM2= 0
##$TOPLEV= 0
##$USERP1= <user>
##$USERP2= <user>
##$USERP3= <user>
##$USERP4= <user>
##$USERP5= <user>
##$WDW= 1
##$XDIM= 65536
##$YMAX_p= 349767759
##$YMIN_p= -72100757
$$ End of Bruker specific parameters
$$ ---------------------------------
##NTUPLES= NMR SPECTRUM
##VAR_NAME=  FREQUENCY,     SPECTRUM/REAL,   SPECTRUM/IMAG
##SYMBOL=    X,             R,               I
##VAR_TYPE=  INDEPENDENT,   DEPENDENT,       DEPENDENT
##VAR_FORM=  AFFN,          ASDF,            ASDF
##VAR_DIM=   65536,         65536,           65536
##UNITS=     HZ,            ARBITRARY UNITS, ARBITRARY UNITS
##FACTOR=    0.456856943014862, 1,           1
##FIRST=     14782.0589164792, 0,            0
##LAST=      -15158.0608439998, 0,           0
##MIN=       -15158.0608439998, -72100757,   0
##MAX=       14782.0589164792, 349767759,    0
$$ Real data points
##PAGE= N=1
##DATA TABLE= (X++(R..R)), XYDATA
$$ [...]
47825 1354262 2465633 2465045 3164612 5109381 6072111 4132882 702707 -1323903 -1161407
47816 -1161407 -146070 596237 634936 -597167 -3231133 -6106571 -7833720 -8092848 -7051048
47807 -7051048 -4740527 -2062883 -917921 -1979627 -3706830 -4791658 -5922455 -7649410
47799 -7649410 -8402964 -6734273 -4092216 -3170059 -4412112 -5920562 -5864884 -3561858 481462
47790 481462 4121792 4788128 2699384 1030558 1349679 1463928 -86262 -647538 1953306
47781 1953306 4447441 2508036 -1955942 -3305162 -893116 583531 -532248 -326415
47773 -326415 3289629 6430635 5397690 2313995 1103502 1562427 1248949 320401 317950
47764 317950 142118 -2448575 -6215258 -7244370 -4322032 -289863 2098662 2700270 1995002
47755 1995002 -325823 -3479563 -4768678 -2626047 845396 2163789 532244 -1940865
47747 -1940865 -3440666 -3993065 -3908716 -2833234 -1265433 -1172373 -3294861 -4998721 -3144812
47738 -3144812 1231975 3610376 1699399 -2074424 -4670923 -6166277 -7417678 -6684995
47730 -6684995 -1946938 4702939 8541391 7993629 5910533 4858238 4106684 2154940
47722 2154940 -395668 -1957580 -2140155 -1462562 -231934 1079568 1332962 -298786 -3237075
47713 -3237075 -5747951 -5983824 -3332523 273452 1271333 -1550162 -4808155 -4648874 -2356805
47704 -2356805 -2540667 -5914513 -8130657 -6897138 -5644927 -7342223 -8788381 -5449748
47696 -5449748 690557 3275152 666307 -2107104 -1032970 1741408 2276324 858483
47688 858483 842080 3381000 6208247 7204441 6865679 6690578 6560306 4879157 1120544
47679 1120544 -2695494 -3760806 -1568357 1480724 2732628 1831231 377157 54414
47671 54414 1725810 5187473 8487060 8430640 3824471 -1855691 -3218687 743227 4914540
47662 4914540 4164184 -140437 -2039959 982041 4757238 4454755 1295480 377113 2954069
47653 2954069 4615028 1856285 -3001656 -5570166 -5342243 -4893099 -5036006 -4484561 -3584733
47644 -3584733 -4494837 -7305463 -9478137 -9997307 -10756829 -12479051 -12497536 -8719971 -3213576
47635 -3213576 528581 1887072 2413513 2706572 2503908 2454823 3300631 4306625 4609053
47626 4609053 4894040 5609082 5046137 1892157 -1669958 -2559872 -1542636 -1910481 -3928513
47617 -3928513 -4420386 -2178891 61507 172285 -372666 216408 902248 339034 24447
47608 24447 2049331 5262847 6594667 5437864 4016444 3585596 2814076 452582 -2459193
47599 -2459193 -4040470 -3832535 -2608604 -1014878 395448 527727 -1317838 -3915411
47591 -3915411 -4932651 -3748531 -2291863 -2376328 -3400901 -3885737 -4155837 -5548964 -7490689
47582 -7490689 -7767659 -6049683 -4808639 -5742706 -7291461 -7007128 -4651401 -1546856 1338197
47573 1338197 2911183 1395122 -3327189 -8025511 -9341093 -7997083 -7439209 -8936259
47565 -8936259 -10569791 -10694919 -9726516 -8465097 -7146121 -6284699 -6009886 -4433121 550254
47556 550254 7253075 10780836 8782881 4316611 1805021 2301149 3977516 5071451
47548 5071451 4716723 2779799 679202 799898 3333409 5125810 3478312 -194362
47540 -194362 -2379598 -1928843 -368845 1256905 3215577 4845525 4072459 204761 -4320456
47531 -4320456 -6260748 -5076155 -3166261 -2726374 -3269646 -2883524 -1385012 -749174 -1940749
47522 -1940749 -3108684 -2597110 -2184722 -4446531 -7608855 -6809188 -1205348 3953418 4285258
47513 4285258 1982149 1824258 4399902 6976431 9029901 12359912 16286502 17257087
47505 17257087 14090591 9990620 7954424 7096077 5105072 1842000 -1334460 -3733884
47497 -3733884 -4900780 -3867403 -1032830 740262 -604623 -3091514 -3525210 -2670576
47489 -2670576 -4051759 -7394306 -7461993 -1620993 4918367 5216826 30991 -3409935 -1678066
47480 -1678066 746178 -839422 -4201371 -4218530 -917111 1102880 -159878 -2156988
47472 -2156988 -2849267 -3188243 -3559877 -1943895 2228000 5642174 5245138 2586773 1402373
47463 1402373 2534112 3776623 3423645 1462452 -1664227 -4899355 -5952645 -3525776
47455 -3525776 90674 1099913 -1052447 -3193920 -2888049 -1293956 -1031639 -2900347
47447 -2900347 -5412637 -6448915 -5017099 -2302768 -908639 -2026855 -3802906 -3876496
47439 -3876496 -2824463 -2955587 -4157136 -3840938 -1450037 104642 -1016648 -2397992
47431 -2397992 -1065149 1762896 2619902 1309162 1149462 3713127 6403266 6303795 4078645
47422 4078645 2477622 2556278 3081394 2686094 937558 -2113115 -5756845 -8291253 -8540661
47413 -8540661 -7728657 -8193119 -10025376 -10741800 -8806918 -5587291 -2855148 -343194 2621281
47404 2621281 4854934 4927149 3764553 3170428 2633209 349200 -3049572 -4775514 -4007722
47395 -4007722 -2857205 -2793212 -2961214 -2708168 -2792057 -3079106 -2168740 -787002 -2298293
47386 -2298293 -7579185 -12290831 -12083945 -8175263 -4768935 -3118524 -1689296 -532897
47378 -532897 -1284879 -3239511 -3454482 -1454821 -628927 -3700005 -9053866 -12848761 -13277523
47369 -13277523 -11584343 -9723070 -8083390 -5715233 -2569399 -593818 -1294171 -2768898
47361 -2768898 -1654565 1628320 2618811 -879336 -5370861 -6615703 -4940285 -3009731
47353 -3009731 -1422699 156169 407762 -1186612 -1926016 -112072 1025477 -1547739
47345 -1547739 -4420480 -2580769 1764529 2261452 -999093 -1827862 1127779 2164152
47337 2164152 -1147171 -3675466 -2020502 -589275 -3924915 -9260554 -11719302 -11705951
47329 -11705951 -11987509 -11879510 -9603414 -6814714 -5731640 -4719694 -1294756 3214958
47321 3214958 6066903 7211585 7199771 4521138 -690437 -3990077 -2510881 10392
47313 10392 -763776 -2470452 -739054 2345280 1600832 -1913879 -2561569 204994 1486542
47304 1486542 -141171 -871729 662370 1125350 -864044 -2373849 -2091369 -2564899 -4693423
47295 -4693423 -5624695 -4052745 -2288957 -1345490 535631 2677792 1344176 -3094585
47287 -3094585 -4433274 323787 5644221 5409988 1438377 -541581 579623 1729848
47279 1729848 1673390 1833199 3002968 5026508 7961405 10541108 9834923 5510591 1803876
47270 1803876 1950612 3445201 2482727 177457 -80601 1046932 322026 -1761805 -1438203
47261 -1438203 1923242 4651782 4414139 2998644 2747564 3482335 3747034 2589328 -230237
47252 -230237 -3561608 -4546924 -1431566 3453628 5991261 5422019 4710444 5886704 7648154
47243 7648154 7872356 6176315 3514086 1107760 109715 799508 2029455 2632674 2865354
47234 2865354 3233052 3016086 1730724 850182 1904384 3893431 4741745 4124724 2601057
47225 2601057 -403479 -4780156 -7499366 -5831753 -1750482 616816 956768 2089224
47217 2089224 4188466 4521255 2858050 2094357 2872543 2607477 908175 759052 2635731
47208 2635731 2802350 -36152 -1722530 228457 1508179 -2349585 -8273877 -9970627
47200 -9970627 -7104026 -4624963 -4684067 -4723486 -2957124 -640417 1318527 3612943 5816581
47191 5816581 6162426 4726671 3564461 3145723 1908442 -30469 -127953 2471207 5129696
47182 5129696 5434551 4015635 2243636 -69148 -2688020 -3234249 -198803 3821670
47174 3821670 4600282 1317726 -3056264 -5837901 -6813414 -6507146 -4705352 -1584260 1373167
47165 1373167 2877186 3431489 4354732 5707421 6267288 5334713 3391649 892259 -2170353
47156 -2170353 -4750604 -4306577 272580 5879721 7528341 3860402 -1482131 -4478157
47148 -4478157 -4680082 -3621004 -1712546 1053254 2976138 2090578 -741393 -2633317
47140 -2633317 -2459957 -1683378 -1551067 -1884236 -2876056 -5484316 -9053656 -10733695 -8674151
47131 -8674151 -4355585 -665498 1012849 980537 147611 -124890 1275298 3395504 3670710
47122 3670710 1535843 -210920 599037 2151693 1882375 1296423 3878876 8835360 11079623
47113 11079623 8278067 4142724 2903049 3696043 3029552 306260 -2345415 -4160663
47105 -4160663 -6071999 -7507549 -6443032 -3152425 -806173 -1221817 -2603159 -2832982
47097 -2832982 -2522231 -2936518 -3173254 -1975712 -736327 -1706292 -4058264 -4800723 -3368328
47088 -3368328 -2166459 -2212527 -1501924 1079449 3220391 2570323 308133 -1061231 -1676557
47079 -1676557 -3385671 -6003536 -7366545 -6764839 -5807569 -5839502 -6607901 -7522145 -8225869
47070 -8225869 -7920287 -6228745 -4789058 -5652145 -7824552 -7999039 -5399735 -3084865 -3160577
47061 -3160577 -3654834 -2331922 -894336 -2101520 -4460776 -3750085 521659 4037757
47053 4037757 3888274 2489434 3472485 6254619 7339151 5620955 3501969 2893365 2791915
47044 2791915 1758164 640546 893367 1367310 -603384 -4705969 -6849283 -4406225
47036 -4406225 -286882 664433 -1856796 -3841812 -3330679 -2778499 -3954067 -4260706 -912299
47027 -912299 3973440 6035255 4820273 3560336 3708097 3688546 3021275 3521840 5415777
47018 5415777 6092822 4480463 3282637 4595224 6297580 5630165 3821032 3766013 4981470
47009 4981470 4692549 2929004 2533130 4180274 5250069 4348197 3360536 3628552 3374696
47000 3374696 1125718 -949368 -1395 2766618 3336090 356429 -3204805 -4081533 -2292906
46991 -2292906 -108380 991872 1379033 2107927 3507434 4807145 4963138 3860405 2336896
46982 2336896 799612 -1359205 -4171602 -5851851 -4757640 -2279796 -1850984 -4615513
46974 -4615513 -7796373 -8267543 -6262615 -4266621 -3464987 -3016857 -2202031 -1441212 -1179603
46965 -1179603 -1252587 -1535467 -1955339 -1785584 -423832 819278 -550634 -4724229 -8265852
46956 -8265852 -7691171 -3547343 346104 1097839 -958939 -3427461 -3903651 -1466888 2276697
46947 2276697 3984150 2065686 -889122 -1072648 1315479 2244138 -297829 -3429906
46939 -3429906 -3851611 -2593890 -2776724 -4456870 -4974229 -3783335 -3541334 -5790128 -8414789
46930 -8414789 -8788295 -7340999 -6233920 -5895137 -4900974 -2746888 -836150 -476255 -1289737
46921 -1289737 -2301048 -3703135 -6397633 -9792683 -11280469 -9092522 -5312134 -4265252
46913 -4265252 -7091574 -9604143 -7468576 -2433478 -616670 -4531841 -9850396 -11327607
46905 -11327607 -9134549 -6946717 -5929629 -4079709 -812768 1435396 967077 -657731
46897 -657731 -1287081 -1282713 -2300650 -4499578 -6733157 -8408351 -9320517 -8505251 -5406283
46888 -5406283 -1924348 -1080418 -3138415 -4840717 -3355068 327548 2802847 1986021
46880 1986021 -1414753 -5135144 -7017440 -6187085 -3656527 -1413896 -357647 173969
46872 173969 479904 -366484 -2378468 -3417733 -2106545 -549910 -1470314 -3590809 -3183391
46863 -3183391 9647 2110325 990494 -1034496 -1887460 -3136471 -6041404 -7751359
46855 -7751359 -5302059 -973176 561705 -1107002 -2568758 -2607777 -3091112 -4069643 -2953304
46846 -2953304 330402 1762988 -1203050 -5938756 -8551250 -8600748 -7857714 -6988380 -5764973
46837 -5764973 -4543924 -3474995 -1882302 98250 1187420 1438313 2468101 3773452
46829 3773452 2019869 -3622665 -8580939 -8510502 -5214854 -3460438 -4320532 -5721890 -7463967
46820 -7463967 -10726941 -13563918 -12058175 -6368868 -1283430 70826 -613337 -719753
46812 -719753 -267709 -544889 -2154716 -5226617 -8831178 -9902502 -6004216 407352 4032493
46803 4032493 3602054 2776632 3420795 2746788 -885220 -4151723 -4034545 -2894548 -4346531
46794 -4346531 -7230797 -7950443 -6428600 -5333173 -4964893 -3210556 298789 3792429
46786 3792429 6399770 8097572 7571468 4008181 355468 525588 3334392 3520226 -576014
46777 -576014 -4613878 -4849860 -3040781 -2561308 -3118187 -2320723 -161710 1208446 1005944
46768 1005944 556606 1094541 2612162 4292538 4731406 2697931 -844706 -2582944 -582556
46759 -582556 2669457 3076333 335883 -1786388 -698888 1922096 3226775 3243131 3940757
46750 3940757 5431270 5468354 2882654 -415433 -1822555 -1209300 -485312 -783880 -1591374
46741 -1591374 -2440745 -3736143 -5288731 -5407093 -2657096 1955126 5454776 5468954 2087720
46732 2087720 -2326275 -4924373 -4707103 -3475406 -3700545 -5224712 -5357811 -2804816 244301
46723 244301 1324977 1367653 2912060 5529025 5652684 1202242 -5670171 -10996987 -12700313
46714 -12700313 -11538907 -9734121 -9023672 -8980043 -7285237 -3011211 708831 -489118
46706 -489118 -6265783 -10895554 -9899707 -5442705 -3198571 -5162367 -7931589 -7784434 -5154599
46697 -5154599 -3308827 -4097266 -6304872 -7679716 -7313194 -5768848 -3950987 -2831921
46689 -2831921 -3626375 -6525746 -9036540 -7551573 -1884691 3298879 3496167 -203515
46681 -203515 -2919877 -2529184 -1611848 -2656871 -4300836 -3822287 -1259104 968930 1480621
46672 1480621 1142963 1159405 1312483 381973 -2202854 -5378786 -7307273 -7311933 -6294999
46663 -6294999 -4750716 -1668771 3062415 6464511 5440346 1626895 147980 2879935
46655 2879935 6004382 5597900 2735917 905097 751440 181815 -1749289 -3804993 -4774151
46646 -4774151 -4491866 -3089407 -1138980 -205080 -1498577 -4091995 -5786232 -5509372 -3850408
46637 -3850408 -1856190 -455558 -329687 -1058574 -1103236 89074 773627 -912647 -4274085
46628 -4274085 -7013594 -8035721 -7778053 -6698215 -5251203 -4576945 -5221678 -5743896 -4545519
46619 -4545519 -2524440 -1806983 -2336825 -2096817 -572550 468901 -52174 -1042941 -1293015
46610 -1293015 -1065105 -969671 -908496 -753216 -643269 -185675 1212178 2885259 3283080
46601 3283080 2174944 1069129 1125932 2027522 3042310 3629449 2863550 84980 -3495864
46592 -3495864 -5574754 -5513600 -4653099 -3783534 -2486287 -1245577 -1422687 -2112153 36428
46583 36428 5865981 11009467 10769146 6092505 1939824 780036 761831 132403 258205
46574 258205 2945718 6844457 8532781 6658273 3405868 1526070 1065368 136842 -1550628
46565 -1550628 -1706875 1193187 5065222 6428344 4730244 2564168 1868838 1982324 1664689
46556 1664689 974775 403517 -176805 -838125 -1182236 -1270375 -1774335 -2786707 -3815378
46547 -3815378 -5236517 -8092310 -11957151 -14674533 -14744097 -12344428 -7800593 -1342876
46539 -1342876 5011096 7986478 6781940 4046813 1961509 -120034 -2673280 -3653657
46531 -3653657 -1651242 1019130 1331040 -58397 -304168 1099523 2180444 1954645 1368590
46522 1368590 1367114 2142599 3526994 4357819 2805707 -720244 -2808777 -1603944 -50757
46513 -50757 -1508994 -4248933 -4302282 -2160047 -1937251 -4626335 -7069639 -7664106 -8235711
46504 -8235711 -9547128 -9592459 -7604395 -5510886 -4041808 -1583605 1565687 2284094 196250
46495 196250 -217310 3875156 8818579 9610778 6726718 4161433 3362586 3020134 2793825
46486 2793825 3199730 3111933 1085340 -1731735 -3196249 -3624620 -4515175 -5101550 -3823784
46477 -3823784 -2277871 -3569601 -6848068 -7548430 -3773459 1122072 3362461 3021219
46469 3021219 2173210 1602674 1043244 565782 48551 -1245150 -3316353 -4968676 -5556118
46460 -5556118 -5746124 -5813974 -4882772 -2817293 -1175176 -1108486 -1878914 -2649768 -4057854
46451 -4057854 -6424497 -8017344 -7239509 -5473765 -5312675 -6395317 -5603823 -1829775 1874720
46442 1874720 2298227 566863 641695 3888766 7207758 7072165 3809482 627732 -595062
46433 -595062 -805729 -1342303 -2014345 -2247148 -2341197 -2309313 -975900 1887610 3650924
46424 3650924 1618802 -2466683 -3550407 145337 4084360 2878717 -2746765 -6782836
46416 -6782836 -5183992 28794 4217312 5475307 5115574 4268361 2392529 -594625
46408 -594625 -2841700 -2816095 -1999267 -3307963 -6907672 -9640107 -9245501 -7184713 -5985499
46399 -5985499 -5622370 -4603820 -3322514 -3566562 -5057879 -5313205 -3480551 -1844340 -2482223
46390 -2482223 -4496870 -5872399 -6312166 -6698469 -7190263 -7560231 -8283736 -9504975 -9809872
46381 -9809872 -7942158 -5148842 -3788900 -3844631 -2952860 -167082 2439838 2873164 2211811
46372 2211811 3026183 5715876 7980008 7839189 6048209 5105548 6302361 8112841 7648999
46363 7648999 3823330 -1151213 -3907494 -3517469 -2226001 -2427624 -3866495 -4567887 -3781528
46354 -3781528 -2767724 -2767977 -3327583 -2991219 -990815 1984771 4127091 3677355 811479
46345 811479 -1443594 328759 5549434 9046004 6574840 213678 -3833161 -2670419
46337 -2670419 372095 843440 -1260613 -2747979 -2227560 -1293341 -1263538 -1253899 -92099
46328 -92099 1595597 2242658 1360753 -247337 -1900625 -3892018 -6787704 -10113969 -12064201
46319 -12064201 -10980431 -7297292 -3513978 -1829847 -2175756 -2851508 -2462597 -805433
46311 -805433 1284064 2198906 593164 -2761713 -4947561 -4029161 -1540780 -410791 -1097213
46302 -1097213 -1602100 -855916 110581 431495 647296 1193782 1627739 1984297 2980256
46293 2980256 4124469 3675884 1589736 482450 2091862 4528839 4992118 3854439
46285 3854439 3764219 5367809 6236938 4199087 18779 -3698783 -5173987 -4595522 -3315760
46276 -3315760 -2389754 -1848042 -1320190 -981539 -1242569 -1762242 -1790497 -1348255 -785522 610452
46266 610452 3629879 6626801 6514150 3256291 869135 2307828 5588237 6957049
46258 6957049 5804115 4067405 2692138 1472811 871845 1005392 21236 -3471985 -7383472
46249 -7383472 -8621806 -7511982 -6366242 -4890625 -1318353 2525595 2359314 -1794444
46241 -1794444 -4955044 -4641345 -4100245 -6015084 -7882545 -6841901 -4773137 -4547450 -4749512
46232 -4749512 -2732993 -176867 -508470 -2561279 -2141770 743233 1478628 -1898882 -5760579
46223 -5760579 -6453329 -4806240 -3426491 -2925202 -2850235 -3608697 -5259688 -6386719 -6066482
46214 -6066482 -5300051 -4939456 -4006636 -1800075 99440 29228 -868497 -113963 2641423
46205 2641423 5565498 7271676 7517927 5963906 2447493 -1661166 -4377324 -5437202
46197 -5437202 -6023762 -6341126 -5534117 -4128445 -4158732 -6075424 -7737485 -7739364 -7736971 -9708707
46187 -9708707 -12461929 -12936041 -10043595 -5349724 -814558 2172586 2447198 315257
46179 315257 -1221684 788677 5087595 7393108 6103658 3945249 3187146 2551511 641137
46170 641137 -816153 -35211 977962 -898683 -4891072 -7412714 -7187004 -5973152 -4963885
46161 -4963885 -4012604 -4037451 -6335259 -9207624 -9009879 -5351004 -1803737 -611783 -356467
46152 -356467 -20870 -1233714 -4272749 -5681787 -2975689 1258447 3184517 3051169 3242472
46143 3242472 3277923 810122 -3642634 -6839674 -7244956 -6160199 -4892963 -3691981 -3068386
46134 -3068386 -3456949 -3982209 -3939446 -4552400 -6586808 -7553785 -4788185 -324772 1275464
46125 1275464 -548119 -2219247 -2179447 -2388375 -3136921 -1573523 2736691 5570028 4175534
46116 4175534 1643862 1871053 3553023 3007382 463934 -578391 1015609 2655205
46108 2655205 1803627 -1562866 -5675442 -7877663 -5733049 239272 5534270 5801881
46100 5801881 1774489 -1864527 -1974636 690160 3906691 6208164 6706112 5108811
46092 5108811 2627562 1289985 1670655 2222626 1162235 -1578308 -4170111 -4258739 -1161016
46083 -1161016 2800571 4189267 2355273 52073 -713250 -1391963 -3685601 -5786295
46075 -5786295 -4779699 -1500002 401444 -212223 -980957 -608741 -946853 -3358235 -5956924
46066 -5956924 -6362686 -5161356 -4583713 -5051605 -5076330 -3998658 -2936351 -2786183 -2644048
46057 -2644048 -1068779 1590867 3223920 2669327 1337737 942535 563273 -1753874 -4776034
46048 -4776034 -4777426 -1487413 318175 -2342628 -5703116 -4987072 -2183128 -2805919 -6534111
46039 -6534111 -7345784 -3201902 726803 377521 -1483189 -1087042 -143838 -1926089 -4553126
46030 -4553126 -3569988 574255 2756462 472274 -3475810 -5844209 -6569810 -6526394 -5106046
46021 -5106046 -2055284 459774 1432 -2622068 -3838787 -1554703 2196849 3592188
46013 3592188 1558806 -1154734 -1737134 -690407 -152667 -241000 483978 1595048 1045834
46004 1045834 -831740 -951038 1733667 4315130 4516423 3861953 3934488 2932900 -592706
45995 -592706 -3579023 -2427644 941831 1874414 541200 1449537 5668547 9010490 8894747
45986 8894747 7823113 8093668 7878840 5556751 3859032 5684463 8494947 7295264
45978 7295264 2073563 -1702281 -94105 4824880 8089587 7264646 3945862 1294254
45970 1294254 963160 1891988 1660240 -894197 -4502442 -6897779 -6931554 -5197351 -3259441
45961 -3259441 -2435903 -2640781 -2425621 -1034169 -92066 -1715779 -5079352 -7003415 -6353738
45952 -6353738 -5372890 -5623101 -5356962 -2927279 -333389 -431409 -2264663 -2535948 -923719
45943 -923719 -379781 -2011090 -3135578 -1600650 809025 1159322 -383354 -1292417 -717152
45934 -717152 -590453 -2538850 -5211058 -5610251 -2712401 1087773 2618251 1627402 894519
45925 894519 2520153 5320846 6653113 5661449 3540278 1623533 719042 1319517 2502318
45916 2502318 1531106 -2789310 -6803108 -5410396 636312 4450438 1815149 -3106387
45908 -3106387 -3858979 -770477 293977 -3015363 -6533144 -6215939 -3429037 -1610727
45900 -1610727 -1091243 -165909 990208 932798 361462 1448168 3829206 4467499 2199616
45891 2199616 -425506 -1052619 -651952 -1003767 -1476803 -823851 -253925 -1466221 -2760952
45882 -2760952 -911479 3166804 4638678 1748199 -1187649 49428 3653814 5023219
45874 5023219 3321701 1135228 -629601 -3135760 -5478106 -4743725 -1125937 941950
45866 941950 -1433477 -5670329 -7466953 -5913265 -2776669 834056 4320159 5883296
45858 5883296 4146702 855397 -686179 373047 2123965 3142726 3633401 3470467
45850 3470467 1697853 -1453993 -4203494 -5645382 -6751069 -8205751 -9002674 -8120946
45842 -8120946 -6010099 -3411231 -320761 2610996 3283669 649660 -2967531 -4054369
45834 -4054369 -2004532 722725 2251683 3114816 4143851 4465420 2708754 -857654
45826 -857654 -4451261 -6454232 -6220655 -3865422 -277413 2856701 3965812 2785531
45818 2785531 370803 -1883124 -2886789 -2072457 51564 1686656 1267659 -417705
45810 -417705 -693731 1735765 4949352 6235541 5517075 4932053 5480750 5835883 4606957
45801 4606957 2117444 -540109 -2645763 -3407170 -2082681 377257 1489554 563138
45793 563138 280889 2859222 5902876 4895688 -508225 -5498624 -5867187 -2378275 1278673
45784 1278673 2602881 1261729 -1964469 -5581925 -7931234 -8563733 -8154531 -6545027
45776 -6545027 -2630609 2823875 6355702 5692315 2990652 2129459 3864968 5811708
45768 5811708 6353333 6104479 5710252 4611970 2584506 801406 509404 1424893 1916522
45759 1916522 580091 -2131452 -3813996 -2683962 -506472 -1125643 -5076943 -7933513
45751 -7933513 -6078501 -2063341 -1303761 -4894730 -9035574 -10727167 -10532678 -10018553 -9917090
45742 -9917090 -10803902 -12267915 -11520090 -6463500 -92766 2310926 612008 -249895 1551826
45733 1551826 2107865 -836032 -3689970 -3467281 -2920198 -4818843 -6045375 -2910880 1606687
45724 1606687 2078685 -916218 -2893368 -3540744 -5767868 -8405752 -7496366 -4422829 -4851673
45715 -4851673 -8686218 -8959369 -3008964 2766469 2901458 802505 1959396 5020622
45707 5020622 5317645 2841063 646711 -1424517 -5183560 -8379660 -6882280 -1830270
45699 -1830270 1197778 345168 -428287 1659233 3897994 2747246 -805705 -3033803
45691 -3033803 -2388799 -356360 1372792 2622044 3816774 4539822 3584605 613938 -2619044
45682 -2619044 -3746831 -2588247 -1060124 -22337 1663317 4020343 4537237 1835982
45674 1835982 -1569507 -2693335 -2189258 -2232672 -2434929 -1458957 -933176 -3389852 -7214942
45665 -7214942 -8267422 -6361113 -5419453 -6703024 -6833095 -4080426 -1852924 -3184145
45657 -3184145 -5592708 -4860616 -1290471 1285799 1104504 -159706 -855078 -1448395 -3105082
45648 -3105082 -5825768 -8174755 -8350353 -6038368 -3259033 -2126325 -1820105 187187
45640 187187 3680042 5247370 3315227 711516 338713 934269 -344331 -3195576 -4863720
45631 -4863720 -4134566 -1936846 961742 4161244 6220331 5645749 3156203 985419
45623 985419 131636 -126916 -546993 -1399225 -2951872 -4725559 -4909909 -2324344 1534654
45614 1534654 3981394 4028776 2382966 -255657 -2933822 -3654428 -1317543 2165605 3967538
45605 3967538 3912635 3668914 3248549 1217642 -1976339 -3979874 -4070846 -3924090 -4439690
45596 -4439690 -4514143 -3605676 -2931183 -3185428 -3322870 -2561781 -1602759 -1002076 -243002 750559
45586 750559 983472 60044 -1119813 -1834889 -2099816 -1662802 -495923 -240906 -2475628
45577 -2475628 -5255904 -4550133 -32211 3803740 3739019 1804056 1238353 1721717 1384101
45568 1384101 877570 2063286 4217043 4654891 2355269 -1251959 -4131193 -4566902 -1878850
45559 -1878850 1834793 2625538 -257539 -2275759 683407 6594399 10552222 11544772
45551 11544772 11751021 10831448 6288909 -674511 -4995987 -4540910 -2529825 -1833657 -1317021
45542 -1317021 89777 -8557 -3613448 -8218378 -9934249 -8554074 -6454327 -4378932
45534 -4378932 -1562847 1326682 2719778 3009819 3959851 5511654 5822094 4435411 2954840
45525 2954840 2316440 1604728 17980 -1924720 -3632303 -5116453 -5901298 -5067540 -3136386
45516 -3136386 -2152836 -2844605 -3356505 -2223184 -1058365 -2238443 -4894091 -5746593 -3857442
45507 -3857442 -1947517 -2222155 -3394698 -3561723 -3836073 -6282092 -9441161 -9475681 -5974985
45498 -5974985 -3077165 -3415292 -4195228 -1824099 2152418 3265343 863957 -1275628
45490 -1275628 -923713 -183408 -1348776 -3214764 -3334284 -1746267 -516220 -880260 -2326034
45481 -2326034 -3511057 -3102234 -849788 1390259 1150544 -1281216 -2722879 -1458323
45473 -1458323 236202 -338210 -2067101 -1793099 862503 3108511 2973665 1263141 -449632
45464 -449632 -1598706 -2048898 -1533941 -197053 1546449 3875572 7097442 10327787 12014084
45455 12014084 11881149 11010158 9901744 7980531 5334721 3367246 2964661 3177122 2464252
45446 2464252 388889 -2422536 -4998825 -6097524 -4644468 -1137012 2011034 2607471
45438 2607471 1028803 -394572 -412584 -497700 -2800884 -6689407 -8437208 -5377487 128255
45429 128255 2539537 -572971 -5698187 -7882091 -6409434 -4184304 -2835235 -1252172
45421 -1252172 1200096 2901226 2382910 477217 -1119123 -1938424 -2324804 -2265796 -1860921
45412 -1860921 -1946395 -3064957 -4520778 -5364985 -5494622 -4860190 -2654043 1228847 4586017
45403 4586017 4591770 1263628 -2185118 -2975343 -1640682 -571027 -687581 -883320 -396996
45394 -396996 -23111 -296959 7571 1999321 4202345 4112185 2023211 815409 1404064
45385 1404064 1198560 -1415726 -3851037 -3152614 -818345 -458014 -2188871 -3176463 -2855183
45376 -2855183 -3290232 -4365537 -3283869 -61593 908705 -2916725 -8073075 -9909962
45368 -9909962 -8568926 -7067650 -5942507 -3463986 197945 2559921 2315053 764545
45360 764545 -59634 948471 3479549 5487327 4518178 1017123 -1146741 520475 3322591
45351 3322591 2822634 -1156606 -4734517 -5306393 -3848978 -2352814 -1686393 -2051662 -3374699
45342 -3374699 -5088106 -6831643 -8662384 -9441315 -6966199 -1825042 1276635 -689484
45334 -689484 -4161766 -4042658 -1667651 -2309782 -5850203 -6515050 -2556749 579016 -836585
45325 -836585 -2974129 -1378560 1512735 847448 -2381941 -3158070 -499506 1630308 856630
45316 856630 -727292 -558026 992845 1930001 1021559 -1531970 -4128688 -4520268 -2006260
45307 -2006260 1434285 3405719 3733608 3646577 3573493 3402253 3696025 4696544 5077635
45298 5077635 3564712 927514 -1258752 -2681383 -3545229 -3431688 -2910151 -4322450 -8228325
45289 -8228325 -10910299 -8842386 -4282771 -2586515 -4778044 -6870261 -6256049 -4459452
45281 -4459452 -3150065 -1754327 -144405 360653 301193 2567710 7451860 10721840 9391581
45272 9391581 6476951 6750901 9860218 11148711 8272621 3817600 1529117 2392548
45264 2392548 4655279 6042736 5635933 4354409 3459076 2499640 43902 -3143202 -3851956
45255 -3851956 -924079 2056903 1030795 -2947364 -5175785 -3628105 -818799 612842
45247 612842 1107426 1986132 2564048 1270536 -1655574 -4281883 -5360192 -5446897 -5714925
45238 -5714925 -6303707 -6034218 -3852192 -720124 484337 -2051527 -6387583 -8514900
45230 -8514900 -7124953 -5268617 -6273143 -9268994 -10460054 -8223117 -4893485 -3277088
45222 -3277088 -3460793 -4094486 -4937978 -6218863 -6748606 -5289707 -3488825 -4647808 -8931147
45213 -8931147 -12363881 -11847033 -8843862 -6435626 -5068043 -3601029 -2455161 -2466761 -2050221
45204 -2050221 660474 3366697 1416424 -5369150 -11441156 -12287574 -9095908 -5297802
45196 -5297802 -2056508 525481 973819 -1481483 -4400163 -4844735 -3315921 -2314420
45188 -2314420 -2298882 -1926232 -1292839 -1885527 -3650568 -4758114 -4199522 -2505381 -303191
45179 -303191 1678625 1823109 -597752 -3306824 -3457671 -1977528 -2465708 -5564831 -7627208
45170 -7627208 -5858192 -1857072 1231056 2436320 2279076 814546 -1564322 -3108213
45162 -3108213 -2572676 -1008248 -120842 6629 72862 -280749 -1670982 -3312097 -4056010
45153 -4056010 -4457264 -5884033 -7832918 -8013962 -5406520 -1813792 123606 -479474 -2536129
45144 -2536129 -4521387 -5565710 -5404850 -4066103 -2092041 -836445 -1657339 -4306896
45136 -4306896 -6855724 -8019610 -8710040 -10006647 -10661278 -8955566 -6516206 -7011259 -10320384
45127 -10320384 -11480189 -7531922 -2432492 -1943031 -5611852 -7632855 -4883993 -293135
45119 -293135 2052857 1650130 284144 -1153307 -2720844 -4009308 -4352405 -3660734 -2231744
45110 -2231744 -611245 30959 -1242149 -3483334 -4670610 -4668606 -5389160 -7136779 -7254155
45101 -7254155 -4271997 -1141019 -1420681 -3657705 -3118270 1038734 3920200 1401248
45093 1401248 -4402282 -8118173 -7592486 -5069675 -3113028 -2037504 -1422645 -1764336 -3378777
45084 -3378777 -4852293 -4007143 -378616 3929125 5931217 4090403 -733233 -6020212
45076 -6020212 -9171017 -9035235 -6646139 -4504570 -4584934 -6718320 -9147550 -10664172 -11519593
45067 -11519593 -11923136 -10731252 -6956775 -2137620 520375 -231083 -2306089 -3109437
45059 -3109437 -2285461 -756635 1277558 3560799 4219116 1510118 -3049027 -5731746
45051 -5731746 -5243606 -4111050 -4587556 -5391030 -4152446 -1417712 1564 -1056234 -2887611
45042 -2887611 -3545386 -3022461 -2527147 -2738285 -3214573 -3032060 -1974909 -1278075 -2497823
45033 -2497823 -5100935 -6236139 -4058757 -365524 1524774 671973 -1372476 -3329189
45025 -3329189 -4633807 -3814258 245660 4955488 5357009 455189 -4582972 -4692760 -1029624
45016 -1029624 1665150 1700084 1193156 1494147 1492795 324710 -1558511 -4441690 -9374962
45007 -9374962 -15191330 -18298455 -16938326 -13391970 -10391559 -7606862 -3830351 -664110
44999 -664110 -998969 -4557697 -7847912 -8707910 -8474506 -9017819 -9748674 -8832646 -6086266
44990 -6086266 -3357494 -2528588 -3885460 -6060915 -7185942 -6596822 -5629078 -6080738 -7849218
44981 -7849218 -9116303 -8947553 -8131238 -6964276 -4396141 -940824 -227453 -4618810 -10369453
44972 -10369453 -10855332 -4935687 1487146 3459171 2895409 4043162 6305745 5740876
44964 5740876 2112745 -317857 603807 1727556 -365674 -4365933 -6591744 -6108129
44956 -6108129 -4948652 -4632887 -5008473 -5864652 -7271570 -8309344 -7449955 -4639316 -1622218
44947 -1622218 186115 1043114 1766655 2321915 2091165 935494 -559527 -1747656 -2622989
44938 -2622989 -3721903 -5012162 -5085630 -2538142 1479713 3541333 1974024 -641256
44930 -641256 -777638 1179649 1739611 -392049 -2618996 -2671635 -1809412 -2253792 -3515489
44921 -3515489 -3400585 -1458888 665156 1715478 1851970 1587567 1364875 1923432 3419518
44912 3419518 4274616 2623606 -885773 -3373861 -3224498 -1764643 -935971 -986012 -1447926
44903 -1447926 -2739891 -5116975 -7148457 -7261619 -6348893 -6723798 -8303811 -7996455 -4020427
44894 -4020427 726377 1393074 -3197168 -9143771 -11728608 -9861789 -6035867 -3156660
44886 -3156660 -2394919 -3410520 -5206563 -6419500 -5800589 -3356805 -818261 -216530 -1819695
44877 -1819695 -3938786 -4940244 -4894658 -4786628 -4603338 -3187949 -199893 2607217 2876233
44868 2876233 323818 -2709064 -3644733 -2242189 -421549 190860 -197801 -638192 -1128055
44859 -1128055 -2180192 -3169373 -2727415 -1201672 -1047804 -3489409 -6104458 -5689718 -2807164
44850 -2807164 -1129916 -2332200 -4215633 -4560569 -4123063 -4233485 -3885107 -1733145 675462
44841 675462 659242 -1340218 -2194995 -727942 834761 477343 -1092978 -2452063 -3751451
44832 -3751451 -5663846 -7618712 -8415542 -7594294 -5402651 -2556334 -720928 -1842137
44824 -1842137 -5941639 -10524382 -12916823 -12317823 -9337622 -5127384 -1546150 -328536
44816 -328536 -1015602 -1295657 -316147 221395 -691741 -1412972 -707728 -384061 -2295692
44807 -2295692 -4590128 -3967352 -471787 2946178 4704629 5364243 4929374 2864312 673657
44798 673657 960650 3361192 4515534 2847616 466645 -580046 -987161 -1773496 -1915374
44789 -1915374 -263783 2185107 3699728 3955396 3423456 2254534 1094768 1349370 3181356
44780 3181356 4734033 4692728 4093458 4242150 4547362 4122321 3992336 5671380 8514790
44771 8514790 10271610 9589110 6741677 2954389 205111 176665 1753298 1132027 -3409992
44762 -3409992 -8133476 -7723230 -1835364 4636351 7346326 6124176 3058505 -380793
44754 -380793 -3582493 -5962831 -6813907 -5363962 -1263450 4030863 7187015 6098570
44746 6098570 2685295 769944 1353787 1873137 103895 -3165272 -5640701 -5951315 -4174229
44737 -4174229 -1473159 339125 87334 -1668880 -3704763 -5786102 -7863357 -8469471
44729 -8469471 -6258305 -2862037 -1598101 -3048516 -4422762 -3733499 -1935055 -225615
44721 -225615 1801349 3940425 4168380 1719232 -881893 -1047765 481973 1625203 2427892
44712 2427892 3976844 5388490 4807913 2572708 691781 -233836 -1029329 -1502793 -776982
44703 -776982 241958 -324425 -1955520 -2184248 -896539 -1013428 -3750805 -6299809 -6159801
44694 -6159801 -5134375 -6439879 -9730483 -11823686 -11186496 -8918575 -6093283 -3097594
44686 -3097594 -1311172 -2233306 -4424463 -4368414 -1535056 282484 -1555552 -4467566 -4710732
44677 -4710732 -3199639 -3541414 -5489193 -4879169 -600302 2745083 1238484 -2719197
44669 -2719197 -4123843 -2262656 -430006 -315017 -564138 -524209 -1540553 -3836314 -5448599
44660 -5448599 -5537622 -5825692 -7104863 -7103867 -4208022 -1051926 -1392943 -4715532 -7032158
44651 -7032158 -6417570 -4643297 -3403456 -2264740 -1273882 -2383549 -6085706 -8818850
44643 -8818850 -6646852 -801109 3108392 1719455 -2265994 -3691552 -913283 2981559
44635 2981559 4108263 1729681 -1559949 -2676247 -868935 1831260 2776604 1353537
44627 1353537 -716438 -1742664 -2028387 -2883253 -4384537 -5329168 -5210621 -4884963 -5086106
44618 -5086106 -5668616 -6763431 -9095595 -12169170 -13660865 -12188043 -9555026 -8393653
44610 -8393653 -8365798 -6851013 -3073683 732021 2463552 2329130 1448433 421385 129861
44601 129861 1874295 5248774 7341800 5618089 843475 -3766037 -5385183 -3053638
44593 -3053638 2012100 6457028 6841029 3299777 -164631 -618922 145895 -1073946 -3636520
44584 -3636520 -4208116 -2319821 -1132357 -2288996 -3497561 -2672951 -1521728 -2640545
44576 -2640545 -5035683 -5433446 -3371298 -2226176 -4669911 -9133375 -11954123 -11773769
44568 -11773769 -10213166 -8653380 -6397609 -2982683 -673899 -2361990 -7184703 -10686228
44560 -10686228 -10201415 -7877948 -6792077 -6235222 -3603010 340139 1644824 -1096216
44552 -1096216 -4290221 -3848372 3867 3715311 4546816 2529356 -216304 -875921 2015057
44543 2015057 6614688 8950963 7268684 4153283 3117225 4206613 4515846 2229927
44535 2229927 -1419220 -3736725 -2870325 775287 4148309 3483136 -1650876 -6896479
44527 -6896479 -7633854 -4512834 -2294274 -3344637 -4924017 -3699601 -496964 1119604
44519 1119604 -505326 -3591909 -5195148 -3653316 490333 4705513 6155525 4339283
44511 4339283 1641731 391807 249326 -248112 -646036 796411 3839516 5966497 5647516
44502 5647516 3806468 1595942 -980961 -3357353 -3833471 -2351538 -1524666 -2726673
44494 -2726673 -3373226 -1003080 1952905 1474032 -1152595 -604283 4101778 7661973 6573453
44485 6573453 4170954 4479399 5437676 2772586 -2478870 -5600542 -5695138 -6132656 -7890245
44476 -7890245 -7739852 -4004345 427265 2492952 2714741 2808360 2745346 2148229 1875607
44467 1875607 2172016 1452654 -1238855 -4457040 -6389539 -6575568 -4568846 301086 6314756
44458 6314756 9581335 8955914 7730479 8105934 7464215 3477083 -516541 81102 3721186
44449 3721186 4937472 2654895 875683 1487985 1913036 623091 -202657 785780 1397362
44440 1397362 -62110 -1732223 -1509260 -271147 488318 1316714 2656630 2770009 594793
44431 594793 -1566260 -1167469 483245 234677 -1991957 -3237982 -1894551 544787 2035037
44422 2035037 2197506 1773083 1299634 656622 -605831 -2267544 -2818448 -1016957 1872060
44413 1872060 3278722 3105774 3762330 5582067 5437191 1817580 -2057385 -3113286 -3220285
44404 -3220285 -5201874 -6888785 -4383833 407847 1556078 -1648463 -3309190 -183306
44396 -183306 3411700 2737391 -274409 -1058638 147174 -325741 -2806198 -3689211 -1218384
44387 -1218384 2147747 3708749 3746661 3675308 3271100 1414880 -1395917 -2806214 -1212129
44378 -1212129 1872941 2907391 447063 -2495294 -1771391 2357626 5095676 3118827
44370 3118827 -1538395 -4790964 -5365191 -4460817 -2805452 -883707 -595981 -3336227 -6845417
44361 -6845417 -6996387 -2783729 2923054 7241374 8942267 6666186 -311949 -8386701
44353 -8386701 -10946445 -6205673 -568413 -727483 -4800796 -5566910 -1211613 2200070
44345 2200070 -301276 -5743215 -7830660 -5175553 -1511949 503328 1784308 3194628
44337 3194628 3146467 502760 -2534348 -2865711 -782694 545436 -353273 -1487012 -751349
44328 -751349 1063830 1946991 1735694 1654955 1806166 1334482 723695 1454561 2959077
44319 2959077 2386473 -1291016 -4991252 -5288152 -3029099 -1853154 -2879719 -3475830 -1384521
44310 -1384521 2341652 5201600 5963032 4567788 1297100 -2500394 -4440687 -3696240
44302 -3696240 -2526775 -3483977 -6036190 -7903006 -8778726 -10065283 -11212147 -9532867
44294 -9532867 -4635033 -209064 442349 -1431769 -2478388 -2159300 -2542350 -4112912 -4822532
44285 -4822532 -3541551 -1884333 -1685918 -2582094 -3226228 -3453225 -3944313 -4677643 -4933203
44276 -4933203 -4348076 -3080878 -1359134 396016 1442814 1488799 1255941 1531376 1906628
44267 1906628 1286831 -343145 -1482023 -890866 632420 1003865 -407137 -1469556 336445
44258 336445 4350051 6842686 5334203 1552129 -1102798 -1888536 -2634802 -4025444 -4486451
44249 -4486451 -3137543 -1516203 -1211328 -1436691 -289962 2584748 5578075 6559866 4278539
44240 4278539 -452354 -4433849 -4448773 -763713 3118605 4796778 5195010 5684650 5563941
44231 5563941 4260732 3682991 5625993 8342952 8538834 5865740 2822781 965027
44223 965027 -183773 -1132572 -2055568 -3897639 -7040693 -9220263 -7718950 -3576887 -698437
44214 -698437 -696812 -1629251 -2033332 -2856693 -4561455 -5486491 -4362827 -1884886 1127200
44205 1127200 4418978 6449956 5169130 1858532 698958 2802126 4363591 3099908
44197 3099908 2593583 6538840 11802986 11885850 5728268 -1283593 -4401319 -3721060 -1641104
44188 -1641104 122863 578483 -362223 -984270 670894 3906499 5968324 5602391 4018507
44179 4018507 2399210 695520 -950209 -1823841 -2137263 -3001484 -4466542 -5278212 -4920459
44170 -4920459 -4282891 -4002886 -3700840 -3167613 -2882675 -3048133 -3250162 -3095566 -2198172
44161 -2198172 -79715 2562755 3300987 603619 -3538933 -5652658 -4935722 -3263126
44153 -3263126 -1803280 -401051 136983 -1468233 -3813995 -3487197 25642 2960902
44145 2960902 2109739 -1453101 -4675932 -6030815 -5292043 -2384279 1534280 3733596
44137 3733596 2654655 -232205 -2571622 -3627119 -3638931 -2722736 -1832835 -2734528 -5199520
44128 -5199520 -6107536 -3357949 974842 3461294 3706633 3645355 3891243 3470982 2380280
44119 2380280 1776660 1850104 1646183 866712 -16290 -1226083 -3365217 -5624708 -6080174
44110 -6080174 -4149796 -1553059 -575441 -2179277 -5668312 -9321773 -11495981 -11817789
44102 -11817789 -11119233 -9962033 -8120213 -5946326 -4758212 -4715630 -3728012 -183216 4163493
44093 4163493 5769661 3222189 -1816943 -6781789 -9750503 -9672317 -7035973 -4045023
44085 -4045023 -2510028 -1873455 -755880 268968 -500151 -2599967 -3269931 -1154846 1637181
44076 1637181 2034294 -539522 -3903042 -5616924 -5188571 -4025428 -3450028 -3105472 -1978579
44067 -1978579 -668410 -1004058 -3031319 -4412159 -3932672 -3502482 -4915205 -6665819 -6391376
44058 -6391376 -4726620 -3822665 -3404489 -1666793 781091 1640494 1440737 3336589 7535631
44049 7535631 9640070 6381691 238604 -3741164 -3755153 -1980402 -1073273 -1928239 -4055754
44040 -4055754 -6459548 -8235280 -9085220 -9169207 -8569119 -7662887 -7706747 -9622317 -12167723
44031 -12167723 -12855393 -10963141 -8187612 -6055666 -4219083 -1703017 1573983 4867360
44023 4867360 6915915 6242872 2821564 -634339 -1142974 580268 954008 -1173093 -2664879
44014 -2664879 -713498 3108431 5217238 4662083 3398654 2983579 2863064 1703840 -640932
44005 -640932 -2491398 -1663963 1885158 5088499 4813303 1648541 -1027636 -1423873 -540606
43996 -540606 735663 2686569 4406836 3735254 955020 -432084 1515903 4253730
43988 4253730 4566104 2759681 801494 -1250369 -4210852 -7142691 -8660772 -9397176
43980 -9397176 -10478504 -10913510 -9240550 -6574715 -5158310 -4788554 -3564505 -1589165
43972 -1589165 -1059564 -2771694 -4968019 -5746034 -4781603 -2958294 -1976487 -3607040 -7381821
43963 -7381821 -9870698 -8471674 -5071011 -3446871 -3870025 -3283180 -448308 2437771
43955 2437771 3676745 4496034 6468683 8951704 10293540 9735288 7231155 3256047
43947 3256047 -239710 -525674 2881090 7061331 8714635 7514424 5664319 4970453
43939 4970453 5212044 4904707 3003298 11963 -2364082 -2767353 -1276244 1051507 3056668
43930 3056668 3639294 2075225 -1040413 -3897717 -5075466 -4199389 -994892 4326814
43922 4326814 9146265 9612706 5407038 762020 -1294987 -2713193 -5549076 -6779602
43914 -6779602 -2731426 3696366 5992890 3200448 203080 -873031 -2969991 -6684445
43906 -6684445 -7427786 -3197939 635881 -1152779 -5582108 -5799018 -610364 5060560
43898 5060560 7362203 6712767 4894288 2971313 1773131 1345036 265483 -2068743
43890 -2068743 -3460183 -1869982 826766 1191560 -621678 -1607642 -1258754 -2115658 -4562471
43881 -4562471 -5219448 -2211136 1395271 1890579 111488 -669868 -418664 -2289985 -6901845
43872 -6901845 -10084249 -8182532 -3560213 -2082106 -5488121 -8996713 -7503812 -1929209
43864 -1929209 2626107 3500171 2449519 1615945 809124 -455579 -1138123 -497501 449350
43855 449350 1007154 2353030 4945065 6145730 3142498 -2606046 -6470300 -6033993 -3181302
43846 -3181302 -812833 285532 705200 490171 -688244 -2231596 -2713017 -1462640 368062
43837 368062 798220 -637049 -1957919 -997625 1642354 3200760 2447942 1124788 999159
43828 999159 1141655 -552524 -4233886 -7778602 -8905563 -6879626 -3146678 -870414
43820 -870414 -2265046 -5465450 -5872545 -1852104 2975043 4743143 4164692 3847072 3337000
43811 3337000 720169 -2391556 -2158800 1219558 2971050 504630 -3191820 -4545886
43803 -4545886 -4282272 -4935499 -6312282 -6451975 -5407551 -5007941 -5502274 -5071948 -2770342
43794 -2770342 -6833 1252020 414943 -1885046 -4705275 -7025127 -7827105 -6683728
43786 -6683728 -4251261 -1894344 -626880 -357801 -308904 -196716 -535831 -1454212 -1943247
43777 -1943247 -1264712 -633837 -2037233 -5223080 -7370980 -6511336 -4089581 -3035330 -4099381
43768 -4099381 -5459764 -5615950 -5110914 -4946345 -4634400 -3085394 -901083 -168211 -1438538
43759 -1438538 -2241842 -11348 4032574 5684855 2949869 -941581 -906665 4089358 9652225
43750 9652225 10744623 7262050 4109750 5366017 9030387 9135096 3420370 -3304514
43742 -3304514 -5278021 -3199851 -2275340 -4174192 -5546386 -4780866 -4947708 -7764200 -9536449
43733 -9536449 -7030433 -3534176 -4088198 -7286866 -7436508 -3609025 -749968 -1733447 -3897548
43724 -3897548 -4636163 -5260936 -7086805 -8053360 -6201586 -3254458 -1747846 -1179726 29895
43715 29895 960172 -163411 -2215328 -2384791 -535842 653293 -56752 -730461 502943
43706 502943 2495169 2651269 440826 -1990758 -2621057 -1907142 -1697775 -2400505 -2552408
43697 -2552408 -1361589 -41489 311504 474018 1115853 759219 -1839762 -4629609 -4728152
43688 -4728152 -3126969 -3275558 -5213670 -5315400 -2516994 -291047 -683733 -821832 1749397
43679 1749397 4170087 2629374 -1274348 -2952241 -1746852 -873913 -1386752 -854457 1730537
43670 1730537 4009672 4438583 4899133 7233594 9713782 9247383 5755144 2310381 1323034
43661 1323034 1988939 1617082 -1245791 -5251561 -7637284 -7030125 -4707131 -3126029 -3609569
43652 -3609569 -5458707 -6664524 -5374497 -1536916 2589795 4424196 3802696 2763705
43644 2763705 2634912 3003446 3813287 6041930 8979454 9188594 4512726 -2263510 -6054301
43635 -6054301 -4941956 -1155897 2335851 4098513 4057867 3420401 4166995 6420191 7046956
43626 7046956 3425325 -1996643 -3955389 -1228004 1946181 2054478 795252 1659990
43618 1659990 4495815 5972487 4379427 1643158 456237 800753 39115 -3681150
43610 -3681150 -8576693 -10628498 -8231209 -4264265 -2271656 -1815653 -1759 2943821
43602 2943821 2955711 -1873287 -7418276 -8039344 -3467306 1353977 2752065 2151008 2922775
43593 2922775 5441867 6803582 4784137 636005 -2326982 -2084456 584109 3225663
43585 3225663 3584399 934726 -3166063 -5444015 -3566410 1234085 5154559 5848464
43577 5848464 4430716 3195570 2913522 3231694 4137998 5627453 7094623 8352840 10000390
43568 10000390 11435900 10156648 5087870 -730308 -3224666 -2185744 -703181 -591472
43560 -591472 -1102675 -1540024 -2036049 -1858472 -121295 1579751 505729 -2662747 -4017874
43551 -4017874 -2276191 -894284 -2487179 -4559948 -3590727 -573458 948300 432144
43543 432144 152623 553542 -228399 -2204779 -2739451 -994142 98223 -1742239 -4205109
43534 -4205109 -3487178 90764 2523726 1956460 1147355 3039799 6227105 6975348 4525826
43525 4525826 1841460 1283319 2112873 2916466 3957736 5466650 5625642 2761885 -1401919
43516 -1401919 -3205960 -1627690 720257 1293035 309470 -744738 -1445873 -2164256 -2585195
43507 -2585195 -1704904 891445 4289871 6850200 7622376 7196136 6786838 6596884 6038342
43498 6038342 5533864 6312656 7759784 7116063 3299379 -982479 -2812246 -2711085 -2461651
43489 -2461651 -1658625 385297 1545161 -66758 -1567849 1163695 6147885 7026749
43481 7026749 2494782 -1639772 -1195479 1135728 1631536 1338151 2583280 4138797 3920352
43472 3920352 3073573 3311753 3059153 322609 -3061225 -4192278 -4030964 -5318040 -7264160
43463 -7264160 -6729580 -3673215 -1175970 -531851 -190518 709041 1408018 1973726 3171544
43454 3171544 3924743 2360343 -392752 -787514 2241382 5930523 7724556 7806048 7102480
43445 7102480 5701301 4133501 3671073 4354596 4814719 4693673 5136109 6399684 7254625
43436 7254625 7319204 7699504 8720741 9384174 9684367 10849324 12371638 11595175 7734974
43427 7734974 3718867 2117505 1564737 -383185 -2728696 -2397094 703392 3043661
43419 3043661 2301735 437243 676870 2836820 3480362 749735 -2618684 -2529179 863183
43410 863183 2954330 770910 -3000518 -3932475 -1946240 -588516 -1267828 -1818871 -949926
43401 -949926 -380665 -1239818 -1700131 -401105 567058 -1004864 -3219507 -2671936 -122186
43392 -122186 349734 -2086326 -3329337 -792518 2031329 555142 -3603424 -4413464 -72491
43383 -72491 4385438 4339260 1576751 387748 861424 175056 -1339827 -535577 2244382
43374 2244382 2427339 -1626201 -5366792 -4705091 -2023832 -1992230 -4453232 -5659319 -4515058
43365 -4515058 -3158257 -2404291 -924787 1246654 2225133 1590998 1044093 1506035 2383990
43356 2383990 3689167 5882569 7519680 6206176 2396552 -650893 -1285194 -1122912
43348 -1122912 -1781033 -2695960 -2900888 -2408652 -1110923 1257387 3403556 3157162 587149
43339 587149 -1736546 -2043973 -773024 1333830 3876704 5427120 4491323 2284638 1697014
43330 1697014 3183800 4653631 5474974 6980819 8696867 8199587 5637196 4250952
43322 4250952 5183964 5971605 5570285 6326104 9045241 10824048 10262307 10132278 11899704
43313 11899704 12379747 9516435 6801948 7461535 8580460 6353985 3527473 5471114
43305 5471114 11205477 14495295 12682582 8867715 6040687 4299192 3652594 4740795
43297 4740795 6546910 7420420 8292676 11146708 14798051 16198449 15458839 15351276 16084018
43288 16084018 14993112 11653832 9084210 9313763 11465025 14449366 17672305 18875474
43280 18875474 15610602 9685885 6100015 6540873 7801869 7624262 7839939 9900290
43272 9900290 11256959 8981531 4431009 1797840 3463584 8223155 12757925 14132525
43264 14132525 12303260 10394641 11016259 12936513 13488876 12950772 13260831 13689568 12232408
43255 12232408 10611002 12567995 16904127 17956311 14352836 11508681 13077196 15563883
43247 15563883 14848979 12954095 13903079 16845211 18088900 17162463 16300278 15932027 14856447
43238 14856447 13448689 13070420 13465682 13752810 14677558 17157232 20086304 22147449 24064247
43229 24064247 26511775 27833877 26689946 24950204 24931863 25731226 25422568 24805977 25493362
43220 25493362 26290999 25372353 24345148 26028669 29520502 31694614 32537456 34606949
43212 34606949 37892443 39773455 40012011 41474874 45534087 50506395 54831621 58158263
43204 58158263 59419707 57951533 56621549 59407162 65314010 69250265 69810664 71289194
43196 71289194 76370243 81944943 84991713 88021767 94889700 104729737 114201159 123128280
43188 123128280 133555395 144865469 154209777 161287822 169004436 179325570 191563232
43181 191563232 205022653 220434839 237820579 255141115 270466694 284379789 299064802
43174 299064802 315273866 330762242 341946886 347304547 348886851 349703173 349767759 346201036
43166 346201036 337638293 326705474 316873589 308366657 298824175 286775366 272492224
43159 272492224 256382705 238987540 222270866 208332775 196352916 183093178 167416835
43152 167416835 152339636 141189983 133352216 125640301 116735443 108048994 100689260 94039376
43144 94039376 87744669 82881157 80076533 78210749 76255701 74808428 74232083 72870799
43136 72870799 69268512 64821149 61511760 58075146 51961957 44828228 41785324 44021635
43128 44021635 46262197 43846961 38803604 35958505 36143412 36881990 37237673 37698841 36988265
43119 36988265 33581157 29545443 28384415 29391534 28600308 25365026 23291917 23915936
43111 23915936 24194312 21795036 18428152 15869780 12930172 9115796 7476755 10357285
43103 10357285 15185718 17890849 18114248 17745438 16690252 13994081 11436054 11767005
43095 11767005 14039455 14507872 12088015 9604432 9443913 10928317 12348473 12940017
43087 12940017 12335121 10406794 8276179 7542678 8094006 8455417 8450418 9438266 11522184
43078 11522184 12675018 11527012 9331842 8191866 8595540 9555150 10203846 10567905 11396693
43069 11396693 13430149 16133971 17366920 15409628 11184252 7266671 4950516 3739068
43061 3739068 3413685 4550018 6687869 8008883 7585292 6272725 4671896 2099274
43053 2099274 -1197028 -2533457 540031 6689950 11463388 11458403 7137971 1957065 -593265
43044 -593265 381943 2643267 3153763 1398990 -180840 477246 2237223 2318217 44875
43035 44875 -2331447 -2582987 -1093986 -4843 -504044 -1685400 -1921336 -744810 920963
43026 920963 2062303 2475037 2229984 971243 -1459078 -3950722 -4683351 -3128129 -892972
43017 -892972 -100123 -1215938 -2829867 -3301924 -2183026 -109338 2125342 3965711 4793940
43008 4793940 3988802 1754107 -577988 -1795104 -2109506 -2431156 -2719269 -2384123 -2194165
42999 -2194165 -3826914 -6834526 -8109624 -5926382 -2842276 -2451708 -4400208 -5136067
42991 -5136067 -3128897 -682184 -264695 -1412045 -2146527 -1682063 -656370 128480 294196
42982 294196 -28875 -235315 28488 269099 199112 919937 3434237 6207739 6348355
42973 6348355 3631477 1244790 1618274 3352390 3472037 1212771 -1744459 -3652730
42965 -3652730 -4056031 -3559823 -3188747 -3376782 -3222068 -1697759 264598 411051 -1738096
42956 -1738096 -4158808 -5271141 -5684698 -6123766 -5663219 -3383511 -97932 2811729 4630176
42947 4630176 4425427 1205480 -3601421 -6277772 -5378438 -3770859 -3914301 -3814959 -778655
42938 -778655 3280669 4267010 2020324 -145616 -919543 -1632629 -2028644 -102696 3547641
42929 3547641 5682746 5487881 5367934 5699186 3512036 -1576161 -4676093 -2118809 2827853
42920 2827853 4346050 1664263 -1313549 -2070527 -1475886 -821427 -374704 -591805 -1865058
42911 -1865058 -3026176 -2445425 -652627 236794 -218070 -154871 1498580 3024433 1963197
42902 1963197 -1634552 -4847573 -4934604 -2634665 -1713595 -4291727 -7389330 -6264197 -1133945
42893 -1133945 2350278 411832 -4085004 -6206061 -5406404 -4363757 -3657685 -1596415
42885 -1596415 1698795 4073745 5138644 6603277 8338348 7633436 3668957 -212948
42877 -212948 -618895 1385419 1711535 -1759266 -6903173 -9633554 -7890685 -3657703 -866321
42868 -866321 -956180 -1548763 -461217 801247 -147961 -1978543 -1428966 1091290 1907525
42859 1907525 286255 -360596 1207474 1250914 -2720392 -7034856 -7053213 -4240438 -3546672
42850 -3546672 -5577663 -6202113 -3538033 -815470 -1388237 -4349947 -6508831 -6261910 -4099036
42841 -4099036 -1041726 2005514 4275361 5358395 4988958 2849138 -382889 -2371739
42833 -2371739 -1443483 446600 -715408 -5772671 -10755750 -11597309 -8722848 -5459349
42825 -5459349 -3489611 -2123500 -1239629 -2153768 -4936504 -7145117 -6864582 -5649317 -6307501
42816 -6307501 -8302949 -8029283 -4419982 -1627520 -3832580 -9083177 -11418820 -8564805
42808 -8564805 -4086184 -1476823 176637 2860424 5314053 5127058 3062306 1907192
42800 1907192 2101328 1717349 206172 -1039574 -1750611 -3183738 -4934547 -4376568 -490526
42791 -490526 4145408 6582128 6795248 6372878 5648588 3892416 1328471 -703853 -1341134
42782 -1341134 -1012229 -835403 -1594908 -3011597 -3950441 -3697024 -2643097 -1152566 1252688
42773 1252688 4321848 5989996 5077376 3948425 5342636 7196077 4737440 -1769060
42765 -1769060 -5947526 -3830584 892743 3047185 3267183 4895821 6884695 5301858
42757 5301858 455971 -3031962 -3240529 -3021635 -4309040 -5052559 -3500291 -1450115 -858926
42748 -858926 -514436 1143039 2477886 1110746 -1691834 -2293041 142264 2417805 1486908
42739 1486908 -2003189 -4884947 -5136020 -3854226 -3755231 -5659684 -6878834 -4263835 1161896
42730 1161896 4566056 3259448 346752 623580 4332980 7465310 7536241 6247200 5984111
42721 5984111 6099599 4099107 -622979 -5451916 -6682175 -2734714 4061326 8719457
42713 8719457 7640791 2085909 -2914661 -3561888 -779962 1438477 401916 -3003555
42705 -3003555 -5659084 -5077739 -1298794 3312375 6081336 6187412 4961952 4201670 4496097
42696 4496097 5068738 4656847 2536053 -576742 -2516370 -1502161 1658532 4199446
42688 4199446 4737148 4731462 5666612 6249313 4347928 918182 -427782 2036702 6112055
42679 6112055 8646723 8530048 5992515 1263332 -4338523 -7753790 -6952553 -3543054
42671 -3543054 -644812 1037405 2773770 4127902 2793956 -1279390 -4417779 -3500087
42663 -3500087 233982 3513536 5656385 8449166 12007723 13436102 10511054 5017403
42655 5017403 954875 31404 298986 -657415 -2467153 -2857735 -1131622 699483 552263
42646 552263 -1175442 -2446473 -2062612 -420646 1358695 2009953 657760 -1979998 -3691055
42637 -3691055 -3376604 -2548515 -2604564 -2089653 615668 3124486 1491689 -3327103 -5938381
42628 -5938381 -4401063 -2891093 -4246234 -4725254 -269551 5888384 7258668 3551671
42620 3551671 506080 1141484 2694504 2511220 1711798 1625092 1153484 -235673 -609411
42611 -609411 1030496 2440729 1469351 -863039 -2661529 -3969491 -5034355 -4281350 -839106
42602 -839106 2757961 3266684 888712 -1803964 -3844052 -6011726 -7890604 -7772089 -5514913
42593 -5514913 -3161273 -2468775 -3524527 -5654025 -7916376 -8841042 -7581928 -5494144
42585 -5494144 -4870669 -5862940 -6207579 -4367681 -1565027 -198489 -1256620 -3650185 -5353490
42576 -5353490 -5163678 -4039011 -4356057 -6848492 -8827245 -6997769 -1839033 2619217
42568 2619217 3575159 2126385 567946 -929034 -3359776 -5964867 -6483774 -4332108
42560 -4332108 -1803450 -1324789 -2474281 -2764478 -1034574 1159253 1904737 1535449 1740882
42551 1740882 2777978 3268521 2786030 2731818 3853241 4627214 3452722 1038826 -1049620
42542 -1049620 -3000179 -5733649 -7983211 -6988621 -2467907 2191697 3555179 1606017
42534 1606017 -973309 -1707463 37735 3050571 5132198 4886705 3235181 2316467 2637565
42525 2637565 2588069 1222685 -144235 -238009 -167917 -1654685 -3822487 -3883520 -932078
42516 -932078 2819791 4896275 4958419 3833686 1952309 -83273 -900890 -43268 784129
42507 784129 74475 -754484 449757 2121353 245918 -5032119 -7948744 -4862692 -101948
42498 -101948 -15597 -3505777 -3731008 1489685 6765792 7665718 6552485 7201075 8387911
42489 8387911 6846344 3219137 683074 -188266 -1065044 -1984710 -1842822 -1558259 -2800643
42480 -2800643 -4388362 -3800187 -1658170 -852088 -1650970 -1688573 -635183 -687978 -2126269
42471 -2126269 -2556728 -1259013 -222645 8199 1354069 3837453 4422774 1955294 -767106
42462 -767106 -1864815 -3252728 -6117705 -7508448 -4795300 -324801 1888241 1489743
42454 1489743 460861 -947211 -3214086 -4577028 -3024843 -12235 1298448 509446
42446 509446 -335115 -422652 -567447 -1027953 -1702941 -3259299 -5413859 -5810950 -3655204
42437 -3655204 -2466205 -5449427 -9949745 -10938498 -8607154 -7445680 -8490366 -8068677
42429 -8068677 -4698747 -1732227 -1518837 -1721639 302335 3344883 4921713 4792052 3742390
42420 3742390 1741990 -638451 -1632551 -1037874 -1047580 -2597498 -3622127 -2850044 -2389154
42411 -2389154 -4025537 -5588319 -4042216 -375773 1535800 -212824 -4197549 -8007647
42403 -8007647 -9834764 -8957035 -6780556 -6324242 -8667956 -10944558 -9738823 -5406326
42395 -5406326 -1171698 932919 1300936 1000030 803185 1197123 1666848 800118 -1492856
42386 -1492856 -3051255 -2177605 211091 2644047 5290850 8005727 8431475 5137054
42378 5137054 1035594 254720 2581319 4338133 3950874 3054286 2487686 1011552 -1654788
42369 -1654788 -3952841 -5280337 -6654262 -8043211 -8057925 -6931475 -6720241 -7646292 -7236045
42360 -7236045 -4168177 -113717 3306015 6360463 8765581 8686314 6057938 3917405
42352 3917405 4274842 5381762 5264310 5037315 6039853 6585853 4898538 2724049 2174270
42343 2174270 1189509 -3239158 -8716564 -9497799 -4833471 -320452 -55446 -2013934 -2773077
42334 -2773077 -2423106 -2257323 -1393139 873586 2108802 -36999 -3371593 -3845281 -1856119
42325 -1856119 -1855873 -5404532 -8471378 -7223175 -3500907 -2046203 -4020492 -6081265 -5392355
42316 -5392355 -2852660 -695032 878592 2905106 4713802 4179280 1197017 -1195247
42308 -1195247 -520103 1685011 1999143 -11714 -1413395 -596545 192221 -1554232 -4445641
42299 -4445641 -4999276 -2827097 -1558954 -4246755 -9659323 -13873307 -14293668 -11379507
42291 -11379507 -7445601 -4684906 -3794555 -3792988 -3428466 -2930106 -3611484 -5427875 -6091546
42282 -6091546 -3683586 547795 3260774 2689469 167142 -1925093 -2588960 -2361161 -2082007
42273 -2082007 -2124681 -2289030 -1952972 -659150 1151696 2366880 2444005 2061548 2261280
42264 2261280 3336408 4862344 6332585 7232251 6869899 4935983 2298782 643740
42256 643740 1035797 3092012 5620320 7612292 8373835 7286544 4314911 796487 -1151219
42247 -1151219 -682206 705846 898638 -218107 -822379 34836 915815 173004 -1336822
42238 -1336822 -1289749 551553 1589846 -109691 -3032113 -4295909 -3641926 -3455462 -4806106
42229 -4806106 -5571244 -3770897 -1241949 -1669582 -5155387 -7262269 -4641426 334527
42221 334527 2589292 821928 -1573730 -1735870 -627917 -407631 -1192595 -2035323 -2963219
42212 -2963219 -3965538 -3586734 -889276 2355499 3892896 4445679 6194467 8420442
42204 8420442 7870924 3687969 -1073867 -3577780 -4072807 -3732531 -2520136 -703067 134895
42195 134895 -440651 -369592 1749577 4049252 4063516 2280154 733850 -337746 -1782434
42186 -1782434 -2714141 -1374714 1642157 3673812 3430268 2003132 636300 -386051
42178 -386051 -751551 -97477 980943 1645698 2299173 3577551 4423513 3375578 1280983
42169 1280983 138515 -400672 -2279229 -4727573 -4402686 -978779 1001079 -1849773
42161 -1849773 -6673019 -8160718 -5546447 -2682005 -2084239 -2115204 -428248 2283037 3266299
42152 3266299 1360540 -1452332 -2086508 452485 4124407 6207195 6277925 6248772 7531465
42143 7531465 9053387 8545029 5380139 1712244 626275 2876091 5617304 5360946
42135 5360946 2326539 197754 818326 1520367 -252928 -2126359 -146127 4573142
42127 4573142 6994097 5666136 4423992 5769453 7134028 5602192 2347831 -42932
42119 -42932 -1226778 -1562836 -239254 2182227 2489860 -546152 -2988594 -867701 3750255
42110 3750255 5667152 3656288 725906 -1092219 -1988347 -1598430 515662 2074652
42102 2074652 125569 -4056147 -6113907 -4828572 -3167506 -2766758 -1734332 878376
42094 878376 2668850 2072942 1494203 3628605 7155191 8715019 7534640 5719512 4902772
42085 4902772 4518148 3081095 96909 -3218755 -5049277 -5255365 -5812296 -7726672 -8659732
42076 -8659732 -5993080 -1451900 540093 -926592 -2215170 -1005107 502623 -147193
42068 -147193 -1551919 -1035487 1138138 2713967 2853977 2197947 841292 -1430843 -3598606
42059 -3598606 -3992591 -2287433 -24674 547711 -1799558 -5536929 -6672068 -2908363
42051 -2908363 2510125 3894394 504635 -2462430 -1404393 931808 532340 -1566211
42043 -1566211 -1563324 843614 2326296 1009100 -1542879 -3023358 -2743871 -1722426 -1967975
42034 -1967975 -4641947 -7681110 -7196572 -2954196 60794 -1879541 -5780368 -6374669
42026 -6374669 -3782000 -2433720 -3814708 -5066931 -4435355 -3365187 -2666583 -1015785
42018 -1015785 1489540 2247330 455919 -837198 752091 3024353 2381189 -817473
42010 -817473 -2787144 -1573741 573128 517151 -1574250 -2616129 -1012538 844087 -129446
42001 -129446 -2922360 -3639555 -1522789 -173561 -1358247 -1639342 1682554 4974881 3345692
41992 3345692 -1269489 -2701864 94482 2268985 1464884 752445 2008666 2346487 -296351
41983 -296351 -2988669 -2488857 -277391 408735 -366612 -257754 1529919 4049763 6368304
41974 6368304 7497328 6538441 4473271 3591792 3986074 3519557 2334656 3328298 6219394
41965 6219394 5977934 694584 -3561416 -716701 6081777 9073019 7183253 6092965
41957 6092965 8028529 8544624 4672307 128832 -421341 2090527 3596900 2924391 1984078
41948 1984078 1522700 -109273 -3918906 -8039307 -9387928 -6974314 -2823317 624282
41940 624282 3222480 5926190 7397983 4466203 -2999121 -10281084 -12963408 -11888763
41932 -11888763 -10768324 -10925285 -11215325 -11244446 -11150732 -9523338 -5403545 -1637417 -2238066
41923 -2238066 -6512552 -9660308 -9398361 -8089442 -7767471 -7210253 -5323499 -3600253 -3215560
41914 -3215560 -2905506 -1939917 -2295670 -5233283 -7993867 -6858316 -2237022 1847869 2710855
41905 2710855 1401651 471428 926374 1529951 448235 -2403134 -4747123 -4277915 -1265746
41896 -1265746 2117229 4368776 5064994 3755697 950424 -534313 1530303 4686984
41888 4686984 4246209 177943 -2588919 -1754555 -849203 -2679828 -4382316 -2701671 -153357
41879 -153357 -1105120 -4503651 -5720003 -3995944 -2763413 -3173308 -2529495 299682 2518046
41870 2518046 1778371 -697569 -2744781 -3918136 -4254580 -3328470 -2048850 -2716061 -5566313
41861 -5566313 -7595687 -6606566 -4249834 -3058595 -2511819 -545971 2539273 4549563
41853 4549563 5025348 5476334 5957047 4345328 151923 -3399635 -3269923 -1232054 -1873578
41844 -1873578 -5979015 -8713519 -5901858 53045 3213478 2008571 626049 2089343
41836 2089343 3682725 1603268 -2666055 -4303908 -2290078 -684884 -2450193 -5465776
41828 -5465776 -6130066 -4238048 -2180567 -1116267 -468601 -449113 -2433829 -6279517 -9165674
41819 -9165674 -8446125 -4875383 -1720110 -875262 -1201927 -1056666 -902978 -1949233 -3215507
41810 -3215507 -2311778 715287 2698279 1533958 -1046115 -2437184 -2933321 -4263150
41802 -4263150 -5816692 -5235108 -2301700 488981 1301938 424597 -1765814 -5478647 -9304183
41793 -9304183 -10066703 -6639067 -2029056 192106 174683 632369 2439168 3545330 2122671
41784 2122671 -1004784 -3496994 -3962931 -2847281 -1606105 -1562739 -3276035 -6399314 -9727590
41775 -9727590 -11476200 -10240640 -6333508 -1878551 1086914 2395741 3026659 3095980 1789941
41766 1789941 -699595 -2469193 -1780815 894109 3042329 2153309 -2005088 -6574039
41758 -6574039 -7704221 -4486879 -153876 1916120 2478217 4574863 7943864 8329805
41750 8329805 3301762 -3845309 -7780558 -7076786 -4691255 -3643165 -4038404 -4064610 -2621296
41741 -2621296 -675174 -116434 -1135601 -1538507 74022 1394658 -818226 -5333060
41733 -5333060 -7107296 -4152699 -305304 565491 -230330 622831 2967852 4167907 3442900
41724 3442900 1812832 -566112 -3528078 -4903758 -3166277 -814118 -1101598 -2527102
41716 -2527102 -1245484 1684733 1029897 -3941903 -7208564 -4659139 -65883 752669
41708 752669 -2357107 -5679169 -7742673 -9374547 -9967985 -8186290 -5334098 -4129031
41700 -4129031 -4630888 -4773982 -4468221 -5636263 -8059781 -8624442 -5688556 -1657080 -93772
41691 -93772 -2029741 -5783149 -8720292 -8643205 -5210885 -828735 1203368 100841 -1885158
41682 -1885158 -2558476 -2047446 -1764633 -2638769 -4817659 -7605863 -9111682 -7459923 -3192068
41673 -3192068 743576 2152389 1719476 1531173 2794271 5550629 9035039 11352329
41665 11352329 10369771 6311891 2274163 766781 832185 67010 -1612028 -2149841 -640846
41656 -640846 1622124 3252165 4028818 3909538 2636257 940300 610275 2423349 4995905
41647 4995905 6500331 6697723 6424099 5784654 4053941 1320519 -804612 -763051 947740
41638 947740 2070809 1268714 -28178 611488 3157250 4872975 4114341 2682889 2779910
41629 2779910 2988244 12975 -5722549 -9212471 -6863140 -1152354 2492111 1938110
41621 1938110 -508482 -2052241 -2043153 -943847 855281 2457771 2473426 686177 -1369569
41612 -1369569 -2395571 -2969025 -4242991 -5801488 -6014505 -4195091 -1312817 1323915
41604 1323915 3095817 3826177 3640996 3342439 3799380 4418194 3376087 364718 -1980656
41595 -1980656 -1019838 2123619 3836102 3163717 3239758 6366931 9947390 9746252 5964469
41586 5964469 3085573 3728585 5573846 5368725 3426107 2212302 2175162 1464979 -724652
41577 -724652 -2878817 -3660794 -3973689 -5530363 -8256058 -10178907 -9727248 -7339535 -4573859
41568 -4573859 -2225592 -42536 1856034 2438637 1383476 311524 977947 2571191
41560 2571191 2461002 -184296 -3172868 -4201237 -3352058 -1858068 -91890 1805299
41552 1805299 2692801 1658234 -271713 -1287137 -1158057 -1016420 -1326859 -1572648 -1539006
41543 -1539006 -1422888 -969402 141367 1399141 2224825 3044474 4202755 4657204 3639636
41534 3639636 2812698 4327906 7102282 7738556 5269311 2211361 427626 -1101456
41526 -1101456 -3314466 -4830119 -4498277 -3712999 -3883550 -3540982 -660297 3320516 4663689
41517 4663689 2362292 -317091 204830 3830012 7265807 7501019 4326603 33256
41509 33256 -2755649 -2838064 -462582 3332431 6739341 7645617 5717416 3491152 3505212
41500 3505212 4710701 4043610 1401492 56833 1506830 3147734 2526692 807672
41492 807672 -124998 -1187717 -3948769 -7171175 -8516675 -8087509 -7407487 -6398071 -4451028
41483 -4451028 -3234089 -4998974 -8662080 -10736577 -9946993 -8101250 -6635124 -5190291
41475 -5190291 -3700265 -3166773 -3898280 -4990159 -5681945 -5600304 -4217604 -1937191 -728837
41466 -728837 -1424476 -1681327 528748 2879980 1827229 -1428668 -2591969 -1318448 -1527035
41457 -1527035 -4290523 -5729302 -3484495 -322899 913527 1388025 2589536 2808536
41449 2808536 662841 -1347919 -468062 1796655 2203815 550928 -1231606 -2549509
41441 -2549509 -3494203 -2820431 -14979 2286124 1354416 -1463282 -2834992 -2518137 -3149455
41432 -3149455 -5854795 -9113771 -11407488 -12324835 -11614333 -9526883 -7470327 -6293854
41424 -6293854 -4926707 -2626235 -988035 -1387420 -2173020 -1149590 831263 1707782 1873537
41415 1873537 2700321 3104043 1313011 -1348305 -2331917 -2261997 -3465174 -5466722 -6373235
41406 -6373235 -7353133 -10513802 -13273423 -10884451 -4602599 -1052258 -2498023 -4073451
41398 -4073451 -2448887 -795990 -2194636 -4196349 -3971425 -3562743 -5307800 -6536963
41390 -6536963 -4098792 -618066 -716631 -3592246 -4830946 -3676150 -2992103 -3302541 -2547107
41381 -2547107 -1376096 -3030797 -7203820 -9118717 -6351454 -2274136 -588568 -132903
41373 -132903 2020077 4994644 5147320 1752954 -1370438 -491693 3465700 6007297 4219248
41364 4219248 -73776 -2628317 -1628207 783120 1721353 951083 378480 1196231 2572537
41355 2572537 2835999 1414740 -224273 228433 3087418 5611465 5199281 2988635 2072172
41346 2072172 2643516 2036447 -306262 -1734289 -1300460 -1653936 -3994615 -5217976 -3051705
41337 -3051705 -270308 -138952 -1096773 -248427 969876 -376276 -2719450 -2352009 -17917
41328 -17917 674265 248545 2501524 6867321 8017909 3963484 -1287245 -4416885 -6466730
41319 -6466730 -8132800 -7133108 -2944295 783511 1513336 1334986 2599372 4285127 5330904
41310 5330904 7068595 9219584 8014927 2145147 -3485207 -4094314 -1447856 268607
41302 268607 1264786 3892173 6781720 6738737 4312274 2278368 453341 -2843771 -5919720
41293 -5919720 -5722952 -3451278 -2789701 -3661215 -3239066 -2165250 -3670263 -6877274 -7367440
41284 -7367440 -4784126 -3460168 -4559457 -4270133 -1601740 -1145388 -4987021 -8173366
41276 -8173366 -6351321 -2530517 -1580956 -2640841 -2186004 -900341 -1882557 -4528072 -5537987
41267 -5537987 -4385888 -3054319 -1796788 233422 1388819 -702522 -4431315 -5685087
41259 -5685087 -3624725 -859903 1541805 4581650 6982766 5431812 288893 -3531168
41251 -3531168 -3226839 -1775519 -2819268 -5370861 -6233426 -4894695 -3038423 -1068974
41243 -1068974 1853590 5108953 6424676 4482984 500514 -2721633 -2946448 -431062
41235 -431062 2029156 2042813 708736 1219024 4198339 6549987 5717640 2893545 669698
41226 669698 -443403 -1328217 -1733880 -622708 1757856 3877298 4445923 2782430 -1293987
41217 -1293987 -6444788 -9622985 -8691609 -4942554 -1793573 -1362600 -3171199 -5375779
41209 -5375779 -6193382 -4987127 -3102287 -2806730 -4436120 -5727654 -4993096 -3369327 -2515118
41200 -2515118 -1967713 -887728 -612792 -2661955 -5507626 -6461982 -5932062 -6529300 -8466871
41191 -8466871 -9328556 -8312849 -7094546 -6175868 -4140159 -1288580 -133147 -926475 -572508
41182 -572508 2055022 3501503 1147714 -2166336 -2344903 -188721 389176 -1681371 -4282710
41173 -4282710 -6271510 -8035251 -8721037 -6872186 -3735084 -2373195 -3254998 -3939463 -3402765
41164 -3402765 -3347814 -4554483 -5218031 -4142698 -2711474 -2191690 -1626092 -126482 958536
41155 958536 209632 -1152760 -817180 1302559 3076604 2991413 1654518 726170 1123315
41146 1123315 2005715 1318825 -1974885 -6150843 -8248858 -7418624 -5473375 -4065485 -2964724
41137 -2964724 -1453315 382063 2328446 4226405 4859277 2680783 -1398918 -3951412
41129 -3951412 -2977615 -121037 2207813 3852219 5474388 6055552 3917149 -878535
41121 -878535 -6575658 -10927102 -11482577 -6914613 359496 5155958 5085409 2991795 2063733
41112 2063733 1493780 -352773 -1851719 -1271990 -1149603 -4430379 -8249960 -7310410 -2369760
41103 -2369760 910940 1512188 4607676 12006184 17684513 16239784 10534312 6868992
41095 6868992 6585158 6647478 5415806 3603253 1728512 403913 1298615 4367316 5931875
41086 5931875 3015466 -1942376 -4079511 -2423468 89007 1412238 1491612 -308771
41078 -308771 -4719628 -9585910 -11017153 -8038926 -3455630 -27606 1697037 1986465
41070 1986465 1155826 289730 338393 573510 40507 -220686 1005747 2134290 985133
41061 985133 -859278 58013 3079940 3826549 1126375 -1056598 -43280 1593295 625512
41052 625512 -2130648 -4246066 -5430941 -6185914 -5799380 -4518704 -4786080 -7235186 -8306500
41043 -8306500 -5404489 -1789701 -2063314 -4791228 -4576063 -615083 1972293 -87741
41035 -87741 -3722374 -4350304 -1567452 2030324 4793685 6301022 5645679 2189975 -2514837
41026 -2514837 -5531701 -5372170 -3083290 -692859 646792 1132666 1647759 2739686 3965961
41017 3965961 4236167 2946179 765608 -769418 -558739 965992 2045015 1168909 -1441889
41008 -1441889 -4055181 -4953191 -3551549 -611279 1917959 1928634 -664556 -3185163 -3185612
40999 -3185612 -1744781 -1654792 -2591828 -1196686 3191920 6216248 4038567 -1414161 -5333424
40990 -5333424 -6032379 -5149446 -3614248 -921720 2274769 4085486 3904352 2626457 728156
40981 728156 -1522009 -2625480 -1468053 7601 -1241829 -4763321 -6964941 -6212216
40973 -6212216 -4447726 -3324145 -2084649 -318561 447116 -370693 -648673 1293478 3830199
40964 3830199 4258581 2257063 -638809 -3529897 -6256130 -8029854 -7759536 -5491306
40956 -5491306 -2668445 -1249473 -2560537 -5940242 -8515424 -7780900 -4504532 -1545627
40948 -1545627 -32102 1156138 2336851 2369760 1422954 1246310 1813344 951969 -1414937
40939 -1414937 -2156032 21033 1828507 260304 -2880919 -4244705 -3933913 -3987149 -4335187
40930 -4335187 -3844135 -3347275 -3923767 -3847865 -1072729 2570368 3439967 1274679 -1314319
40921 -1314319 -3314980 -5302858 -6079420 -3858723 -371574 739936 -462806 -808450
40913 -808450 -364499 -3030517 -9508391 -14532132 -13410729 -7644226 -1929604 1135037
40905 1135037 1470224 -41744 -1402007 -662170 908406 -289210 -4557391 -7565104
40897 -7565104 -6538407 -4085861 -3403580 -3493389 -2293999 -867932 -627613 239955 3113573
40888 3113573 4639204 1222320 -4342171 -6223532 -4118081 -2710591 -3352004 -2601923
40880 -2601923 364019 1275563 -2098744 -5741083 -5405151 -2562111 -966705 -877006 -443597
40871 -443597 -34108 -1057011 -2259568 -1259344 1090950 1586328 -316849 -1780240 -1212141
40862 -1212141 -509000 -1685157 -3840083 -5008788 -5159834 -5459752 -5578041 -3796816 59604
40853 59604 3344512 3183612 -179989 -3552883 -4302269 -2864703 -1492004 -1563811 -3063743
40844 -3063743 -5739794 -9083025 -11491362 -11428332 -9674138 -8474227 -7922065 -5469721 -290218
40835 -290218 4170740 4197800 753525 -2096038 -2621235 -2537331 -3227161 -3820729 -3299284
40826 -3299284 -1959839 -307722 1215599 1089232 -1987898 -5944569 -6510538 -2986315
40818 -2986315 144320 -517668 -2346052 -1103125 2170451 2836860 13393 -2281637
40810 -2281637 -1433941 633949 1759013 2975916 5446907 7146519 5659958 2401274
40802 2401274 986707 2289169 3784501 3466794 1976319 624847 -611138 -2307310
40794 -2307310 -4068759 -4718663 -3659403 -1709182 -643297 -1641675 -3948516 -5528574
40786 -5528574 -5340613 -4239934 -3205489 -1778819 684598 3124333 3673170 2185326
40778 2185326 469466 -125054 -207508 -1034849 -2499117 -3102403 -1899561 -17010 469080
40769 469080 -520850 -314443 2971993 7037169 7875266 5348079 3207245 3124088 2541938
40760 2541938 156178 -742865 2176912 5188386 3836099 526897 769985 3472764
40752 3472764 2100194 -4178906 -7905314 -4389637 1186286 1772828 -1737871 -3689028
40744 -3689028 -2656291 -1694228 -2080524 -2358905 -2462038 -3827123 -5819648 -6336556 -5729001
40735 -5729001 -6115422 -6997345 -5727065 -2499886 -551668 -647816 195692 2963483 4017427
40726 4017427 953233 -2586847 -1693458 2565892 4745117 2785373 109976 -287518
40718 -287518 -102076 -2310409 -6039229 -7525322 -5456814 -2884189 -3213769 -6004672 -8003166
40709 -8003166 -7313984 -4834504 -1920256 1242723 4279192 5598488 4296502 1895008
40701 1895008 457379 -271692 -2023860 -4769639 -6390588 -5754908 -4198170 -3235290 -2357513
40692 -2357513 -240949 2756733 4539888 3669641 1195286 -207324 896156 2747644
40684 2747644 2017287 -2133557 -6424072 -6906888 -3450476 523083 2362933 2586329 2844307
40675 2844307 3265669 2783612 1105757 -667186 -1119059 222239 2450140 3996264 4144206
40666 4144206 3722661 3750416 3723631 2349086 -17877 -1155229 -19429 1188945 -449245
40657 -449245 -4384059 -6855123 -6069378 -5278626 -8449821 -13624716 -14018582 -7113520 569319
40648 569319 1093792 -4506819 -7902639 -4900329 -43326 1278898 9069 -234914 505697
40639 505697 122191 -810957 -548729 -242376 -1750163 -3064288 -1049901 2208441 1283403
40630 1283403 -4276422 -8828334 -8730400 -6474370 -5155899 -3743084 -516774 2773308
40622 2773308 3415571 1729899 -148930 -1335785 -1876726 -1492876 -633800 -764274 -1912309
40613 -1912309 -2169147 -1236145 -1785321 -5171995 -8422988 -8092194 -4923270 -2035114 -481287
40604 -481287 569405 961431 -121539 -2055983 -3607725 -4944593 -6636847 -7783010
40596 -7783010 -7330673 -6165859 -5809242 -6188277 -6601591 -7368817 -8415226 -7999847 -5416106
40587 -5416106 -3232619 -3868908 -5443299 -4388814 -1141075 353681 -1621491 -4631278
40579 -4631278 -5815692 -4566977 -1560452 1979117 3941599 2961117 569123 -600650
40571 -600650 -526559 -1214447 -2887828 -3851572 -4034012 -5273404 -7603447 -8534010 -6932847
40562 -6932847 -4610133 -2934455 -764217 2792787 6118224 7287079 6517357 4907221
40554 4907221 2622745 -80657 -1736481 -1345124 -72192 151587 -1129923 -3060246
40546 -3060246 -4879639 -6185851 -6647575 -6335577 -5730747 -4989027 -3964879 -3056567 -2873560
40537 -2873560 -2965079 -2321083 -1370235 -1818853 -3988866 -5997820 -6347714 -5717920 -5221189
40528 -5221189 -4448323 -2632525 -629932 -145738 -1389997 -2737008 -2696230 -1424763 -152285
40519 -152285 405066 675286 1266413 1874002 1809229 1282478 998848 652130 -421723 -1024139
40509 -1024139 858679 3915410 3625038 -1396857 -6347047 -6658929 -4524612 -4835327 -7088754
40500 -7088754 -6638937 -2689373 738509 1699407 2522066 4416679 5332035 4490503 3837647
40491 3837647 3288209 -251623 -6869819 -11697039 -11647073 -9290743 -7231299 -4001136 564864
40482 564864 1339366 -5057086 -13203831 -15059271 -10673190 -6844352 -6947243 -8071879 -7355352
40473 -7355352 -5318638 -2789443 394548 3003963 3047924 1381680 852702 1476458 393563
40464 393563 -2747579 -4317341 -1825480 2839648 6576075 8500503 8947651 7881417
40456 7881417 5962110 5024695 5853658 6894769 6240680 3754672 785463 -946865 -157970
40447 -157970 2643612 4583595 3038491 -1076999 -4426115 -5517600 -5679648 -5753622 -4472958
40438 -4472958 -1085653 2518509 3745971 2397008 948155 2082019 5882215 9173888
40430 9173888 8542117 4566504 1332733 639304 -603024 -4735935 -8189601 -6345106
40422 -6345106 -1496337 -358167 -4168441 -7211318 -5994503 -3886003 -4351938 -5131977
40414 -5131977 -2881812 611221 1262827 -876616 -2087904 -338741 3079579 6022333
40406 6022333 6927588 5081944 1849213 273800 1305056 2104817 353247 -1892308
40398 -1892308 -1562998 257537 263779 -1401075 -1668343 -229268 -185881 -2355199 -3200913
40389 -3200913 -323821 3436728 4062826 2109300 1274752 2539673 3159466 1619691 399138
40380 399138 2162605 5361043 6191402 4086103 2327788 2827286 3300315 1312034 -1534826
40371 -1534826 -2299982 -1687927 -2652066 -5011398 -5749525 -4744977 -5458422 -8459571 -8989832
40362 -8989832 -4015230 2109538 3065508 -932591 -4399111 -4620271 -3703752 -3192545 -1634057
40353 -1634057 1351487 2776153 483739 -2982252 -3367484 -245668 2824358 3243256
40345 3243256 2241153 2125777 2354690 384353 -3605134 -5285524 -1510998 4363330
40337 4363330 5713626 1187360 -3533110 -3658138 -1286476 -966921 -2593940 -2657881 -566040
40328 -566040 729979 -154119 -1300848 -1060335 -13345 921506 1328513 141488 -3138914
40319 -3138914 -5932418 -4957187 -1740782 -1710133 -6300495 -10021145 -7858385 -2027384 1854457
40310 1854457 2329387 1964054 1858247 800442 -917627 -1194787 97080 800922 743783
40301 743783 2708844 7427923 10704283 8358156 2344860 -1140313 627104 3777270
40293 3777270 3228774 -843757 -3716678 -2479058 518041 1273262 -555451 -1852508
40285 -1852508 -873815 598347 555537 -89391 652078 2512627 3730763 4085945 4547140
40276 4547140 4405410 1892911 -1882287 -2877739 425372 4281125 4681017 2784823 2403890
40267 2403890 3825468 3927405 1881066 720061 2394667 4613354 4156806 863009
40259 863009 -3142257 -5958759 -6272664 -3589609 124453 1248706 -1105458 -3657977
40251 -3657977 -3837986 -3397805 -4465420 -5012969 -2384455 1016123 762737 -2092212 -2307967
40242 -2307967 798693 1954677 -1426603 -5144148 -5349431 -4354222 -5567448 -7226006
40234 -7226006 -5826749 -2495529 -1131221 -2494783 -4608340 -7014647 -10032432 -11454744
40226 -11454744 -8992647 -5109603 -4425066 -6565101 -6559357 -2753092 541760 -495237 -4380578
40217 -4380578 -7549624 -8547720 -7200002 -3211145 2069769 5380928 5390143 4453662 4544977
40208 4544977 4020827 968090 -2501782 -2502531 1150128 4537807 4464686 1676269 -633640
40199 -633640 -114332 2764389 5044332 3952696 -87488 -3741535 -4474090 -2899882 -1008460
40190 -1008460 262553 620634 -630394 -3347631 -5320218 -4311413 -1032768 1469830
40182 1469830 1283117 -743388 -2684614 -3591740 -3606851 -3021206 -1988518 -1056723 -1271491
40173 -1271491 -2976026 -4650315 -4250015 -2217027 -1495904 -3322722 -4986884 -3991647 -2293762
40164 -2293762 -2810080 -3432582 314114 6963516 9504013 5600873 1350337 1699653 2969980
40155 2969980 -112515 -4848357 -4704999 -76277 2395887 347894 -1491198 272853
40147 272853 2811778 2644502 840367 -136651 -715130 -2255857 -3732714 -3350486 -1558516
40138 -1558516 -69145 656842 1112910 1283993 956377 335522 -469962 -1138730 -86624
40129 -86624 3807811 7841583 7084478 954956 -4911981 -5615872 -2859858 -1070482 -562595
40120 -562595 1499891 5263372 7802751 7991744 7638362 7628126 6676297 4500529 2720059
40111 2720059 1567351 -952263 -4997242 -7005315 -4268520 668722 2743044 357288
40103 357288 -3563586 -5693638 -5317995 -3491463 -1207460 1030835 2869345 3920503
40095 3920503 3808037 2612955 1323636 1000267 1095004 -265574 -3486378 -6179112 -5941774
40086 -5941774 -3514515 -1658933 -1778607 -3474777 -6571844 -10959916 -14564574 -14484707 -11070853
40077 -11070853 -8180824 -7888502 -7483628 -3973097 637294 1744504 -1303468 -4517024
40069 -4517024 -4990023 -3885436 -2928168 -1271441 2049087 4877503 3936697 -800265 -5998378
40060 -5998378 -8875540 -9330003 -8400342 -6801715 -5621798 -6554224 -9825469 -12624286 -11259043
40051 -11259043 -5249212 1647714 5081681 4293775 2036203 769478 153954 -1350800
40043 -1350800 -3619232 -4769400 -3499781 -458104 2564610 3970639 3199603 1240498
40035 1240498 33319 302979 401292 -1357873 -3784075 -4253105 -2831588 -2339116 -3799196
40026 -3799196 -4736056 -3408023 -1945673 -3001916 -5553022 -6816817 -6577055 -6425230 -6004926
40017 -6004926 -3703246 -631215 -46230 -2260137 -3659353 -2038505 171881 -263220
40009 -263220 -2872598 -4851298 -5029408 -4412514 -4187334 -5032993 -7122603 -9048866 -8142740
40000 -8142740 -3946111 -146053 -589185 -4138030 -6116154 -4500307 -1810160 -616827
39992 -616827 -275411 570016 895273 -1055709 -4616676 -7498257 -8868485 -9468738 -9245547
39983 -9245547 -7322455 -4436558 -2932884 -3451466 -3730459 -2036530 86484 331059 -669257
39974 -669257 -565802 746463 1242934 615695 941507 2891955 4276441 3745686 3176145
39965 3176145 4303577 5449167 4396235 2630013 3259592 5691703 6087016 3142867
39957 3142867 -149079 -1354593 -1948310 -4198680 -7299561 -8708063 -7630739 -5206595
39949 -5206595 -2492068 -175444 646706 -586718 -2466639 -2707914 -721118 1924825
39941 1924825 3481734 3569950 2880235 2180406 1765655 1545248 1669464 2945118 5975534
39932 5975534 9750946 11945281 11080398 7821860 3931234 697567 -1493240 -3101529
39924 -3101529 -5172005 -7935367 -9544296 -7937497 -4465958 -3462977 -6798524 -10817814
39916 -10817814 -10743841 -6703318 -3054577 -2675562 -4440952 -5993034 -6441216 -5913992 -4502290
39907 -4502290 -2475279 -340324 1733367 3648784 4711173 4504302 4218615 5485430
39899 5485430 7840061 9016791 7969031 5859048 3738333 1278376 -1354474 -2391602
39891 -2391602 -790397 1697154 2436967 989969 -1240074 -3536259 -6081768 -7973494
39883 -7973494 -7276000 -3852679 -541537 -146013 -1998870 -2914366 -1388121 594937 449968
39874 449968 -1600040 -3255357 -3508117 -3453792 -3684270 -2959374 -634621 1235907 150848
39865 150848 -3272877 -6017935 -6757936 -7195383 -8906125 -10689545 -10099490 -6497467 -1620233
39856 -1620233 2163098 3428305 2217607 -233035 -2619239 -4775064 -7259426 -9622423
39848 -9622423 -10127313 -7852501 -4165458 -1142741 854515 2875482 4887308 4926506 1459562
39839 1459562 -3915021 -7108691 -5524846 -1214996 840155 -1909773 -6745718 -9088012
39831 -9088012 -7906485 -6110463 -5946326 -6323811 -5476476 -4143142 -4279770 -5681085 -5789145
39822 -5789145 -2745437 2498729 6921762 7554480 3647183 -2001757 -4493468 -1332369
39814 -1332369 4470537 7325346 5373104 2349596 2517947 5313954 6521654 3956215
39806 3956215 79174 -1360255 230316 2327724 3006293 3028240 3966074 5644125 6561553
39797 6561553 6135067 5166515 4278103 3267246 2213518 1869767 2355137 2575349 1714201
39788 1714201 421406 -241887 -227811 -105116 -43937 -10603 -162943 -181266 904776 3160321
39778 3160321 4876324 4521614 2883792 1985313 2472153 3295616 3247018 1537632 -2084947
39769 -2084947 -6112682 -7413906 -4950704 -2249264 -3087949 -5496629 -4056800 1624573
39761 1624573 5387747 3180794 -1228480 -2337109 -922732 -1610902 -4976279 -7214321
39753 -7214321 -6826089 -6590337 -8282920 -9720646 -8531462 -5560323 -2854727 -896840
39745 -896840 527361 966396 409802 -236722 -1189429 -4092123 -8551354 -10667810 -7557421
39736 -7557421 -1755075 1588391 924369 -848540 -1004165 355387 2152020 4107025
39728 4107025 6006102 7195390 7518162 7286516 6080931 3339890 457787 144920 2708738
39719 2708738 4899844 3955359 1332437 648482 2830861 5220634 5261076 3386187 1870964
39710 1870964 1937730 2694265 2642292 1788545 1808967 3621739 5202912 3290567 -2213454
39701 -2213454 -7178370 -8018176 -6245125 -6109461 -8387032 -9335016 -6330561 -1727445 678321
39692 678321 943760 2123163 5076823 7058197 5850364 2904603 1212115 1713145 3160929
39683 3160929 4292502 4535622 3356159 712744 -1958825 -2793322 -1807017 -949175 -1502636
39674 -1502636 -2476590 -1994216 568179 4082582 6421473 5657158 1859028 -1936916 -2147625
39665 -2147625 1105402 3720739 2808180 500995 659026 3148045 4175521 1934251
39657 1934251 -1073113 -2028441 -1513382 -1751344 -3034628 -3843371 -3538935 -3038721 -2995591
39648 -2995591 -2777439 -1579659 267251 1514090 1305309 119776 -717486 -584615 -248119
39639 -248119 -481270 -515593 1000995 3713575 5707074 6141206 6099792 6219359 5298996
39630 5298996 2588523 -61785 -197966 1968626 4172840 5438185 6777188 8605379
39622 8605379 9541916 8459791 6139734 3953757 2095693 176125 -1317118 -1410815 -123105
39613 -123105 1565781 3100491 4636914 5813988 5383215 2727096 -1071156 -4532564
39605 -4532564 -7433049 -9926647 -10685376 -8045591 -3344363 -740413 -2225089 -4739930
39597 -4739930 -4405004 -2040475 -1568286 -3836048 -5677483 -5440822 -5733080 -9004715 -13348552
39588 -13348552 -15007517 -13065847 -9411878 -5675119 -2544718 -842519 -697087 -233739
39580 -233739 2588044 6892858 9422436 8249859 4787085 2196544 2534366 4901119
39572 4901119 5899219 3124809 -1172998 -1895626 2127080 5581652 3342027 -2392880
39564 -2392880 -4984423 -2140798 1887596 2622702 332385 -1850685 -1915677 -212743 1334215
39555 1334215 867026 -1037503 -1170985 2183228 6003385 6180451 3320161 1311568 961705
39546 961705 -372127 -2776275 -2630034 1071465 4095445 3090241 171932 -1338856
39538 -1338856 -1889245 -3136091 -3827478 -2044487 964068 2852201 3976943 5593433
39530 5593433 6260337 3911531 76911 -1804737 -1350295 -948486 -1337443 -1093378 -79370
39521 -79370 176911 -418208 -230591 1119271 2305674 2890649 3582585 3859879 2268643
39512 2268643 -534290 -1836373 -645216 992873 1095648 2443 -1021723 -1424116
39504 -1424116 -1168919 -773385 -1653433 -4373774 -6663227 -5760247 -2855017 -2129373 -4597099
39495 -4597099 -6103841 -3167706 1854379 3734778 744319 -4258549 -8037267 -9983465
39487 -9983465 -11026526 -11293221 -9749715 -6039101 -2120865 -957529 -2896851 -4633038
39479 -4633038 -3299809 -408674 559431 -504241 -571204 1157194 1799311 -342126 -2888272
39470 -2888272 -3111979 -1727619 -916140 -1016457 -1448617 -2734630 -4930387 -5730702 -3106904
39461 -3106904 1041092 2634951 546001 -2342648 -3152714 -2018252 -820024 -661175
39453 -661175 -1253060 -1808192 -1971667 -2113036 -2594998 -2711044 -1256085 1278651 2211674
39444 2211674 -384408 -4870715 -7456837 -6212050 -2692313 208830 1037036 336437
39436 336437 -764635 -1946944 -3510301 -5035229 -5201676 -3662497 -2091779 -1946313 -2126782
39427 -2126782 -1008496 -32828 -2139642 -6503847 -8491269 -6138020 -3132355 -3170966 -4618339
39418 -4618339 -3835587 -1140132 341324 95477 575856 2852735 5438969 7183022 8122388
39409 8122388 7527237 4249579 -563396 -3782124 -3857171 -1981705 282619 2165693 2566598
39400 2566598 599395 -2244348 -3032247 -1151286 1086643 1969156 2068620 2003277 1273575
39391 1273575 137822 -62815 516445 -11196 -1779348 -2313856 -713396 262982 -1535572
39382 -1535572 -4009574 -4195185 -3033436 -3471869 -5310454 -5512664 -3180988 -950851 -1080665
39373 -1080665 -2723523 -3780154 -3575588 -2913659 -2674913 -2929027 -2849057 -1563299 470336
39364 470336 1649256 1456536 1308464 2023140 1957111 -389960 -3242689 -3677727 -2166023
39355 -2166023 -1998710 -4198503 -6056934 -5434543 -3691096 -3062631 -3510514 -3792925 -3764193
39346 -3764193 -3836625 -3561681 -2455250 -1246003 -911945 -1392195 -2359137 -4030867 -5902523
39337 -5902523 -6061609 -3589509 -633946 -142601 -2197084 -4413612 -5283655 -5085070 -4080893
39328 -4080893 -2279052 -966334 -1998676 -4984436 -7240042 -7204839 -5987058 -4913634
39320 -4913634 -3761796 -2516269 -2628770 -4687609 -6497185 -5609306 -2786383 -992762
39312 -992762 -1593163 -3309241 -4397605 -4141682 -2620384 -706284 26677 -962933 -1924493
39303 -1924493 -1076873 299350 -701135 -4064463 -6280567 -5027740 -2103114 -491604
39295 -491604 -615383 -1141952 -1718775 -2655591 -2877715 -625449 3741639 7436179 8225053
39286 8225053 6608656 4599073 3189777 1718217 -503325 -2600978 -2857769 -1184016
39278 -1184016 82369 -1026477 -3167390 -3348694 -1304026 275666 428507 1823060
39270 1823060 6100013 10124305 10089128 7535711 7382114 10631491 13137009 11968349 8933413
39261 8933413 6449028 3843520 258512 -2027480 -612577 2770490 4595908 4773093
39253 4773093 5674741 6633050 3904226 -2959363 -8820092 -9300510 -6344485 -4614899 -4724237
39244 -4724237 -3661292 -708298 1210073 520756 -277719 1447042 4353844 5046725 2457439
39235 2457439 -1725122 -5744077 -8633925 -9128793 -6220642 -1077860 3427077 5552858
39227 5552858 5741929 4811177 2826232 244636 -1510976 -1553272 -441847 1086625 3022719
39218 3022719 4925443 5270090 3240910 213551 -1833525 -2679269 -3442953 -4436418 -4696429
39209 -4696429 -3359200 -539219 2844817 5397298 5971280 4838311 3445798 2294068
39201 2294068 179958 -3320120 -6013903 -5729678 -3880845 -3915974 -6326966 -7671998 -5178222
39192 -5178222 -285550 3287225 3355655 221011 -4570078 -9002923 -11151085 -10460627 -8234994
39183 -8234994 -6010605 -3832255 -873138 2674538 5273033 5647453 4148275 2321726
39175 2321726 1326748 953233 326367 -550313 -557748 892100 2664730 3143957 2146126
39166 2146126 627605 -1010144 -2940227 -4388641 -3711192 -498648 3524666 6141576
39158 6141576 6224573 3619258 -917390 -4955368 -5311492 -1400181 3200868 4257549 1646338
39149 1646338 -1022704 -1543286 -1867343 -4588993 -8227118 -8358494 -3523732 2238404 4085919
39140 4085919 2052326 33259 40954 145883 -1768131 -4982520 -7643587 -8976134 -8435788
39131 -8435788 -5199531 -487441 2017018 606934 -1795419 -2349081 -3203963 -7539356
39123 -7539356 -12592726 -12119630 -5588166 585777 1892436 466047 -747661 -2980758
39115 -2980758 -7429616 -10773076 -9517320 -5732220 -3844364 -3863618 -2393376 1002320
39107 1002320 3075945 2177030 196409 -952146 -1345818 -1207485 -168821 1022412 690513
39098 690513 -1285555 -3389106 -5079648 -7106721 -9002525 -8969404 -7041440 -5900339 -7404851
39089 -7404851 -10252844 -12104711 -12176820 -10655208 -7409835 -2888710 899245 1882239 28014
39080 28014 -2814934 -4652123 -4496399 -2649887 -510580 467059 124858 -422205 -201388
39071 -201388 794820 2075987 3124228 3455400 3028526 2442000 1914506 598760 -1819974
39062 -1819974 -3475498 -2298677 400635 686247 -2869340 -6879531 -7307449 -4286264
39054 -4286264 -1112254 349849 1145336 2430083 3265386 2060189 -814018 -2987668
39046 -2987668 -2736248 -1024207 -408584 -2097029 -4807277 -6725607 -7692220 -8654862 -9551105
39037 -9551105 -8852096 -5276730 641435 6676114 10335846 10630908 8823173 6895405
39029 6895405 5107929 2199747 -1619811 -3762225 -2692821 -499935 -3553 -768077
39021 -768077 -474400 986234 1869186 2286093 3979687 6286861 6038532 2578139 -408444
39012 -408444 171863 2624271 3106877 486953 -3194774 -5430921 -4799655 -1299483 3357345
39003 3357345 6960519 9219707 11398707 12943761 11059732 5131353 -1108275 -4102690
38995 -4102690 -4857481 -6128223 -7359238 -5867292 -1791896 1778520 3194966 3380928
38987 3380928 2629494 -228176 -4605340 -7159908 -5647089 -1848472 763003 899318
38979 899318 -87735 -335763 1065198 3731193 6042391 6257861 4444059 2693436 2666410
38970 2666410 3489044 2956492 497882 -2007386 -2571314 -1576997 -1188920 -2252799 -2689506
38961 -2689506 -22334 4780887 7525201 5445689 332560 -3955026 -5773871 -5964173
38953 -5964173 -4994218 -2327717 1229622 2879387 848302 -3036323 -5048497 -3538727
38945 -3538727 -416000 1247618 411880 -1510299 -3097422 -4756951 -7247357 -9097441
38937 -9097441 -7513423 -2451890 2184383 3022226 1493416 1538189 3874744 5090261 2542857
38928 2542857 -2191396 -5616740 -6294743 -5402450 -4539185 -4186037 -3762428 -2367350 219427
38919 219427 2901734 4112230 3500747 2144287 996764 128359 -206662 925733 3578055
38910 3578055 5816546 5556745 3242498 1507210 2079205 3997028 5162287 4720355 3209622
38901 3209622 1024960 -2031054 -5456771 -7420961 -6488973 -3721913 -1936555 -2466156
38893 -2466156 -3441798 -2052526 1802189 4966645 4433737 873239 -1835598 -777469
38885 -777469 2850887 5531850 5965860 6148898 7413684 7672458 4790464 1052046 819701
38876 819701 4060855 6041132 4372617 2504932 4071910 7256987 8035591 6359973
38868 6359973 5157086 4892181 3535470 1327055 1129223 3511970 5383450 4622227 2705683
38859 2705683 1380986 -96486 -2562925 -4541503 -4457807 -3156068 -2070623 -794845
38851 -794845 1225639 2307887 630928 -2304602 -3199590 -1644618 -577047 -1743322
38843 -1743322 -3192826 -2336518 392241 2470954 2777996 2425629 2398081 2078960 766694
38834 766694 -645082 -864675 -459949 -1124849 -2569864 -2233018 827633 3713928 3300031
38825 3300031 571098 -1126478 -1044412 -1077303 -1294496 731229 5212073 8379801 7458228
38816 7458228 4577159 3266058 3302892 1927426 -1341666 -4129070 -4734520 -3569992 -1422168
38807 -1422168 1251849 3324572 3520155 2188436 805728 -272251 -1653912 -2533545
38799 -2533545 -881211 3130417 5966176 4602131 486484 -1901156 -121035 3729296
38791 3729296 5671349 4222639 1589754 630523 1412811 1666719 322700 -1023375 -808004
38782 -808004 19368 -264788 -1185515 -876912 823197 2326958 3097283 4063891 4973179
38773 4973179 3913282 559683 -2363104 -2515173 -1141776 -995791 -2414339 -3619262
38765 -3619262 -4017968 -4664617 -5508889 -4743524 -1814572 845047 515077 -2531175 -5802437
38756 -5802437 -7740121 -8502812 -8151819 -6048616 -2433804 1058539 3299864 4773755
38748 4773755 5817998 5156649 1824655 -2410609 -4644985 -4507562 -4044810 -3966519 -2681558
38739 -2681558 68409 1418005 -714297 -4016973 -4797379 -3340113 -3230736 -5767294
38731 -5767294 -8198512 -8056560 -6414498 -5541225 -5509542 -4819930 -2923035 -458219 2040085
38722 2040085 4182951 5180237 4577453 3026523 1285514 -839294 -3420547 -5146774
38714 -5146774 -4721439 -3012177 -2082484 -2307563 -2308488 -1835002 -2571775 -5193333 -7470007
38705 -7470007 -6884218 -4093327 -2192749 -2982822 -5257911 -6486409 -5021189 -998263
38697 -998263 3568440 5696457 3997095 642830 -706764 492175 742763 -2660748
38689 -2660748 -7334737 -8317086 -4313261 680451 2246355 151830 -2705401 -4231332
38681 -4231332 -4398331 -3542979 -1534007 1018090 2318629 1246131 -1010903 -2163999
38673 -2163999 -1405060 137674 1416079 2743116 4538975 5879466 5500036 3808921
38665 3808921 2576929 2597524 2938039 2803184 2729713 3128061 2910143 897805 -2118053
38656 -2118053 -4047556 -3833719 -1992623 634366 3234346 4480935 3405677 1045982
38648 1045982 -369716 -395910 -1023163 -3495491 -5830085 -4959098 -754561 3555742 5172685
38639 5172685 4873230 5641725 8510579 10801015 9217883 4125993 -621554 -2265535
38631 -2265535 -1961452 -2271815 -3606068 -4727138 -5263630 -5477426 -4601842 -2054216 286162
38622 286162 -91770 -2320939 -2938628 -910004 1202811 1559700 1107225 377484 -1926421
38613 -1926421 -5191379 -5500696 -1036098 4091066 4936538 2414195 1175407 2492384
38605 2492384 3277633 1420982 -1678740 -3827653 -4159153 -2595758 41459 1562663
38597 1562663 685331 -585569 438896 2753402 3066667 1156292 201054 1715571 3878323
38588 3878323 5279106 6390841 6529074 3626978 -1337813 -3883786 -2401872 -1135376
38580 -1135376 -3708284 -7185752 -6590173 -2729921 -868391 -2835386 -5061587 -4446043
38572 -4446043 -2099685 -356118 609117 1639111 2440880 2328535 1792652 1886609 2688893
38563 2688893 3245417 2604705 524136 -2222902 -3891653 -2861579 649076 4286792
38555 4286792 5551452 4103879 1842579 705925 758305 782965 430203 714488 1926695
38546 1926695 2325284 407488 -2224054 -2346570 416892 2733158 1909071 -829235 -2580353
38537 -2580353 -2507151 -1661667 -516425 1124197 2378617 1679347 -859888 -3064573 -3161161
38528 -3161161 -1585880 -7946 550366 155550 -874918 -2638698 -5352560 -8394663
$$ [...]
##END NTUPLES=NMR SPECTRUM
##END=
