##TITLE=31Pdec_PR164_E1
 D2O, 24 sc
 5.4.2019
##JCAMPDX= 6.0         $$ Bruker NMR JCAMP-DX V2.0
##DATA TYPE= NMR SPECTRUM
##DATA CLASS= NTUPLES
##ORIGIN= UXNMR, Bruker Analytische Messtechnik GmbH
##OWNER= root
$$ XWIN-NMR		Version 3.5
$$ Fri Apr  5 16:15:01 2019 Russian Standard Time (UT+4h)  she@DPX200
##.OBSERVE FREQUENCY= 81.013821
##.OBSERVE NUCLEUS= ^31P
##.ACQUISITION MODE= SIMULTANEOUS
##.ACQUISITION SCHEME= undefined
##.AVERAGES= 24
##.DIGITISER RES= 17
##SPECTROMETER/DATA SYSTEM= spect
##.PULSE SEQUENCE= zgpg30
##.SOLVENT NAME= DMSO
##.SHIFT REFERENCE= (INTERNAL, DMSO, 0, 182.463)
##AUDIT TRAIL= $$ (NUMBER, WHEN, WHO, WHERE, WHAT)
$$ ##TITLE= Audit trail, XWIN-NMR		Version 3.5
$$ ##JCAMPDX= 5.01
$$ ##ORIGIN= Bruker BioSpin GmbH
$$ ##OWNER= she
$$ F:/spectra/data/she/nmr/P31/1/pdata/1/auditp.txt
$$ ##AUDIT TRAIL=  $$ (NUMBER, WHEN, WHO, WHERE, WHAT)
(   1,<2019-04-05 16:14:04.64 +0400>,<she>,<DPX200>,
      <created by zg, POWCHK disabled, PULCHK disabled
       configuration hash MD5:
       00 E9 B6 7A A2 85 ED C7 34 08 36 98 17 FE 4E 26
       data hash MD5: 32K
       A3 D5 D3 03 3C 72 0A 42 CC 98 00 E2 ED 93 C2 78>)
(   2,<2019-04-05 16:14:07.89 +0400>,<she>,<DPX200>,
      <Start of raw data processing
       efp BC_mod = 2 LB = 1 FT_mod = 6 PKNL = 1 PHC0 = -1828.055 PHC1 = 62.99897 SI = 64K 
       data hash MD5: 64K
       07 B3 EC 59 E6 0C D7 60 E9 07 C4 F3 5B 06 0A 76>)
(   3,<2019-04-05 16:14:27.87 +0400>,<she>,<DPX200>,
      <pk PHC0 = -16.60052 PHC1 = 39 
       data hash MD5: 64K
       F3 2E 9F 90 D1 12 21 67 8C 44 EA F5 CC D4 01 A7>)
(   4,<2019-04-05 16:14:30.85 +0400>,<she>,<DPX200>,
      <abs ABSG = 5 
       data hash MD5: 64K
       F5 50 42 61 FC 7F 86 95 EC BD 3A B7 E6 81 3C B5>)
$$ ##END=
$$ 
$$ hash MD5
$$ E4 37 8B E5 DC 89 70 8D 43 6B 2A 8B 01 CE D7 B2
##$RELAX= 
##$RELAX= 
##$RELAX= 
##$RELAX= 
##$RELAX= 
##$RELAX= 
##$RELAX= 
##$RELAX= 
$$ Bruker specific parameters
$$ --------------------------
##$DU= <F:/spectra>
##$EXPNO= 1
##$NAME= <P31>
##$PROCNO= 1
##$TYPE= <nmr>
##$USER= <she>
##$AMP= (0..31)
100 100 100 100 100 100 100 100 100 100 100 100 100 100 100 100 100 100 
100 100 100 100 100 100 100 100 100 100 100 100 100 100 
##$AQSEQ= 0
##$AQ_mod= 1
##$AUNM= <au_zg>
##$AUTOPOS= <>
##$BF1= 81.014009
##$BF2= 200.13
##$BF3= 200.13
##$BF4= 200.13
##$BF5= 200.13
##$BF6= 200.13
##$BF7= 200.13
##$BF8= 200.13
##$BYTORDA= 1
##$CFDGTYP= 0
##$CFRGTYP= 5
##$CHEMSTR= <none>
##$CNST= (0..31)
1 1 145 1 1 1 1 1 1 1 1 1 1 1 1 1 1 1 1 1 1 1 1 1 1 1 1 1 1 1 1 1 
##$CPDPRG= <waltz16>
##$CPDPRG1= <>
##$CPDPRG2= <waltz16>
##$CPDPRG3= <>
##$CPDPRG4= <mlev>
##$CPDPRG5= <mlev>
##$CPDPRG6= <mlev>
##$CPDPRG7= <mlev>
##$CPDPRG8= <mlev>
##$CPDPRGB= <>
##$CPDPRGT= <>
##$D= (0..31)
0 1 0 0 0 0 0 0 0 0 0 0.03 2e-05 3e-06 0 0 0 0 0 0 0 0 0 0 0 0 0 0 0 0 
0 0 
##$DATE= 1554466444
##$DBL= (0..7)
120 120 120 11 120 120 24 19 
##$DBP= (0..7)
150 150 150 150 150 150 150 150 
##$DBP07= 0
##$DBPNAM0= <>
##$DBPNAM1= <>
##$DBPNAM2= <>
$$ [...]
##$SUBNAM3= <"">
##$SUBNAM4= <"">
##$SUBNAM5= <"">
##$SUBNAM6= <"">
##$SUBNAM7= <"">
##$SUBNAM8= <"">
##$SUBNAM9= <"">
##$SW= 369.568048894756
##$SWIBOX= (0..15)
0 1 3 0 0 0 0 0 0 0 0 0 0 0 0 0 
##$SW_h= 29940.119760479
##$TD= 32768
##$TD0= 1
##$TE= 0
##$TE2= 300
##$TE3= 300
##$TEG= 300
##$TL= (0..7)
0 120 53 12 22 120 120 120 
##$TP= (0..7)
150 150 150 150 150 150 150 150 
##$TP07= 0
##$TPNAME0= <>
##$TPNAME1= <>
##$TPNAME2= <>
##$TPNAME3= <>
##$TPNAME4= <>
##$TPNAME5= <>
##$TPNAME6= <>
##$TPNAME7= <>
##$TPOAL= (0..7)
0.5 0.5 0.5 0.5 0.5 0.5 0.5 0.5 
##$TPOFFS= (0..7)
0 0 0 0 0 0 0 0 
##$TUNHIN= 0
##$TUNHOUT= 0
##$TUNXOUT= 0
##$USERA1= <user>
##$USERA2= <user>
##$USERA3= <user>
##$USERA4= <user>
##$USERA5= <user>
##$V9= 5
##$VALIST= <valist>
##$VCLIST= <CCCCCCCCCCCCCCC>
##$VD= 0
##$VDLIST= <DDDDDDDDDDDDDDD>
##$VPLIST= <PPPPPPPPPPPPPPP>
##$VTLIST= <TTTTTTTTTTTTTTT>
##$WBST= 1024
##$WBSW= 4
##$XGAIN= (0..3)
0 0 0 0 
##$XL= 0
##$YL= 0
##$YMAX_a= 65451
##$YMIN_a= -72924
##$ZGOPTNS= <>
##$ZL1= 120
##$ZL2= 120
##$ZL3= 120
##$ZL4= 120
##$ABSF1= 182.463
##$ABSF2= -187.1042
##$ABSG= 5
##$ABSL= 3
##$ALPHA= 0
##$AQORDER= 0
##$ASSFAC= 0
##$ASSFACI= 0
##$ASSFACX= 0
##$ASSWID= 0
##$AUNMP= <proc_1d>
##$AZFE= 0.1
##$AZFW= 0.5
##$BCFW= 0
##$BC_mod= 2
##$BYTORDP= 0
##$COROFFS= 0
##$CY= -3
##$DATMOD= 1
##$DC= 0
##$DFILT= <>
##$DTYPP= 0
##$F1P= 0
##$F2P= 0
##$FCOR= 1
##$FTSIZE= 65536
##$FT_mod= 6
##$GAMMA= 0
##$GB= 0
##$INTBC= 1
##$INTSCL= 5.30512e-09
##$ISEN= 30
##$LB= 1
##$LEV0= 0
##$LPBIN= 0
##$MAXI= 10000
##$MC2= 0
##$MEAN= 0
##$ME_mod= 0
##$MI= 50
##$NCOEF= 0
##$NC_proc= -2
##$NLEV= 6
##$NOISF1= 182.463
##$NOISF2= 159.3651
##$NSP= 0
##$NTH_PI= 0
##$NZP= 0
##$OFFSET= 182.463
##$PC= 4
##$PHC0= -1844.656
##$PHC1= 101.999
##$PH_mod= 1
##$PKNL= yes
##$PPARMOD= 0
##$PSCAL= 0
##$PSIGN= 0
##$REVERSE= no
##$SF= 81.0140089999434
##$SI= 65536
##$SIGF1= 159.3651
##$SIGF2= -187.1042
##$SINO= 113.3802
##$SIOLD= 16384
##$SREGLST= <1H.CDCl3>
##$SSB= 0
##$STSI= 65536
##$STSR= 0
##$SW_p= 29940.119760479
##$SYMM= 0
##$S_DEV= 0
##$TDeff= 32768
##$TDoff= 0
##$TI= <>
##$TILT= no
##$TM1= 0
##$TM2= 0
##$TOPLEV= 0
##$USERP1= <user>
##$USERP2= <user>
##$USERP3= <user>
##$USERP4= <user>
##$USERP5= <user>
##$WDW= 1
##$XDIM= 65536
##$YMAX_p= 354173941
##$YMIN_p= -2693061
$$ End of Bruker specific parameters
$$ ---------------------------------
##NTUPLES= NMR SPECTRUM
##VAR_NAME=  FREQUENCY,     SPECTRUM/REAL,   SPECTRUM/IMAG
##SYMBOL=    X,             R,               I
##VAR_TYPE=  INDEPENDENT,   DEPENDENT,       DEPENDENT
##VAR_FORM=  AFFN,          ASDF,            ASDF
##VAR_DIM=   65536,         65536,           65536
##UNITS=     HZ,            ARBITRARY UNITS, ARBITRARY UNITS
##FACTOR=    0.456856943014862, 1,           1
##FIRST=     14782.0589164792, 0,            0
##LAST=      -15158.0608439998, 0,           0
##MIN=       -15158.0608439998, -2693061,    0
##MAX=       14782.0589164792, 354173941,    0
$$ Real data points
##PAGE= N=1
##DATA TABLE= (X++(R..R)), XYDATA
$$ [...]
37490a39220k3491P2477R9763N2309j8394q1148j26366j23962n4882L0409N8035
37479b54470L0601J4416L2373M0087J0836k6368m6011n9598p1032n3692K450N9113
37467c21295O6898J4703n9842r2220l9629O5463J31406J05151K6311m0679p8991
37456b22724q7211m2350M0572P8063L0205j8584J5297P5218O6189K9296O4203
37445B8174J25124P3918p3693j45411q2784k7261p5899j28236p2427K6715M4968
37434c06812q133l3688l290L0907L1550K898k8190q572R4147K00336J70764O164
37422A48081j14217p1003K6666J1517r8221j46541o8140M7587Q8044K5258p8181
37411b29150j12093j5879J21197J33355M859p9504R187J49053J46712J7353n8606
$$ plain form
37490 -139220 -162711 -90234 9529 61838 43444 -37704 -164070 -288032 -342914 -312505 -254470
37479 -254470 -223869 -209453 -177080 -136993 -126157 -152525 -198536 -258134 -329166 -382858 -380408 -321295
37467 -321295 -254397 -239694 -299536 -391756 -431385 -365922 -234516 -129365 -103054 -143733 -222724
37456 -222724 -309935 -352285 -311713 -233650 -203445 -222029 -206732 -131514 -65325 -36029 28174
37445 28174 153298 227216 153523 8112 -74672 -101933 -177832 -306068 -378495 -351780 -306812
37434 -306812 -314945 -348633 -351923 -321016 -289466 -286568 -314758 -323330 -229183 -28847 141917 148081
37422 148081 33864 -37139 -10473 1044 -97177 -243718 -311858 -264271 -176227 -150969 -229150
37411 -229150 -341243 -357122 -235925 -102570 -97711 -177215 -168028 -18975 127737 145090 86484
37400H6484j762Q6751Q9880J422j02182j31372m6171Q3907J23845L6310o2749
37389A64363p1651l3537k0650k524N6035P7576m044r7923q7453j9528k936r915
37377e2187M0621R0053L5899n2620l7116L2619O068p2053k8315R3738N8986j48686
37365c2993k48000q9204J20474J52927O5324J3606o160m6119l9111N6035J09048
37354E5827K0242p7429k3910R0235P1891n1193q7279J603O6882L5178o589M067
37342I9525J6660p260k6834j2851P063J5782K6938L3822K1952J9782N1352O5214
37330C11145P663o4478n5837Q776K0866l1560n4005j9475j3945p6161j20281p6040
37318a63332j530J6456k062K4292R7913J24218L6529j05339j68217r7473J0441
$$ plain form
37400 86484 84722 171473 261353 262775 160593 29221 -16950 66957 190802 227112 164363
37389 164363 92712 59175 38525 36001 92036 169612 165568 67645 -19808 -39336 -42272 -52187
37377 -52187 -11566 78487 114386 61766 24650 57269 63337 -8716 -37031 56707 115693 -32993
37365 -32993 -280993 -370197 -249723 -96796 -31472 -17866 -24026 -70145 -109256 -53221 55827
37354 55827 76069 -1360 -25270 64965 136856 85663 -1616 -13 66869 102047 95458 99525
37342 99525 116185 108925 82091 69240 76303 92085 119023 152845 174797 194579 245931 311145
37330 311145 318808 254330 198493 207269 228135 196575 142570 123095 109150 32989 -87292 -163332
37318 -163332 -164862 -148406 -150468 -126176 -28263 95955 132484 27145 -141072 -238545 -228104
37307b28104K4387m7161p0313J4503J04446R7676M3286L7745O1182L7292j1870
37296F3069j0327J7434j3603p7410o2092L2264P8458K8352k0142n014L677m2212
37284g546o2064R969R2569P9892O524k3849n713j1856n2703o7659l4193R934L9302
37271b7393N5111M3934P55k4425J4248O7144M7929k2516l6049K3575L8838m8962
37259A32189j15786k6846J40127J76490K8526j32071j48268o3205k965J3404L8705
37248D0300N1814j0928j04271j00204J3520R1589L8081n8234o6722K294M4914
37237e7847K1950k2927n3065o0132l3245J6732L8293J2652M09M5290Q9272O7749
37225F5131K4971K8902L3214m3219j43788j33823j6600O5320M9332J7511K0591
$$ plain form
37307 -228104 -203717 -250878 -321191 -306688 -202242 -104566 -61280 -23535 37647 74939 63069
37296 63069 52742 70176 56573 -20837 -82929 -50665 27793 56145 36003 30989 34666 -7546
37284 -7546 -69610 -59641 32928 112820 119344 95495 89782 77926 25223 -42436 -76629 -66695 -27393
37271 -27393 27718 71652 72407 47982 62230 129374 177303 154787 118738 142313 181151 132189
37259 132189 16403 -10443 129684 306174 334700 202629 54361 -8844 -11809 1595 40300
37248 40300 92114 81186 -23085 -123289 -109769 -18180 19901 -38333 -105055 -102761 -57847
37237 -57847 -35897 -58824 -111889 -172021 -205266 -188534 -150241 -137589 -137180 -91890 -2618 65131
37225 65131 90102 119004 152218 108999 -34789 -168612 -185212 -119892 -70560 -53049 -32458
37214c2458j143o9430r1261p862J02111J44173J23143O8933l3010j53813j81121
37203a31738p1215N5024P0769Q490l3863n3164q5091q0093J4239J08886P0721
37192a27035o4701j26600m6023P5940J34535J24348O8366k4725j05149r9224j8598
37181b08866M2005M1018K9781L8196K8600o497j3599J1331l044n9691m4518Q8062
37169e7222J91728J16257n8536j21469k5282O6049K9340n9368o6167J1237P1212
37158I7779N8147P035k9974l5573j4829K0797N2921O6185O0154M0452J0839j5302
37146C18631j9622j3037l4393q5394j03658n1190L079l3470j22833j23032N467
37135b59452J20397Q9705k1998n6179R552N6537K8514M989M5583Q3880M1785m0874
$$ plain form
37214 -32458 -33601 -103031 -194292 -202154 -100043 44130 167273 236206 203196 49383 -131738
37203 -131738 -202953 -147929 -77160 -68670 -102533 -155697 -240788 -320881 -306642 -197756 -127035
37192 -127035 -191736 -318336 -364359 -288419 -153884 -29536 38830 14105 -91044 -190268 -208866
37181 -208866 -166861 -125843 -96062 -57866 -29266 -35763 -49362 -38031 -41075 -100766 -145284 -57222
37169 -57222 134506 250763 192227 70758 45476 111525 140865 81497 15330 26567 97779
37158 97779 155926 162961 132987 97414 82585 103382 156303 222488 282642 323094 333933 318631
37146 318631 299009 285972 251579 166185 62527 11337 14416 -19054 -141887 -264919 -259452
37135 -259452 -139055 -49350 -71348 -127527 -117975 -61438 -32924 -27935 17648 101528 143313 102439
37123A02439p2671m6446k4807k6770j3053K7513N1128K7898j5165l5710k7229
37112e2873j4743j6862k1523M8M8003P2381K8727m6854o6760q576N2479N2991
37100B6438K2476J5033K3084J6986J3009K7922J4289p0438j62205j53491m6046
37089b72943N0251O8566M5369K4738l003m1212m8732k412O0435R3604Q8559N3717
37077A16937J545l2245j8282P203j7038o6577m7990M8011J06670N2359l8661n4941
37065E6991O66N3649P5528P0862J3576r8193j71012j14517J2754O6827J7930k3927
37053c8866J1514O1726M7964j3657o4545q7865q7610m8172K6084P7266N9273R376
37041d7512L533N3316Q7236L5098q6817j75782j36386P333J13985Q2782j1750
$$ plain form
37123 102439 29768 -16678 -41485 -68255 -81308 -53795 -2667 25231 10066 -25644 -52873
37112 -52873 -67616 -84478 -106001 -105953 -57950 14431 43158 -3696 -70456 -79032 -26553 26438
37100 26438 48914 63947 87031 104017 117026 144948 159237 88799 -73406 -226897 -272943
37089 -272943 -222692 -154126 -108757 -84019 -87022 -128234 -176966 -179378 -118943 -25339 63220 116937
37077 116937 118482 86237 67955 75158 58120 -8457 -56447 -8436 98234 150593 111932 56991
37065 56991 57657 111306 186834 257696 271272 173079 2067 -112450 -99696 -32869 -14939 -38866
37053 -38866 -27352 34374 82338 68681 4136 -83729 -171339 -219511 -193427 -116161 -56888 -47512
37041 -47512 -43979 9337 96573 131671 44854 -130928 -267314 -259981 -145996 -63214 -74964
37030g4964j6528P5297J02077k6277j76394j68096k2065Q6412P7581L9357N0524
37019e3076O3772J4970n1499m8422J4814L9286k7522j22088j42461o3703M0379
37008c35550Q1671N0793J4714K4593N5971O1715M9114N4591O4195K8586m2893
36997A07500p8666n5152l5249n9870p5959l0941K7461K4589j7293k0316J3757
36986b00139J1381l6187m9126P045N9849M5381N573J3028N9937Q5159O7761L0875
36974A00537j4623o7072r6519p1753j4786K3986L4891M2777M5629K0976j0928
36963f885K84M7163N7053m56o0887n7941j2268K1431M0804O1197M0498o4382j78219
36950a12608j54169K4842J82272J51988j4899j25125q6433J3139N6936L4852R56
$$ plain form
37030 -74964 -91492 -16195 85882 59605 -116789 -284885 -306950 -220538 -142957 -103600 -53076
37019 -53076 10696 25666 -25833 -74255 -59441 -20155 -47677 -169765 -312226 -375929 -335550
37008 -335550 -253879 -203086 -188372 -163779 -107808 -46093 3021 57612 121807 150393 107500
36997 107500 28834 -26318 -61567 -121437 -197396 -228337 -200876 -176287 -193580 -213896 -200139
36986 -200139 -188758 -224945 -274071 -267026 -207177 -161796 -156223 -143195 -83258 1901 69662 100537
36974 100537 85914 18842 -77677 -149430 -164216 -140230 -105339 -62562 -16933 4043 -6885
36963 -6885 -6601 40562 97615 97159 36272 -21669 -33937 -12506 28298 89495 129993 65611 -112608
36950 -112608 -266777 -241935 -59663 92325 77426 -47699 -134132 -120993 -64057 -29205 -28249
36939b8249k3752m9945o5130l8476L0380J00667J21863O5779m4110j22042q5178
36928a38193L7124J06172L6992q2958j04154j0580P8323Q4719N2298L6508J6536
36917A12787l4577p2595m3681K6337O8818O4876M4696K4799K787j0241r118k4487
36905A50401p3527j02083m8856M1340N2946l4927j02007n0453N4438P7507N513
36894b9708m1101J4121R7471R4001M638o7180o1452k4199j5814k4133j0444Q217
36882e5583j0183m1310j1621Q2619J44536R8752j1386r0744j07675q9182m5375
36871a37152K4221O8442J8239r7202j44609m6920R7863J21762l686j24536q7415
36860c10993P9504K04770J69952K1756j10083j52997j21588n4446J8885O2999
$$ plain form
36939 -28249 -52001 -101946 -167076 -205552 -175172 -74505 47358 113137 69027 -53015 -138193
36928 -138193 -101069 5103 42095 -40863 -145017 -155597 -77274 7445 59743 96251 112787
36917 112787 78210 5615 -38066 -11729 57089 121965 166661 191460 194247 184006 174888 150401
36905 150401 76874 -25209 -74065 -32725 20221 -14706 -116713 -167166 -112728 -35221 -29708
36894 -29708 -70809 -56688 40783 134784 139422 72242 10790 -13409 -29223 -53356 -63800 -55583
36882 -55583 -65766 -107076 -118697 -36078 108458 207210 195824 105080 -2595 -91777 -137152
36871 -137152 -112931 -44489 -26250 -123452 -268061 -314981 -217118 -95356 -99042 -223578 -310993
36860 -310993 -231489 -26719 143233 164989 54906 -98091 -219679 -274125 -255240 -192241
36850a92241N2706J6351J4569N9641R8198Q9091N2031J8720j3229m5659m9959
36839A00219j7539J425l5870q9886q8064l0782J1291J337j8688K88M0785M3355
36827h2129r899n9109k8988O9688J29444P3163l1160m6942M5276J21935R3146
36816B74425J1466l8085n8677q2262p9221k1285L5429L1414J0061L9673Q3044
36805B05982N6780k5652q6450j12887j27946q2205O8882K11543J77141J367j01162
36794A85393m7505J3739l4048j01185p6377j8189l2777q5706p1805J2689Q6585
36783a69186J07288Q2608K3598l4281l3903Q995n94p8797j04742j0523Q4898M8194
36771g6445o5533j14088p9661l7487J320N9152P6637k110q1332k5838J12644J56305
$$ plain form
36850 -192241 -139535 -123184 -108615 -48974 49224 138315 190346 209066 195837 150178 100219
36839 100219 82680 84105 48235 -41651 -129715 -160497 -149206 -147869 -166557 -166269 -125484 -82129
36827 -82129 -92028 -151137 -180125 -110437 19007 92170 61010 14068 59344 181279 274425
36816 274425 285891 247806 189129 106867 27646 6361 41790 73204 83265 122938 205982
36805 205982 262762 237110 150660 37773 -90173 -172378 -103496 108047 285188 286555 185393
36794 185393 137888 151627 117579 16394 -59983 -78172 -110949 -196655 -268460 -255771 -169186
36783 -169186 -61898 20710 44308 10027 -23876 -14881 -15475 -94272 -199014 -209537 -124639 -76445
36771 -76445 -141978 -256066 -335727 -373214 -371894 -312742 -236105 -238215 -319547 -345385 -232741 -76436
36759g6436O8158j8542k9709k6241l7981o585O5125P6490m33o2484m5485j1508
36747a05631p745J6916Q0965R6263J6873o1677n0909p053j6030m3056j4912L0809
36735f5187P147o4785q2464j9074N1186P2106O1237M8808L1588l871n2540q6922
36723a02771p0311N7O0412M4363j4567k2030K0070L317r3743j27088M66J57200
36711a44625J49857K137q8211l8915K8820L003o4025o5493K827O4242P2413M0116
36699c7854p63k0121J02L9899M8153M760m3877l9408J1449M2947J3087m4728o7571
36686i3925m4765k3220k9833l2103k585K3784J0273m537L0684O8996K2034p6873
36674a52070r0709J0802Q7397L7620m9524m4755K4458M3680R52j9462J5042N9390
$$ plain form
36759 -76436 -8278 -26820 -56529 -82770 -120751 -127336 -62211 14279 13846 -48638 -94123 -105631
36747 -105631 -113376 -96460 -15495 80768 97641 35964 -14945 -21998 -38028 -81084 -95996 -65187
36735 -65187 -58040 -122825 -205289 -224363 -173177 -101071 -39834 8974 40562 36691 -15849 -102771
36723 -102771 -173082 -173025 -112613 -68250 -82817 -104847 -84777 -81460 -175203 -302291 -301825 -144625
36711 -144625 5232 7369 -80842 -119757 -90937 -87934 -151959 -217452 -214625 -150383 -77970 -37854
36699 -37854 -38617 -58738 -58636 -18737 29416 34176 -9701 -49109 -37660 5287 18374 -26354 -93925
36686 -93925 -138690 -161910 -191743 -223846 -226431 -202647 -192374 -196911 -166227 -97231 -75197 -152070
36674 -152070 -242779 -231977 -144580 -106960 -156484 -201239 -176781 -133101 -132149 -151611 -136569 -77179
36662g7179P7983N7377k5210j41372j69468l7587J30024J46556J9714o7967k6021
36651a13150N0166O4906M3766K7079j2391p9356j05913o3913k3867l2557l1389
36640b76619K8498Q4941O6604J7409K4268P7692R5670M8064k1646p0293q4429
36629i841o0936j4831J4190O140j1384r234L564J1235J8456K2005P192n438K4783
36616d099P1070M7828n2856j22042q8354k0910n602j0958K7185O9909M1028k9737
36604g7538m9399q492K7113L6599M4505L3929k0912o2116j7068N4909K3206j03794
36592a19058j71165j04355l954L0084L2028N8103O4019n113q8364p9453K1010
36581c66218J09368J08173K9371o4310j08508p2206J3038P8588R6324R5812Q9195
$$ plain form
36662 -77179 804 58181 32971 -108401 -277869 -315456 -185432 -38876 -19162 -87129 -113150
36651 -113150 -62984 1922 45688 72767 60376 -18980 -124893 -188806 -212673 -245230 -276619
36640 -276619 -248121 -163180 -96576 -79167 -54899 22793 118463 166527 144881 74588 -9841
36629 -9841 -70777 -85608 -71418 -65278 -76662 -85896 -82332 -71097 -52641 -30636 -23444 -28882 -4099
36616 -4099 66971 114799 61943 -60099 -148453 -169363 -174965 -185923 -158738 -88829 -47801 -77538
36604 -77538 -126937 -135429 -108316 -71717 -27212 6717 -14195 -76311 -93379 -38470 -15264 -119058
36592 -119058 -290223 -394578 -398532 -368448 -336420 -278317 -214298 -219411 -307775 -387228 -366218
36581 -366218 -256850 -148677 -119306 -183616 -292124 -364330 -351292 -272704 -176380 -80568 8627
36570H627M0383n5069j24296j08622n0722k7254l3764n867O6509J13390P5299
36559a01386k3510r9200q8951j3348M1223K5098l274L8451J13781J00294j8827
36548b9649j07720p5894j0192j9961n5891j0747P7357P6865j8503p9863m9926
36537c04124j2350l2667o6180o5116n5165n2337j4945N7029P5479m582q8804o2797
36525f26559N3117J47398J65936J41074J11837Q9946Q1037P8762N7263J3478j3250
36514C00039l300M689j6789k7631Q635M8741L5651m637j0454J1195J2452K188
36502C60779K3235N9257O2938N5548R0390J31295R1522k135k0215O3288J15037
36491A030939N5328o945M7022J40814J08100n7770j91667j75884o2569K3681J9351
$$ plain form
36570 8627 49010 -6059 -130355 -238977 -289699 -316953 -350717 -356584 -290075 -176685 -101386
36559 -101386 -124896 -224096 -313047 -326395 -285172 -260074 -263348 -224897 -111116 -10822 -29649
36548 -29649 -137369 -213263 -223455 -243416 -299307 -310054 -232697 -155832 -174335 -254198 -304124
36537 -304124 -316474 -349141 -415321 -480437 -535602 -587939 -602884 -545855 -470376 -474958 -563762 -626559
36525 -626559 -573442 -426044 -260108 -119034 -7197 82749 163786 242548 299811 313289 300039
36514 300039 296739 301428 284639 257008 265643 314384 350035 345398 334944 346139 358591 360779
36502 360779 384014 443271 506209 561757 652147 783442 874964 872829 852614 915902 1030939
36491 1030939 1086267 1079322 1126344 1267158 1375258 1317488 1125821 949937 887368 911049 930400
36480I30400m9613j07388r1220k1507N742n4957j14254o3539N4642Q9648q104
36469E69850j23574j42248q1521j8919K0422M4700L7182p191l3057J0685Q0426
36458C56755Q1265n673r7829j17031p2601k7102j7889l3804m6901m2694k1872
36447d5376J0863M7665O8824M9848p744o2505p1113l7036q17J3526J6615K0278
36435C028J7518M035n554N661L7873P2463P7777L2580l4814n6508r671L9882K9822
36422B14092j68K2243O9753N9491R912J7385O6839K6183j18613j93004r8391J6157
36410I1879p627p4724q951J24358J09195n7143j47553o6608K0467j1417m8360
36399g6484L7780J54518J38887J4081o5613m5655j470J0946P862Q953J3437K3549
$$ plain form
36480 930400 880787 773399 682179 660672 666414 611457 497203 433664 488306 577954 569850
36469 569850 446276 304028 222507 203588 224010 268710 305892 298701 265644 276329 356755
36458 356755 438020 432347 334518 217487 144886 117784 99895 66091 19190 -23504 -45376
36447 -45376 -34513 13152 81976 131824 124080 61575 -9538 -46574 -47391 -33865 -17250 3028
36435 3028 20546 24581 19027 24688 62561 135024 212801 245381 210567 154059 144388 184270 214092
36422 214092 213924 236167 305920 365411 375323 392708 459547 485730 367117 174113 75722 91879
36410 91879 84252 9528 577 124935 234130 176987 29434 -37174 -16707 -28124 -76484
36399 -76484 -38704 115814 254701 268782 203169 157514 156044 166990 174852 183805 197242 220791
36387B20791K5130j5946q2070q9847j1196O3440N6280J6838J8550K6625k0862
36376B07733p6815n8348J894J0040k8174l3779n113o593l4797l0741l170n518
36364f3381j5422J9933M6730k1801j11790n9376J10348J75641M3501j07220r3489
36353g6326K8793R4352O0854m36l4825k3226L6575Q8477N2481l9641n8065J9714
36341A48727N9354m274n6568j7111J4086m0799o7195L4304J34191P7501l9085
36330B43131k9488N7408L6906p0999q4346j747o178j18969j44152j4029Q6286
36319d6177L2890m9852l4770O915o478J1970J33591K22689J25038p1086j49608
36308A75122o2565N2828R0775O1177L947m7279m7948L517L1034j1712n4664k2394
$$ plain form
36387 220791 245921 229975 147905 58058 46862 110302 166582 183420 201970 228595 207733
36376 207733 130918 72570 74464 84504 56330 22551 17438 10845 -23952 -54693 -57863 -63381
36364 -63381 -78803 -58870 -12140 -33941 -145731 -205107 -94759 80882 124383 17163 -76326
36353 -76326 -47533 46819 107673 107237 72412 49186 85761 174238 226719 187078 129013 148727
36341 148727 208081 203807 147239 130128 144214 103415 36220 70524 204715 282216 243131
36330 243131 213643 271051 307957 236958 152612 150865 144687 25718 -118434 -132463 -46177
36319 -46177 -13287 -63139 -97909 -90994 -97472 -85502 48089 270778 395816 324730 175122
36308 175122 112557 165385 256160 317337 321284 274005 226057 229574 260608 248896 194232 171838
36296A71838L6843L7524K822M450J8261k5507r0928p6676J0782N7665J6248m0612
36284A22710m6619j8937N668K1680K6727J3589m244j3637k9181m4218l664R2569
36272A22443J21671m376j60723j42857L6542J50810Q0296l8595m4915K4457M4813
36261A89566R966q36J5312r796p6821j00133l6055M8897O1355q362p6298n3194
36249c6399N5364J37739R0669n0270j34785p2478N7572J06862L6071n2252n0104
36238H7989L1744R1966O5207j3310p3491j01852j26084j32527p3284L2555Q7347
36227a23740M7253j0721j2472M517j0771k881Q7695J68881J02650o1183j27232
36216F1996l8850N1263L2561j4425L439K5834l2536j13074j07462l4344Q966R959
$$ plain form
36296 171838 208681 246205 249027 253477 271738 246231 155303 78627 89409 147074 163322 122710
36284 122710 76091 57154 62822 84502 111229 124818 120574 106937 77756 33538 29874 122443
36272 122443 244114 239738 79015 -63842 -27300 123510 203806 165211 120296 144753 189566
36261 189566 199532 198696 214008 204212 127391 27258 -8797 40100 101455 93093 16795 -36399
36249 -36399 18965 156704 247373 197103 62318 -10160 47412 154274 190345 138093 87989
36238 87989 119733 211699 276906 263596 190105 88253 -37831 -170358 -243642 -211087 -123740
36227 -123740 -76487 -87208 -99680 -95163 -105934 -108815 -21120 147761 250411 189228 61996
36216 61996 23146 74409 106970 92545 95984 121818 89282 -23792 -131254 -165598 -156632 -146673
36204a46673K9898P0494P1468K2305k5405m6056n4886m8238r208L8567N6733N9397
36192A8396Q3487J06036O6757k9708j02619r2536k0721M6234N2343j0240q1734
36181C5695q2657k0220L611n4698q7151J3374J67371K00128Q6804l2521p3776
36170A55960r0133j06937m2813J19563K23409J28772p0317j55301o8016M4143
36160A38330N7289J5775J3620L8524J1725p0585j21966q9880k9120k0793n6410
36149a13491n2079K6231J02868Q6734p207p5299n1998K7942R5475J21732J03367
36138B64275K7021r4397j73872j13079O4722K00037J63475Q065r9199q3189k7647
36127A36212k6975n5836m0358J1438L8164M0836O5144Q4948K2830r6931j37853
$$ plain form
36204 -146673 -116775 -46281 25187 47492 22087 -23969 -78855 -127093 -136301 -97734 -41001 18396
36192 18396 101883 207919 274676 244968 142349 49813 29092 75326 127669 117429 35695
36181 35695 -46962 -67182 -63571 -118269 -205420 -192046 -24675 175453 262257 229736 155960
36170 155960 65827 -41110 -83923 35640 259049 387821 317504 162203 94187 138330
36160 138330 195619 211394 225014 263538 275263 204678 82712 -7168 -36288 -57081 -113491
36149 -113491 -165570 -139339 -36471 50263 43056 -32243 -84241 -56299 39176 160908 264275
36138 264275 291296 196899 23027 -90052 -25330 174707 338182 346247 247048 163859 136212
36127 136212 109237 53401 13043 24481 62645 103481 168625 253573 276403 179472 41619
36116D1619m4270O4278O4673q84k0698N407J58k9998q48R3653J49950R7146j6127
36103D04059r4649q9679j3651P3745R2928J9403p3190j02427q5914q5746p8584
36092c3705O163J29344J56149N3760n1062o0356l0797m2432n6622o387N8336L6453
36080A58844n8348j09606n9793L1596Q4963P8192L0479k1154k8091K4414P5612
36069B07108N2334k4480o0796k7278m098n4420j19354j02447j9302J7988l6778
36058a71523r9915r2661o9079j34070k73553l66689l66071l52460l68007l10233
36048b604261q8800J95167L53178L48536K99058K65683J92319P2009J2005O4572
36038h90534J24853R0486J8214J6294O6181P2540L3342K9505O7811O1959j4591
$$ plain form
36116 41619 -2651 61627 126300 125416 104718 110125 110283 80285 79437 173090 323040 420186 404059
36103 404059 309410 219731 206080 279825 372753 392156 318966 216539 130625 44879 -33705
36092 -33705 -27542 101802 257951 311711 260649 200293 169496 127064 70442 64055 122391 158844
36080 158844 100496 -9110 -68903 -37307 47656 125848 156327 135173 107082 131496 207108
36069 207108 259442 234962 174166 146888 142790 88370 -30984 -133431 -152733 -134745 -171523
36058 -171523 -271438 -364099 -433178 -567248 -840801 -1207490 -1573561 -1926021 -2294028 -2604261
36048 -2604261 -2693061 -2497894 -2144716 -1796180 -1497122 -1231439 -1039120 -967111 -955106 -890534
36038 -890534 -765681 -675195 -656981 -640687 -574506 -501966 -468624 -439119 -371308 -309349 -323940
36027c23940o4048J290J27409J76557R2778l0874n8548K8407J05855O5654l3011
36016H7529m1678N6766J11158K4615r6148r9633p138M6378K7334J8957M4773K5791
36004A98704o1808j17967o7661J9177K9673l6292q5883o6690j0278L6298N7817
35993a04910M9936M789o1111r6327o4573O21K3131j9924n8070j6430P5893J17878
35981a49097P1255K72l2251l6185l4326j0153L4436M3156m865l5216J1078O7022
35969g4874L6672m5529o3235M358P0716R2384J06722J14297N3144p3293j56103
35958F5259j25066m5017j1236k2973k1308O445K2959N455l4290p1487q1768n5516
35946c68543j1511K6967O3042R9170J03358N9668K3757M8227P9604L3355m8079
$$ plain form
36027 -323940 -387988 -386698 -259289 -82732 10046 -20828 -79376 -50969 54886 120540 87529
36016 87529 45851 102617 213775 238390 142242 42609 35471 81849 109183 128140 172913 198704
36004 198704 136896 18929 -48732 -29555 118 -36174 -122057 -188747 -199025 -162727 -104910
35993 -104910 -54974 -50185 -111296 -207623 -272196 -271575 -248444 -268368 -326438 -342868 -266975 -149097
35981 -149097 -77842 -77570 -109821 -146006 -180332 -190485 -156049 -112893 -117758 -152974 -141896 -74874
35969 -74874 -38202 -83731 -146966 -142608 -71892 20492 127214 241511 294655 221362 65259
35958 65259 -59807 -104824 -116060 -139033 -160341 -153896 -130937 -125482 -159772 -231259 -313027 -368543
35946 -368543 -380054 -353087 -290045 -190875 -87517 -27849 -4092 44135 123739 157094 109015
35935A09015m3782L7573N2454l8460q9371n233R5681O9372l4002p5867n2526n8247
35923c3393r3098o7005L0874J05010R2102K2215m9455q4352n6092J1975L6082
35912h5137j8971o6426k4650M3917L7952j743L2792J04696P2901o2716j40918
35901a08303r1068k6710l2257k9299N3220J26923Q4640j6482m1894K0259O4871
35890C900L3944k7738o1282n8382m2869l6264l5634j1379M4197P1678J3183p4706
35878a81352p1875K3665P8394K7298l1159j1162K2541n300k8853L3551J07118
35867c7134P4835j3382k3028K5139p645j16375j34547j4420P0480j0500j39196
35856c25773j27430J1618J05909P5151P676K178M3116O0376M3208M4506Q7662
$$ plain form
35935 109015 65233 102806 155260 116800 27429 22196 117877 187249 153247 77380 24854 -33393
35923 -33393 -126491 -193496 -162622 -57612 34490 56705 7250 -77102 -133194 -121219 -85137
35912 -85137 -104108 -170534 -195184 -151267 -113315 -115058 -82266 22430 95331 32615 -108303
35901 -108303 -199371 -226081 -258338 -287637 -234417 -107494 -22854 -39336 -81230 -60971 3900
35890 3900 37844 10106 -51176 -109558 -152427 -188691 -224325 -235704 -191507 -119829 -106646 -181352
35878 -181352 -253227 -229562 -151168 -123870 -155029 -166191 -143650 -148950 -177803 -144252 -37134
35867 -37134 37701 24319 1291 26430 18785 -97590 -232137 -246557 -176077 -186577 -325773
35856 -325773 -453203 -441585 -335676 -260525 -252849 -250671 -207555 -147179 -103971 -59465 28197
35845B8197J13616N2485o4643j21316o6018J4082K1489j2037J174M2743J7526
35834B7298p2489j10939m1642N3051Q1118M7691j954m9158p1178l5911L0178N5404
35822h8531L7382M5422P6136L1198j01383j75064q6615O4555J25527R5995O9243
35811I3865O1486L0826r847l1153p1520j52170j76992o2380R4397J33242O5172
35800b5074K2391K5079r578n6751l101J12755J07115m4351j25001L250J88421
35789A95155K17880R9121k2287q7749j20973j06653k9060L7721J5820m9768o4969
35778H4238l3984k2126k4129J2827P1952Q4802M2748n875m5078q7753j09875p7670
35766a09923j9652Q704R766K1007L8934L9002L6108N1418N8961L8889L3676O9939
$$ plain form
35845 28197 141813 194298 129655 8339 -57679 -43597 -22108 -34145 -32971 9772 27298
35834 27298 -45191 -156130 -197772 -144721 -63603 -15912 -17866 -67024 -138202 -174113 -143935 -88531
35822 -88531 -51149 -5727 70409 101607 224 -174840 -261455 -196900 -71373 24622 93865
35811 93865 155351 186177 176330 145177 73657 -78513 -255505 -317885 -223488 -90246 -25074
35800 -25074 -2683 22396 12818 -43933 -47034 65721 172836 128485 3484 6734 195155
35789 195155 413035 512156 489869 402120 281147 174494 145434 183155 198975 149207 84238
35778 84238 50254 28128 3999 16826 88778 173580 216328 210453 165375 77622 -32253 -109923
35766 -109923 -129575 -120871 -111105 -90098 -51164 -12162 23946 75364 134325 173214 206890 276829
35754B76829Q3609J9210n7033n4370q827j1373l9903q028O0319O4413R247j2494
35742C21599o657o3959j54956j35698K372Q4444K3789m6313q211N0337J0600o5427
35730A1920n0528L4101P4859N1892K4869L76m7480p8265m0754J5047O473l9889
35718c7379l6970R507K3454M025J5794N1232L9750r083j0154L4328J6124r3696
35706F932j68530j03447L0642Q9130M2022j7353j1962L7578N9179J7393m5375
35695f3791n3960J186L7339n401n7590j1309J00341J26050J7138r1852p8397m53
35683h0699J6189k7960l6450J2046M5025L1374J8871K5840K355o3116q8954j3767
35671a59246R6706J25809N6723j7470k1076K3962M6393Q101p0421j30954j15497
$$ plain form
35754 276829 360438 379648 322615 268245 259418 248045 208142 200114 260433 324846 334093 321599
35742 321599 314942 250983 96027 -39671 -37299 47145 70934 24621 16410 66747 77347 11920
35730 11920 -38608 -4507 70352 122244 147113 147489 100009 21744 -19010 -3963 2510 -37379
35718 -37379 -74349 -64842 -41388 -37363 -21569 29663 69413 60330 50176 84504 100628 6932
35706 6932 -161598 -265045 -234403 -145273 -103251 -120604 -132566 -94988 -35809 -18416 -63791
35695 -63791 -117751 -116565 -79226 -84627 -142217 -153526 -53185 72865 90003 -1849 -80246 -80699
35683 -80699 -64510 -92470 -128920 -116874 -71849 -40475 -21604 4236 6591 -56525 -145479 -159246
35671 -159246 -62540 63269 119992 102522 81446 105408 151801 159902 89481 -41473 -156970
35660a56970j7716R1819J25264P7000K7567K8209K7799l8773j27812j28843k7487
35649a19943N4626J9112p2914q6606M4P3701N1570p370J080P2076J04293N2530
35637A42199r821p764K1259p663q4032j04826k2441Q4466J14337N7747k3856p9159
35625H0446q4159k9057N7592J08533R2927N8007N1357N1515L3852M3588J15081
35614E79682J71877J21783K0065Q738J00507J58663J08374L0708N683m328m6844
35603A254908p3399l0640L1502L3551j5043m8049m0078j0743J5953J0248m2268
35592A085942q2719k7834Q3926J05476O18p5162m142J10274J12030K8111j4995
35581A321525j5495o2809j40505j42866o5834k0309n9552j29346j79247j96362
$$ plain form
35660 -156970 -174686 -82867 42397 119397 146964 175173 202972 164199 36387 -92456 -119943
35649 -119943 -65317 -46205 -119119 -205725 -205681 -131980 -80410 -87780 -86700 -14624 89669 142199
35637 142199 132378 124614 145873 138210 54178 -50648 -73089 11377 125714 183461 159605 80446
35625 80446 -3713 -32770 24822 133355 226282 284289 335646 387161 421013 464601 579682
35614 579682 751559 873342 893407 902145 1002652 1161315 1269689 1300397 1306080 1301752 1254908
35603 1254908 1181509 1150869 1182371 1215922 1200879 1152830 1112752 1102009 1117962 1128210 1085942
35592 1085942 1003223 975389 1059315 1164791 1165409 1090247 1086105 1196379 1308409 1336520 1321525
35581 1321525 1306030 1243221 1102716 959850 894016 873707 814155 684809 505562 309200
35571C09200j50753m1267K9290l1823j41075j37669k5843M8456M6568P3349J55433
35560A33866J80798R9594J290n6871j16297j59516q4103Q4007J47220J9871j21590
35549A28269j01138Q363M5971K1298L9399Q3853N9373k1191o0056m0939l3380
35538A29822o6300j09445j38652j27075l4753J01380J49124N6415m5313k7472
35528a12269M7992O1805M6313Q7797J17870J3416j53159j86084o8424K5275K0928
35517i8540K8689J00164J20226J9385r3718j12091q6363r4526r1909j1149R2875
35506b26957J20974Q2275O0964P9388Q6382M9817j0554n8405o2171j2953M5114
35495A53874M4099j9294p3030p2289n3170n4164n0276q840M5886O9300N3331J4963
$$ plain form
35571 309200 158447 117180 146470 114647 -26428 -164097 -189940 -141484 -94916 -21567 133866
35560 133866 314664 414258 415548 358677 242380 82864 -1239 82768 229988 249859 128269
35549 128269 27131 35494 81465 102763 142162 226015 285388 264197 204141 163202 129822
35538 129822 63522 -45923 -184575 -311650 -346403 -245023 -95899 -39484 -84797 -112269
35528 -112269 -64277 -2472 43841 131638 249508 262924 109765 -76319 -144743 -119468 -98540
35517 -98540 -69851 30313 150539 169924 76206 -35885 -122248 -216774 -308683 -319832 -226957
35506 -226957 -105983 -23708 37256 116644 203026 252843 242289 183884 121713 108760 153874
35495 153874 197973 178679 105649 33360 -19810 -73974 -124250 -133090 -87204 -17904 35427 50390
35483E0390k4985l0061K4781R1536Q3764L76o2853n8626n3977r8635j24279n7779
35471b60348M4463P6747M5065M2349R1855J17910P0340p678n0623m8586l6129
35460H5365m0236n1788l5435K3997Q1543P3286Q711k9642l814K3988m602m9617
35448H1756m3919j267K2016K5991M1604M1173k7918j29359j51021m8980Q7535
35437a02389J33485M9091r5173j74715j06655O3092J85349J66354P2664K5186
35427B16289L5500L0451m088j9346k4304p7412j45792j11174L6742J41522Q8903
35416A67291l5168q5210n9224n2014p9794p6827k7346J8918M4974P1231P2546
35405d0623K025r7410j15944l4635M2135M5057K9052N4441P9245M6756j232O622
$$ plain form
35483 50390 25405 -4656 20125 111661 195425 195801 132948 74322 20345 -78290 -202569 -260348
35471 -260348 -215885 -139138 -94073 -51724 40131 158041 228381 220703 170080 121494 85365
35460 85365 45129 -6659 -42094 -18097 63446 136732 145443 115801 111987 135975 131373 81756
35448 81756 37837 36570 58586 84577 126181 167354 139436 10077 -140944 -189924 -102389
35437 -102389 31096 80187 -14986 -189701 -296356 -233264 -47915 118439 191103 216289
35427 216289 251789 282240 278152 258806 234502 157090 11298 -99876 -63134 78388 167291
35416 167291 132123 46913 -12311 -64325 -144119 -220946 -248292 -229374 -184400 -113169 -40623
35405 -40623 -38598 -136008 -251952 -286587 -244452 -199395 -170343 -115902 -36657 10099 8867 15489
35393A5489M6018M1286k114j2933J7705L0519J8778M3043J02484J01679k816j18081
35381B81057j46474j19167j10811r2236J2702J57072J91842P4899n5514o5868
35371A27502L498K2087m2820j04910r4217l1655L1250P8346J12001J16645P4654
35360B92381L099n1582n8376l3472k2996n0759q5447p2255j170P3249R2984O1094
35348A46750K5352J0927j726l3607p1406q5558o3973j5369M4933R7186J17280
35337A70789R6025N8035M1366M8786L5030l5981j25471j42661n2700O2505Q9993
35326B45716K5350k2386K0770R4729R8299L7130O887M3632P4726L8047k7428n4851
35314E80621m8781m9015m6993j7956k271n8975j45935j47799m4046M6461L1409
$$ plain form
35393 15489 61507 102793 100679 87746 105451 135970 154748 197791 300275 401954 399138 281057
35381 281057 134583 15416 -95395 -187631 -174929 -17857 173985 248884 193370 127502
35371 127502 131000 153087 110267 5357 -88860 -120515 -89265 -10919 101082 217727 292381
35360 292381 295480 243898 185522 152050 129054 78295 -7152 -79407 -80577 -7328 85656 146750
35348 146750 172102 183029 181303 147696 76290 -9268 -73241 -88610 -43677 53509 170789
35337 170789 266814 324849 366215 415001 450031 414050 288579 145918 93218 155723 245716
35326 245716 271066 248680 269450 364179 462478 499608 506495 550127 624853 662900 635472 580621
35314 580621 531840 482825 435832 417876 415605 356630 210695 62896 18850 65311 96720
35303I6720l1071l6063J3967L7712O469l5700n1067l3112J9349Q1609Q8728J9615
35291A77156l9016m188O1310L1878p5890j17246m7288J2426j8848n0181K1026
35280d8861J36369J69706J07415K9025k6184o6687p2691j9934M5983M9204j6241
35269B87104q8819j14935p2123L1270J21366R3588m0449j19019m2239O5199L3772
35258A54715q4601r9325J4685R1523N5336K5166Q4012J27542M7426p3769p9530
35247B63180L0330J06155N1149p0962j25822o0246L9172M2717n2224r4389J5791
35236A44851J56876J42955L292o2010L610M3760k4310o9637J247N5834l7497j56134
35224B02837j01094P6671J44236L1728r6031j05613m6565j1884q007j4523m5306
$$ plain form
35303 96720 65649 29586 43553 81265 87734 52034 967 -32145 -12796 68813 157541 177156
35291 177156 138140 133952 195262 227140 151250 34004 -13284 -858 -19706 -69887 -48861
35280 -48861 87508 257214 364629 393654 367470 300783 228092 208158 254141 303345 287104
35269 287104 198285 83350 11227 42497 163863 257451 217002 97983 55744 120943 154715
35258 154715 70114 -29211 -14526 76997 132333 157499 241511 369053 416479 342710 263180
35247 263180 293510 399665 450814 379852 254030 193784 232956 275673 223449 129060 144851
35236 144851 301727 444682 447974 385964 389574 433334 409024 339387 340634 396468 358971 202837
35224 202837 101743 178414 322650 354378 258347 152734 106169 94285 86278 71755 26449
35213B6449q7996p6436J7145J27614J77537J56764R1045q299j19803j82227j44493
35202b2700l7164M1915K6749m1828o0632Q500Q7003Q8442L8563J6503J1358m9696
35190A07013j37665j29882j5506O1443L4789L0514J35098K07844R1453j11931
35180B73170j70357m8568Q9893J46727J52026J07247j3619j17005o9547N6630
35170D06597M3297j26168k10058q0709P4470N3905n8741o6916K5584O9067L0532
35159A60860M900J9014M770m8840o8906k9215J2449J7329Q707N270k940n638K3708
35146A01468O6766P0425K5839k1827m7636p1901j00731r8281m2969K7170N3603
35135c8074K5474r835j027M9495Q7673P1430K0300j5163j7309l652J8009M9143
$$ plain form
35213 26449 -61547 -137983 -120838 6776 184313 341077 432122 423823 304020 121793 -22700
35202 -22700 -59864 -17949 8800 -33028 -93660 -85160 1843 90285 128848 145351 156709 107013
35190 107013 -30652 -160534 -176040 -114597 -79808 -49294 85804 293648 385101 273170
35180 273170 102813 54245 144138 290865 442891 550138 536519 419514 349967 406597
35170 406597 449894 323726 113668 32959 107429 161334 102593 35677 61261 130328 160860
35159 160860 165760 184774 189544 140704 71798 42583 55032 72361 81068 86338 83398 77760 101468
35146 101468 168234 238659 264498 242671 195035 123134 22403 -75878 -118847 -91677 -38074
35135 -38074 -12600 -22435 -23462 26033 113706 185136 205436 190273 172964 169312 187321 236464
35123B36464O4223L3356j8008l4084j6793j7424l4442j1151M0050J9140r5218
35112A66113j64915p6098P4828J01544q513q3932k0901Q4550R9277M2325K7252
35101B41530P2036P1785k8913j24920q0949O5080J26389J6181j24221j19080k296
35090A12622M9429j4771o5781j6762N3298N3842K3537K7608K8487k8194q4491
35079A38824n2773K8569M8360j007k3629J5853M7469K5753k346J0294L6830L5685
35067C07882K0909K8913N3280N0898j992p8935j23585j02932m5644r717m025K0782
35055A15834P9901J02523K5350r6085j36039m9935P7559J34769Q8971r330q7289
35044B46229j06587q2843n3943k8555J3232O6304Q9156O3601K2827k104j8259
$$ plain form
35123 236464 300687 334043 316035 281951 265158 247734 213292 202141 242191 261331 166113
35112 166113 1198 -74900 -72 101472 92959 9027 -11874 72676 171953 214278 241530
35101 241530 313566 385351 356438 231518 150569 215649 342038 358219 233998 114918 112622
35090 112622 162051 147280 81499 64737 118035 171877 195414 223022 251509 223315 138824
35079 138824 86051 114620 162980 161973 138344 154197 201666 227419 225073 235367 272197 307882
35067 307882 328791 357704 410984 461882 459890 380955 257370 154438 108794 99077 95052 115834
35055 115834 195735 298258 323608 227523 91484 41549 119108 253877 342848 333518 246229
35044 246229 139642 56799 2856 -25699 -12467 53837 142993 206594 229421 227317 209058
35033B09058l2612l2707k8479m6591n6441J1320J28778J57048M3598p0057m0491
35022B42424P3239J22290R5890Q0913O4837l0846j49411j35065R960R8208M1236
35011E13675k0771L7334J15493N2400j16074k08306j45902k1573N4404O5098M5443
35000C71221J6139j8398m9909o3445m7245j0596J4392J4820K7929Q2418J22097
34989D59423O2604o9859j43356r3474p984P589k8835l0973K2168P6305Q2207K7668
34977C63483p0342j52683j41598l4234O9773R0818P0252Q1059R3315L0267p1547
34966C28563q1621K6604J08568L8484j10145j51771j9164J68864K59397K14680
34956G82459R8456j7581q9568r2731m4017j5787n9887j22744j09723l7438k4940
$$ plain form
35033 209058 176446 143739 115260 68669 12228 23548 152326 309374 352972 282915 242424
35022 242424 315663 437953 533843 614756 679593 648747 499336 364271 374231 472439 513675
35011 513675 492904 530238 645731 698131 582057 373751 227849 206276 260680 325778 371221
35000 371221 387360 368962 319053 255608 208363 197767 212159 226979 254908 337326 459423
34989 459423 522027 452168 308812 215338 207354 214943 186108 155135 177303 253608 335815 363483
34977 363483 293141 140458 -1140 -35374 34399 125217 195469 276528 369843 400110 328563
34966 328563 246942 273546 382114 420598 310453 158682 139518 308382 567779 782459
34956 782459 880915 863334 773766 681035 637018 621231 561344 438600 328877 291439 266499
34945B66499j00276j30426k5896R2879O6221m5036m3110R0581J55686M3855r4435
34934B76542q4705J8644M0730n3996j47160j54143r9115k9998K9591N1723K2213
34923a29674j0641J5270P3615O9099k7214j25382j22564j5986J10506J74529J46877
34912A58435M8501o5180j22539p7319L8366J15187O5371o4538j25988m8323O3433
34901a4594O9262j6763o7251l6118L632P938J6076L4760K131q1126j10985m1664
34889b34702K8151J3230k7253j4037R127k2492n0342N977Q2670O4827j2012j9997
34877a76853L7292L5773m0498n9381M0178J47453J51651Q2734K2404j2180l5315
34866A93258l9419k9877l1404k4403L2106Q7039K8318j21049j71117j9924J76537
$$ plain form
34945 266499 166223 35797 9901 102780 169001 123965 80855 171436 327122 370977 276542
34934 276542 191837 210481 251211 197215 50055 -104088 -203203 -233201 -203610 -151887 -129674
34923 -129674 -140315 -125045 -51430 17669 -9545 -134927 -257491 -273477 -162971 11558 158435
34912 158435 206936 141756 19217 -58102 -19736 95451 160822 96284 -29704 -78027 -14594
34901 -14594 54668 37905 -29346 -65464 -61832 -53894 -37818 -3058 -927 -82053 -193038 -234702
34889 -234702 -206551 -193321 -220574 -234611 -225484 -247976 -298318 -292341 -209671 -144844 -156856 -176853
34877 -176853 -139561 -103788 -144286 -203667 -163489 -16036 135615 218349 240753 228573 193258
34866 193258 153839 123962 92558 68155 100261 187300 215618 94569 -76548 -96472 80065
34855H0065K05732P7137l3796n1073n4325r6726j22191q7617m0909k6139m796
34844a54638O4502J31319J10101N482p9483o2970K4624Q2840N5508j7398o1919
34833I7968n9392m8785n2876m5285l269M6909O6153N6033M4100L7148K4244J2269
34821A75217K0560M1647L8496j0305p6845j01575m8990M1508P0822j3442j23277
34810A3816j07550M2982J42717M3110j40497j57802L3200J98817J54048J0962
34800B33803j2669P3698O7049r2088k09164j23290N1344R3939j0218p5828l104
34789f528R4800P9815j7652o5583j7349N1035O1944K3678n962J951K3201K0428
34777B43778m800j0001K8733P1475N9108m727n6483n7522l1087r425M190P072
$$ plain form
34855 80065 285797 362934 329138 278065 223740 127014 4823 -82794 -123703 -149842 -154638
34844 -154638 -90136 41183 151284 156766 77283 14313 38937 121777 177285 159887 97968
34833 97968 38576 -10209 -63085 -108370 -111639 -64730 1423 57456 101556 138704 162948 175217
34821 175217 195777 237424 275920 265615 188770 87195 38205 79713 150535 137093 13816
34810 13816 -93734 -50752 91965 135075 -5422 -163224 -130024 68793 222841 233803
34800 233803 221134 294832 361881 269793 60629 -62661 -11317 82622 72404 -3424 -6528
34789 -6528 88272 168087 150435 84852 67503 118538 180482 204160 198198 200149 223350 243778
34777 243778 238978 228977 257710 329185 388293 383566 327083 269561 238474 229049 233239 240311
34765B40311j2531l3402q370N3424P0715J195q7797j12202q0058m5020n653O6721
34753D7333J37632J38713P2642O759k9672o3722j00025j03494o4148p906N5057
34742H9169J16672J14523q843j74523k06299n2438J24227J46693L9349l8981k1456
34731A28093Q662k7255q5259o9780K7094J03954O7992m9139j18814o4711M6610
34720c2553R5207N8706J8592L0148N8816N8381M1173L5723L0535M335k5333k4587
34708C49143J0091N6696R6561J16792J06950P0804K3873k1762m6140j1976Q4197
34697H35229J66683J54586P4263J8913K323m4021j20238j32131n4980J0233Q456
34686I19316J8272P6048O3694q4860k01354j01532J07287J58612K0333p8520j3905
$$ plain form
34765 240311 227780 194378 186008 239432 310147 311342 223545 111343 31285 -13735 -19388 47333
34753 47333 184965 323678 396320 403079 373407 309685 209660 106166 42018 34112 89169
34742 89169 205841 320364 311521 136998 -69301 -121739 2488 149181 188530 149549 128093
34731 128093 136755 109500 24241 -45539 -18445 85509 153501 104362 -14452 -79163 -32553
34720 -32553 62654 121360 139952 170100 228916 287297 328470 364193 394728 399063 373730 349143
34708 349143 359234 415930 512491 629283 736233 807037 830910 809148 763008 751032 835229
34697 835229 1001912 1156498 1230761 1249674 1251997 1207976 1087738 955607 900627 910860 919316
34686 919316 937588 1013636 1077330 992470 791116 689584 796871 955483 975816 897296 883391
34675H83391P9638P2208K9558M5233P7314P3021Q6909J40366J17425m3855j90845
34664A370363j62738m6355l3734j13747j22032m4136l1941j19805j58864q1203
34654D55808j3884m6912q1775k4064M3022J6280l8523j3649L7316j755q7814q3990
34642A60060l664N210q2048j16338k4182O7923M1448k8186r086O9829P4808j6348
34630A39426q8468o6608k542L2633M4061O0491O0815J4410m6209n7648j9271K136
34618G3226l0312p0260n7096m75M1544M2185J7535k2790p6546j02858m5123P7894
34606a53076J65543J53169Q2442K2021j7814m4796k8598M3129J06073R4163L0820
34595D53076k5720p3494j18684j03031K019Q2965J3039j35692j70673o3416K0407
$$ plain form
34675 883391 963029 1035237 1064795 1110028 1187342 1260363 1347272 1487638 1605063 1561208 1370363
34664 1370363 1207625 1161270 1127536 1013789 891757 847621 815680 695875 537011 455808
34654 455808 441924 395012 313237 289173 332195 348475 309952 296303 333619 331864 244050 160060
34642 160060 156396 161606 79558 -36780 -60962 6961 48409 20223 11137 80966 155774 139426
34630 139426 50958 -15650 -18192 14441 58502 118993 179808 194218 148009 90361 71090 73226
34618 73226 42914 -27346 -84442 -84917 -43373 -1188 16347 -6443 -82989 -185847 -230970 -153076
34606 -153076 12467 165636 248078 270099 252285 207489 178891 222020 328093 422256 453076
34595 453076 427356 353862 235178 132147 134166 217131 230170 94478 -76195 -139611 -119204
34584a19204k824j9458N3760J12848N2878m1488l3909M6210O9825J2932m3031
34573H8539n8854n6387k9765M1859J13276J05272R545j04615j65480j34169j5386
34562b06165J16062J60930J16105P4001O2901M699j06093j31894j3266Q9811L2864
34551A99955p3807m9367N3947N6236k9107l3007N2454N7753n4749j15994l4957
34540B9357O4474O4260J6076J668m40k0008j3158L5843N1750j3469r7160j17291
34528A902o2669L1807J08638R2443j5118p1077L2777J66628J23836m4530r0734
34517B73903L4248J15497M7658j5098K3300K4503r7399j86205j23029m3241o9027
34506a4890o9683O8438J62346J7695j89490j46843R5621J98222M9627j10608r0054
$$ plain form
34584 -119204 -122028 -141486 -87726 25122 78000 36512 2603 48813 118638 131570 88539
34573 88539 29685 -26702 -56467 -14608 98668 203940 213485 108870 -56610 -190779 -206165
34562 -206165 -90103 70827 186932 260933 323834 328533 222440 90546 77280 167091 199955
34551 199955 126148 76781 130728 186964 157857 124850 177304 235057 180308 64314 29357
34540 29357 93831 158091 174167 175835 175395 155387 142229 178072 229822 216353 119193 1902
34528 1902 -60767 -28960 79678 172121 157003 85926 118703 285331 409167 364637 273903
34517 273903 308151 423648 471306 456208 479508 504011 406612 220407 97378 54137 -14890
34506 -14890 -84573 -16135 146211 163906 -25584 -172427 -76806 121416 171043 60435 -29619
34495b9619K6542R0392Q7336N5389m076o5146p0349k6205Q375L0042O9299Q7685
34483B59665L5697j8744K5146J16934J20560L7689j0869n503l6454r7963p9630
34472C46528J5025M4011l5498r6165o2499j8918k7667j8790M9867Q8005L1217
34461C15116l9826m4802l7089p9161j05226l6890N8572O0335j8556o1685k6951
34450a6163K2396M3682O2871R0289P9953Q751o0664m6911L6321Q3293L2786m1644
34438B94960l4331K8906K8148m4643m9331P0927J59689O9663r7920j36291l6331
34427B53446L5723J7996J1097O0054P8124K9835J3780R4710J96943K35426K27932
34416A255066K10129J62407J00192J24094K85041M88461O30380P54645R57206
$$ plain form
34495 -29619 -3077 87315 174651 230040 225964 160818 90469 64264 72639 102681 171980 259665
34483 259665 295362 276618 301764 418698 539258 576947 566078 560575 524121 426158 346528
34472 346528 361553 405564 370066 273901 211402 192484 164817 146027 195894 283899 315116
34461 315116 275290 230488 193399 114238 9012 -27878 30694 91029 72473 10788 -16163
34450 -16163 6233 49915 112786 203075 283028 291779 231115 184204 220525 303818 336604 294960
34438 294960 260629 289535 317683 273040 223709 294636 454325 523988 426068 289777 253446
34427 253446 289169 307165 318262 378316 456440 486275 500055 594765 791708 1027134 1255066
34416 1255066 1465195 1627602 1727794 1851888 2136929 2625390 3255770 4010415 4967621
34407D967621J161760J106839O05022k14517r57554j281181j168701q82093o59505
34398B677691n22108l85523k45621j60787j27141r2945o3994q5544j37557j45992
34388G10479q9272j3854M0444O2817M7662J0096j3310k5861o5334r7588l1519
34377E34760R3880R1627r0316k33605j54780J8877P3211M0081O3627Q8075k2026
34366E03411j59484j02682Q9030J39364k171j05410n6762P190j895J026M5613
34355C57230L6707k7735l3484J4868K85m8220N231R6898K7879j40994j28012P8331
34343B38984J62277J4987q2120M4025J81298J45715Q0594J14828R4659q2259k08233
34332G04755j21012n054n5843j41955q9004q390m1817o0458O3964J57601M7974
$$ plain form
34407 4967621 6129381 7236220 7841242 7626725 6669171 5387990 4219289 3337196 2677691
34398 2677691 2155583 1770060 1524439 1363652 1236511 1143566 1079572 994028 856471 710479
34388 710479 621207 607353 647797 710614 758276 768372 755062 729201 663867 566279 534760
34377 534760 628640 720267 629951 396346 241566 260443 333654 373735 437362 525437 503411
34366 503411 343927 241245 330275 469639 467468 362058 305296 312486 310591 311617 357230
34355 357230 393937 366202 332718 347586 347871 299651 304882 401780 429659 288665 160653 238984
34343 238984 401261 416248 334128 378153 559451 705166 785760 900588 995247 912988 704755
34332 704755 583743 578689 522846 380891 291887 283497 241680 181222 245186 402787 450761
34321D50761q2240N541J78141J58934j3374j06096r4779r8558p9033N0169J58081
34310E27547P8497o7118m4939J10533J84752J30822N5086j3015p9776o4856M1029
34299H58562P5180j5904k9479J19106J72761j7802j54021K2348K32404J08984
34289A372139j54947j28956J19935J73158k0470j27948l6322M9654N2108Q3421
34279A381772J21788O1296O835J03914J95481P2744r1447j7792J52675J09392
34269B096658l4408N1432K77389K83944R3738L1311J14835J10407O1600J72161
34259C259067L06096K12278P6991K18508M36988L53695J62032K86054N42832M78411
34249F332952K82560M56220Q21978Q57573P54395J060564J542764J600407J529452
$$ plain form
34321 450761 368521 374062 552203 711137 697763 591667 496888 398330 319297 369466 527547
34310 527547 606044 538926 493987 604520 789272 920094 975180 962165 882389 817533 858562
34299 858562 933742 917838 888359 1007465 1180226 1162424 1008403 1030751 1263155 1372139
34289 1372139 1217192 1088236 1208171 1381329 1360859 1232911 1196589 1246243 1298351 1381772
34279 1381772 1503560 1564856 1571691 1675605 1871086 1943830 1852383 1834591 1987266 2096658
34269 2096658 2062250 2113682 2391071 2675015 2768753 2800064 2914899 3025306 3086906 3259067
34259 3259067 3565163 3777441 3854432 4072940 4509928 4863623 5025655 5311709 5854541 6332952
34249 6332952 6615512 7071732 7893710 8751283 9505678 10566242 12109006 13709413 15238865
34240A5238865K048329K879710L306599L787233N269257P292492Q879392J0921024
34232E9622901J5140338K1185513K8130067L8144532N2793865O3898939N5229417
34225C34145572K0028369k6268234n7835960o2760070n0558399l6786998k7489183
34218I2475097k0479073j4396614j0499571q623131o851850m750314l522551l293077
34210B0058916k876556k002064j526597j570936j357567q25180p12439j048737
34202H138840j058329n92397l20846m51326m67192k06970j00880k45967k46031
34193D448902n9484q8036l39159l55772o0434J29186R7050J83134M80889P08365
34183E144641Q30047J077857J281425R13915m3558r36344j292210j263522j107934
$$ plain form
34240 15238865 17287194 20166904 23473503 27260736 32529993 39822485 48701877 59622901
34232 59622901 74763239 95948752 124078819 162223351 215017216 278916155 334145572
34225 334145572 354173941 327905707 270069747 207309677 156751278 119964280 92475097
34218 92475097 71996024 57599410 47099839 38476708 31624858 26874544 23351993 20058916
34210 20058916 17182360 15180296 13653699 12082763 10725196 9900016 9187577 8138840
34202 8138840 7080511 6488114 6167268 5715942 5248750 5041780 4940900 4694933 4448902
34193 4448902 4389418 4301382 3962223 3606451 3546017 3675203 3772253 3955387 4436276 5144641
34183 5144641 5974688 7052545 8333970 9247885 9204327 8267983 6975773 5712251 4604317
34174D604317q32181n07650l73337m25384l71791j42636n849p2255j35579j01949
34164A635706j27953k32096k13313n9693q336j02776j16906m833J3764q8780n8768
34153F36016J49033K39408Q2952p2402n6974l3440j18832j50550l0667N8097j3773
34142F88868r6425n6343M619p652j3478J7236k2146j07606n1746J30043J65521
34131F50891j5038j30459l5453K5864j21115k43520j05461J20643J60676P3691
34121C80719N8484P4169j0664r6207k0378J07183O9147p9388j07702k075L6588
34110D09876n6462j31251q9511p739K0199k382k7728j6409M6939J12188R3418
34099C51138N853k2683M6954P7631k7170j49600j30850n099P6818O3407J3261
$$ plain form
34174 4604317 3772136 3264486 2891149 2465765 2093974 1951338 1945489 1873234 1737655 1635706
34164 1635706 1507753 1275657 1062344 1002651 994315 891539 774633 769800 783564 694784 636016
34153 636016 785049 1024457 1107409 1035007 978033 944593 825761 675211 644544 702641 688868
34142 688868 592443 536100 540719 533067 519589 536825 514679 407073 355327 485370 650891
34131 650891 635853 505394 469941 495805 374690 131170 25709 146352 307028 380719
34121 380719 439203 513372 502708 406501 386123 493306 562453 483065 375363 373288 409876
34110 409876 353414 222163 132652 124913 145112 142730 115002 98593 145532 257720 351138
34099 351138 356991 334308 381262 458893 431723 282123 151273 146174 222992 286399 299660
34088B99660k6473l6784p56M4009J5565p1321q7576P744Q5700O2019L6151R3297
34076D21235J28448K6483j20252j48875o9934n194J9101M6429M6152k8945j07572
34065B07076q7655p235K1154l997M558O1191J02012J01464P7064K3624m9539p1826
34053C77891q345N7880M4756J054R381L9345K0642j1997J9363Q6865R6853L2502
34041G66190n0424j13640j25868m2777R2724J21369k9314j95958j77449j0202
34031B34651J02623P2748j6260q0227j03984p3518J1887P7305M7109l9839r3486
34020A39009j02938r6699m3740P3128J53149R7148k2405o0383j5052J0038M199
34009A35454L4365P3319L3420m3502k0558R9441J52756N8897p2308j16389p8125
$$ plain form
34088 299660 273187 236403 235647 279656 295221 223900 136324 144068 229768 291787 327938 421235
34076 421235 549683 576166 455914 307039 237105 231911 251012 297441 343593 314648 207076
34065 207076 119421 112186 133340 129343 133901 195092 297104 398568 475632 499256 449717 377891
34053 377891 369546 427426 472182 473236 482617 521962 542604 530607 549970 636835 733688 766190
34041 766190 715766 602126 476258 433481 526205 647574 618260 422302 244853 234651
34031 234651 337274 410022 393762 313535 209551 136033 147920 225225 272334 232495 139009
34020 139009 36071 -60628 -104368 -31240 121909 219057 196652 136269 121217 131255 135454
34009 135454 169819 243138 276558 233056 212498 311939 464695 523592 451284 334895 256770
33998B56770k0842K3913L5079n442o4308q0212m5149Q395P6136J49802J59992
33987D94134O6332l6112l0915L6321L0417n1724q9249m4561L940K6293O6390J00486
33975E71752M7349n8409p4777K7714J10718P6151j0635m4893l094Q5513J68163
33964H95552J68911Q9916Q7993K90166N72553P28491Q12515J029815J265755J072921
33954G014588K80301o65922j177269j137424q57330o18660m89895m45323m18076
33945A484990l02950r3993M4105r424j37835j63193j10674j15515j61777j23905
33935C09829j1483L9180j626k4250J9045N2393L0011J276K041P972J0177K5197
33923D59762K7791j7513o5242m1574K3297L3554j1802k2381K2501M5827J5374
$$ plain form
33998 256770 235928 259841 294920 289478 225170 144958 99809 108204 184340 334142 494134
33987 494134 560466 524354 493439 529760 560177 508453 419204 374643 378583 404876 471266 571752
33975 571752 619101 560692 485915 513629 624347 700498 689863 644970 641876 727389 895552
33964 895552 1064463 1154379 1242372 1532538 2105091 2833582 3646097 4675912 5941667 7014588
33954 7014588 7294889 6628967 5451698 4314274 3456944 2838284 2348389 1903066 1484990
33945 1484990 1182040 1088047 1132152 1122728 984893 821700 711026 595511 433734 309829
33935 309829 298346 337526 335900 311650 330695 383088 413099 414375 416416 424388 434565 459762
33923 459762 487553 470040 404798 363224 386521 420075 408273 385892 408393 454220 469594
33912D69594j2147q268j4252m0936m0236m836R772r539r432K1450K2686k8292
33900C55564p5386q2787p7834o8967k5110L3681L6861p331k42Q0233J22175N4413
33888C45270m0395o6866n4530o0585n1134L296K1498n6048j18116l4025J07943
33877c692J03226m9170j29465k6635J07979J10537L6210K3949O5995O1762J4752
33866C15448J2768M8477J9797q1021j22943l1709Q3147P5327l7726j09104o0808
33855A11653L6035P4725L6363k1014m9290n0001m3423l1649n457K4123K4965j2482
33843I4548m7577l2875J9434M6739J7395k9711m1741j8655j505j4110l6226k3373
33831f7657N0698J49532J77604P4999q3404j43743n6515N6770O3323j6896o9239
$$ plain form
33912 469594 457447 449179 434927 393991 353755 348919 358691 349152 339720 361170 383856 355564
33900 355564 280178 197391 119557 50590 25480 59161 96022 88691 88449 168682 290857 345270
33888 345270 304875 238009 183479 122894 71760 75056 96554 40506 -77610 -111635 -3692
33877 -3692 99534 50364 -79101 -105736 2243 112780 148990 172939 238934 300696 315448
33866 315448 328216 376693 396490 315469 192526 160817 243964 319291 281565 172461 111653
33855 111653 147688 222413 258776 237762 188472 138471 95048 63399 57942 82065 107030 94548
33843 94548 46971 14096 33530 80269 97664 67953 26212 7557 6052 -8058 -44284 -67657
33831 -67657 -16959 132573 310177 385176 301772 158029 101514 158284 221607 204711 135472
33820A35472m9938q996J7237M3275P2359P7822N1634J2951k7018n8722n5870j9761
33808A90445n069l1908k3436P3497J62097J20825J0193q710O0261N8164m0927
33797E65432p0269L5535J08320K8400o4913j0467J02079R9142K5266M8099J51888
33786A018512J68062P0626M992K4395K0908n1673r4110n6469k8675o1267o5041
33775I50260J6696Q4459M3314l2581j9238N9270P6591K02o7810l4639P0945J32894
33763A280363O7499p8908j56044p5940O2821R1110n386q3747o7697l7347n9227
33752I37497p5441m0468k9538r8914j56324j05309k4032m6770j32730j19864J6329
33741A24436J20320Q5635j2712n1950j8444J6624K302n1750q9931m9259O9614
$$ plain form
33820 135472 85534 76538 93775 137050 209409 287231 338865 351816 324798 266076 210206 190445
33808 190445 185376 153468 130032 203529 365626 486451 496644 487934 548195 606359 565432
33797 565432 495163 530698 639018 667418 602505 592038 694117 793259 818525 866624 1018512
33786 1018512 1186574 1257200 1262192 1286587 1307495 1255822 1161712 1105243 1076568 1015301 950260
33775 950260 966956 1051415 1094729 1062148 1042910 1102180 1178771 1178973 1111163 1076524 1147469 1280363
33763 1280363 1347862 1268954 1112910 1036970 1099791 1190901 1185515 1101768 1034071 996724 937497
33752 937497 862056 821588 792050 693136 536812 431503 407471 360701 227971 108107 124436
33741 124436 244756 330391 317679 265729 247285 263909 266211 214461 124530 75271 144885
33730A44885J69709J50602K9971q3480j25089j15929q7116m6762j7926k1677j7842
33719b0654M8866J36518J36672L6246n2232n4267k5399l3139m8889k5186Q151
33708A06687N445r212J267R537j3169k0138K9893P3477L4890k8667l395Q4227
33696B70842R1516r829p6178j5826O5178L0629p7394j12649m1871L5340N5225
33685B14983N6282P0460O0018M847l4261l309M9232L4328m8657j12630j04273
33674A87020o1126l7762l3199k0774n164o873j5310j491L3894O4373Q1145R1143
33662B75876P7951J7136o1513q4442l4093J2906j2452p5084r1170m3492J9552
33651A175P1475J16821J23347L7627j04098j62738n5224J20010J82852Q0902n7593
$$ plain form
33730 144885 314594 465196 495167 411687 286598 170669 83553 36791 18865 -2812 -20654
33719 -20654 28212 164730 301402 337648 285416 231149 205750 172611 123722 98536 106687
33708 106687 112132 102920 104187 113724 100555 80417 110310 183787 218677 190010 186615 270842
33696 270842 362358 352529 276351 260525 325703 356332 278938 166289 124418 159758 214983
33685 214983 271265 341725 401743 406590 372329 369020 418252 452580 403923 291293 187020
33674 187020 125894 88132 54933 34159 28995 22122 6812 5321 39215 103588 184733 275876
33662 275876 353827 370963 309450 225008 190915 203821 191369 116285 25115 -18377 1175
33651 1175 72650 189471 312818 350445 246347 83609 28385 148395 331247 412149 354556
33640C54556q4128J987P1766L4705m9260n4065L1626P3198k0133j37701r7203
33629A25348Q8898K01716J04462p6649j37101o0570R870l26l0004j9311J3349
33618B19682M0446O3496O0775p609j12850j61147j18078n2480k4099q129K7383
33607g2610N0756L1355O610K0393M9504N2223L8557L0190J952o6278j22761j05037
33595h5146l6764R202J7759K8320M7538M3622J8464J2275L5891N7951N5905K7262
33583B32279l4115j11679j35743n4760P2334J34067J13205Q9957R4207N4915o6014
33572C88653j77268j61423k8776Q8732Q1322k8155j07242m8893R6978J55400L7984
33561B97312j17079j06317O0074J61003O0728j23411j97500j19415J8788J31668
$$ plain form
33640 354556 270428 272415 344181 378886 329626 275561 307187 380385 360252 222551 125348
33629 125348 214246 415962 520424 443775 306674 246104 255974 255648 225644 206333 219682
33618 219682 260128 323624 384399 376790 263940 102793 -15285 -67765 -91864 -99993 -72610
33607 -72610 -21854 9501 16111 36504 86008 138231 176788 206978 208930 142652 19891 -85146
33595 -85146 -121910 -112708 -94949 -66629 -19091 24531 42995 55270 91161 149112 205017 232279
33583 232279 198164 86485 -49258 -104018 -31684 102383 215588 305545 399752 454667 388653
33572 388653 211385 49962 21186 109918 191240 163085 55843 6950 103928 259328 297312
33561 297312 180233 73916 133990 294993 355721 232310 34810 -84605 -65817 65851
33551F5851J73403J16823L574m5320L1094J30265J14480k061r0023q9237n3530
33540C55319l5779k9419j7057O551N0642R6455P6665l1209j25221r3411J7792
33529B71328O0817k679o8523o4563l2320j8469q076L611j3226m1643k0599M0611
33517A06269O4484N0332Q4464J62951J55405J9603r9748q9266l7066n5437p5806
33506B86185R627J18002R1794k5498m3869O9547J50528J09359M2238L1001J6858
33495H55772n4163j15757j00557n3826m3294n4289m8695l8503l5256j3695J6601
33484C14338k518o2428o4012K1016P4983Q561r4473j09109n0018p691P991L5260
33472G1900M8552J3831q686M3167R5768M3725n7775p0046o603r626r8159j31899
$$ plain form
33551 65851 239254 356077 359651 314331 345425 475690 590170 588109 498086 408849 355319
33540 355319 319540 290121 273064 279615 330257 426712 503377 472168 346947 253536 271328
33529 271328 332145 329466 260943 196380 164060 145591 137515 141126 127900 86257 65658 106269
33517 106269 170753 221085 305549 468500 623905 643508 543760 454494 417428 361991 286185
33506 286185 295812 413814 505608 480110 436241 505788 656316 765675 807913 838914 855772
33495 855772 801609 685852 585295 531469 488175 433886 385191 346688 311432 297737 314338
33484 314338 311820 249392 185380 206396 281379 289940 195467 86358 36340 28649 36640 71900
33472 71900 120452 134283 125597 168764 264532 308257 250482 180436 173833 164207 66048 -65851
33460f5851n4022J7008l513l7783n376M3460M8807N5170R7747J00373O351r5813
33448A06558j01521n2513m3972n4836r844N7229N0333k0966n9072l3232J2962
33437a48874P5477J70833K27567J50891l569p2592j9712K1988k7364q2474o2114
33426B30057k3284l8059o1875l2732j843m4920j14501j04884k1357L3008J7267
33415a63123j0874j3164k0473m6570m1980K6615J10424J32456P3655k0426q9484
33404f2944r3460k7360O7466J19281Q2864j2399q3570p1750L488O9911P5083K2600
33392H9210n1446j05102r2993N276J27897J54611M5743q3288r9239k5809J5094
33381b0046P010M7672J43365J53452J3781j25469j03965J2685M4115k8826n8572
$$ plain form
33460 -65851 -119873 -102865 -106378 -144161 -149537 -106077 -57270 -2100 95647 196020 202371 106558
33448 106558 5037 -47476 -91448 -146284 -156128 -98899 -48566 -69532 -128604 -161836 -148874
33437 -148874 -73397 97436 325003 475894 472325 399733 380021 402009 374645 292171 230057
33426 230057 206773 168714 106839 74107 72264 27344 -87157 -192041 -213398 -180390 -163123
33415 -163123 -173997 -187161 -207634 -254204 -296184 -269569 -159145 -26689 46966 26540 -62944
33404 -62944 -156404 -183764 -116298 2983 85847 73448 -10122 -81872 -78384 -8473 66610 89210
33392 89210 37764 -67338 -160331 -155055 -27158 127453 173196 89908 -9331 -35140 -20046
33381 -20046 -13036 34636 178001 331453 345234 219765 115800 128485 172600 143774 85202
33370H5202K9807J55383K44098L18883L80659L34291J20014j62479l43892l57582
33360H04384k68858j73995j20934j01778q0969m1078j1345k5408n5066l7922K3336
33349h9633N3450J5893l5169m4800l0793k3914k035N4910R8869P4683J1270j8320
33337F4411l565L915j8844m1359l9863k3999l185K3886M4698M0489J8562J287
33325F6433r889k3505k6193o051P702j9141o1027o1944k3556j429j2692j4369
33313a85661J6276M7923N9266O7875P0109K5611n7627r3634l1897N6910P4218
33302D9369K5858j0081r213j3870m0920n8061m8667k8840J015N3793J01959R4989
33290A17331L8213j3066m3178q0888j04996m7194P0561J09269K425j18741r5836
$$ plain form
33370 85202 115009 270392 514490 833373 1214032 1548323 1668337 1505858 1161966 804384
33360 804384 535526 361531 240597 138819 57850 16772 5427 -19981 -75047 -112969 -89633
33349 -89633 -36183 -20290 -55459 -100259 -131052 -154966 -157001 -102091 -3222 71461 82731 64411
33337 64411 60846 64761 45917 4558 -35305 -59304 -62489 -38603 6095 46584 65146 66433
33325 66433 56544 33039 6846 795 8497 -10644 -71671 -133615 -157171 -158600 -171292 -185661
33313 -185661 -169385 -121462 -62196 5679 75788 101399 43772 -49862 -81759 -24849 49369
33302 49369 75227 65146 55933 42063 1143 -56918 -105585 -134425 -133410 -79617 22342 117331
33290 117331 155544 142478 99300 18412 -86584 -133778 -63217 46052 48477 -70264 -166100
33279a66100K9932R0646M8932K9526R1888J32130O9451r277P945P1850N0979o0668
33267C87234j41226j24171o5751k6347M672L8323L8566n559l6251j1957K2418
33256G9951Q434l1153l3176P869M7164O5464O9997M4231k4492p9004m3828M6639
33244A58096O3649l6049j31849j01091J2744P4591M7322P567q53j5788m8216l6594
33232f471L9697R1423M1416m5797m8718K8261N7232k4884j26464j36398o9937
33221b00640j6314M785M8238J18849J31639L2896r5378j09846K6653J92807K30367
33210C64056R8331r4662j95133j42806j9743L9376m241n2313l960R3503R3884
33199A76292m0057j59258j13885M5803J38092Q5547j7623o8804p6903q4830p5235
$$ plain form
33279 -166100 -136168 -45522 3410 32936 124824 256954 326405 317128 325073 396923 447902 387234
33267 387234 246008 121837 56086 29739 34411 72734 111300 105741 69490 57533 79951
33256 79951 88385 57232 24056 31925 79089 144553 214550 258781 234289 155285 111457 158096
33244 158096 221745 185696 53847 -47244 -34500 40091 87413 94980 94127 78339 30123 -6471
33232 -6471 33226 124649 166065 120268 71550 99811 157043 132159 5695 -130703 -200640
33221 -200640 -216954 -212169 -163931 -45082 86557 119453 24075 -85771 -59118 133689 364056
33210 364056 462387 367725 172592 29786 10043 49419 45178 -7135 -11095 82408 176292
33199 176292 136235 -23023 -136908 -91105 46987 132534 114911 46107 -30796 -115626 -190861
33188a90861k5447J7720N509j7691K1889R5844J00255Q687r0555j20442r5134
33177b90226n1705J5126J03767J56577J22794L7166j7774j0438J9372K5642O710
33166A17011n174J5494N2553N1384j8708j01647r7546Q295J04806Q5700j4744
33155A97424p1388l2436L0253L5277q109m0320m2657m1167m0942j1334M9970Q0674
33143A05245K4999p0800q8065J7085J41132J53118N6735k9133l7814k5255n8216
33132A89031j10059j14807o8659j9240J0753L1108L8131J8296j2010k1028j3420
33121g1904k3256n2950n9266j1647O1639R7349N8165k7491q1455m9005L3531P0355
33109e5935K3217l6365k2939M7030Q0502L0643n2484q8897n0017K4224O4339L6620
$$ plain form
33188 -190861 -216308 -198588 -193079 -210770 -188881 -93037 7218 15905 -74650 -195092 -290226
33177 -290226 -341931 -326805 -223038 -66461 56333 93499 75725 65287 84659 110301 117011
33166 117011 111837 127331 179884 231268 212560 110913 13367 21662 126468 212168 197424
33155 197424 126036 93600 123853 159130 151021 110701 68044 26877 -14065 -25399 24571 105245
33143 105245 130244 59444 -28621 -11536 129596 282714 339449 310316 272502 247247 189031
33132 189031 78972 -35835 -104494 -123734 -112981 -81873 -43742 -25446 -37456 -58484 -71904
33121 -71904 -95160 -148110 -207376 -219023 -157384 -60035 -1870 -29361 -110816 -159821 -126290 -55935
33109 -55935 -32718 -69083 -92022 -44992 35510 66153 13669 -75228 -125245 -101021 -36682 -62
33097f2j3417p203N8312R1242L0984n6133o8459j3798J7349l207j5159J4335L8870
33084G3654J5514l5476p7447j00687r7378n2787J5643O3518Q0773R3245R3013
33073G1585L7466n8067j00671l7578O2392R1355K6209o3912r4896k9569Q9736
33062e950J50953P4343p2134j30952o0190N895m4656j35701j24853j6060O3671
33051b95634N6588K3137J2782K504k2221k5806N442K6766N690k9716m2072l1128
33039c13668m326M4416R5626R5427K6377n1284o9631l5209l241M494J2357L4627
33027a64035M9827L4732m979m4290o0582m4264o501K0996J3847j0070l994M4491
33015a74822Q3196N6291j4646m9302j4047L4477L5405J0593J8593N1556M3924
$$ plain form
33097 -62 -13479 -20682 37630 128872 159856 103723 35264 21466 38815 35608 20449 34784 73654
33084 73654 89168 53692 -23755 -124442 -221820 -274607 -258964 -195446 -114673 -21428 71585
33073 71585 109051 50984 -49687 -87265 -24873 66482 92691 28779 -66117 -95686 -5950
33062 -5950 145003 219346 147212 16260 -43930 -38035 -82691 -218392 -343245 -359305 -295634
33051 -295634 -239046 -215909 -203127 -200623 -222844 -248650 -243208 -216442 -210752 -240468 -282540 -313668
33039 -313668 -317994 -273578 -177952 -82525 -56148 -107432 -177063 -212272 -215513 -211019 -198662 -164035
33027 -164035 -114208 -79476 -84455 -128745 -189327 -233591 -240092 -219096 -205249 -215319 -219313 -174822
33015 -174822 -91626 -35335 -49981 -99283 -113330 -78853 -43448 -32855 -14262 37294 81218
33004H1218j9212o8748m6353K0635O7720P4130O1865M6128K2516j3108n6179r2630
32992G7982r8125o1027j1078P360l298J019L3018N6995N7174O0622O6053J9564
32980B06259r0276j74218j41787j6867J00261J44060J06523N725r8803j12795
32970g1918j5985P5440M5730n5934q8337k5213L1660L6393N7345J22269J39004
32959B50454M0867r0040j29538p1648k402L0814M1398L4572J719l2211k8675P5
32947D5385N594j9184l1728j1612J3615K4337L7049N3969L5875l1800q3668m6867
32935i035M3304P0118n778q3367o2524J3875L5733m91j783M6784M3864n3356j35958
32922i8614j01557o257M0228M6138Q0690J10428M4492q0197j17589l3617L8756
$$ plain form
33004 81218 62006 -6742 -53095 -32460 35260 109390 171255 217383 239899 226791 170612 77982
32992 77982 -20143 -81170 -92248 -84888 -88186 -87167 -54149 2846 60020 120642 186695 206259
32980 206259 115983 -58235 -200022 -216889 -116628 27432 133955 139680 40877 -71918
32970 -71918 -87903 -12463 33267 -22667 -111004 -136217 -104557 -68164 -10819 111450 250454
32959 250454 291321 201281 71743 95 -2307 28507 69905 104477 106196 73985 45310 45385
32947 45385 50979 31795 67 -11545 2070 26407 63456 117425 153300 121500 37832 -9035
32935 -9035 34269 104387 98609 15242 -47282 -33407 2326 1835 52 46836 90700 37344 -98614
32922 -98614 -200171 -206428 -166200 -120062 -39372 71056 115548 35351 -82238 -115855 -77099
32911g7099J0444l4183O530Q1810P7545k046n0488j8068L9511N5725K0952l8931
32899G1702r0648r8213m6078L5285R4561J08918R0326N6373J9294o660j2426p935
32887B14499j4733m3584p9376q5017l3841M6350Q3856N1421K1812Q2788K07351
32876D51526K73627K21415J24325Q3596J07547J29081R8025K0167o4593j12018
32866A332698j00134m5827J2471M4497K9716l9949j24100j40593o6175R690O498
32855I18792j7860L6379J27063J25058L8221J2929Q8171J24252L9024n7446n9798
32844A374785l6939p8745j19470o9695n147m7826j45608j54019p9779n5994j05337
32833D76226j15234n0169j1513n4270r8032p0126j2016J0869M663K884P239J0280
$$ plain form
32911 -77099 -66655 -100838 -94308 -12498 65047 63001 12513 -5555 33956 89681 110633 71702
32899 71702 -18946 -117159 -163237 -127952 -33391 75527 165853 222226 241520 234860 222434 214499
32887 214499 199766 156182 76806 -8211 -42052 4298 88154 139575 161387 244175 451526
32876 451526 725153 946568 1070893 1154489 1262036 1391117 1489142 1509309 1444716 1332698
32866 1332698 1232564 1186737 1199208 1243705 1273421 1233472 1109372 968779 902604 912294 918792
32855 918792 900932 937311 1064374 1189432 1227653 1240582 1328753 1453005 1492029 1434583 1374785
32844 1374785 1337846 1259101 1139631 1069936 1064789 1016963 871355 717336 637557 581563 476226
32833 476226 360992 310823 299310 245040 147008 76882 64866 75735 80398 83282 90521 100801
32821A00801J1028q778n5412p0844K517J03219J00446j9320j18566r2436J1550
32810c5795R3166J19683R6990J6696r5040j47408q5500J8062M1868l2266j00631
32799a10175o8563L6760R9211N2421l6379n3151M447K7870k3441m5578L7753J29251
32787E0426R9714q665o4853o6082r8664j30213m9521R2073J05303k7858r3044
32776a91384K1604J40838Q2536o1288q7911J2104R0118Q0422L7777K492k0817
32765A06491l890N0794N1068n7338j59788j09443N0765J48261J29278R3730R4814
32754C94742O2982m2676j40913j39647n4180K7968M2961q002o5733n9826J0831
32743B8507O3185L7496k1281m4083m1179m8122l4209K9759P0517R513p8652n1528
$$ plain form
32821 100801 111829 103051 47639 -23205 -20688 82531 182977 163657 45091 -47345 -35795
32810 -35795 57371 177054 274044 290740 195700 48292 -37208 -19146 22722 -9544 -110175
32799 -110175 -178738 -141978 -42767 9654 -26725 -79876 -75429 -47559 -71000 -116578 -78825 50426
32787 50426 150140 141475 76622 10540 -88124 -218337 -267858 -175785 -70482 -98340 -191384
32776 -191384 -169780 -28942 53594 -7694 -95605 -83501 6617 87039 124816 127308 106491
32765 106491 102601 153395 204463 147125 -12663 -122106 -71341 76920 206198 299928 394742
32754 394742 457724 415048 274135 134488 80308 108276 151237 143235 77502 17676 28507
32743 28507 91692 129188 107907 63824 22645 -25477 -59686 -29927 40590 50103 -28549 -80077
32731h0077P1970J21173K6441q5844q9865j8976K8333K8081J1095p245j5162Q979
32719a097M9834N4893J4638j8298j2685N818J8610L6496M1942m966q1129j09062
32707e006p3853l9199k6095J6846R0702J14534O9081N1509J14420J64340J09047
32696E86326K427n6929p6549j08925j25021p5261j2547k1853o8829m8819L6101
32685C0121P4494J6665o2816q3153m5521Q720N0901O6152O2019P2924J03690R3342
32673C87538N43j07520j31900p6466j5917L5545J10232J65026J10004l0633j19423
32662C27029r8324n4592n4289m4523J0991L2520l4809r0315j9461J08489J27587
32651B10303J9546p4486p7152o2123q8576q8667J257J00335Q3766k7187q6119
$$ plain form
32731 -80077 -8107 113066 139507 53663 -36202 -55178 -26845 1236 12331 5086 -10076 -1097
32719 -1097 48737 103630 118268 99970 87285 93103 111713 148209 190151 185185 104056 -5006
32707 -5006 -78859 -118058 -144153 -127307 -36605 77929 147010 198519 312939 477279 586326
32696 586326 588753 531824 455275 346350 221329 146068 133521 111668 42839 -5980 30121
32685 30121 104615 121280 58464 -24689 -70210 -61490 -10589 55563 117582 190506 294196 387538
32673 387538 388081 280561 148661 72195 56278 91823 202055 367081 477085 446452 327029
32662 327029 228705 174113 119824 75301 86292 118812 84003 -6312 -25773 82716 210303
32651 210303 229849 155363 78211 16088 -72488 -161155 -159898 -59563 24203 -2984 -89103
32640h9103k3234P2824R5553N5489K4037J0665k4188o6341n0168K7935P9897M5658
32628A59024k0850l4990k228N851l3183o6984n0749q82L6699L4419J924j5616
32616A2435K3183Q6980P9044l2791j34815r9579K6369P2866j4007r8728n9280
32605a38323M6376Q5081L3912k4005l2817q387J8489L1526K0427m273j0003N014
32593B3017l540m6359n9868n617M7488K2071l6196k6192M2854O6481J4303l3883
32581D559l2338l2364o6159p5690j5318O1157Q1397N4721K8153K618l8507o6320
32569i4091m4101M602L0099L0828L2992K4929k0537p8001r4650p3779o0801m6899
32557c89409L0281J62168K22606J10681r6697k07083j30032K4774R2131M7064
$$ plain form
32640 -89103 -112337 -39513 56040 111529 135566 146231 122043 55702 5534 33469 113366 159024
32628 159024 138174 103184 100956 106807 73624 6640 -44109 -44991 -8292 26127 28051 12435
32616 12435 35618 122598 201642 168851 34036 -65543 -39174 33692 19685 -79043 -138323
32605 -138323 -91947 -6866 27046 3041 -29776 -38163 -19674 11852 32279 28006 18003 23017
32593 23017 19477 -26882 -86750 -92367 -44879 -22808 -59004 -85196 -42342 24139 38442 4559
32581 4559 -27779 -60143 -126302 -201992 -217310 -156153 -74756 -20035 8118 10736 -27771 -94091
32569 -94091 -138192 -133590 -103491 -72663 -39671 -14742 -35279 -113280 -207930 -281709 -342510 -389409
32557 -389409 -359128 -196960 25646 136327 39630 -167453 -297485 -272711 -180580 -133516
32547a33516O44K1150M3805p063q2736q0066n465L6052R823m841L2270M3755k2893
32534a49081p8647k2233Q6734J03859R469p7062p4918j8767L7610P8329P4666
32523c0041m012r6170p9533M9540J32650N8932p2554r3186R42O4374J7588o3527
32511a14997p7293k6005J2474j2576p9361j21804q7564J2973J10302J42267J12968
32500a28616P2236M9872L1808o632o3104j01107p6665J0637R1606Q5277m357q4909
32488a23954q5638l0807J6898L5249L0871L768k6360r094N8549Q9025J5307r2309
32476a18495j08933k9696L5954L2709J3087J4306pl4622j2733R2654J65938Q8378
32464A38540p8846j54622o8347O0031Q4108K941o7728n3298P45P758l9644o5315
$$ plain form
32547 -133516 -132872 -111722 -67917 -74980 -157716 -237782 -243247 -207195 -197372 -202213 -169943 -126188 -149081
32534 -149081 -227728 -249961 -163227 -59368 -49899 -126961 -201879 -220646 -183036 -104707 -30041
32523 -30041 -34053 -130223 -209756 -160216 -27566 31366 -41188 -134374 -133432 -69058 -51470 -114997
32511 -114997 -192290 -218295 -205821 -218397 -297758 -419562 -507126 -494153 -383851 -241584 -128616
32500 -128616 -56380 -6508 25300 18668 -44436 -145543 -222208 -211571 -119965 -34688 -39045 -123954
32488 -123954 -209592 -240399 -223501 -188252 -157381 -153613 -179973 -189067 -130518 -41493 -26186 -118495
32476 -118495 -227428 -257124 -221170 -188461 -175374 -161068 -161075 -195697 -208430 -115776 50162 138540
32464 138540 59694 -94928 -163275 -103244 -19136 -16195 -83923 -137221 -136476 -128718 -168362 -233677
32452b33677k5194K2389K518n8329o9852j6875K5936K4042K8593N9845N1249k4105
32440b13460p0912j2494O8719N2790j8784j1193P0459Q1254k0446r6298m8197
32429b18562L2603K1862n4071r4038q4091p0795m9203K985L7117K035m2613r011
32417e25782N4656K2318r7934j59177j03246m5829q3383j51462j55661j28950
32407a374450j56208k25315k60124k44541k10915j44515L03K06155L95286N11118
32397a503206N32852M41660K54511P1478K332M4815R9980R8570M9634j6011p4253
32386B362r0858n0949J563J9143K3724N2710P0345L2418J509O5245J56264J11359
32374C94835o9899j87894j19269K0865P1021L6782J1765R477o157j8244l994p115
$$ plain form
32452 -233677 -258871 -236482 -233964 -292293 -362145 -379020 -353084 -329042 -300449 -240604 -189355 -213460
32440 -213460 -284372 -296866 -228147 -175357 -194141 -205334 -134875 -53621 -74067 -170365 -218562
32429 -218562 -185959 -164097 -218168 -312206 -396297 -467092 -516295 -513310 -476193 -474158 -516771 -525782
32417 -525782 -471126 -448808 -546742 -705919 -809165 -854994 -938377 -1089839 -1245500 -1374450
32407 -1374450 -1530658 -1755973 -2016097 -2260638 -2471553 -2616068 -2615765 -2409610 -2014324 -1503206
32397 -1503206 -970354 -528694 -274183 -202705 -200373 -155558 -55578 42992 92626 76615 2362
32386 2362 -88496 -139445 -137882 -118739 -95015 -42305 28040 60458 61967 127212 283476 394835
32374 394835 324936 137042 17773 38638 109659 146441 158206 167683 161526 143282 139288 132173
32362A32173n6050q7261n3975k3705n1578n2152N8113J76184J42101m236p7997
32351A01617k9467J6495q151l2850j6861j6956m3430j6669P2223J10002L9906
32340A75859m6589o7536o3529p3777l8872O6621J28537M9715p8631r5751m31O5689
32328B1305K5663n8835j02768q4494j9183O9837J39175J39826O1929n0019j20762
32317B1674r1170J5783Q1943J7732r8222r9231L1058J23404P7110Q469M3875R9140
32305B31565K3487j27776j56314k6960P8864L9094m7982m3276K9675N7654K2206
32294H0237j042J4665J2796l4339o8318l9237N740k834k7645L0191J45454J49314
32282B64982k6629j95893j45908N0298J30606K4600p1273k5037M8356K3816k8306
$$ plain form
32362 132173 76123 -11138 -65113 -88818 -140396 -192548 -134435 41749 183850 179614 101617
32351 101617 72150 88645 80494 47644 30783 13827 -29603 -46272 25951 135953 175859
32340 175859 129270 61734 -1795 -75572 -114444 -47823 80714 130429 51798 -43953 -44384 21305
32328 21305 46968 -11867 -114635 -199129 -218312 -148475 -9300 130526 192455 142436 21674
32317 21674 -69496 -53713 28230 45962 -52260 -151491 -120433 2971 80081 88550 132425 231565
32305 231565 255052 127276 -29038 -55998 22866 61960 13978 -29298 377 58031 80237
32294 80237 79195 93860 106656 72317 3999 -35238 -29498 -32332 -59977 -29786 115668 264982
32282 264982 238353 42460 -103448 -53150 77456 102056 30783 5746 54102 77918 49612
32271D9612j2949J625n8001q7593J2671J10350L3786j09362p5471J05539J51612
32260A21819k8307j91952j39443J4215O3550J2941K187O5835J16303R5599L1281
32249A64028j9574j8399K3246L4492l2844j09911q7998Q845M6682p730l7422K2856
32237a3729P9111M2633k9452m7275k9683l5483m6970k1156J7242K6450L1077P3318
32225D6083J30492J47172J05938K4083o4259r7070l4464N4026M8144m7679j00381
32214B12085n5403j3167m3037p0458l4689q061m4416n1120M8609J49737J17229
32203B07309L714m2128j583L3575L0572J3141l6251j15086j17201J8551J44842
32192A39455Q0607r9613j50850r007J41664J50760O0796l0793q8440q9265k0361
$$ plain form
32271 49612 36663 38288 -19713 -107306 -94635 15715 49501 -59861 -135332 -29793 121819
32260 121819 93512 -98440 -237883 -223668 -160118 -147177 -144990 -79155 37148 132747 164028
32249 164028 144454 126055 149301 183793 150949 41038 -46960 -38115 8567 837 -36585 -13729
32237 -13729 65382 108015 78563 31288 1605 -33878 -80848 -102004 -84762 -58312 -27235 46083
32225 46083 176575 323747 429685 453768 389509 292439 257975 312001 360145 312466 212085
32214 212085 156682 143515 100478 30020 -4669 -12730 -57146 -108266 -59657 90080 207309
32203 207309 211023 168895 167312 200887 231459 244600 208349 93263 -23938 -5387 139455
32192 139455 220062 120449 -30401 -39408 102256 253016 313812 283019 194579 105314 84953
32181H4953M6496K5786k6702J0141R3736O1438p6201j09911L1256J40457M9623
32170C31072j10553j21783O087J00496R2808M7455J875n7741j01290p7762j7231
32159I3433N67l2838n2378k2118L2620P7047R1375O7091K5203N808O732j5289
32147B77253n3014l7535L6207O7821M768o1029m2014l805m5568j15464r2757p7
32135f5214K7440l3942o2821N436R1354J20024J19501J15548N6758o9368j48935
32124A55781q1891N1970Q3798j2403r1815n1331L7686N7866J9357J6485N8728
32113B44231N7224j6546p0954m0541O455j2213m7225l847Q1957Q7606P82o8368
32101B18561p1001o8098p7010l1689N3485M8099p6925j53779n9436Q8757J22015
$$ plain form
32181 84953 131449 157235 130533 140674 234410 295848 219647 109736 140992 281449 331072
32170 331072 220519 98736 104823 205319 298127 345582 347457 289716 188426 110664 93433
32159 93433 94000 61162 8784 -13334 19286 96333 187708 254799 280002 285810 292542 277253
32147 277253 224239 186704 222911 290732 295500 234471 192457 188652 143084 27620 -65137 -65214
32135 -65214 -37774 -71716 -134537 -129101 -37747 82277 201778 317326 374084 304716 155781
32124 155781 73890 125860 209658 197255 105440 54109 91795 149661 169018 185503 244231
32113 244231 301455 284909 213955 173414 179869 167656 120431 116584 198541 286147 286929 218561
32101 218561 147560 79462 2452 -29237 24248 72347 -4578 -158357 -217793 -129036 -7021
32090g021P4028P3277R3369K0089j01630j13578j5547K8964l0426o2564l628L5254
32078i413j4532m9388Q558N5363j2722r9688n4845P8252J27992N8489L550M6138
32066A37754J06388P7450k9542j17082j17817m9243J6451K5814O75N030M5479
32055A01357N2329q832o7496m7819J7458M6423L2650K2801J1660l3593o9145j6910
32043D0883Q7081J11807K4304n9888o3495n5909r8157j05763J0070J56448J66704
32032B14085M7931l5759j5528O510m2025q4333m2309K9290M8325L6476M0857J9264
32020B22784p1157j44208q7538M7493J07168O6225M2673Q0308Q2481K101o4172
32009B84158m6300k1113o2159r4721k4358Q8224J18040P1557N0484O6647L8351
$$ plain form
32090 -7021 67007 140284 233653 253742 152112 38534 22987 51951 21525 -41039 -44667 -9413
32078 -9413 -23945 -73333 -64775 -9412 -22134 -121822 -176667 -98415 29577 88066 91616 137754
32066 137754 244142 321592 292050 174968 57151 7908 24359 50173 50848 55878 101357
32055 101357 153686 144854 77358 29539 46997 93420 126070 148871 160531 126938 57793 40883
32043 40883 127964 239771 264075 204187 140692 84783 -13374 -119137 -109067 47381 214085
32032 214085 262016 226257 210729 217239 175214 90881 48572 77862 126187 162663 203520 222784
32020 222784 151627 7419 -80119 -32626 74542 140767 183440 263748 346229 348330 284158
32009 284158 237858 216745 154586 59865 35507 123731 241771 313328 363812 430459 468810
31998D68810m4777r0484m9416J8322M0780J2127l5561o2603k9082N1370Q4298
31987C63784J0734p6708m7256O0851Q7924Q162k5234O7480J56937J07504j9693
31976F94485p8224m9038k0319k3957j2981L1618P1760P7685N6890L5696N1600
31965H35215J20867J76270J06422q4454k30334j95556m6381N6364O8240N7377
31955H64030M7445k105p8581j06621o6297j8742l403n24l436l5803q2499r1135
31943D22329o1762n2492p4955o6464N432Q6114J12307P9556O797r2017j69962
31932A94883j58774o4489J4282R238l9080p0395r9121j52351j77904j06654K3019
31921f27346R3186N7194j0063k3081J2967L4924J4692j0437J2092Q3875J39431
$$ plain form
31998 468810 424033 333549 284133 302455 343235 355362 319801 257198 228116 279486 363784
31987 363784 374518 297810 250554 311405 399329 407491 382257 449737 606674 714178 694485
31976 694485 616261 567223 546904 522947 509966 541584 613344 691029 747919 783615 835215
31965 835215 956082 1132352 1238774 1154320 923986 728430 682049 738413 806653 864030
31955 864030 911475 909370 830789 724168 657871 639129 635726 635202 631766 595963 513464 422329
31943 422329 360567 308075 233120 166656 172088 258202 370509 450065 456862 364845 194883
31932 194883 36109 -28380 -14098 -4860 -43940 -114335 -213456 -365807 -543711 -650365 -627346
31921 -627346 -534160 -476966 -487029 -510110 -497143 -462219 -447527 -457964 -445872 -361997 -222566
31910b22566J05156j5193j27949j42516o7115J0528K9163J0630P901K8910L6996
31899c46055J5389j025K5197P1319P3421J3147m7752m2915J3229M9660L3625O18
31887a42142q346K010N140l720p932J479J1339j265l9917p0824n2895K823L3299
31874b70951P724k3704n143L7967M5305K2037J6498K0522j3726o2225m2278M1629
31862b26345P5940R680n6498k4653M9351N2604p869l2757P969M9314M7669K4058
31850c1537l332l9427o2378l7582Q817R211l7660n5434j0816K9613L121n1475
31838b78879n2260J1446P6474R5292Q0638O5338N2873J9094m6139j07072j05019
31827a88214k6396O5056Q9427L7433l0317o2293n8055l4282N256M9617O7772M4181
$$ plain form
31910 -222566 -117410 -132603 -260552 -403068 -470183 -459655 -430492 -419862 -411961 -383051 -346055
31899 -346055 -330666 -331691 -306494 -235175 -161754 -148607 -196359 -239274 -226045 -176385 -142760 -142142
31887 -142142 -150488 -148478 -143338 -147058 -154990 -153511 -142172 -143437 -183354 -254178 -307073 -304250 -270951
31874 -270951 -263227 -286931 -292074 -254107 -208802 -186765 -170267 -149745 -163471 -225696 -267974 -226345
31862 -226345 -150405 -140725 -197223 -221876 -172525 -119921 -127790 -160547 -152578 -103264 -55595 -31537
31850 -31537 -34869 -74296 -136674 -174256 -165439 -156228 -193888 -249322 -260138 -230525 -227404 -278879
31838 -278879 -331139 -319693 -243219 -147927 -67289 -1951 50922 70016 23877 -83195 -188214
31827 -188214 -214610 -149554 -60127 -22694 -53011 -115304 -173359 -207641 -202385 -152768 -84996 -40815
31815d0815R334R527M8225P1264K0536r0327j64983j22092q464L6437m1204j25317
31803c97879q4985L9036R7212N2077J6659N9548R5456L0541q0064j07364k4134
31792c03897P8651J19127R5016M5852Q824L973J5202l238o2724j04132o8638J9760
31780a56224Q9457J11511J00330N5418k3655q2741o0687N481J0531o3008j05713
31769a19300l9846O2118Q1697J7131l6191l1403j1296j2595r553K7356P4196Q4447
31757H6761M3919k3848p8315p7324q721P3507Q1553n828j02725j12694m6813l470
31745a73998l8491j00822j06449l9366M2158P8261O3267L4135J9070P630k1759
31734b36364n3007m0704K0956P3805P1069M0527K5305J628o7105j21033n7587
$$ plain form
31815 -40815 -31481 -21954 26271 97535 118071 27744 -137239 -259331 -267795 -231358 -272562 -397879
31803 -397879 -482864 -443828 -346616 -294539 -277880 -218332 -122876 -92335 -172399 -279763 -303897
31792 -303897 -225246 -106119 -11103 34749 43573 47546 62748 59510 -3214 -107346 -175984 -156224
31780 -156224 -66767 44744 145074 200492 176837 94096 33409 38890 49421 -13587 -119300
31769 -119300 -159146 -97028 -15331 1800 -34391 -65794 -77090 -89685 -99238 -71882 2314 86761
31757 86761 130680 106832 28517 -48807 -57528 15979 97532 91704 -11021 -123715 -170528 -173998
31745 -173998 -212489 -313311 -419760 -459126 -416968 -338707 -275440 -241305 -222235 -214605 -236364
31734 -236364 -289371 -330075 -309119 -235314 -164245 -123718 -98413 -96785 -163890 -284923 -342510
31723c42510R3963J67156P6545o1352r4712l0850K4154L5934M0228L3130j3308
31712g1622o2698n9873l5301m6203m7666L7825J44023J18331l3102j25580o2226
31701b44092M0715N4899Q268k8026o6569j12647q9075K3406R8509N3983P033Q3634
31689a69962J87364J49070J9114j0377O7862O1338r7093k30177j85519l9573N5153
31678a92800P6897Q6090Q5375M1605j8274k7637L0639J04977J22614M7615o6646
31667B90455r9123o885P7860O744j46489j56688K4238J76695J17278o2929j62733
31656E8423j34694o0771J8134R9701J27401N3194m9549o9232k1984j3225o1374
31645e3976q3900m5036L325K7617M6503N1733M490o9450q2599j5382M5554L5099
$$ plain form
31723 -342510 -248547 -81391 -4846 -66198 -160910 -191760 -167606 -131672 -91444 -58314 -71622
31712 -71622 -134320 -194193 -229494 -275697 -323363 -285538 -141515 -23184 -56286 -181866 -244092
31701 -244092 -203377 -148478 -140210 -168236 -234805 -347452 -436527 -413121 -314612 -260629 -253596 -169962
31689 -169962 17402 166472 185586 175209 243071 304409 207316 -22861 -208380 -247953 -192800
31678 -192800 -115903 -29813 55562 97167 78893 51256 81895 186872 309486 357101 290455
31667 290455 191332 184447 262307 269051 122562 -34126 -9888 166807 284085 221156 58423
31656 58423 -76271 -137042 -118908 -19207 108194 161388 111839 42607 20623 7398 -53976
31645 -53976 -137876 -182912 -179587 -151970 -105467 -53734 -49244 -118694 -201293 -216675 -171121 -136022
31633a36022l844m503K4090L5213K8330L5212N3461N0138K1640L983J5498K0335
31621A43531k6360j03267j24967m4258O8519R5903K0968n3470m8252m440L97l1323
31609a07019m3232k0270O224J6482R831j2962k5249K1673J12216J41266N4321
31598A53281m4875l0405M9523M2085o6144j22075m1977O7208P7728J3774k3388
31587G4735j4215j6595n5054r2351q8734m1449J6305L5196K079k1082L2063J14893
31575e4209J05643p558p9071q907R9634Q5528l5330j04080n3947K0279L1025P735
31563F742j349k0941o6858o4432M2385J51710J03103q2604j90974r3153P3187
31552a43184R8446m304l8403P0042J65593J06271k9371p5554k0905P548m7862
$$ plain form
31633 -136022 -139866 -144369 -120279 -85066 -56736 -21524 31937 82075 103715 107698 123196 143531
31621 143531 117171 13904 -111063 -155321 -86802 9101 30069 -23401 -71653 -76093 -75696 -107019
31609 -107019 -150251 -170521 -164297 -147815 -137984 -150946 -176195 -154522 -42306 98960 153281
31598 153281 108406 78001 127524 169609 103465 -18610 -60587 6621 84349 98123 74735
31587 74735 60520 43925 -11129 -103480 -192214 -233663 -217358 -182162 -180083 -201165 -169102 -54209
31575 -54209 51434 43876 -35195 -44102 55532 141060 105730 1650 -52297 -32018 -993 6742
31563 6742 5393 -15548 -82406 -146838 -104453 47257 150360 67756 -123218 -216371 -143184
31552 -143184 -44738 -49042 -87445 -17403 148190 254461 225090 149536 128631 136179 88317
31541H8317j08766r4943k2509M5616P1895N3151J5141L367L0619M2872q697p8758
31529C7305p6805O791R1168J10554O1567l6861j48524j96888j29858j0439M5182
31518b46808K3358J5479O0678Q9340M5447l1554p6893o8298n631Q5917J19877
31507A0912K5944j12656j21344K3453J39799R1948k6300m8083L1806Q5364M3151
31496A43994m3830r3651p2508j4449L038n0479q8289j3772J04252R8639l2219
31485e9274r8096j4787O1248L373p1954j9924P6872O4373j1612r996L7833M1r0712
31472a32615q6106N533L2716k9789n3371J666L7467K7451N6269J21921J09114
31461I0256K536p3015o7562o1412o7212M020J23136J24141q316p0593K4899Q6348
$$ plain form
31541 88317 -20449 -115392 -137901 -92285 -20390 32761 47902 51269 81888 124760 116063 37305
31529 37305 -39500 -32709 58459 169013 230580 193719 45195 -151693 -281551 -291990 -246808
31518 -246808 -223450 -207971 -147293 -57953 -12506 -44060 -120953 -189251 -194882 -108965 10912
31507 10912 36856 -75800 -197144 -173691 -33892 58056 31756 -16327 15479 100843 143994
31496 143994 100164 6513 -65995 -80444 -77406 -127885 -216174 -229946 -125694 -27055 -59274
31485 -59274 -157370 -172157 -110909 -107536 -179490 -199414 -122542 -58169 -69781 -79777 -41944 -41903 -132615
31472 -132615 -218721 -213188 -180472 -210261 -263632 -261966 -224499 -197048 -140779 -18858 90256
31461 90256 92792 19777 -47785 -109197 -176409 -172389 -49253 74888 66572 -4021 20878 107226
31449A07226l0376j62060j07579M0557O7585j5589m3997j676K071k0288L1684
31438a32442J10181P1008m9429n8437O8109J25885J0488j14785q2108L3541N9900
31427D1911j6422p7098o4917k1446J3398L1524K0165j6625k5041L3091R9969P9926
31415I8435k4566r9777o0616M1536Q1276J0393q7045r9171j8996O1255P6683N3692
31403C3099L1637r154q3941j26163o4248M9541Q7728K7915j8488J2404L1478n5057
31391h3249j70409j48467L1444J94841J83684M3999m9065j1671O7891O3879l2199
31380I0678j20220j16504k8931P2959J19181Q0238n815m8167N301Q7561Q0396
31369B16677k5954j09712q3161o833J5014j6870k9928q050O630O824J5391O227
$$ plain form
31449 107226 76850 -85210 -192789 -152232 -84647 -100236 -144233 -145909 -143838 -164126 -132442
31438 -132442 -22261 48747 -682 -59119 8990 134875 145363 30578 -51530 -17989 41911
31427 41911 25489 -51609 -116526 -137972 -124574 -93050 -72885 -89510 -114551 -81460 18509 98435
31415 98435 73869 -25908 -86524 -44988 36288 46681 -40364 -139535 -158531 -97276 -20593 33099
31403 33099 64736 55582 -28359 -154522 -218770 -169229 -81501 -53586 -72074 -59670 -28192 -83249
31391 -83249 -253658 -402125 -370681 -175840 7844 51843 2778 -8893 58998 122877 90678
31380 90678 -29542 -146046 -174977 -102018 17163 97401 91586 43419 48720 136281 216677
31369 216677 190723 81011 -2150 -8983 6031 -10839 -40767 -48817 -42187 -35363 -19972 -13745
31357a3745o1118j29128q7192M1540Q5450l2374j50786q4355J00677J72129O3642
31346i5260m3108p59R3287O6201o1923j19789m4640N0010O9151N4811O3273N3862
31334H5116j1572n9175q764P7124P5642l828m2332j1941j1911q5311j37349q9796
31322b24097r00L8365L3204L5903M7914M7155M5320M5618Q578o7234r7924k9826
31310a17924O0117O8747J4512j4235m145k002K45M3951R1958O3675k2502o2151
31298A20246k8772o418l6218m9813l391K9461k6894j18476j30392m8119K6967
31287b71819J6297l8198l3528N9459J48003J22919J73q8636o0240K4266O3717
31276e7587N1270L9590L2705L218k5887j7410o352m2352p2842j0208R5692R7374
$$ plain form
31357 -13745 -74863 -203991 -291183 -249643 -164193 -196567 -347353 -431708 -331031 -158902 -95260
31346 -95260 -138368 -139127 -45840 20361 -41562 -161351 -205991 -155981 -86830 -32019 31254 85116
31334 85116 73544 14369 5605 82729 158371 154543 112211 100270 88359 3048 -134301 -224097
31322 -224097 -224997 -186632 -153428 -117525 -69611 -22456 22864 68482 77060 9826 -88098 -117924
31310 -117924 -57807 10940 25452 11217 7072 5070 5315 49266 141224 204899 182397 120246
31298 120246 91474 85056 48838 -975 -4366 25095 -1799 -120275 -250667 -298786 -271819
31287 -271819 -255522 -293720 -327248 -267789 -119786 3133 3306 -85330 -145570 -121304 -57587
31276 -57587 -6317 33273 65978 69196 43309 25899 19547 -22805 -95647 -105855 -10163 87211
31264H7211j8740r0375k1736P3433N5634l3877o0508l974M1010K3248j5917l3144
31252B265l3835l4375l5929l4904k0758K1955P7441R2190M2845j6989j9517K8868
31240F9257O1558L9847o782k3646M604L2852O134n8843p6873j7370K5940l0325
31228B6353j01162l9105J16564J59625K1209j17640j01403k1959l3163q9575n0758
31217b31014N2943O6747j7762m4937M1836J06651M0615p8262j14320m7344M9339
31206a75508J07758Q3902l1013j55830j60234k7370R8935R6596K0267m545K9970
31195a17072L6199l693j5658K5767M5440j0430q2749q2184j3578L6807J6030m0265
31183b05386o4604l6174P482K2046Q434J0460N7827J16898J17027L5107o4680
$$ plain form
31264 87211 68471 -21904 -43640 29793 85427 51550 -8958 -12932 28078 51326 35409 2265
31252 2265 -31570 -65945 -101874 -136778 -157536 -135581 -58140 34050 76895 59906 40389 69257
31240 69257 130815 170662 163880 140234 144838 177690 183824 124981 48108 30738 56678 26353
31228 26353 -74809 -113914 2650 162275 183484 65844 -35559 -57518 -90681 -180256 -231014
31217 -231014 -178071 -111324 -129086 -174023 -132187 -25536 15079 -63183 -177503 -224847 -175508
31206 -175508 -67750 16152 -14861 -170691 -330925 -358295 -259360 -162764 -142497 -147042 -117072
31195 -117072 -80873 -84566 -100224 -74457 -29017 -39447 -122196 -204380 -217958 -181151 -165121 -205386
31183 -205386 -269990 -306164 -298682 -276636 -268202 -257742 -199915 -83017 34010 69117 4437
31172D437r7111n1895L297J2864p533j3401L38L455j3238j8208K1012R3824J45299
31159H3140J19988K1744p0172p4098l201M8381L1869L558K4060N9105M4221l859
31147B84736k4980k6762n8266r5413o6904O742K2093l8099o8433j5856L3454R493
31135c8195j9297K4365P7155L7225n6251p8638j6566K2143j2081l9997J5405J15842
31123C1110J58701Q9988m8169j47502j19470Q924J03774P2105k7282p2092l6457
31112A3630J0478L2191N5457Q0506N8010k2335r5930j05761o6374k2991O406K7323
31100b9390M3717N3260M6746J5889j8115r139M5311P4448K5628m9250o5503l1313
31088A02289j9510l8583l1010N848M810m6100o4783m99Q5359J08889O4826l780
$$ plain form
31172 4437 -92674 -144569 -141272 -128408 -135941 -149342 -149004 -145549 -158787 -176995 -155983 -62159 83140
31159 83140 203128 224872 154700 80602 77401 125782 157651 161209 185269 244374 288595 284736
31147 284736 259756 232994 174728 79315 12411 19153 41246 3147 -65286 -81142 -47688 -38195
31135 -38195 -57492 -33127 44028 81253 25002 -53636 -70202 -48059 -60140 -100137 -84732 31110
31123 31110 189811 279799 231630 84128 -35342 -26418 77356 149461 122179 50087 13630
31112 13630 24108 56299 111756 192262 250272 227937 132007 26246 -40128 -63119 -56713 -29390
31100 -29390 14327 67587 114333 130222 112107 102968 148279 222727 248355 199105 133602 102289
31088 102289 82779 44196 13186 19034 23844 -22256 -87039 -87538 -2179 106710 171536 167756
31076A67756p0453j13886j03088m6461n512q006N643R0274J87046J77105L7709
31065C18127j12954j43976n4164L5698K5659n2609q9872m8690j641j743Q740Q8458
31053b8967J57078Q1836j09216k23999j45999K7143J30197J22052O9701K4309
31043A04135k987L621M4937O7309J7892p0609j10635o9803M19M1427M3803K5099
31031I4608j344k0420j4095R874Q851m6784j20676j33452n4380M7378P1056o50
31019a60034q6401j07671o5916q686L1351L6971k469n7490o0892N381O6348N2879
31007c56629L485J107M5433O6026L7430O17j5648j8867r629J5399L1302K0601
30995a79373J5095L3678K1236o1876j36928j05122p267M3372M8626R1411J41629
$$ plain form
31076 167756 97303 -16583 -119671 -166132 -171644 -179650 -174007 -83733 103313 280418 318127
31065 318127 205173 61197 7033 42731 68390 15781 -74091 -122781 -124422 -126165 -117425 -28967
31053 -28967 128111 209947 100731 -123268 -269267 -242124 -111927 10125 79826 104135
31043 104135 101148 104769 149706 217015 234907 164298 53663 -16140 -15721 25706 69509 94608
31031 94608 93264 72844 58749 68623 77474 30690 -89986 -223438 -277818 -230440 -159384 -160034
31019 -160034 -246435 -354106 -420022 -428708 -397357 -360386 -362855 -420345 -481237 -475856 -409508 -356629
31007 -356629 -353144 -352037 -306604 -240578 -203148 -202531 -218179 -237046 -246675 -231276 -199974 -179373
30995 -179373 -164278 -130600 -109364 -171240 -308168 -413290 -420557 -377185 -328559 -237148 -95519
30984i5519Q4055m9871q0220L7766J23410N2973m8998k3549P1662P4554k7200
30973A19063j03048p4098J9963R8540R6116k432j12937j09801Q109R8469P5356
30962A13300J0948k4096p1756j43106j29720J532Q3727m014j09494l5595J27843
30951a80431J45304K2039k4178N7057Q1735k9216j13636n3039L8320K4799l8525
30940f9771l6095J3248K6928J4908L5922P2433O1437P0o4514j05591j11568o2103
30928b24696K7331Q6897P7984M9650N4892O4463K9595j8895j6172J9206J301q5842
$$ plain form
30984 -95519 -11464 -61335 -141555 -103789 19621 72594 23596 47 71709 146263 119063
30973 119063 16015 -58083 -38120 60420 156536 154104 41167 -68634 -60525 37944 113300
30962 113300 124248 100152 28396 -114710 -244430 -242898 -159171 -163185 -272679 -308274 -180431
30951 -180431 -35127 -13088 -37266 19791 101526 72310 -41326 -94365 -56045 -31246 -69771
30940 -69771 -105866 -92618 -65690 -50782 -14860 57573 119010 119080 54566 -51025 -162593 -224696
30928 -224696 -197365 -110468 -32484 17166 72058 136521 166116 147221 131049 150255 151556 65714
$$ [...]
##END NTUPLES=NMR SPECTRUM
##END=
