##TITLE=31Pdec_PR164_3E
 D2O, 24 sc
 11.4.2019
##JCAMPDX= 6.0         $$ Bruker NMR JCAMP-DX V2.0
##DATA TYPE= NMR SPECTRUM
##DATA CLASS= NTUPLES
##ORIGIN= UXNMR, Bruker Analytische Messtechnik GmbH
##OWNER= root
$$ XWIN-NMR		Version 3.5
$$ Thu Apr 11 16:31:35 2019 Russian Standard Time (UT+4h)  she@DPX200
##.OBSERVE FREQUENCY= 81.013821
##.OBSERVE NUCLEUS= ^31P
##.ACQUISITION MODE= SIMULTANEOUS
##.ACQUISITION SCHEME= undefined
##.AVERAGES= 24
##.DIGITISER RES= 17
##SPECTROMETER/DATA SYSTEM= spect
##.PULSE SEQUENCE= zgpg30
##.SOLVENT NAME= CDCl3
##.SHIFT REFERENCE= (INTERNAL, CDCl3, 0, 182.463)
##AUDIT TRAIL= $$ (NUMBER, WHEN, WHO, WHERE, WHAT)
$$ ##TITLE= Audit trail, XWIN-NMR		Version 3.5
$$ ##JCAMPDX= 5.01
$$ ##ORIGIN= Bruker BioSpin GmbH
$$ ##OWNER= she
$$ F:/spectra/data/she/nmr/P31/1/pdata/1/auditp.txt
$$ ##AUDIT TRAIL=  $$ (NUMBER, WHEN, WHO, WHERE, WHAT)
(   1,<2019-04-11 16:30:39.26 +0400>,<she>,<DPX200>,
      <created by zg, POWCHK disabled, PULCHK disabled
       configuration hash MD5:
       00 E9 B6 7A A2 85 ED C7 34 08 36 98 17 FE 4E 26
       data hash MD5: 32K
       AB 51 CF 2A 4E E1 67 F4 88 30 64 2D 76 E5 AE 1D>)
(   2,<2019-04-11 16:30:41.59 +0400>,<she>,<DPX200>,
      <Start of raw data processing
       efp BC_mod = 2 LB = 1 FT_mod = 6 PKNL = 1 PHC0 = -1828.811 PHC1 = 70.39899 SI = 64K 
       data hash MD5: 64K
       DD E6 4C 6E 08 7E 3A 31 EB 9F 38 78 1C 85 CA 2E>)
(   3,<2019-04-11 16:31:00.15 +0400>,<she>,<DPX200>,
      <pk PHC0 = 4.300178 PHC1 = -9.2 
       data hash MD5: 64K
       55 F8 46 2C BF 41 21 53 BF BC E7 2C AB 94 98 0C>)
(   4,<2019-04-11 16:31:04.68 +0400>,<she>,<DPX200>,
      <abs ABSG = 5 
       data hash MD5: 64K
       A4 F5 06 0D A2 98 55 E1 DD 31 E1 28 77 04 26 AA>)
$$ ##END=
$$ 
$$ hash MD5
$$ BF 13 A6 4E D6 E1 A0 9C F4 C0 56 D3 FA FF 2D B3
##$RELAX= 
##$RELAX= 
##$RELAX= 
##$RELAX= 
##$RELAX= 
##$RELAX= 
##$RELAX= 
##$RELAX= 
$$ Bruker specific parameters
$$ --------------------------
##$DU= <F:/spectra>
##$EXPNO= 1
##$NAME= <P31>
##$PROCNO= 1
##$TYPE= <nmr>
##$USER= <she>
##$AMP= (0..31)
100 100 100 100 100 100 100 100 100 100 100 100 100 100 100 100 100 100 
100 100 100 100 100 100 100 100 100 100 100 100 100 100 
##$AQSEQ= 0
##$AQ_mod= 1
##$AUNM= <au_zg>
##$AUTOPOS= <>
##$BF1= 81.014009
##$BF2= 200.13
##$BF3= 200.13
##$BF4= 200.13
##$BF5= 200.13
##$BF6= 200.13
##$BF7= 200.13
##$BF8= 200.13
##$BYTORDA= 1
##$CFDGTYP= 0
##$CFRGTYP= 5
##$CHEMSTR= <none>
##$CNST= (0..31)
1 1 145 1 1 1 1 1 1 1 1 1 1 1 1 1 1 1 1 1 1 1 1 1 1 1 1 1 1 1 1 1 
##$CPDPRG= <waltz16>
##$CPDPRG1= <>
##$CPDPRG2= <waltz16>
##$CPDPRG3= <>
##$CPDPRG4= <mlev>
##$CPDPRG5= <mlev>
##$CPDPRG6= <mlev>
##$CPDPRG7= <mlev>
##$CPDPRG8= <mlev>
##$CPDPRGB= <>
##$CPDPRGT= <>
##$D= (0..31)
0 1 0 0 0 0 0 0 0 0 0 0.03 2e-05 3e-06 0 0 0 0 0 0 0 0 0 0 0 0 0 0 0 0 
0 0 
##$DATE= 1554985838
##$DBL= (0..7)
120 120 120 11 120 120 24 19 
##$DBP= (0..7)
150 150 150 150 150 150 150 150 
##$DBP07= 0
##$DBPNAM0= <>
##$DBPNAM1= <>
##$DBPNAM2= <>
$$ [...]
##$SUBNAM3= <"">
##$SUBNAM4= <"">
##$SUBNAM5= <"">
##$SUBNAM6= <"">
##$SUBNAM7= <"">
##$SUBNAM8= <"">
##$SUBNAM9= <"">
##$SW= 369.568048894756
##$SWIBOX= (0..15)
0 1 3 0 0 0 0 0 0 0 0 0 0 0 0 0 
##$SW_h= 29940.119760479
##$TD= 32768
##$TD0= 1
##$TE= 0
##$TE2= 300
##$TE3= 300
##$TEG= 300
##$TL= (0..7)
0 120 53 12 22 120 120 120 
##$TP= (0..7)
150 150 150 150 150 150 150 150 
##$TP07= 0
##$TPNAME0= <>
##$TPNAME1= <>
##$TPNAME2= <>
##$TPNAME3= <>
##$TPNAME4= <>
##$TPNAME5= <>
##$TPNAME6= <>
##$TPNAME7= <>
##$TPOAL= (0..7)
0.5 0.5 0.5 0.5 0.5 0.5 0.5 0.5 
##$TPOFFS= (0..7)
0 0 0 0 0 0 0 0 
##$TUNHIN= 0
##$TUNHOUT= 0
##$TUNXOUT= 0
##$USERA1= <user>
##$USERA2= <user>
##$USERA3= <user>
##$USERA4= <user>
##$USERA5= <user>
##$V9= 5
##$VALIST= <valist>
##$VCLIST= <CCCCCCCCCCCCCCC>
##$VD= 0
##$VDLIST= <DDDDDDDDDDDDDDD>
##$VPLIST= <PPPPPPPPPPPPPPP>
##$VTLIST= <TTTTTTTTTTTTTTT>
##$WBST= 1024
##$WBSW= 4
##$XGAIN= (0..3)
0 0 0 0 
##$XL= 0
##$YL= 0
##$YMAX_a= 57983
##$YMIN_a= -62896
##$ZGOPTNS= <>
##$ZL1= 120
##$ZL2= 120
##$ZL3= 120
##$ZL4= 120
##$ABSF1= 182.463
##$ABSF2= -187.1042
##$ABSG= 5
##$ABSL= 3
##$ALPHA= 0
##$AQORDER= 0
##$ASSFAC= 0
##$ASSFACI= 0
##$ASSFACX= 0
##$ASSWID= 0
##$AUNMP= <proc_1d>
##$AZFE= 0.1
##$AZFW= 0.5
##$BCFW= 0
##$BC_mod= 2
##$BYTORDP= 0
##$COROFFS= 0
##$CY= -3
##$DATMOD= 1
##$DC= 0
##$DFILT= <>
##$DTYPP= 0
##$F1P= 0
##$F2P= 0
##$FCOR= 1
##$FTSIZE= 65536
##$FT_mod= 6
##$GAMMA= 0
##$GB= 0
##$INTBC= 1
##$INTSCL= 5.30512e-09
##$ISEN= 30
##$LB= 1
##$LEV0= 0
##$LPBIN= 0
##$MAXI= 10000
##$MC2= 0
##$MEAN= 0
##$ME_mod= 0
##$MI= 50
##$NCOEF= 0
##$NC_proc= -3
##$NLEV= 6
##$NOISF1= 182.463
##$NOISF2= 159.3651
##$NSP= 0
##$NTH_PI= 0
##$NZP= 0
##$OFFSET= 182.463
##$PC= 4
##$PHC0= -1824.511
##$PHC1= 61.19899
##$PH_mod= 1
##$PKNL= yes
##$PPARMOD= 0
##$PSCAL= 0
##$PSIGN= 0
##$REVERSE= no
##$SF= 81.0140089999434
##$SI= 65536
##$SIGF1= 159.3651
##$SIGF2= -187.1042
##$SINO= 113.3802
##$SIOLD= 16384
##$SREGLST= <1H.CDCl3>
##$SSB= 0
##$STSI= 65536
##$STSR= 0
##$SW_p= 29940.119760479
##$SYMM= 0
##$S_DEV= 0
##$TDeff= 32768
##$TDoff= 0
##$TI= <>
##$TILT= no
##$TM1= 0
##$TM2= 0
##$TOPLEV= 0
##$USERP1= <user>
##$USERP2= <user>
##$USERP3= <user>
##$USERP4= <user>
##$USERP5= <user>
##$WDW= 1
##$XDIM= 65536
##$YMAX_p= 322388733
##$YMIN_p= -3011135
$$ End of Bruker specific parameters
$$ ---------------------------------
##NTUPLES= NMR SPECTRUM
##VAR_NAME=  FREQUENCY,     SPECTRUM/REAL,   SPECTRUM/IMAG
##SYMBOL=    X,             R,               I
##VAR_TYPE=  INDEPENDENT,   DEPENDENT,       DEPENDENT
##VAR_FORM=  AFFN,          ASDF,            ASDF
##VAR_DIM=   65536,         65536,           65536
##UNITS=     HZ,            ARBITRARY UNITS, ARBITRARY UNITS
##FACTOR=    0.456856943014862, 1,           1
##FIRST=     14782.0589164792, 0,            0
##LAST=      -15158.0608439998, 0,           0
##MIN=       -15158.0608439998, -3011135,    0
##MAX=       14782.0589164792, 322388733,    0
$$ Real data points
##PAGE= N=1
##DATA TABLE= (X++(R..R)), XYDATA
$$ [...]
$$ plain form
37320 400467 631090 611984 325324 -6710 -198751 -268437 -332268 -416368 -414500 -237359 24052
37309 24052 164656 139994 163836 396984 636967 547895 175297 -49687 106437 369451
37299 369451 380702 173434 4870 -68937 -161162 -242927 -184331 -40625 11630 1109 114431
37288 114431 308346 301106 42836 -126722 29565 260600 178565 -180824 -420113 -320608
37278 -320608 -67185 66609 49193 43359 158453 332055 415950 338993 184405 91851 87438
37267 87438 71054 -10527 -69496 -17357 83943 103132 15589 -94790 -164092 -182497 -139337
37256 -139337 -42112 29639 -4024 -105022 -170890 -197207 -267414 -370214 -363591 -179865 46767
37245 46767 141432 89703 -16601 -155313 -360756 -563500 -594820 -400179 -143351 -19152
$$ packed form
37320D00467K30623j9106k86660l32034j92041o9686o3831q4100J868J77141K61411
37309B4052J40604k4662K3842K33148K39983q9072l72598k24984J56124K63014
37299C69451J1251k07268j68564p3807r2225q1765N8596J43706N2255j0521J13322
37288A14431J93915p240k58270j69558J56287K31035q2035l59389k39289R9505
37278c20608K53423J33794j7416n834J15094J73602Q3895p6957j54588r2554m413
37267H7438j6384q1581n8969N2139J01300J9189q7543j10379o9302j8405M3160
37256a39337R7225P1751l3663j00998o5868k6317p0207j02800O623J83726K26632
37245D6767R4665n1729j06304j38712k05443k02744l1320J94641K56828J24199
$$ plain form
37235 -19152 -23880 -539 115803 202414 130182 -39422 -118554 -32063 94001 113042 56634
37224 56634 76239 214317 334532 309907 189349 100509 52368 -49482 -209025 -294122 -224762
37213 -224762 -95496 -39158 -58437 -80957 -102968 -163374 -227552 -226941 -190415 -203563 -241191 -180679
37201 -180679 -7467 127002 101956 -32977 -163423 -237348 -227826 -97016 110914 246570
37191 246570 222062 109861 -7119 -161775 -361659 -453627 -310183 -68118 18857 -71607
37181 -71607 -128650 -48819 26611 -38877 -169640 -204812 -102890 63808 214803 277434 181179
37170 181179 -68398 -344273 -491032 -454573 -303048 -148156 -56973 -17770 4705 -23958
37160 -23958 -185278 -450008 -631268 -594391 -442069 -367026 -385246 -368204 -288361 -244452 -253480
$$ packed form
37235a9152m728K3341J16342Q6611p2232j69604p9132Q6491J26064J9041n6408
37224E6634J9605J38078J20215k4625j20558q8840m8141j01850j59543q5097O9360
37213b24762J29266N6338j9279k2520k2011o0406o4178O11L6526j3148l7628O0512
37201a80679J73212J34469k5046j34933j30446p3925R522J30810K07930J35656
37191B46570k4508j12201j16980j54656j99884r1968J43444K42065Q6975r0464
37181g1607n7043P9831P5430o5488j30763l5172J01922J66698J50995O2631r6255
37170A81179k49577k75875j46759L6459J51525J54892R1183L9203K2475k8663
37160b3958j61320k64730j81260L6877J52322P5043j8220J7042P9843M3909r028
$$ plain form
37149 -253480 -209526 -70892 86015 218679 344016 396802 275083 72108 35096 209707
37139 209707 349715 287796 167358 166158 221276 212747 199740 241333 175320 -141415 -505772
37128 -505772 -582325 -370572 -169895 -124751 -106722 -46039 -56853 -147996 -101452 193408 491824
37117 491824 477261 176793 -87681 -109679 -2825 5505 -138160 -291910 -333044 -309424 -334916
37106 -334916 -383881 -298535 -28316 248212 323496 204552 61158 -5027 -32636 -88677 -190418
37095 -190418 -305946 -345378 -204731 82759 302722 287420 130173 41875 55993 38400
37085 38400 -52612 -106504 -64874 -8297 -4020 -15832 -6860 -2529 -8932 19846 96082 172948
37073 172948 220416 236002 185184 38141 -138626 -235391 -234292 -190759 -120825 -33407 -18305
$$ packed form
37149b53480M3954J38634J56907J32664J25337N2786j21719k02975l7012J74611
37139B09707J40008o1919j20438j200N5118q529j3007M1593o6013l16735l64357
37128e05772p6553K11753K00677M5144J8029O0683j0814r1143M6544K94860K98416
37117D91824j4563l00468k64474k1998J06854Q330j43665j53750m1134K3620k5492
37106c34916m8965Q5346K70219K76528P5284j18944j43394o6185k7609n6041j01741
37095a90418j15528l9432J40647K87490K19963j5302j57247q8298J4118j7593
37085C8400r1012n3892M1630N6577M277j1812Q972M331o403K8778P6236P6866
37073A72948M7468J5586n0818j47043j76767r6765J099M3533O9934Q7418J5102
$$ plain form
37062 -18305 -136454 -270419 -274828 -231100 -326062 -506829 -526695 -347995 -205973 -208537 -172513
37051 -172513 28038 241351 322139 364984 465162 499235 366579 223807 230479 258307 120575
37040 120575 -81484 -133188 -89410 -170679 -363599 -437610 -321644 -170887 -69785 50105
37030 50105 180338 191354 65148 -60332 -127042 -217185 -328285 -314547 -136690 30952
37020 30952 46729 -9949 3836 92493 175107 217796 221947 181793 126726 114904 135442 114776
37008 114776 53006 37010 86349 119614 109697 119029 130335 19429 -214887 -370219 -314374
36997 -314374 -178845 -128890 -93645 76696 296598 323048 112047 -120674 -209458 -217275 -254366
36986 -254366 -284836 -210403 -45273 89758 104946 16531 -84594 -109422 -52293 -12862 -90986
$$ packed form
37062a8305j18149j33965m409M3728r4962j80767j9866J78700J42022k564L6024
37051a72513K00551K13313Q0788M2845J00178L4073j32656j42772O672K7828j37732
37040A20575k02059n1704M3778q1269j92920p4011J15966J50757J01102J19890
37030E0105J30233J1016j26206j25480o6710r0143j11100J3738J77857J67642
37020C0952J5777n6678J3785Q8657Q2614M2689M151m0154n5067j1822K0538k0666
37008A14776o1770j5996M9339L3265r917R332J1306j10906k34316j55332N5845
36997c14374J35529M9955L5245J70341K19902K6450k11001k32721q8784p817l7091
36986b54366l0470P4433J65130J35031J5188q8415j01125k4828N7129L9431p8124
$$ plain form
36975 -90986 -246548 -325673 -253711 -132628 -95821 -135240 -160162 -181121 -306453 -536223 -683620
36964 -683620 -584253 -305005 -43300 124593 262131 364788 313080 99710 -50631 75877
36954 75877 404134 669801 737964 677871 563171 380843 163429 40550 75267 165621
36944 165621 192482 168232 150323 100543 -46233 -222894 -271870 -151552 -676 30821 -58983
36933 -58983 -172328 -258435 -340431 -407371 -362694 -147093 115183 193356 20523 -190341 -188801
36922 -188801 1334 123425 24476 -177678 -288014 -268872 -214521 -191216 -191300 -181250 -110083
36911 -110083 79912 362884 581505 575936 355127 81224 -101092 -164336 -154492 -128017 -135387
36900 -135387 -192284 -234571 -150472 95260 381527 518209 437307 277709 236051 332163 390957
$$ packed form
36975i0986j55562p9125P1962J21083L6807l9419k4922k0959j25332k29770j47397
36964f83620R9367K79248K61705J67893J37538J02657n1708k13370j50341J26508
36954G5877L28257K65667O8163o0093j14700j82328k17414j22879L4717R0354
36944A65621K6861k4250j7909m9780j46776j76661m8976J20318J50876L1497q9804
36933e8983j13345q6107q1996o6940M4677K15601K62276P8173j72833k10864J540
36922a88801J90135J22091r8949k02154j10336J9142N4351K3305q4J0050P1167
36911a10083J89995K82972K18621n569k20809k73903j82316o3244R844K6475p370
36900a35387n6897m2287Q4099K45732K86267J36682q0902j59598m1658R6112N8794
$$ plain form
36889 390957 292915 149487 125510 164260 63395 -187394 -344802 -245643 -14864 159427
36879 159427 275371 391466 419998 261541 37980 -46387 -22207 -92241 -266433 -312455
36869 -312455 -115433 143960 255205 223510 156575 100920 111609 292616 594426 723966
36859 723966 465432 3151 -271691 -218382 -24993 116555 192796 222271 151673 -17423
36849 -17423 -157774 -174152 -126015 -108073 -101809 -37300 68303 130137 114468 60516 10474
36838 10474 -18918 -20106 -10234 -43391 -149269 -271770 -326293 -317815 -346267 -473306 -619821
36827 -619821 -630591 -440499 -160106 16349 -9512 -159305 -274560 -271067 -184423 -94677 -45041
36816 -45041 -21838 20333 103744 177023 159492 76110 81541 257351 440779 395523 135886
$$ packed form
36889C90957r8042j43428k3977L8750j00865k50789j57408R9159K30779J74291
36879A59427J15944J16095K8532j58457k23561q4367K4180p0034j74192m6022
36869c12455J97022K59393J11245l1695o6935n5655J0689J81007L01810J29540
36859G23966k58534m62281k74842N3309J93389J41548P6241K9475p0598j69096
36849a7423j40351j6378M8137J7942O264O4509J05603O1834j5669n3952n0042
36838A0474k9392j188R872l3157j05878j22501n4523Q478k8452j27039j46515
36827f19821j0770J90092K80393J76455k5861j49793j15255L493Q6644Q9746M9636
36816d5041K3203M2171Q3411P3279j7531q3382N431J75810J83428m5256k59637
$$ plain form
36805 135886 -82825 -117633 -99279 -173783 -276146 -294901 -291961 -368797 -434234 -323922 -84194
36794 -84194 83958 133823 202950 331872 382418 290569 193031 211206 280882 298209 286425
36783 286425 307867 336329 326749 303156 275560 176798 -12827 -182692 -242637 -251570 -277115
36772 -277115 -239318 -48408 188633 277162 209501 162814 234754 336642 365686 349437 375654
36761 375654 464466 545323 515209 322843 39859 -172110 -205466 -83111 125018 361652
36751 361652 505324 382189 -972 -345562 -366960 -148341 -2707 -29853 -27521 152426
36741 152426 378328 439221 309588 129896 27839 19908 22775 -53509 -166740 -143368 84923
36730 84923 324485 353153 228739 157933 134966 -5677 -202157 -177834 83009 216865
$$ packed form
36805A35886k18711l4808J8354p4504j02363j8755K940p6836o5437J10312K39728
36794h4194J68152M9865O9127J28922N0546r1849r7538J8175O9676J7327j1784
36783B86425K1442K8462r580k3593k7596r8762j89625j69865n9945q933k5545
36772b77115L7797J90910K37041Q8529o7661m6687P1940J01888K9044j6249K6217
36761C75654Q8812Q0857l0114j92366k82984k11969l3356J22355K08129K36634
36751C61652J43672j23135l83161l44590k1398K18619J45634k7146K332J79947
36741A52426K25902O0893j29633j79692j02057p931K867p6284j13231K3372K28291
36730H4923K39562K8668j24414p0806k2967j40643j96480K4323K60843J33856
$$ plain form
36720 216865 4835 -285738 -303719 -107423 -4495 -103096 -289381 -484028 -638496 -610574
36710 -610574 -348228 -113250 -214802 -556378 -741577 -622637 -447575 -428942 -466201 -400365
36700 -400365 -284436 -240085 -230456 -146861 -5137 91739 107222 64293 -49725 -248371 -444183
36689 -444183 -489247 -335378 -103195 24619 -32240 -187565 -283892 -256604 -188522 -191560 -274282
36678 -274282 -362270 -406272 -413428 -403637 -396930 -422552 -486314 -547587 -563581 -517322 -378132 -118727
36666 -118727 174243 314810 243637 142407 195896 328248 329215 168779 6359 -65593 -90386
36655 -90386 -75508 43655 241065 380187 402364 387740 398508 409606 419738 471884 528413
36644 528413 484865 349075 251491 242389 243184 226984 253134 279604 166906 -50183 -133824
$$ packed form
36720B16865k12030k90573j7981J96296J02928r8601j86285j94647j54468K7922
36710f10574K62346K34978j01552l41576j85199J18940J75062J8633l7259O5836
36700d00365J15929M4351R629Q3595J41724R6876J5483m2929j14018j98646j95812
36689d44183m5064J53869K32183J27814n6859j55325r6327K7288O8082l038q2722
36678b74282q7988m4002p156R791O707k5622o3762o1273j5994M6259J39190K59405
36666a18727K92970J40567p1173j01230N3489J32352R67j60436j62420p1952k4793
36655i0386J4878J19163J97410J39122K2177j4624J0768J1098J0132N2146N6529
36644E28413m3548j35790r7584r102P95j6200K6150K6470j12698k17089q3641
$$ plain form
36633 -133824 -9651 77229 -59839 -249187 -258962 -181548 -237246 -353077 -269810 -526 150294
36622 150294 42174 -118418 -119019 -23508 -15384 -145315 -334177 -482141 -492858 -324305 -95620
36611 -95620 -15399 -116755 -182193 -31498 219141 303128 138664 -101959 -223470 -194858
36601 -194858 -103195 -16682 53633 87622 12112 -229813 -562731 -792053 -790221 -636259 -500632
36590 -500632 -421766 -296995 -90047 78649 99554 28736 -7032 7272 -22796 -152160 -334250
36579 -334250 -494784 -589607 -580841 -427548 -148815 125255 213093 24625 -345889 -684199
36569 -684199 -834036 -811448 -738362 -694408 -672308 -648372 -620299 -570755 -474471 -369791 -342479
36558 -342479 -390151 -386895 -261059 -129008 -133763 -205417 -140432 83450 245295 189233 28701
$$ packed form
36633a33824J24173Q6880j37068j89348r775P7414n5698j15831Q3267K69284J50820
36622A50294j08120j60592o01R5511Q124j29931j88862j47964j0717J68553K28685
36611i5620Q0221j01356o5438J50695K50639Q3987j64464k40623j21511K8612
36601a94858R1663Q6513P0315L3989p5510k41925l32918k29322J832J53962J35627
36590e00632P8866J24771K06948J68696K0905p0818l5768J4304l0068j29364j82090
36579c34250j60534r4823Q766J53293K78733K74070Q7838j88468l70514l38310
36569f84199j49837K2588P3086M3954K2100K3936K8073M9544R6284J04680K7312
36558c42479m7672L256J25836J32051m755p1654O4985K23882J61845n6062j60532
$$ plain form
36547 28701 -64059 -119340 -250263 -381271 -324674 -106616 13920 -93204 -242813 -203583
36537 -203583 6944 211911 322806 358030 316257 182929 8549 -139916 -259481 -360121
36527 -360121 -421489 -490841 -688410 -972394 -1055446 -776118 -420707 -388329 -621655 -712238
36517 -712238 -548431 -465265 -670025 -915203 -926486 -799587 -714347 -570027 -243855 23962
36507 23962 -100298 -507070 -750432 -648255 -438718 -350186 -349037 -361595 -437837 -584838 -672487
36496 -672487 -619831 -503656 -408788 -334897 -296594 -329689 -351743 -222075 428 85852 4590
36485 4590 20798 274693 521092 498201 349613 404941 670942 839200 756787 605944 581621
36474 581621 627091 578946 410767 234942 161434 219628 340965 380617 244035 31587
$$ packed form
36547B8701r2760n5281j30923j31008N6597K18058J20536j07124j49609L9230
36537b03583K10527K04967J10895L5224m1773j33328j74380j48465j19565j00640
36527c60121o1368o9352j97569k83984q3052K79328L55411L2378k33326r0583
36517g12238J63807Q3166k04760k45178j1283J26899Q5240J44320L26172K67817
36507B3962j24260m06772k43362J02177K09537Q8532J149j2558p6242j47001q7649
36496f72487N2656J16175R4868P3891L8303l3095k2054J29668K22503Q5424q1262
36485D590J6208K53895K46399k2891j48588N5328K66001J68258q2413j50843k4323
36474E81621M5470m8145j68179j75825p3508N8194J21337L9652j36582k12448
$$ plain form
36464 31587 -32597 135286 373963 499058 542151 668979 914310 1124861 1173943 1121926
36454 1121926 1105933 1143857 1135028 1027653 887843 783332 690110 576741 509981 573665 709569
36443 709569 756950 671379 595190 653064 770923 790101 698776 630848 649973 660242 570487
36432 570487 440398 375502 344310 226100 36534 -33097 124983 346851 402582 330292
36422 330292 380537 610093 740024 545185 221438 157681 414128 650326 578236 282203
36412 282203 30875 -46301 9241 130087 256697 306969 245547 150563 115406 114446 49168
36401 49168 -102449 -263048 -359201 -374383 -320618 -230959 -167977 -173062 -212134 -220541 -180578 -99938
36389 -99938 52090 300815 566181 697075 630765 455486 293426 183609 109419 74821
$$ packed form
36464C1587o4184J67883K38677J25095M3093J26828K45331K10551M9082n2017
36454A121926j5993L7924q829j07375j39810j04511r3222j13369o6760O3684J35904
36443G09569M7381q5571p6189N7874J17859J9178r1325o7928J9125J0269q9755
36432E70487j30089o4896l1192j18210j89566o9631J58080K21868N5731p2290
36422C30292N0245K29556J29931j94839l23747o3757K56447K36198p2090k96033
36412B82203k51328p7176N5542J20846J26610N0272o1422r4984l5157r60o5278
36401D9168j51617j60599r6153j5182N3765Q9659O2982n085l9072q407L9963Q0640
36389i9938J52028K48725K65366J30894o6310j75279j62060j09817p4190l4598
$$ plain form
36379 74821 90303 118613 108355 83564 134369 285458 420288 393944 207385 9287 -80761
36368 -80761 -87697 -99728 -145591 -203146 -262309 -305271 -280245 -183348 -115190 -148919 -190498 -107133
36356 -107133 40464 68297 -28269 -43072 117224 283224 299061 250363 263142 256572 110253
36345 110253 -52794 -6568 206355 292096 103150 -195532 -390973 -455806 -458610 -416356 -325104
36334 -325104 -212108 -84473 71355 199170 208924 146764 180088 340691 434845 314522
36324 314522 101060 10217 71225 162222 222386 262772 237617 84916 -128610 -256819 -257360
36313 -257360 -197674 -110838 7263 89072 60923 12208 109763 323886 440886 393666 357427
36302 357427 425115 423760 216682 -23785 -69768 537 -41801 -173653 -167322 12517 167383
$$ packed form
36379G4821J5482K8310j0258k4791N0805J51089J34830k6344j86559j98098r0048
36368h0761o936j2031m5863n7555n9163m2962K5026R6897O8158l3729m1579Q3365
36356a07133J47597K7833r6566j4803J60296J66000J5837m8698J2779o570j46319
36345A10253j63047M6226K12923Q5741j88946k98682j95441o4833k804M2254R1252
36334c25104J12996J27635J55828J27815R754o2160L3324J60603R4154j20323
36324C14522k13462r0843O1008R0997O0164M0386k5155j52701k13526j28209n41
36313b57360N9686Q6836J18101Q1809k8149m8715R7555K14123J17000m7220l6239
36302C57427O7688j355k07078k40467m5983P0305m2338j31852O331J79839J54866
$$ plain form
36291 167383 224268 323563 488364 523075 374379 297481 459015 620213 470155 95333
36281 95333 -156527 -162473 -102246 -120914 -173409 -175404 -81326 156742 484551 644438 442207
36270 442207 102694 67269 394740 658025 529984 183448 -40318 -91036 -122450 -160222
36260 -160222 -119165 -32569 -18725 -69988 -69066 19418 133617 253055 403062 549542 622996
36249 622996 621817 575314 444693 189650 -95652 -244306 -209958 -98270 -21144 -10421 -48348
36238 -48348 -86401 -54886 61531 187531 269321 363598 518547 634089 570829 356551 152121
36227 152121 38839 -29694 -83126 -81338 -17464 42092 47668 23785 34987 145014 366680
36216 366680 585448 605150 371892 83337 -38492 -1503 63338 155059 343751 532280
$$ packed form
36291A67383N6885R9295J64801L4711j48696p6898J61534J61198j50058l74822
36281I5333k51860n946O0227j8668n2495j995R4078K38068L27809J59887k02231
36270D42207l39513l5425L27471K63285j28041l46536k23766n0718l1414l7772
36260a60222M1057Q6596J3844n1263R22Q8484J14199J19438J50007J46480P3454
36249F22996j179m6503j30621k55043k85302j48654L4348J11688P7126J0723l7927
36238d8348l8053L1515J16417J26000Q1790R4277J54949J15542o3260k14278k04430
36227A52121j13282o8533n3432J788O3874N9556N576k3883J1202J10027K21666
36216C66680K18768J9702k33258k88555j21829L6989O4841R1721J88692J88529
$$ plain form
36206 532280 534810 395752 376811 567141 735496 667943 454476 315096 303280 325695 338196
36195 338196 372360 428360 461248 450075 411380 366469 326912 279103 180842 26868 -100545
36184 -100545 -126920 -102054 -109506 -92874 69536 318159 423741 294578 106170 53196 122462
36173 122462 197082 246708 304699 355877 352622 289363 203001 142824 141604 146104 23700 -225419
36161 -225419 -324124 -13185 515609 754224 513911 151273 40389 100341 43000 -156812
36151 -156812 -299487 -299757 -220437 -74178 157543 368630 414135 326303 275574 347695 490421
36140 490421 617565 639344 478716 196537 2674 -746 25119 -91854 -263417 -305628
36130 -305628 -232729 -168838 -104490 6497 38267 -120490 -273404 -148072 138371 215653
$$ packed form
36206E32280K530j39058j8941J90330J68355o7553k13467j39380j1816K2415J2501
36195C38196L4164N6000L2888j1173l8695m4911l9557m7809r8261j53974j27413
36184a00545k6375K4866p452J6632J62410K48623J05582j29163j88408n2974O9266
36173A22462P4620M9626N7991N1178l255o3259q6362o0177j220M500j22404k49119
36161b25419r8705L10939N28794K38615k40313l62638j10884N9952n7341j99812
36151a56812j42675k70P9320J46259K31721K11087M5505q7832n0729P2121J42726
36140D90421J27144K1779j60628k82179j93863l420K5865j16973j71563m2211
36130c05628P2899O3891O4348J10987L1770j58757j52914J25332K86443P7282
$$ plain form
36120 215653 55309 24515 264570 423299 201026 -179617 -318820 -205752 -137909 -223081
36110 -223081 -265376 -112098 128815 253152 191246 33386 -87000 -103536 -55243 -36797
36100 -36797 -108300 -255263 -406555 -457504 -325474 -55870 173376 244528 246061 315476 402712
36089 402712 349790 162357 13682 -10470 19770 61036 136209 175430 53508 -156047 -201718
36078 -201718 -24544 117132 16937 -198504 -305636 -296238 -267372 -178214 52239 315275
36068 315275 409435 320730 220955 216023 254366 264934 239826 175576 49034 -121899 -253739
36057 -253739 -248918 -70275 195607 362285 320521 186707 152983 199181 137903 -27707 -33550
36046 -33550 240105 518054 471840 149067 -128803 -164358 3763 257213 465422 498739
$$ packed form
36120B15653j60344l0794K40055J58729k22273l80643j39203J13068O7843q5172
36110b23081m2295J53278K40913J24337o1906j57860j20386j6536M8293J8446
36100c6797p1503j46963j51292n0949J32030K69604K29246P1152J533O9415Q7236
36089D02712n2922j87433j48675k4152L0240M1266P5173L9221j21922k09555m5671
36078b01718J77174J41676j00195k15441j07132R398K8866Q9158K30453K63036
36068C15275R4160q8705r9775m932L8343J0568k5108o4250j26542j70933j31840
36057b53739M821J78643K65882J66678m1764j33814l3724M6198o1278j65610n843
36046c3550K73655K77949m6214l22773k77870l5555J68121K53450K08209L3317
$$ plain form
36036 498739 367177 260346 286810 298894 161958 39995 155648 390654 424456 196585
36026 196585 -75636 -291661 -547859 -829246 -979928 -1056199 -1369424 -2025702 -2695194 -3011135
36016 -3011135 -2975387 -2798181 -2551169 -2202686 -1849383 -1662864 -1638367 -1573621 -1311322 -909736
36006 -909736 -570407 -441256 -477300 -488235 -352724 -146570 12347 168056 422951 689265
35996 689265 761053 633508 519515 514280 490111 391707 362791 446914 428143 166711 -129414
35985 -129414 -196106 -92918 -48766 -84437 -57426 29766 45425 -12688 -40151 -65667 -200817
35974 -200817 -357397 -280120 89780 495023 657785 525885 209774 -136693 -348611 -355241
35964 -355241 -290087 -323897 -386285 -273778 -45973 -22999 -286311 -474027 -270575 133198
$$ packed form
36036D98739j31562j06831K6464J2084j36936j21963J15653K35006L3802k27871
36026A96585k72221k16025k56198k81387j50682p6271l13225o56278o69492l15941
36016c011135L5748J77206K47012L48483L53303J86519K4497O4746K62299M01586
36006i09736L39329J29151l6044j0935J35511K06154J58917J55709K54895K66314
35996F89265P1788j27545j13993n235k4169r8404k8916Q4123j8771k61432k96125
35985a29414o6692J03188M4152l5671K7011Q7192J5659n8113k7463k5516j35150
35974b00817j56580P7277L69900M05243J62762j31900l16111l46467k11918o630
35964c55241O5154l3810o2388J12507K27805K2974k63312j87716K03452M03773
$$ plain form
35954 133198 319631 223145 150957 294246 481278 440803 132296 -228262 -374190 -221594
35944 -221594 31871 89237 -92493 -223627 -60389 260023 425422 370673 269309 188192
35934 188192 32993 -171287 -243693 -162334 -147813 -315603 -485204 -483374 -415358 -445608 -498381
35923 -498381 -402007 -192915 -43545 12143 52143 51860 -53203 -140694 -3317 318721 551999
35912 551999 561726 474340 395383 265093 80678 5767 110674 213838 149220 13799 -25794
35901 -25794 -4355 -31353 -38497 102679 299167 322768 147674 -23552 -66019 -51516 -45312
35890 -45312 4181 110618 161975 78013 -66300 -150553 -150872 -122013 -121393 -183907 -290749 -348833
35878 -348833 -290000 -186661 -159162 -186499 -161377 -126573 -251233 -517824 -648316 -465593
$$ packed form
35954A33198J86433r6486p2188J43289J87032m0475l08507l60558j45928J52596
35944b21594K53465N7366j81730j31134J63238L20412J65399n4749j01364q1117
35934A88192j55199k04280p2406Q1359J4521j67790j69601J830O8016l0250n2773
35923d98381R6374K09092J49370N5688M0000k83j05063q7491J37377L22038K33278
35912E51999R727q7386p8957j30290j84415p4911J04907J03164o4618j35421l9593
35901b5794K1439k6998p144J41176J96488K3601j75094j71226m2467J4503O204
35890d5312M9493J06437N1357q3962j44313q4253l19K8859O20o2514j06842n8084
35878c48833N8833J03339K7499k7337K5122L4804j24660k66591j30492J82723
$$ plain form
35868 -465593 -151118 7421 -24190 -86291 -110244 -139024 -149062 -70613 39720 39962 -80187
35857 -80187 -183639 -186909 -122164 -6864 165480 283141 169956 -131575 -308344 -143369
35847 -143369 188229 335956 203000 7627 -33569 79630 234891 369843 463844 467855
35837 467855 338262 116361 -83191 -159416 -80400 118850 352861 513292 530401 432373
35827 432373 332076 335832 447791 547898 475320 182584 -166411 -302926 -124413 164336
35817 164336 259872 102473 -82992 -93367 33141 154760 237845 304186 278543 70577
35807 70577 -232319 -431825 -474675 -476252 -482222 -391931 -167631 58213 166645 189250 177669
35796 177669 97104 -43443 -119138 -89117 -117212 -323318 -550490 -580313 -466377 -421283 -452638
$$ packed form
35868d65593L14475J58539l1611o2101k3953k8780j0038P8449J10333K42j20149
35857h0187j03452l270O4745J15300J72344J17661j13185l01531j76769J64975
35847a43369L31598J47727j32956j95373m1196J13199J55261J34952R4001M011
35837D67855j29593k21901j99552p6225P9016J99250K34011J60431J7109r8028
35827D32373j00297L756J11959J00107p2578k92736l48995j36515J78513K88749
35817A64336R5536j57399j85465j0375J26508J21619Q3085O6341k5643k07966
35807G0577l02896j99506m2850j577n970R0291K24300K25844J08432K2605j1581
35796A77669q0565j40547p5695L0021k8095k06106k27172k9823J13936M5094l1355
$$ plain form
35785 -452638 -375041 -160679 -10569 -40070 -128394 -141644 -95100 -26448 84611 185022 141466
35774 141466 -24930 -89715 60103 247899 293606 287587 377093 448758 295732 14776 -55858
35763 -55858 194576 494748 570094 465567 384055 368945 300976 133920 -12611 -4786 137068
35752 137068 252040 206421 35934 -93071 -68229 55194 147962 170164 188842 260709 358615
35741 358615 410938 376403 290327 253796 333232 444496 410900 197290 7930 56207 297506
35730 297506 498566 520629 413477 275117 163382 129168 193291 289141 351802 437799 605920
35719 605920 722589 606386 369089 348488 622867 855918 766185 500758 344454 293043
35709 293043 190065 105407 233796 493275 569197 370625 143829 86592 127246 156237
$$ packed form
35785d52638P7597K14362J50110k9501q8324j3250M6544O8652J11059J00411m3556
35774A41466j66396o4785J49818J87796M5707o019Q9506P1665j53026k80956p0634
35763e5858K50434L00172P5346j04527q1512j5110o7969j67056j46531P825J41854
35752A37068J14972m5619j70487j29005K4842J23423R2768K2202J8678P1867R7906
35741C58615N2323l4535q6076l6531P9436J11264l3596k13610j89360M8277K41299
35730B97506K01060K2063j07152j38360j11735l4214O4123R5850O2661Q5997J68121
35719F05920J16669j16203k37297k0601K74379K33051q9733k65427j56304n1411
35709B93043j02978q4658J28389K59479P5922j98572k26796n7237M0654K8991
$$ plain form
35699 156237 199952 246789 157284 -86380 -250828 -152576 84479 249830 348059 465811
35689 465811 500636 303869 8887 -82286 60518 140699 -25815 -259887 -312863 -209490
35679 -209490 -144543 -167585 -142853 15476 202044 243520 113869 -8023 74576 322249
35669 322249 464904 330880 85355 5556 92861 120448 49610 127753 480700 863640
35659 863640 996104 940563 921399 927210 774132 484189 302137 329593 408881 417974 429974
35648 429974 491151 480279 335655 223847 294071 408246 325903 70312 -107905 -102543 -74880
35637 -74880 -171988 -301226 -274907 -71838 139750 194888 87235 -45065 -55918 73948
35627 73948 230553 300384 279343 218858 119991 -40082 -213394 -312806 -321203 -266715 -114910
$$ packed form
35699A56237M3715M6837q9505k43664j64448R8252K37055J65351R8229J17752
35689D65811L4825j96767k94982r1173J42804Q0181j66514k34072n2976J03373
35679b09490O4947k3042K4732J58329J86568M1476j29651j21892Q2599K47673
35669C22249J42655j34024k45525p9799Q7305K7587p0838P8143L52947L82940
35659H63640J32464n5541j9164N811j53078k89943j82052K7456P9288R093J2000
35648D29974O1177j0872j44624j11808P0224J14175q2343k55591j78217N362K7663
35637g4880r7108j29238K6319K03069K11588N5138j07653j32300j0853J29866
35627G3948J56605O9831k1041o0485r8867j60073j73312r9412q397N4488J51805
$$ plain form
35616 -114910 167252 435150 442829 176100 -61881 -25364 164239 248291 229397 301833 462330
35605 462330 483284 305345 176445 275394 423681 352994 95811 -98869 -128246 -83421
35595 -83421 9819 240909 565980 739060 617724 392939 369061 591457 828845 890775
35585 890775 829806 814921 919995 1102642 1320711 1568039 1795614 1893530 1817443 1684306
35575 1684306 1649820 1696126 1646415 1430465 1229567 1260583 1483779 1649196 1609784 1461597
35565 1461597 1361619 1331078 1294102 1218782 1145421 1123348 1175347 1289410 1405936 1450551 1419600
35554 1419600 1404292 1496434 1687299 1870191 1917053 1762400 1468623 1209895 1122454 1157812
35544 1157812 1151359 1036073 889811 760162 582533 340394 172290 200578 347801 450976
$$ packed form
35616a14910K82162K67898P679k66729k37981L6517J89603Q4052j8894P2436J60497
35605D62330K0954j77939j28900R8949J48287p0687k57183j94680k9377M4825
35595h3421R3240K31090L25071J73080j21336k24785k3878K22396K37388O1930
35585H90775o0969j4885J05074J82647K18069K47328K27575R7916p6087j33137
35575A684306l4486M6306m9711k15950k00898L1016K23196J65417l9412j48187
35565A461597r9978l0541l6976p5320p3361k2073N1999J14063J16526M4615l0951
35554A419600j5308R2142J90865J82892M6862j54653k93777k58728q7441L5358
35544A157812o453j15286j46262j29649j77629k42139j68104K8288J47223J03175
$$ plain form
35534 450976 483455 523609 562510 508428 369876 277082 298082 360676 383209 363336 304342
35523 304342 174923 1878 -94737 -28794 153241 344781 477968 509238 398773 184298
35513 184298 11551 1160 115188 227447 296021 383682 515920 608203 572347 443200
35503 443200 345850 349210 400881 422216 420163 448423 479718 407806 207582 5104 -81897
35492 -81897 -98256 -144929 -178805 -64062 184603 366126 351910 254227 255195 361151 423159
35481 423159 344590 174413 19071 -62068 -78268 -75244 -83768 -84031 -41455 18385 23481 -34288
35469 -34288 -67639 -18056 51459 57908 47731 154683 411033 674941 771463 665319 468022
35458 468022 296812 164035 23326 -101145 -99755 70729 282165 367597 328644 305681
$$ packed form
35534D50976L2479M0154L8901n4082j38552r2794K1000O2594K2533j9873n8994
35523C04342j29419j73045r6615O5943J82035J91540J33187L1270j10465k14475
35513A84298j72747j0391J14028J12259O8574Q7661J32238R2283l5856j29147
35503D43200r7350L360N1671K1335k053K8260L1295p1912k00224k02478q7001
35492h1897j6359m6673l3876J14743K48665J81523j4216r7683R68J05956O2008
35481D23159p8569j70177j55342q1139j6200L024q524k63M2576N9840N096n7769
35469c4288l3351M9583O9515O449j0177J06952K56350K63908R6522j06144j97297
35458D68022j71210j32777j40709j24471J390J70484K11436Q5432l8953k2963
$$ plain form
35448 305681 350067 357962 266903 182677 221907 328902 356114 260232 117437 1377 -47092
35437 -47092 21300 208335 388678 414031 314125 282055 414385 552780 455836 93576 -290295
35426 -290295 -417211 -249700 -10728 68908 -16409 -105023 -112412 -110015 -151819 -157673 -50632
35415 -50632 95431 159918 152658 159394 164609 78149 -74832 -138799 -31973 147485 253598
35404 253598 241236 161078 96221 123696 245178 333669 250780 47385 -66898 -8038 48235
35393 48235 -89956 -350609 -488667 -405517 -243260 -162521 -146712 -72996 94717 241869
35383 241869 214813 -20650 -311676 -412763 -199351 185681 439407 394292 181060 54380
35373 54380 91709 148555 104095 25544 21600 45928 -18782 -142182 -175376 -87551 -28 44537
$$ packed form
35448C05681M4386P895r1059q4226L9230J06995K7212r5882j42795j16060m8469
35437d7092O8392J87035J80343K5353r9906l2070J32330J38395r6944l62260l83871
35426b90295j26916J67511K38972P9636q5317q8614p389K397m1804n854J07041
35415e0632J46063O4487p260O736N215q6460j52981o3967J06826J79458J06113
35404B53598j2362q0158o4857K7475J21482Q8491q2889k03395j14283N8860N6273
35393D8235j38191k60653j38058Q3150J62257Q0739J5809P3716J67713J47152
35383B41869k7056k35463k91026j01087K13412L85032K53726m5115k13232j26680
35373E4380L7329N6846m4460p8551l944K4328o4710j23400l3194Q7825Q7523M4565
$$ plain form
35361 44537 158326 368916 489526 382899 214490 246619 456842 559712 384614 59506
35351 59506 -177581 -198064 -16217 244665 401902 358313 212827 121638 77139 -32445
35341 -32445 -175043 -178346 2140 205328 292270 273693 176414 -11603 -197348 -201754 -29838
35330 -29838 84031 29166 4321 179887 383573 359597 179268 112641 185920 165074 -37920
35319 -37920 -224844 -225272 -115061 -36440 12052 100451 218364 306510 352039 375334 384579 392458
35307 392458 419453 450496 449299 432200 457197 524905 565154 535793 456867 338239 170679
35296 170679 16860 6511 173849 368587 403129 261107 111175 125715 309063 496782
35286 496782 522274 389995 259282 244293 289832 291003 256893 259105 279662 240308 154122
$$ packed form
35361D4537J13789K10590J20610j06627j68409L2129K10223J02870j75098l25108
35351E9506k37087k0483J81847K60882J57237m3589j45486r1189m4499j09584
35341c2445j42598l303J80486K03188Q6942j8577r7279j88017j85745m406J71916
35330b9838J13869n4865k4845J75566K03686k3976j80329o6627P3279k0846k02994
35319c7920j86924m28J10211P8621M8492Q8399J17913Q8146M5529K3295R245P879
35307C92458K6995L1043j197j7099K4997O7708M0249k9361p8926j18628j67560
35296A70679j53819j0349J67338J94738L4542j42022j49932J4540J83348J87719
35286D96782K5492j32279j30713j4989M5539J171l4110K212K0557l9354q6186
$$ plain form
35275 154122 110623 116856 91501 22486 -13362 -3646 -15465 -20487 120155 412132 628364
35264 628364 577366 356617 214901 253187 380613 483310 504591 413120 220974 15874
35254 15874 -107191 -118383 -16247 187401 372002 328101 18950 -276360 -260760 314
35244 314 184310 155777 88881 140871 233362 237173 183671 171763 196261 186824 126089 33715
35232 33715 -84207 -185439 -176182 -33664 132902 227892 292323 386983 442811 359343 196913
35221 196913 130150 221447 350902 366308 215928 -44173 -277900 -326805 -147842 112594
35211 112594 275049 335422 411874 519607 550570 477442 407349 387357 319609 150103 -4584
35200 -4584 -26855 25689 33454 6841 40317 155712 317512 527831 763658 882449 756406
$$ packed form
35275A54122m3499O233k5355o9015l5848R716j1819n022J40642K91977K16232
35264F28364n0998k20749j41716L8286J27426J02697K1281r1471j92146k05100
35254A5874j23065j1192J02136K03648J84601m3901l09151k95310J5600K61074
35244C14J83996k8533o6896N1990R2491L811n3502j1908K4498r437o0735r2374
35232C3715j17922j01232R257J42518J66566R4990O4431R4660N5828q3468j62430
35221A96913o6763R1297J29455J5406j50380k60101k33727m8905J78963K60436
35211A12594J62455O0373P6452J07733L0963p3128p0093j9992o7748j69506j54687
35200d584k2271N2544P765k6613L3476J15395J61800K10319K35827J18791j26043
$$ plain form
35189 756406 477668 271760 209018 153584 9115 -146551 -219279 -244937 -295808 -344899 -309977
35178 -309977 -169411 25852 198740 262658 162143 -46221 -205773 -205647 -84720 32605
35168 32605 62433 9950 -56767 -67637 -26727 -14674 -61540 -63368 71574 238183 250614
35157 250614 133485 117569 313380 568531 701570 688827 549250 261991 -72976 -200003
35147 -200003 -13543 260039 357124 292753 207641 96666 -63815 -96422 151023 467305
35137 467305 501376 273280 128793 201061 263384 151764 -8964 -84525 -118469 -130200 -25284
35126 -25284 162788 225618 115194 48243 135744 215650 224041 378664 731720 894615 583945
35115 583945 154150 130418 407375 422895 43436 -260995 -172172 53850 88576 29779
$$ packed form
35189G56406k78738k05908o2742n5434j44469j55666p2728k5658n0871m9091L4922
35178c09977J40566J95263J72888O3918j00515k08364j59552J26J20927J17325
35168C2605K9828n2483o6717j0870M0910J2053m6866j828J34942J66609J2431
35157B50614j17129j5916J95811K55151J33039j2743j39577k87259l34967j27027
35147b00003J86460K73582R7085o4371q5112j10975j60481l2607K47445L16282
35137D67305L4071k28096j44487P2268O2323j11620j60728p5561l3944j1731J04916
35126b5284J88072O2830j10424o6951Q7501P9906Q391J54623L53056J62895l10670
35115E83945m29795k3732K76957J5520l79459l04431Q8823K26022L4726n8797
$$ plain form
35105 29779 147526 443035 724290 897528 942271 782848 431966 129487 102660 267378
35095 267378 358999 285389 171958 125193 132396 153978 155536 85457 -35170 -50498 145501
35084 145501 410309 515441 474488 504952 658547 716393 531634 279507 228335 389268
35074 389268 536062 495892 297721 91016 32915 207848 537627 793808 807711 652746
35064 652746 520025 447836 314484 93142 -60753 -38045 63306 110661 141474 256801
35054 256801 404659 434346 318119 158137 6491 -142309 -189703 19703 426079 725984
35044 725984 728487 579926 507575 498977 412220 274148 237581 297552 285590 155806 64657
35033 64657 115207 207517 224247 206423 235621 262456 180796 8531 -114853 -87269 61769
$$ packed form
35105B9779J17747K95509K81255J73238M4743j59423l50882l02479k6827J64718
35095B67378R1621p3610j13431m6765P203K1582J558p0079j20627j5328J95999
35084A45501K64808J05132m0953L0464J53595N7846j84759k52127n1172J60933
35074C89268J46794m0170j98171k06705n8101J74933L29779K56181J3903j54965
35064F52746j32721p2189j33352k21342j53895K2708J01351M7355L0813J15327
35054B56801J47858K9687j16227j59982j51646j48800m7394K09406M06376K99905
35044G25984K503j48561p2351q598q6757j38072l6567N9971j1962j29784r1149
35033F4657N0550R2310J6730j7824K9198K6835q1660j72265j23384K7584J49038
$$ plain form
35022 61769 209834 245291 180826 177451 372693 661418 763614 572519 314418 262174 401678
35011 401678 519068 525420 511811 519738 458288 288482 126342 83773 119265 125560 80375
35000 80375 34167 18330 42649 127067 255205 338509 311238 237955 244624 350567 449194
34989 449194 465962 457549 515160 625497 687758 651964 585431 583680 644147 663691 567936 413961
34977 413961 330650 365740 438667 456553 420777 379389 330942 251683 184932 205526 297770
34966 297770 372711 425378 554380 766283 885949 780847 588277 566629 753761 925531
34956 925531 896998 719590 549157 456667 428085 430648 401152 267156 64101 -50334 17055
34945 17055 164126 229550 192369 153580 182540 264264 337935 312051 119902 -152235 -285612
$$ packed form
35022F1769J48065L5457o4465l375J95242K88725J02196j91095k58101n2244J39504
35011D01678J17390O352j3609P927o1450j69806j62140m2569L5492O295m5185
35000H0375m6208j5837K4319Q4418J28138Q3304k7271p3283O669J05943R8627
34989D49194J6768q413N7611J10337O2261l5794o6533j751O0467J9544r5755j53975
34977D13961q3311L5090P2927J7886l5776m1388m8447p9259o6751K0594R2244
34966B97770P4941N2667J29002K11903J19666j05102j92570k1648J87132J71770
34956I25531k8533j77408j70433r2490k8582K563k9496j33996k03055j14435O7389
34945A7055J47071O5424l7181l8789K8960Q1724P3671k5884j92149k72137j33377
$$ plain form
34934 -285612 -189716 -41975 -23731 -22895 198576 609661 922344 987228 934780 894021 822626
34923 822626 700356 648846 713451 719295 512996 200495 -18346 -118757 -183844 -193530 -83643
34912 -83643 64473 98237 18097 -51058 -72418 -96667 -83903 60909 265626 317767 168593
34901 168593 21997 44047 160185 241875 322217 468916 566382 418872 33805 -359483
34891 -359483 -574601 -621289 -582005 -467237 -256034 5772 228608 367813 432363 425554
34881 425554 332534 171009 15384 -49404 7215 135805 233125 215113 102418 21501 62741
34870 62741 133651 35448 -269877 -552767 -564877 -334729 -102340 -3535 29956 63191 39066
34859 39066 -60347 -97627 43788 272659 411883 427956 404589 357974 239738 94903 53241
$$ packed form
34934b85612R5896J47741J8244Q36K21471M11085L12683O4884n2448m0759p1395
34923H22626j22270n1510O4605N844k06299l12501k18841j00411o5087r686J09887
34912h3643J48116L3764q0140o9155k1360k4249J2764J44812K04717N2141j49174
34901A68593j46596K2050J16138Q1690Q0342J46699R7466j47510l85067l93288
34891c59483k15118m6688L9284J14768K11203K61806K22836J39205O4550o809
34881D25554r3020j61525j55625o4788N6619J28590R7320j8012j12695q0917M1240
34870F2741P0910r8203l05325k82890j2110K30148K32389R8805L3491L3235k4125
34859C9066r9413l7280J41415K28871J39224J6073k3367m6615j18236j44835m1662
$$ plain form
34848 53241 144960 253536 279107 245190 222700 242550 296555 331424 241451 -15195 -274844
34837 -274844 -273383 50712 459810 678368 658230 533167 417141 334272 269845 192526 65914
34826 65914 -88387 -173880 -128083 -19357 17542 -78472 -247379 -363962 -322823 -127613 73837
34815 73837 109418 -23227 -150076 -147248 -90312 -117102 -226986 -303103 -271715 -154798 -18218
34804 -18218 55172 5091 -107971 -118232 25366 132373 4886 -261506 -381374 -258254
34794 -258254 -73708 13425 60225 170469 314791 424311 510743 566301 482206 234873
34784 234873 51470 179630 517995 681420 472531 111339 -85162 -96543 -133045 -274043
34774 -274043 -356772 -236225 -9291 98675 -1447 -191127 -306397 -297892 -228998 -175773
$$ packed form
34848E3241R1719J08576K5571l3917k2490J9850N4005L4869q9973k56646k59649
34837b74844J461L24095M09098K18558k0138j25063j16026q2869o4427p7319j26612
34826F5914j54301q5493M5797J08726L6899r6014j68907j16583M1139J95210K01450
34815G3837L5581j32645j26849K828N6936k6790j09884p6117L1388J16917J36580
34804a8218P3390n0081j13062j0261J43598J07007j27487k66392j19868J23120
34794b58254J84546Q7133M6800J10244J44322J09520Q6432N5558q4095k47333
34784B34873j83403J28160L38365J63425k08889l61192j96501j1381l6502j40998
34774b74043q2729J20547K26934J07966j00122j89680j15270Q505O8894N3225
$$ plain form
34764 -175773 -155816 -128695 -48583 69345 138876 92973 -16412 -60767 7200 101429 144230
34753 144230 182038 278117 355549 280992 94327 5821 114387 259521 247092 120635 81028
34742 81028 197336 343593 412619 449177 529441 620147 630891 546540 444146 402680 422604
34731 422604 407462 230538 -112926 -416162 -425936 -143272 143271 201557 131379 177775 355179
34720 355179 435206 296653 104992 79427 214874 328534 299960 175280 82426 117491
34710 117491 283752 484547 595735 579100 500198 428117 378341 366514 421719 495377 456837
34699 456837 265476 64907 5896 49891 65465 48522 92419 178490 175934 65849 -2358
34688 -2358 69257 194881 262891 298568 379417 494712 593894 693328 822416 918144 888205
$$ packed form
34764a75773J9957K7121Q0112J17928O9531m5903j09385m4355O7967R4229M2801
34753A44230L7808R6079P7432p4557j86665q8506J08566J45134j2429j26457l9607
34742H1028J16308J46257O9026L6558Q0264R0706J0744q4351j02394m1466J9924
34731D22604j5142j76924l43464l03236r774K82664K86543N8286p0178M6396J77404
34720C55179Q0027j38553j91661k5565J35447J13660k8574j24680r2854L5065
34710A17491J66261K00795J11188j6635p8902p2081m9776j1827N5205P3658l8540
34699D56837j91361k00569n9011M3995J5574j6943M3897Q6071k556j10085o8207
34688b358P1615J25624O8010L5677Q0849J15295R9182R9434J29088R5728k9939
$$ plain form
34677 888205 760378 676929 739714 915774 1081700 1122035 1024089 923133 995649 1239344
34667 1239344 1426621 1378010 1220075 1225731 1422541 1540360 1396192 1158443 1105955 1243999
34657 1243999 1327683 1221721 1060249 1019839 1088318 1151707 1200514 1303820 1409735 1328317
34647 1328317 972705 518415 234662 206104 305683 410042 533341 725633 929860 1014170
34637 1014170 928912 782174 737259 831781 914550 808467 554679 426157 625811 1021111
34627 1021111 1284692 1276312 1158274 1123963 1159939 1138908 1012784 806168 519978 177912
34617 177912 -81843 -96595 135224 441516 647473 705152 685944 712599 861584 1053782
34607 1053782 1079508 825540 448981 221557 216220 258630 187748 41236 -50284 -39459 34711
$$ packed form
34677H88205j27827q3449O2785J76060J65926M0335r7946j00956P2516K43695
34667A239344J87277m8611j57935N656J96810J17819j44168k37749n2488J38044
34657A243999Q3684j05962j61472m0410O8479O3389M8807J03306J05915q1418
34647A328317l55612m54290k83753k8558R9579J04359J23299J92292K04227Q4310
34637A014170q5258j46738m4915R4522Q2769j06083k53788j28522J99654L95300
34627A021111K63581q380j18038l4311L5976k1031j26124k06616k86190l42066
34617A77912k59755j4752K31819L06292K05957N7679j9208K6655J48985J92198
34607A053782K5726k53968l76559k27424n337M2410p0882j46512r1520J0825P4170
$$ plain form
34596 34711 142589 278739 401504 416759 249068 -56134 -308314 -314472 -94903 106106
34586 106106 103117 -2071 10199 139582 169571 5064 -184604 -219984 -138603 -65731 2090
34575 2090 148331 355569 501472 495809 340934 111446 -60901 -66795 33063 36333 -122613
34564 -122613 -235415 -107461 125904 179472 53805 40346 272374 519280 524945 345165
34554 345165 206985 189508 209130 212220 208346 173794 84897 18101 73692 214999 310730
34543 310730 320520 310024 302685 267189 243887 303289 353658 199068 -122455 -270450 -38814
34532 -38814 308002 358849 105709 -88812 -26188 116933 156298 188479 355248 537488
34522 537488 510411 298005 154845 219986 362611 384200 242970 51884 -49798 3932
$$ packed form
34596C4711J07878J36150J22765J5255j67691l05202k52180o158K19569K01009
34586A06106k989j05188J2270J29383K9989j64507j89668l5380Q1381P2872O7821
34575B090J46241K07238J45903n663j54875k29488j72347n894R9858L270j58946
34564a22613j12802J27954K33365N3568j25667j3459K32028K46906N665j79780
34554C45165j38180j7477J9622L090l874l4552q8897o6796N5591J41307R5731
34543C10730R790j0496p339l5496k3302N9402N0369j54590l21523j47995K31636
34532c8814L46816N0847k53140j94521O2624J43121L9365L2181J66769J82240
34522E37488k7077k12406j43160O5141J42625K1589j41230j91086j01682N3730
$$ plain form
34512 3932 167930 329163 420765 471017 507419 483386 378748 294740 322554 373359 296106
34501 296106 137781 104296 244456 361794 308693 195185 197159 301623 380266 408859 458475
34490 458475 529811 546101 490640 430633 411078 419311 440645 462736 449031 400792 414668 562939
34478 562939 734149 732106 552267 416334 471235 583100 532384 318813 141973 124042
34468 124042 187520 212565 193491 191104 219154 251479 292791 365211 439790 450054 385015 323320
34456 323320 357052 503652 693151 818797 815983 733877 711426 817840 930718 870382 667870
34445 667870 571473 719443 932022 949720 777950 631881 601610 573258 485153 454164 567362
34434 567362 709375 714675 592043 488958 497434 584816 668875 689692 646338 608276 638325
$$ packed form
34512C932J63998J61233R1602N0252L6402k4033j04638q4008K7814N0805p7253
34501B96106j58325l3485J40160J17338n3101j13508J974J04464P8643K8593M9616
34490D58475P1336J6290n5461o0007j9555Q233K1334K2091j3705m8239J3876J48271
34478E62939J71210k043j79839j35933N4901J11865n0716k13571j76840j7931
34468A24042O3478K5045j9074k387K8050L2325M1312P2420P4579J0264o5039o1695
34456C23320L3732J46600J89499J25646k814q2106k2451J06414J12878o0336k02512
34445F67870r6397J47970K12579J7698j71770j46069l0271k8352q8105l0989J13198
34434E67362J42013N300j22632j03085Q476Q7382Q4059K0817m3354l8062L0049
$$ plain form
34423 638325 675527 582134 356073 191459 241377 409727 483186 401811 291359 281666 401427
34412 401427 609759 821518 925874 877511 757149 677222 668848 720227 837708 963423
34402 963423 932190 679193 432021 494830 840615 1111708 1066703 849043 740817 813734
34392 813734 933664 983957 950294 858076 752933 714369 792226 938738 1064840 1145398 1219990
34381 1219990 1321119 1462517 1678253 2006415 2424039 2837328 3148783 3319331 3370862 3349321
34371 3349321 3282209 3148657 2884649 2442306 1876050 1366867 1105520 1102033 1144629 1022000
34361 1022000 770815 607964 621183 665612 617074 573174 679741 875358 969205 902303
34351 902303 769116 631180 487197 405283 492565 705079 851995 835379 750516 710356
$$ packed form
34423F38325L7202r3393k26061j64614M9918J68350P3459q1375j10452r693J19761
34412D01427K08332K11759J04356m8363j20362p9927q374N1379J17481J25715
34402I63423l1233k52997k47172O2809L45785K71093m5005k17660j08226P2917
34392H13734J19930N0293l3663r2218j05143l8564P7857J46512J26102Q0558P4592
34381A219990J01129J41398K15736L28162M17624M13289L11455J70548N1531k1541
34371C349321o7112j33552k64008m42343n66256n09183k61347l487M2596j22629
34361A022000k51185j62851J3219M4429m8538m3900J06567J95617R3847o6902
34351I02303j33187j37936j43983q1914Q7282K12514J46916j6616q4863m0160
$$ plain form
34341 710356 707481 699680 704195 745336 808621 886604 972367 995486 894775 771390 810618 1008457
34329 1008457 1141864 1072460 906561 774758 647820 502214 482369 704922 1020179 1162336
34319 1162336 1069854 897470 778194 734577 771157 886572 1010315 1061182 1056378 1063171 1082978
34308 1082978 1084299 1091355 1124946 1121837 1044335 998883 1085739 1188366 1101540 850277 688656
34297 688656 762035 947513 1072652 1125890 1172630 1197998 1142055 1025265 951968 1001830 1144261
34286 1144261 1249453 1201681 1030252 888986 870861 917667 971526 1098049 1333040 1521533
34276 1521533 1502439 1385129 1421041 1624303 1754291 1693622 1606055 1655025 1784735 1872670
34266 1872670 1900986 1873841 1758707 1631808 1690470 1968647 2214535 2224649 2136728 2187700
$$ packed form
34341G10356k875p801M515M1141O3285P7983Q5763K3119j00711j23385L9228J97839
34329A008457J33407o9404j65899j31803j26938j45606j9845K22553L15257J42157
34319A162336r2482j72384j19276m3617L6580J15415J23743N0867m804O793J9807
34308A082978J321P056L3591l109p7502m5452Q6856J02627q6826k51263j61621
34297F88656P3379J85478J25139N3238M6740K5368n5943j16790p3297M9862J42431
34286A144261J05192m7772j71429j41266j8125M6806N3859J26523K34991J88493
34276A521533j9094j17310L5912K03262J29988o0669q7567M8970J29710Q7935
34266A872670K8316k7145j15134j26899N8662K78177K45888J0114q7921N0972
$$ plain form
34256 2187700 2331657 2355802 2278114 2331947 2562502 2725598 2666085 2566028 2688453 3032922
34246 3032922 3381066 3580296 3654143 3692042 3743879 3803001 3816595 3728106 3567554 3484046 3630542
34235 3630542 4006956 4442711 4738761 4827411 4818687 4906967 5211828 5688154 6188839 6598569
34225 6598569 6884448 7056446 7166828 7358505 7809011 8553867 9427399 10252717 11036839
34216 11036839 11900969 12894292 14013086 15355740 17069383 19121290 21317568 23629603
34208 23629603 26333186 29733869 33953418 39140525 45702348 54136856 64847674 78402882
34200 78402882 95811431 118268738 146818362 182315550 224493845 269166663 306147425
34193 306147425 322388733 310167219 273253704 224519525 177152957 137978788 107659961
$$ packed form
34256B187700J43957K4145p7688N3833K30555J63096n9513j00057J22425L44469
34246C032922L48144J99230P3847L7899N1837N9122J3594q8489j60552q3508J46496
34235C630542L76414M35755K96050Q8650q724Q8280L04861M76326N00685M09730
34225F598569K85879J71998J10382J91677M50506P44856Q73532Q25318P84122
34216A1036839Q64130R93323J118794J342654J713643K051907K196278K312035
34208B3629603K703583L400683M219549N187107O561823Q434508J0710818J3555208
34200G8402882J7408549K2457307K8549624L5497188M2178295M4672818L6980762
34193C06147425J6241308j2221514l6913515m8734179m7366568l9174169l0318827
$$ plain form
34186 107659961 84599404 67326723 54496542 44722663 37047949 31038151 26310184
34179 26310184 22408158 19138089 16564388 14604082 12963872 11495406 10277167 9316903
34171 9316903 8482591 7748383 7196402 6738736 6151655 5453232 4947439 4792230 4783907 4667902
34161 4667902 4413234 4077364 3659292 3231309 2986766 2987061 3041858 2993093 2947562 3079000
34151 3079000 3372210 3727999 4147327 4598931 4834586 4581964 3886099 3078311 2433149
34142 2433149 2001482 1731244 1572252 1455864 1318181 1179907 1119624 1162277 1257347 1340224
34132 1340224 1345924 1212288 965391 756018 698560 705951 603674 382969 207615 176521
34122 176521 225955 287305 382876 496150 494192 306511 89161 60009 200899 269400 127126
$$ packed form
34186A07659961k3060557j7272681j2830181r773879p674714o009798m727967
34179B6310184l902026l270069k573701j960306j640210j468466j218239r60264
34171I316903q34312p34208n51981m57666n87081o98423n05793j55209q323j16005
34161D667902k54668l35870m18072m27983k44543K95N4797m8765m5531J31438
34151C079000K93210L55789M19328M51604K35655k52622o95865q07788o45162
34142B433149m31667k70238j58992j16388j37683j38274o0283M2653R5070Q2877
34132A340224N700j33636k46897k09373n7458P391j02277k20705j75354l1094
34122A76521M9434O1350R5571J13274j958j87681k17350k9152J40890O8501j42274
$$ plain form
34111 127126 -75008 -109909 24532 128594 82359 -22342 -48205 3026 36064 12052 -31460
34100 -31460 -60487 -55020 25860 186675 315132 272356 87906 -35057 43887 238940 360883
34089 360883 333021 224756 129611 85748 88890 116305 139559 147452 146350 123268 45103 -77087
34077 -77087 -162504 -140958 -33188 81176 143711 130088 26086 -143534 -274574 -241044 -23553
34066 -23553 247930 410630 428894 415835 474401 535575 420834 99662 -185896 -150178 198122
34055 198122 542262 598156 392966 185238 182912 371373 558773 559961 380701 227233
34045 227233 277155 451594 501941 317703 34433 -172992 -259521 -227566 -41229 262358
34035 262358 498092 510751 363726 240694 221539 255425 284704 283258 233699 177383 224234
$$ packed form
34111A27126k02134l4901J34441J04062m6235j04701k5863N1231L3038k4012m3512
34100c1460k9027N467Q0880J60815J28457m2776j84450j22963P8944J95053J21943
34089C60883k7862j08265r5145m3863L142K7415K3254P893j102k3082p8165j22190
34077g7087q5417K1546J07770J14364O2535j3623j04002j69620j31040L3530K17491
34066b3553K71483J62700J8264j3059N8566O1174j14741l21172k85558L5718L48300
34055A98122L44140N5894k05190k07728k326J88461J87400J188j79260j53468
34045B27233M9922J74439N0347j84238k83270k07425q6529L1955J86337L03587
34035B62358K35734J2659j47025j23032j9155L3886K9279j446m9559n6316M6851
$$ plain form
34024 224234 397160 531985 459294 225362 3151 -139573 -222967 -187930 32787 305523
34014 305523 400529 332721 355186 538576 606750 347997 -17294 -110482 74656 163162 -85333
34003 -85333 -462319 -585633 -355411 -28767 106697 29844 -62989 -33305 53043 57849 -37043
33992 -37043 -138433 -191373 -221911 -243267 -222712 -161465 -117643 -115499 -107346 -60053 -5389 34367
33980 34367 91864 167439 167163 14538 -204406 -289854 -140301 119462 245782 118436 -125973
33969 -125973 -227138 -80227 160037 282842 257497 192661 138289 65620 7579 50133 163734
33958 163734 202264 120866 49790 84663 145591 135959 111118 174718 310568 431757 504629
33947 504629 510088 380141 116572 -97783 -60290 209541 510240 697213 757918 706392
$$ packed form
34024B24234J72926J34825p2691k33932k22211j42724q3394L5037K20717K72736
34014C05523R5006o7808K2465J83390O8174k58753l65291r3188J85138Q8506k48495
34003h5333l76986j23314K30222L26644J35464p6853r2833K9684Q6348M806r4892
33992c7043j01390n2940l0538k1356K0555O1247M3822K144Q153M7293N4664L9756
33980C4367N7497P5575k76j52625k18944q5448J49553K59763J26320j27346k44409
33969a25973j01165J46911K40264J22805k5345o4836n4372p2669n8041M2554J13601
33958A63734L8530q1398p1076L4873O0928r632k4841O3600J35850J21189P2872
33947E04629N459j29947k63569k14355L7493K69831L00699J86973O0705n1526
$$ plain form
33937 706392 570031 468684 538756 747538 918677 979518 1060048 1298890 1664320 2032253
33927 2032253 2348156 2629635 2863097 2973331 2881643 2563485 2076272 1555747 1153703 941472
33917 941472 870957 832107 746415 620025 517734 470874 418913 289476 127862 54405 70857
33906 70857 33712 -108431 -186575 -49805 183737 287151 251140 246936 315839 331454 270060
33895 270060 266251 335645 281372 -649 -320915 -452520 -431542 -437594 -501362 -513839 -446207
33884 -446207 -380548 -357217 -341337 -317725 -288288 -198901 -2547 211702 281421 177018 35541
33873 35541 -34171 -80154 -199778 -378621 -492542 -442938 -259564 -74811 3182 -8407 -17204
33862 -17204 -2863 -47876 -191616 -333099 -349070 -249109 -133723 -53983 -13400 -66396 -279058
$$ packed form
33937G06392j36361j01347P0072K08782J71139O0841Q0530K38842L65430L67933
33927B032253L15903K81479K33462J10234r1688l18158m87213n20525m02044k12231
33917I41472p0515l8850q5692j26390j02291m6860n1961j29437j61614p3457J6452
33906G0857l7145j42143p8144J36770K33542J03414l6011m204O8903J5615o1394
33895B70060l809O9394n4273k82021l20266j31605K0978o052o3768j2477O7632
33884d46207O5659K3331J5880K3612K9437Q9387J96354K14249O9719j04403j41477
33873C5541o9712m5983j19624j78843j13921M9604J83374J84753P7993j1589q797
33862a7204J4341m5013j43740j41483j5971R9961J15386P9740M0583n2996k12662
$$ plain form
33851 -279058 -570176 -702783 -508300 -89132 249193 283521 95928 -7247 163514 449745
33841 449745 544950 406325 300097 382125 441371 234921 -85945 -148022 108959 348430
33831 348430 311889 122484 29464 70677 125515 140167 142649 131332 86054 34385 11676
33820 11676 10128 33720 123588 255072 300679 189380 21821 -73371 -120178 -216476 -340608
33809 -340608 -374932 -299148 -232965 -273463 -378444 -428602 -353275 -197246 -96406 -153426 -297693
33798 -297693 -324005 -129835 144421 281862 231217 98092 -33388 -148732 -216595 -187460
33788 -187460 -74988 60980 196183 311741 322681 170098 -29994 -75427 65869 215090
33778 215090 219813 108508 -15378 -99708 -119807 -58301 26159 19754 -89440 -168948 -110767
$$ packed form
33851b79058k91118j32607J94483M19168L38325L4328j87593j03175J70761K86231
33841D49745R5205j38625j06228Q2028N9246k06450l20866o2077K56981K39471
33831C48430l6541j89405r3020M1213N4838J4652K482j1317m5278n1669k2709
33820A1676j548K3592Q9868J31484M5607j11299j67559r5192m6807r6298j24132
33809c40608l4324P5784O6183m0498j04981n0158P5327J56029J00840n7020j44267
33798b97693k6312J94170K74256J37441n0645j33125j31480j15344o7863K9135
33788a87460J12472J35968J35203J15558J0940j52583k00092m5433J41296J49221
33778B15090M723j11305j23886q4330k0099O1506Q4460o405j09194p9508N8181
$$ plain form
33767 -110767 55580 263544 496708 706688 783849 722080 695455 839797 1054742 1161259
33757 1161259 1163158 1184631 1216797 1125659 902342 717289 689668 755011 808716 846847 904774
33746 904774 970051 1022953 1070597 1080812 976013 768439 621280 680264 883968 1019622
33736 1019622 949758 734387 553959 553110 729592 932318 992606 895109 795339 836361 978042
33725 978042 1046162 929765 698316 539377 594865 826494 1025105 991570 728916 418622
33715 418622 206821 90057 28329 52171 173276 286942 290414 242244 267726 336023 283511
33704 283511 71970 -120835 -121979 30817 155650 111900 -114047 -401919 -530641 -342662
33694 -342662 41097 281467 199776 -5328 -40992 85915 130420 -6094 -166785 -211209
$$ packed form
33767a10767J66347K07964K33164K09980P7161o1769k6625J44342K14945J06517
33757A161259J899K1473L2166r1138k23317j85053k7621O5343N3705L8131N7927
33746I04774O5277N2902M7644J0215j04799k07574j47159N8984K03704J35654
33736A019622o9864k15371j80428q49J76482K02726O0288r7497r9770M1022J41681
33725I78042O8120j16397k31449j58939N5488K31629J98611l3535k62654l10294
33715D18622k11801j16764o1728K3842J21105J13666L472m8170K5482O8297n2512
33704B83511k11541j92805j144J52796J24833m3750k25947k87872j28722J87979
33694c42662L83759K40370q1691k05104l5664J26907M4505j36514j60691m4424
$$ plain form
33684 -211209 -183802 -158638 -110099 -34281 -33435 -150665 -249167 -195135 -54097 43662 131471
33673 131471 310390 490127 454014 194783 -29734 -45339 20195 -25373 -144335 -167852
33663 -167852 -80725 -22300 -39724 -18646 112176 249012 253555 134339 15666 -14728 45248
33652 45248 171982 335541 461513 458973 327336 180781 110111 55730 -105428 -352264
33642 -352264 -490630 -374930 -88623 159399 263047 265823 230808 179301 149877 195473 286356
33631 286356 314726 242384 156399 125687 92705 -15901 -147664 -190002 -129366 -48343 6476
33620 6476 57236 103626 88720 -23723 -190291 -319071 -334692 -231061 -92516 -31433 -63254
33609 -63254 -81083 -1050 117139 156501 93617 -16034 -143816 -271833 -319354 -219478 -54510
$$ packed form
33684b11209K7407K5164M8539P5818Q46j17230r8502N4032J41038R7759Q7809
33673A31471J78919J79737l6113k59231k24517j5605O5534m5568j18962k3517
33663a67852Q7127N8425j7424K1078J30822J36836M543j19216j18673l0394N9976
33652D5248J26734J63559J25972k540j31637j46555p0670n4381j61158k46836
33642c52264j38366J15700K86307K48022J03648K776l5015n1507k9424M5596R0883
33631B86356K8370p2342q5985l0712l2982j08606j31763m2338O0636Q1023N4819
33620F476N0760M6390j4906j12443j66568j28780j5621J03631J38545O1083l1821
33609f3254j7829Q0033J18189L9362o2884j09651j27782j28017m7521R9876J64968
$$ plain form
33598 -54510 16808 -31858 -86626 -95941 -132032 -223084 -284128 -281473 -315889 -439792 -514875 -380376
33586 -380376 -84863 172521 282505 295552 281425 228510 101345 -57256 -113087 42757
33576 42757 328075 472207 299578 -12000 -119512 29632 146354 72301 34179 236787
33566 236787 452063 329946 -27187 -173170 27152 222720 128169 -92301 -159477 -119208
33556 -119208 -208831 -453314 -637882 -608886 -409314 -154597 67827 192492 197492 136935
33546 136935 80351 42583 21652 41007 85923 72873 -33735 -147435 -186716 -186030 -178915 -86160
33534 -86160 120541 243943 71774 -271165 -415587 -221928 56471 152901 115800 132155
33524 132155 209425 223920 174509 178287 245199 244187 118138 -14701 -28616 46255 93823
$$ packed form
33598e4510P1318m8666n4768r315l6091r1052o1044K655l4416j23903p5083J34499
33586c80376K95513K57384J09984J3047j4127n2915j27165j58601n5831J55844
33576D2757K85318J44132j72629l11578j07512J49144J16722p4053l8122K02608
33566B36787K15276j22117l57133j45983K00322J95568r4551k20470o7176M0269
33556a19208q9623k44483j84568K8996J99572K54717K22424J24665N000o0557
33546A36935n6584l7768k0931J9355M4916j3050j06608j13700l9281O86P115R2755
33534h6160K06701J23402j72169l42939j44422J93659K78399R6430l7101J6355
33524A32155P7270J4495m9411L778O6912j012j26049j32839j3915P4871M7568
$$ plain form
33513 93823 71225 25443 -6095 -34851 -65037 -59401 11293 115551 197984 266166 393032
33502 393032 596062 747425 679605 397948 119337 44284 130745 161605 19542 -183385
33492 -183385 -269460 -221659 -190771 -300292 -501498 -636641 -608368 -452670 -263209 -99553
33482 -99553 11260 42790 5919 -11302 70232 188399 189476 47276 -67303 -12355 118409
33471 118409 131916 20647 -32965 78472 270082 434141 568931 668740 632802 413198
33461 413198 163260 92974 206082 298090 206970 -25829 -232702 -273722 -129975 67217
33451 67217 112966 -69486 -306473 -347641 -158409 65689 172641 202546 228877 208848 95881
33440 95881 -18608 -23479 9807 -99563 -356055 -510171 -343044 33639 256390 108325
$$ packed form
33513I3823k2598m5782l1538k8756l0186N636P0694J04258Q2433O8182J26866
33502C93032K03030J51363o7820k81657k78611p5053Q6461L0860j42063k02927
33492a83385q6075M7801L0888j09521k01206j35143K8273J55698J89461J63656
33482i9553J10813L1530l6871j7221Q1534J18167J077j42200j14579N4948J30764
33471A18409J3507j11269n3612J11437J91610J64059J34790R9809l5938k19604
33461D13198k49938p0286J13108R2008r1120k32799k06873m1020J43747J97192
33451F7217M5749j82452k36987m1168J89232K24098J06952K9905K6331k0029j12967
33440I5881j14489m871L3286j09370k56492j54116J67127L76683K22751j48065
$$ plain form
33430 108325 -219737 -336537 -108715 192678 260257 145175 133642 303620 428465 340244
33420 340244 154476 37697 -29556 -102065 -81151 101079 254085 152452 -84323 -106070
33410 -106070 187771 537016 707408 734162 722454 657771 531048 439936 420652 350006 163348
33399 163348 15921 57434 170612 123527 -94373 -271652 -273768 -181084 -137755 -198499 -334665
33388 -334665 -487823 -599266 -648855 -661800 -641802 -543908 -363490 -187397 -87588 -28088 49393
33377 49393 120963 148631 182375 304997 545241 917057 1424151 1912264 2067124 1754915
33367 1754915 1259838 962766 867245 698768 411548 271649 400336 557799 508987 336890
33357 336890 225841 160692 42593 -73009 -74518 -14699 -31785 -132194 -224940 -287558 -322752
$$ packed form
33430A08325l28062j16800K27822L01393O7579j15082j1533J69978J24845q8221
33420C40244j85768j16779o7253p2509K0914J82230J53006j01633k36775k1747
33410a06070K93841L49245J70392K6754j1708o4683j26723r1112j9284p0646j86658
33399A63348j47427M1513J13178m7085k17900j77279k116R2684M3329o0744j36166
33388c34665j53158j11443m9589j2945J9998R7894J80418J76093R9809N9500P7481
33377D9393P1570K7668L3744J22622K40244L71816N07094M88113J54860l12209
33367A754915m95077k97072r5521j68477k87220j39899J28687J57463m8812j72097
33357C36890j11049o5149j18099j15602j509N9819j7086j00409r2746o2618l5194
$$ plain form
33346 -322752 -239368 14501 254537 223510 -46374 -241317 -175252 -11654 -8600 -186966
33336 -186966 -342643 -300520 -79338 153675 254143 241140 240888 266304 161035 -121201 -305906
33325 -305906 -101873 325292 473288 163897 -194539 -157932 181148 393094 299513 87767
33315 87767 -58661 -146125 -194956 -148684 -26424 36511 -17297 -81957 -55367 48864 194257
33304 194257 357819 424010 247109 -77569 -214638 -23321 199994 129681 -104636 -124009
33294 -124009 116053 288641 236204 189657 330412 444889 236304 -216184 -544455 -532354
33284 -532354 -275661 21245 226518 302961 305874 335796 384062 289778 -23090 -351518 -433267
33273 -433267 -307462 -254940 -387489 -498583 -365972 -39022 234308 250405 -4093 -329590
$$ packed form
33346c22752Q3384K53869K40036l1027k69884j94943O6065J63598L054j78366
33336a86966j55677M2123K21182K33013J00468j3003k52K5416j05269k82236j84705
33325c05906K04033M27165J47996l09391l58436L6607L39080K11946r3581k11746
33315H7767j46428q7464m8831M6272J22260O2935n3808o4660K6590J04231J45393
33304A94257J63562O6191j76901l24678j37069J91317K23315p0313k34317j9373
33294a24009K40062J72588n2437m6547J40755J14477k08585m52488l28271J2101
33284e32354K56693K96906K05273P6443K913K9922M8266r4284l12868l28428q1749
33273d33267J25805N2522j32549j11094J32611L26950K73330J6097k54498l25497
$$ plain form
33263 -329590 -435775 -230196 20307 -8864 -239714 -262039 89275 489528 580986 422557
33253 422557 287451 227094 99065 -106919 -254434 -319309 -410548 -538703 -577361 -468263
33243 -468263 -286012 -94629 89212 194864 148254 39976 54612 197504 274457 188953
33233 188953 70511 38045 27149 -40033 -87493 -31028 41708 -10047 -171742 -317501 -381805
33222 -381805 -360754 -228329 -4008 154175 88919 -135673 -289384 -251416 -112186 -4925
33212 -4925 32564 3671 -114035 -313857 -507040 -583227 -500486 -311027 -140354 -124080 -283160
33201 -283160 -451423 -411060 -129958 205894 418275 505274 541098 514673 374803 176159
33191 176159 48589 18183 -29607 -170052 -307863 -287285 -82009 187588 393708 490189
$$ packed form
33263c29590j06185K05579K50503k9171k30850k2325L51314M00253R1458j58429
33253D22557j35106o0357j28029k05984j47515o4875r1239j28155l8658J09098
33243d68263J82251J91383J83841J05652m6610j08278J4636J42892P6953q5504
33233A88953j18442l2466j0896o7182m7460N6465P2736n1755j61695j45759o4304
33222c81805K1051J32425K24321J58183o5256k24592j53711L7968J39230J07261
33212d925L7489k8893j17706j99822j93183p6187Q2741J89459J70673J6274j59080
33201b83160j68263M0363K81102L35852K12381Q6999L5824k6425j39870j98644
33191A76159j27570l0406m7790j40445j37811K0578K05276K69597K06120R6481
$$ plain form
33181 490189 479234 370404 201028 47055 -26224 -9718 60120 125161 115369 -5073 -166725
33170 -166725 -228025 -140184 -35207 -72226 -224810 -315745 -259315 -163717 -160261 -224316 -226391
33159 -226391 -97165 116566 305966 353997 195901 -96705 -335298 -400826 -379430 -427239
33149 -427239 -533766 -537099 -374158 -182732 -101049 -79048 14456 166011 215538 71663 -160036
33138 -160036 -285029 -208221 -7847 135963 83842 -143318 -369334 -416476 -265611 -47479
33128 -47479 105407 151808 105784 -9282 -146240 -243447 -287304 -310781 -307960 -239934 -172009
33117 -172009 -275866 -568981 -761339 -565215 -121084 118653 -31216 -263139 -236498 -26798
33107 -26798 83508 71518 142535 320319 389548 275215 185405 262614 338395 212291 -7339
$$ packed form
33181D90189j0955j08830j69376j53973p3279J6506O9838O5041r792j20442j61652
33170a66725o1300Q7841J04977l7019j52584r0935N6430R5598L456o4055k075
33159b26391J29226K13731J89400M8031j58096k92606k38593o5528K1396m7809
33149d27239j06527l333J62941J91426Q1683K2001R3504J51555M9527j43875k31699
33138a60036j24993P6808K00374J43810n2121k27160k26016m7142J50865K18132
33128d7479J52886M6401m6024j15066j36958r7207m3857k3477K821O8026O7925
33117a72009j03857k93115j92358J96124M44131K39737j49869k31923K6641K09700
33107b6798J10306j1990P1017J77784O9229j14333q9810P7209P5781j26104k19630
$$ plain form
33096 -7339 -62582 56267 107883 -18682 -131101 -7509 301809 547574 584751 502400 459429
33085 459429 472037 421759 258339 109468 116826 211302 179935 -24963 -186205 -117174 65316
33074 65316 104705 -35931 -151521 -112575 -24654 -28546 -97697 -119871 -63577 36832 169101
33063 169101 299158 308935 122952 -121725 -179081 -1941 175823 129892 -82174 -233013
33053 -233013 -233077 -193845 -204849 -191284 -42593 219530 473659 631145 664875 565558 362357
33042 362357 162982 89165 170529 346940 542274 675714 655315 469254 261791 203795
33032 203795 288083 358311 330483 257386 178066 68686 -24298 15455 161592 209216 65402
33021 65402 -93662 -102011 -71102 -177580 -330401 -314586 -186454 -223353 -468876 -619923 -459161
$$ packed form
33096g339n5243J18849N1616j26565j12419J23592L09318K45765L7177q2351m2971
33085D59429J2608n0278j63420j48871P358R4476l1367k04898j61242O9031J82490
33074F5316L9389j40636j15590L8946Q7921l892o9151k2174N6294J00409J32269
33063A69101J30057R777j85983k44677n7356J77140J77764m5931k12066j50839
33053b33013o4L9232j1004J3565J48691K62123K54129J57486L3730r9317k03201
33042C62357j99375p3817Q1364J76411J95334J33440k0399j86061k07463n7996
33032B03795Q4288P0228k7828p3097p9320j09380r2984L9753J46137M7624j43814
33021F5402j59064q349L0909j06478j52821J5815J28132l6899k45523j51047J60762
$$ plain form
33010 -459161 -156967 -4372 -36962 -90107 -87021 -85554 -112990 -127697 -127044 -160877 -231730 -276224
32998 -276224 -257421 -210814 -190409 -212202 -250477 -259398 -204112 -88961 53501 194377 293852
32987 293852 274164 90211 -158434 -284157 -233834 -171630 -267244 -473332 -605901 -593893
32977 -593893 -537215 -530341 -538618 -481094 -359211 -248792 -194865 -162952 -101654 -26872 -9540
32966 -9540 -68695 -115247 -49932 103704 230593 283334 325931 397260 427085 356674 274182
32955 274182 330716 531427 685164 587524 234250 -151266 -303014 -146359 145517 342203
32945 342203 376436 328130 238588 70188 -133269 -201771 -60341 106576 52407 -205313
32935 -205313 -383967 -271987 27319 218575 123422 -167719 -425904 -525016 -524122 -517211 -483166
$$ packed form
33010d59161L02194J52595l2590n3145L086J467k7436j4707O53l3833p0853m4494
32998b76224J8803M6607K0405k1793l8275q921N5286J15151J42462J40876R9475
32987B93852j9688j83953k48645j25723N0323O2204r5614k06088j32569J2008
32977e93893N6678O874q277N7524J21883J10419N3927L1913O1298P4782J7332
32966i540n9155m6552O5315J53636J26889N2741M2597P1329K9825p0411q2492
32955B74182N6534K00711J53737r7640l53274l85516j51748J56655K91876J96686
32945C42203L4233m8306q9542j68400k03457o8502J41430J66917n4169k57720
32935b05313j78654J11980K99306J91256r5153k91141k58185r9112Q94O911L4045
$$ plain form
32924 -483166 -365966 -236418 -217690 -259408 -178385 24117 100082 -61210 -191602 -893
32914 -893 369782 514181 310767 34531 -72226 -68321 -94054 -131664 -112546 -87841 -150640
32903 -150640 -291024 -426142 -486992 -418542 -212079 801 28174 -118874 -188376 -30318
32893 -30318 171022 171838 46070 63034 249686 330074 140443 -115161 -136853 89949 319840
32882 319840 368403 270112 150213 75324 56971 98444 170961 200159 150346 94384 121810
32871 121810 188078 152357 -8354 -125889 -53462 131685 239370 220256 186828 214842 260253
32860 260253 271176 247181 171970 27086 -92112 -22237 235930 462350 481967 367129
32850 367129 285479 272730 280552 333507 473941 624663 677558 678287 757037 899577 961224
$$ packed form
32924d83166J17200J29548J8728m1718Q1023K02502P5965j61292j30392J90709
32914h93L70675J44399k03414k76236j06757L905k5733l7610J9118K4705o2799
32903a50640j40384j35118o0850O8450K06463K12880K7373j47048o9502J58058
32893c0318K01340Q16j25768J6964J86652Q0388j89631k55604k1692K26802K29891
32882C19840M8563r8291j19899p4889j8353M1473P2517K9198m9813n5962K7426
32871A21810O6268l5721j60711j17535P2427J85147J07685j9114l3428K8014M5411
32860B60253J0923k3995p5211j44884j19198O9875K58167K26420J9617j14838
32850C67129q1650j2749P822N2955J40434J50722N2895P29P8750J42540O1647
$$ plain form
32839 961224 912957 896465 990070 1079155 1035267 898429 798473 799419 906825 1129513 1418796
32828 1418796 1607537 1536877 1245985 958790 873105 1001790 1204150 1324466 1310733 1245544
32818 1245544 1262630 1405219 1573956 1634185 1550602 1387659 1214849 1071404 1003628 1049208
32808 1049208 1151278 1154042 952511 629408 382757 313203 339504 342678 321189 333362 336075
32797 336075 202267 -78031 -324973 -369814 -252100 -129911 -62597 -5576 22730 -60414
32787 -60414 -204479 -192440 87896 449405 613126 541782 421983 351076 219473 -53868
32777 -53868 -329412 -407700 -297952 -200658 -248945 -373219 -423738 -338342 -170792 -25942 8987
32766 8987 -68205 -149300 -115993 8598 71345 -19237 -187641 -319524 -403319 -465947 -458414
$$ packed form
32839I61224m8267j6492R3605Q9085m3888j36838r9956R46J07406K22688K89283
32828A418796J88741p0660k90892k87195q5685J28685K02360J20316j3733o5189
32818A245544J7086J42589J68737O0229q3583j62943j72810j43445o7776M5580
32808A049208J02070K764k01531l23103k46651o9554K6301L174k1489J2173K713
32797C36075j33808k80298k46942m4841J17714J22189O7314N7021K8306q3144
32787f0414j44065J2039K80336L61509J63721p1344j19799p0907j31603k73341
32777e3868k75544p8288J09748R7294m8287j24274n0519Q5396J67550J44850L4929
32766H987p7192q1095L3307J24591O2747r0582j68404j31883q3795o2628P533
$$ plain form
32755 -458414 -331854 -175822 -138221 -220418 -286353 -274284 -255688 -264726 -226363 -112347 -23959
32744 -23959 -36226 -87815 -120306 -200819 -385086 -568292 -615291 -556685 -506837 -453390 -289827
32733 -289827 -21412 213874 310695 251899 43137 -245092 -402302 -244639 118506 361769
32723 361769 328223 171757 76490 23969 -74222 -189253 -250492 -280233 -325063 -349465 -307647
32712 -307647 -230577 -146055 -18244 129855 157170 4687 -160353 -166783 -108515 -194286 -392732
32701 -392732 -449014 -247529 51779 265879 379740 427956 373456 211967 64548 50992
32691 50992 149933 259049 307895 246448 31800 -271355 -465354 -418194 -239342 -145810 -188057
32680 -188057 -224704 -157743 -71025 -96046 -221978 -301568 -222327 -29489 133495 196714 240420
$$ packed form
32755d58414J26560J56032L7601q2197o5935J2069J8596r038L8363J14016Q8388
32744b3959j2267n1589l2491q0513j84267j83206m6999N8606M9848N3447J63563
32733b89827K68415K35286R6821n8796k08762k88229j57210J57663L63145K43263
32723C61769l3546j56466r5267n2521r8191j15031o1239k9741m4830k4402M1818
32712c07647P7070Q4522J27811J48099K7315j52483j65040o430N8268q5771j98446
32701c92732n6282K01485K99308K14100J13861M8216n4500j61489j47419j3556
32691E0992R8941J09116M8846o1447k14648l03155j93999M7160J78852R3532m2247
32680a88057l6647O6961Q6718k5021j25932p9590P9241J92838J62984O3219M3706
$$ plain form
32669 240420 359944 486405 444636 215211 19530 53167 227443 303848 219168 112215
32659 112215 50526 -69894 -292275 -445375 -355109 -103582 68251 66625 22789 82916 236211
32648 236211 360757 349779 176473 -93808 -335290 -453352 -449717 -369104 -228138 -67452
32638 -67452 -13569 -155526 -376119 -456581 -368341 -299851 -340314 -315246 -58815 295418 463725
32627 463725 367764 180847 78831 102423 217605 339665 322024 100719 -153329 -209901
32617 -209901 -115864 -146135 -372964 -524961 -406431 -236807 -350361 -691963 -871423 -690713
32607 -690713 -380533 -260628 -345306 -388285 -216194 89551 310887 321395 191922 93131
32597 93131 103381 131151 42541 -165032 -358794 -424947 -380497 -333119 -371090 -498979 -646214
$$ packed form
32669B40420J19524J26461m1769k29425j95681L3637J74276P6405q4680j06953
32659A12215o1689j20420k22381j53100R0266K51527J71833j626m3836O0127J53295
32648B36211J24546j0978j73306k70281k41482j18062L635Q0613J40966J60686
32638f7452N3883j41957k20593q0462Q8240O8490m0463K5068K56431L54233J68307
32627D63725r5961j86917j02016K3592J15182J22060j7641k21305k54048n6572
32617b09901R4037l0271k26829j51997J18530J69624j13554l41602j79460J80710
32607f90713L10180J19905q4678m2979J72091L05745K21336J0508j29473r8791
32597I3131J0250K7770q8610k07573j93762o6153M4450M7378l7971j27889j47235
$$ plain form
32586 -646214 -719828 -664111 -489716 -259232 -50694 81026 132370 139280 124948 80417 16721
32575 16721 -9384 27947 67329 48025 -578 -46573 -155560 -356487 -479042 -343753 -93654
32564 -93654 -70820 -316256 -482042 -358064 -184712 -237733 -384069 -342303 -162206 -94674
32554 -94674 -131380 -51518 143460 216373 104281 -10755 -58166 -155934 -285452 -251844 -70418
32543 -70418 -42786 -293214 -543188 -528215 -352678 -234639 -174280 -104546 -119193 -291192 -473219
32532 -473219 -537607 -619529 -847988 -1021198 -866890 -493669 -257828 -261597 -294545 -223078 -133673
32521 -133673 -101688 -97581 -133697 -256834 -382739 -363111 -219891 -101047 -27527 80739 159050
32510 159050 58588 -140286 -168847 24283 187579 162101 90169 125905 198748 205251 210529
$$ packed form
32586f46214p3614N5717J74395K30484K08538J31720N1344O910j4332m4531o3696
32575A6721k6105L7331L9382j9304m8603m5995j08987k00927j22555J35289K50099
32564i3654K2834k45436j65786J23978J73352n3021j46336M1766J80097O7532
32554i4674l6706P9862J94978P2913j12092j15036m7411r7768j29518L3608J81426
32543g0418K7632k50428k49974J4973J75537J18039O0359O9734j4647j71999j82027
32532d73219o4388q1922k28459j73210J54308L73221K35841l769l2948P1467Q9405
32521a33673L1985M107l6116j23137j25905J9628J43220J18844P3520J08266P8311
32510A59050j00462j98874k8561J93130J63296k5478p1932L5736P2843O503N278
$$ plain form
32499 210529 299845 405314 420798 344845 210958 32406 -106687 -87396 41856 99899
32489 99899 74587 140730 289308 245609 -77723 -359029 -337448 -214187 -287490 -450015 -416560
32478 -416560 -252729 -262497 -460910 -572709 -511234 -459365 -470716 -380556 -169653 -50799 -96078
32467 -96078 -113797 -17283 6480 -144703 -259708 -147067 49275 86398 -21067 -95493 -85963
32456 -85963 -56795 -21558 16690 -20473 -148234 -211064 -98083 50038 42938 -64898 -96557
32445 -96557 -68050 -136479 -296066 -378619 -331926 -255958 -175747 -33409 84999 -3268 -237718
32434 -237718 -300260 -64055 197684 216647 104621 98601 132583 -34403 -363928 -532983
32424 -532983 -393623 -165346 -99592 -175210 -230023 -213670 -179123 -150487 -126920 -127955 -129630
$$ packed form
32499B10529Q9316J05469J5484p5953j33887j78552j39093J9291J29252N8043
32489I9899k5312O6143J48578m3699l23332k81306K1581J23261p3303j62525L3455
32478d16560J63831r768j98413j11799O1475N1869j1351R0160K10903J18854m5279
32467i6078j7719R6514K3763j51183j15005J12641J96342L7123j07465p4426R530
32456h5963K9168L5237L8248l7163j27761o2830J12981J48121p100j07836l1659
32445i6557K8507o8429j59587q2553M6693P5968Q0211J42338J18408q8267k34450
32434b37718o2542K36205K61739J8963j12026o020L3982j66986l29525j69055
32424e32983J39360K28277O5754p5618n4813J6353L4547K8636K3567j035j675
$$ plain form
32413 -129630 -47037 110669 165132 -13145 -289025 -424261 -402171 -412005 -530357 -618422 -569687
32402 -569687 -465286 -401179 -333655 -216437 -146733 -220954 -344928 -353912 -265864 -256130 -403786
32391 -403786 -607629 -749164 -805963 -792514 -708984 -577018 -438961 -310928 -213596 -228394
32381 -228394 -412974 -671428 -834508 -875506 -920776 -1040787 -1180399 -1325249 -1572936 -1965183
32371 -1965183 -2380645 -2662745 -2731562 -2528750 -2032603 -1419918 -1018627 -943128 -932422 -717661
32361 -717661 -394554 -227693 -236082 -238299 -206014 -263747 -370865 -328511 -145749 -90210 -268045
32350 -268045 -427333 -329282 -78969 93109 175314 287133 401525 387618 242834 78042
32340 78042 -62307 -178697 -186340 -16023 195659 233718 113026 39571 44884 -97384 -489213
$$ packed form
32413a29630Q2593J57706N4463j78277k75880j35236K2090r834j18352q8065M8735
32402e69687J04401O4107O7524J17218O9704p4221j23974q984Q8048R734j47656
32391d03786k03843j41535n6799J3449Q3530J31966J38057J28033R7332j4798
32381b28394j84580k58454j63080m0998m5270j20011j39612j44850k47687l92247
32371a965183m15462k82100o8817K02812M96147O12685M01291P5499J0706K14761
32361g17661L23107J66861q389k217L2285n7733j07118M2354J82762N5539j77835
32350b68045j59288R8051K50313J72078Q2205J11819J14392j3907j44784j64792
32340G8042j40349j16390p643J70317K11682L8059j20692p3455N313j42268l91829
$$ plain form
32329 -489213 -850590 -818550 -395037 68502 283776 276438 231784 227299 188202 49709 -127310
32318 -127310 -232622 -248306 -239456 -211063 -82689 142897 302807 280821 197226 232389 327278
32307 327278 264410 28054 -150392 -145659 -94731 -105932 -58259 143836 334753 332765 252712
32296 252712 316490 476536 514018 429602 417466 473850 375579 103803 -52816 45230 139686
32285 139686 -12086 -239583 -239934 -58287 17366 -75297 -124580 -29046 65095 43145 -11960
32274 -11960 -5083 16646 -23859 -120182 -245634 -391055 -491274 -460399 -346910 -292309 -282414
32263 -282414 -131903 191081 435029 417703 318180 395228 556966 487473 144751 -152873
32253 -152873 -164274 3602 140714 226098 341448 459826 486241 418417 324352 215079
$$ packed form
32329d89213l61377L2040M23513M63539K15274p338m4654m485l9097j38493j77019
32318a27310j05312j5684Q850K8393J28374K25586J59910k1986q3595L5163R4889
32307C27278o2868k36356j78446M733N0928j1201M7673K02095J90917j988q0053
32296B52712O3778J60046L7482q4416j2136N6384r8271k71776j56619R8046R4456
32285A39686j51772k27497l51J81647P5653r2663m9283R5534R4141k1950n5105
32274a1960O877K1729m0505r6323j25452j45421j00219L0875J13489N4601R895
32263b82414J50511L22984K43948j7326r9523P7048J61738o9493l42722k97624
32253a52873j1401J67876J37112Q5384J15350J18378K6415o7824r4065j09273
$$ plain form
32243 215079 60538 -108388 -224671 -288023 -348388 -407323 -423909 -399884 -369340 -316974 -200018
32232 -200018 -49594 44307 60757 71710 119932 163709 171506 175501 180666 114458 -51322 -196148
32220 -196148 -164787 42945 270759 367218 284231 59537 -204528 -368619 -368923 -307299 -336669
32209 -336669 -452140 -499541 -407486 -287573 -249697 -238652 -152684 -32912 -5451 -75748 -107185
32198 -107185 -7796 159308 270875 278108 227162 196653 229164 291674 306620 248774 185140
32187 185140 180959 207149 196991 146469 81270 -23868 -183693 -297364 -242727 -76019 -384
32176 -384 -109571 -288915 -399933 -425787 -385797 -253665 -46863 128661 220455 306242 436784
32165 436784 525964 510967 488092 531303 494584 203102 -222407 -452253 -349330 -86767
$$ packed form
32243B15079j54541j68926j16283o3352o0365n8935j6586K4025L0544N2366J16956
32232b00018J50424R3901J6450J0953M8222M3777P797L995N165o6208j65780j44826
32220a96148L1361K07732K27814R6459q2987k24694k64065j64091l04O1624k9370
32209c36669j15471m7401R2055J19913L7876J1045Q5968J19772K7461p0297l1437
32198a07185R9389J67104J11567P233n0946l0509L2511O2510J4946n7846o3634
32187A85140m181K6190j0158n0522o5199j05138j59825j13671N4637J66708P5635
32176c84j09187j79344j11018k5854L9990J32132K06802J75524R1794Q5787J30542
32165D36784Q9180j4997k2875M3211l6719k91482m25509k29846J02923K62563
$$ plain form
32155 -86767 140116 310985 444075 468057 339250 146196 -8197 -122089 -206486 -196828
32145 -196828 -63507 78858 94586 4195 -73497 -118010 -228895 -449718 -667736 -731662
32135 -731662 -630378 -514292 -525589 -616345 -582258 -316143 27057 207762 204996 208063 307881
32124 307881 365253 249220 47109 -75494 -95485 -78038 -11590 137359 278918 293949
32114 293949 243947 303354 475551 554416 414455 181583 43937 29352 60250 106268 160582
32103 160582 154081 37263 -92790 -87251 36970 106122 41165 -28724 26979 130923 114458
32092 114458 -19153 -96242 -38160 23955 -37474 -143404 -130515 5176 124072 160909 172215
32081 172215 161669 24439 -259129 -501255 -494454 -262253 -28530 24065 -111703 -327678
$$ packed form
32155h6767K26883J70869J33090K3982j28807j93054j54393j13892q4397R658
32145a96828J33321J42365J5728r0391p7692m4513j10885k20823k18018o3926
32135g31662J01284J16086j1297r0756L4087K66115L43200J80705k766L067R9818
32124C07881N7372j16033k02111j22603j9991J7447O6448J48949J41559J5031
32114B93949n0002N9407J72197P8865j39961k32872j37646j4585L0898M6018N4314
32103A60582o501j16818j30053N539J24221O9152o4957o9889N5703J03944j6465
32092A14458j33611p7089N8082O2115o1429j05930J2889J35691J18896L6837J1306
32081A72215j0546j37230k83568k42126O801K32201K33723N2595j35768k15975
$$ plain form
32071 -327678 -494901 -515197 -381174 -211878 -161225 -253017 -344658 -289583 -112831 19024
32061 19024 6588 -58074 -31090 57734 37337 -123087 -217898 -99645 77120 96086 42398
32050 42398 149715 342385 288397 -28238 -169476 125994 508759 505810 175612 -71169
32040 -71169 -100413 -100367 -123733 -26367 154159 182005 37853 -41189 -18620 -150680 -472616
32029 -472616 -600456 -297825 106457 183672 9720 -53706 36100 35474 -60644 24560 333341
32018 333341 513411 332424 60694 113315 469434 685062 461322 19789 -166686 60201
32008 60201 370966 378996 126380 -18218 99874 223727 104417 -126076 -193385 -105806
31998 -105806 -78750 -141756 -116080 36539 133103 89966 63893 165953 258959 197417 98275
$$ packed form
32071c27678j67223k0296J34023J69296N0653r1792r1641N5075J76752J31855
32061A9024j2436o4662K6984Q8824k0397j60424r4811J18253J76765J8966n3688
32050D2398J07317J92670n3988l16635j41238K95470L82765k949l30198k46781
32040g1169k9244M6k3366R7366J80526K7846j44152p9042K2569j32060l21936
32029d72616j27840L02631M04282P7215j73952o3426Q9806o26r6118Q5204L08781
32018C33341J80070j80987k71730N2621L56119K15628k23740m41533j86475K26887
32008F0201L10765Q030k52616j44598J18092J23853j19310k30493o7309Q7579
31998a05806K7056o3006K5676J52619R6564m3137k6073J02060R3006o1542r9142
$$ plain form
31987 98275 176305 402151 520558 390639 144718 -18372 -65612 -86435 -110016 -79908 6054
31976 6054 48709 -2049 -32806 96793 344783 532037 579650 562670 521197 390001 173626
31965 173626 14512 -15098 -22010 -69995 -31186 168745 339132 289856 150119 138502 147309
31954 147309 -85521 -445324 -487459 -77630 389417 547206 498762 513813 586023 546271
31944 546271 400673 290108 252872 258276 361153 606360 869506 987976 976402 952783
31934 952783 952626 979447 1108258 1330525 1415579 1174777 786172 600779 675369 759398 715465
31923 715465 662360 674918 633435 464840 287280 195299 111112 -20161 -78346 33949 198148
31912 198148 253000 241138 309117 446826 504250 427144 313018 235464 150316 5381 -153815
$$ packed form
31987I8275P8030K25846J18407j29919k45921j63090m7240k0823k3581L0108Q5962
31976F054M2655n0758l0757J29599K47990J87254M7613j6980m1473j31196k16375
31965A73626j59114k9610o912m7985L8809J99931J70387m9276j39737j1617Q807
31954A47309k32830l59803m2135M09829M67047J57789m8444J5051P2210l9752
31944E46271j45598j10565l7236N404J02877K45207K63146J18470j1574k3619
31934I52783j57K6821J28811K22267Q5054k40802l88605j85393P4590Q4029m3933
31923G15465n3105J2558m1483j68595j77560r1981q4187j31273n8185J12295J64199
31912A98148N4852j1862O7979J37709N7424p7106j14126p7554q5148j44935j59196
$$ plain form
31901 -153815 -231707 -190088 -82106 6020 45966 92627 181557 212895 28006 -363113 -727869
31890 -727869 -858274 -791798 -698240 -632412 -533512 -417818 -403425 -528279 -687535 -792584
31880 -792584 -864812 -919278 -891561 -773865 -700756 -760513 -807205 -632614 -291972 -75646 -135838
31869 -135838 -314459 -401854 -400068 -422611 -477167 -497778 -490519 -479561 -381110 -121383 151008
31858 151008 173574 -85043 -366121 -450868 -384119 -310858 -258412 -180461 -87885 -34305 -63914
31847 -63914 -225362 -506113 -708255 -586541 -219167 -30364 -265407 -631634 -689525 -434976
31837 -434976 -204943 -122588 9867 273808 439129 308558 -5611 -275865 -432143 -523346
31827 -523346 -574763 -599884 -622140 -595276 -428427 -160148 32243 66846 52203 76560 72732
$$ packed form
31901a53815p7892M1619J07982Q8126L9946M6661Q8930L1338j84889l91119l64756
31890g27869j30405O6476R3558O5828R8900J15694J4393j24854j59256j05049
31880g92584p2228n4466K7717J17696P3109n9757m6692J74591L40642K16326o0192
31869a35838j78621q7395J786k2543n4556k0611P259J0958R8451K59727K72391
31858A51008K2566k58617k81078q4747O6749P3261N2446P7951R2576N3580k9609
31847f3914j61448k80751k02142J21714L67374J88803k35043l66227n7891K54549
31837d34976K30033Q2355J32455K63941J65321j30571l14169k70254j56278r1203
31827e23346n1417k5121k2256K6864J66849K68279J92391L4603j4643K4357l828
$$ plain form
31816 72732 -3124 -29710 91903 237422 209516 15530 -135987 -68496 211566 524887
31806 524887 622396 384435 -14571 -252357 -225820 -132046 -136338 -167966 -150359 -192206 -358150
31795 -358150 -464342 -351585 -193680 -255949 -472667 -558090 -448322 -327011 -265981 -160616
31785 -160616 -18581 -397 -130409 -245165 -277853 -326566 -391113 -330237 -164237 -126631 -282600
31774 -282600 -369914 -192979 62817 108294 -54841 -222983 -315295 -400997 -515892 -632745
31764 -632745 -724971 -725597 -542051 -241247 -69669 -133942 -222387 -130568 1694 -83834 -335099
31753 -335099 -460783 -355207 -187019 -105573 -113583 -211163 -415196 -627714 -710357 -692780 -689809
31742 -689809 -637262 -383009 -47418 27131 -222426 -432066 -320166 -84641 -91434 -369019
$$ packed form
31816G2732p5856k6586J21613J45519k7906j93986j51517O7491K80062L13321
31806E24887R7509k37961l99006k37786K6537R3774m292l1628J7607m1847j65944
31795c58150j06192J12757J57905o2269k16718q5423J09768J21311O1030J05365
31785a60616J42035J8184j30012j14756l2688m8713o4547O0876J66000L7606j55969
31774b82600q7314J76935K55796M5477j63135j68142r2312q5702j14895j16853
31764f32745r2226o26J83546L00804J71578o4273q8445R1819J32262q5528k51265
31753c35099j25684J05576J68188Q1446q010r7580k04033k12518q2643J7577K971
31742f89809N2547K54253L35591P4549k49557k09640J11900K35525o793k77585
$$ plain form
31732 -369019 -629317 -650139 -441432 -145534 52713 21388 -153754 -210605 -64885 23903
31722 23903 -170422 -456773 -481124 -250268 -92795 -147110 -224953 -215032 -277985 -504008 -668946
31711 -668946 -548621 -282656 -191906 -342305 -503622 -486930 -330176 -155460 -5255 138007
31701 138007 267364 332951 278263 100701 -99628 -172159 -63562 121105 240913 251431
31691 251431 181301 64539 -29558 11277 202135 369297 326358 109981 -85164 -177534
31681 -177534 -255924 -367090 -413108 -316477 -151328 -30767 33200 79840 104969 105580 139277
31670 139277 236903 311192 256106 104174 -12190 -36708 -32927 -57303 -80435 -55177 5595
31659 5595 47276 24749 -80942 -252403 -419091 -485214 -408450 -250282 -139284 -174364 -337108
$$ packed form
31732c69019k60298k0822K08707K95898J98247l1325j75142n6851J45720Q8788
31722B3903j94325k86351k4351K30856J57473n4315p7843R921o2953k26023j64938
31711f68946J20325K65965R0750j50399j61317J6692J56754J74716J50205J43262
31701A38007J29357O5587n4688j77562k00329p2531J08597J84667J19808J0518
31691B51431p0130j16762r4097M0835J90858J67162m2939k16377j95145r2370
31681a77534p8390j11166m6018R6631J65149J20561O3967M6640K5129O11L3697
31670A39277R7626P4289n5086j51932j16364k4518L781k4376k3132K5258O0772
31659E595M1681k2527j05691j71461j66688o6123P6764J58168J10998l5080j62744
$$ plain form
31648 -337108 -482235 -442702 -185313 136385 305410 223557 -18573 -220242 -215551 5675
31638 5675 284406 432835 417249 363301 360363 335017 178981 -66602 -247366 -275787 -183942
31627 -183942 -32880 124576 212596 183841 108932 106915 175655 199833 139401 83021 79335
31616 79335 51281 -51842 -140499 -117524 -22456 59853 140582 252040 306791 182951 -74823
31605 -74823 -275002 -302052 -212217 -109261 -33170 19435 68906 164651 326893 459531 427972
31594 427972 257821 144190 198466 284267 200374 -37811 -209253 -162223 15385 118609
31584 118609 58439 -61308 -81850 24152 132297 146949 150625 285143 497469 544873 322900
31573 322900 54789 10365 127073 113109 -92133 -201776 -16217 238452 196610 -145634
$$ packed form
31648c37108j45127L9533K57389L21698J69025q1853k42130k01669M691K21226
31638E675K78731J48429j5586n3948k938k5346j56036k45583j80764k8421R1845
31627a83942J51062J57456Q8020k8755p4909k017O8740K4178o0432n6380l686
31616G9335k8054j03123q8657K2975R5068Q2309Q0729J11458N4751j23840k57774
31605g4823k00179k7050Q9835J02956P6091N2605M9471R5745J62242J32638l1559
31594D27972j70151j13631N4276Q5801q3893k38185j71442M7030J77608J03224
31584A18609o0170j19747k0542J06002J08145J4652L676J34518K12326M7404k21973
31573C22900k68111m4424J16708j3964k05242j09643J85559K54669m1842l42244
$$ plain form
31563 -145634 -440209 -461320 -346876 -330133 -431426 -518877 -527655 -485296 -407852 -299619 -206987
31552 -206987 -167178 -142663 -93772 -62545 -86245 -88076 21859 182747 257928 237822 213289
31541 213289 172969 16864 -217187 -349956 -340247 -353383 -449228 -424510 -141901 172798 201708
31530 201708 -16408 -167893 -131100 -84004 -140303 -159848 -20485 146251 144731 -2176 -111837
31519 -111837 -98144 -39178 -42077 -148436 -338308 -535479 -628933 -564071 -406467 -272751 -219781
31508 -219781 -232178 -274228 -306576 -292431 -241893 -219208 -254991 -281496 -210890 -57408 73527
31497 73527 110904 89469 95969 171183 264486 279364 181418 55849 14046 46098 40363 -32137
31485 -32137 -54292 49641 159352 108318 -65533 -152199 -39810 174128 346931 428762
$$ packed form
31563a45634k94575k1111J14444J6743j01293q7451q778M2359P7444J08233R2632
31552b06987L9809K4515M8891L1227k3700j831J09935J60888P5181k0106k4533
31541B13289m0320j56105k34051j32769R709j3136r5845K4718K82609L14699K8910
31530B01708k18116j51485L6793M7096n6299j9545J39363J66736j520j46907j09661
31519a11837J3693N8966k899j06359j89872j97171r3454O4862J57604J33716N2970
31508b19781j2397m2050l2348J4145N0538K2685l5783k6505P0606J53482J30935
31497G3527L7377k1435O500P5214R3303J4878r7946j25569m1803L2052n735p2500
31485c2137k2155J03933J09711n1034j73851q6666J12389K13938J72803Q1831
$$ plain form
31475 428762 396827 197399 -138824 -418265 -456550 -299588 -164648 -177644 -273712 -350737
31465 -350737 -397620 -437153 -455749 -454080 -474228 -499954 -418114 -180778 68327 153389 94723
31454 94723 31425 -35968 -226588 -494520 -591533 -411605 -177351 -138648 -250146 -326558 -370918
31443 -370918 -507280 -668958 -629128 -355638 -93971 -29953 -66411 -23753 102362 192230
31433 192230 188026 120141 27849 -64018 -147569 -254938 -412504 -557178 -591921 -530025 -461115
31422 -461115 -370120 -158113 120039 232622 75771 -169996 -289869 -274385 -203596 -83723
31412 -83723 49470 47179 -143633 -340925 -389116 -403310 -535658 -661444 -571785 -348942 -236276
31401 -236276 -222652 -101868 92284 88050 -145086 -287364 -153945 40846 63564 7258
$$ packed form
31475D28762l1935j99428l36223k79441l8285J56962J34940j2996r6068p7025
31465c50737m6883l9533j8596J669k0148k5726Q1840K37336K49105Q5062n8666
31454I4723o3298o7393j90620k67932r7013J79928K34254L8703j11498p6412m4360
31443c70918j36362j61678L9830K73490K61667O4018l6458M2658J26115Q9868
31433A92230m204o7885r2292r1867q3551j07369j57566j44674l4743O1896O8910
31422d61115R0995K12007K78152J12583j56851k45767j19873J5484P0789J19873
31412h3723J33193k291j90812j97292m8191j4194j32348j25786Q9659K22843J12666
31401b36276J3624J20784J94152m234k33136j42278J33419J94791K2718n6306
$$ plain form
31391 7258 52132 133974 95742 -14828 -46807 -16976 -46910 -118831 -112825 -37610 -31394 -148158
31379 -148158 -288028 -329352 -232633 -54421 60300 -25913 -260796 -402009 -298653 -73311
31369 -73311 83882 172119 278000 348668 280590 156049 161023 291808 354255 255939 107375
31358 107375 21409 -9150 -21913 -49761 -182174 -462196 -693564 -573321 -103819 323758
31348 323758 374410 134822 -85636 -155119 -157835 -162148 -153001 -148195 -206332 -316961 -405454 -446237
31336 -446237 -469219 -461056 -364444 -187397 -28650 22663 -46314 -196495 -350740 -389817 -237184
31325 -237184 15778 155675 82826 -54518 -36535 146678 276759 182931 -45480 -185859
31315 -185859 -175813 -176180 -314701 -466675 -397797 -94768 177079 191970 34249 -44072 29919
$$ packed form
31391G258M4874Q1842l8232j10570l1979K9831k9934p1921O006P5215O216j16764
31379a48158j39870m1324R6719J78212J14721q6213k34883j41213J03356K25342
31369g3311J57193Q8237J05881P0668o8078j24541M974J30785O2447r8316j48564
31358A07375q5966l0559j2763k7848j32413k80022k31368J20243M69502M27577
31348C23758N0652k39588k20458o9483k716m313R147M806n8137j10629q8493m0783
31336d46237k2982Q163R6612J77047J58747N1313o8977j50181j54245l9077J52633
31325b37184K52962J39897p2849j37344J7983J83213J30081r3828k28411j40379
31315a85859J0046l67j38521j51974O8878L03029K71847J4891j57721p8321P3991
$$ plain form
31304 29919 78806 -51401 -280624 -419099 -402944 -313011 -226579 -166771 -167199 -252950 -344765
31293 -344765 -311797 -160825 -42604 -4588 108511 373437 550412 349044 -126970 -449227
31283 -449227 -398277 -190468 -102705 -112524 -57850 51986 97988 92775 134957 195119 165973
31272 165973 95054 157127 383809 602354 671221 618704 522488 412678 335947 357078 430497
31261 430497 410941 269617 172493 250731 399344 408275 221726 -23164 -161585 -133846 -5934
31250 -5934 81578 34701 -79050 -96595 26829 158797 194632 208279 298437 378604 267394
31239 267394 -39703 -323857 -390659 -274274 -162056 -176638 -273398 -327180 -280759 -191354 -141982
31228 -141982 -148314 -179525 -222239 -257476 -212032 -31725 205811 354761 380556 368712 354724
$$ packed form
31304B9919M8887j30207k29223j38475J6155Q9933Q6432N9808m28q5751r1815
31293c44765L2968J50972J18221L8016J13099K64926J76975k01368m76014l22257
31283d49227N0950K07809Q7763r819N4674J09836M6002n213M2182O0162k9146
31272A65973p0919O2073K26682K18545O8867n2517r6216j09810p6731K1131P3419
31261D30497j9556j41324r7124P8238J48613Q931j86549k44890j38421K7739J27912
31250e934Q7512m6877j13751j7545J23424J31968L5835J3647R0158Q0167j11210
31239B67394l07097k84154o6802J16385J12218j4582r6760n3782M6421Q9405M9372
31228a41982o332l1211m2714l5237M5444J80307K37536J48950K5795j1844j3988
$$ plain form
31217 354724 283228 161978 99656 125407 117736 -4266 -159829 -263661 -346814 -409424 -329011
31206 -329011 -79281 123303 99033 -8712 31486 138700 53291 -193708 -287486 -131246
31196 -131246 563 -79613 -178198 -77464 73961 -4974 -260249 -355419 -146758 135795
31186 135795 206822 47831 -139464 -180797 -67602 87321 177955 194846 193473 192617 162960
31175 162960 122077 142963 217244 216133 83171 -29365 43809 207026 191335 -86546 -408380
31164 -408380 -530585 -437454 -262074 -87481 71196 176866 188223 141058 119372 153234
31154 153234 208484 258217 297695 305534 263176 207157 192168 204823 184725 126575 78535 41837
31142 41837 -20844 -62382 26689 213603 285957 134123 -53695 -37488 126149 172207 10150
$$ packed form
31217C54724p1496j21250o2322K5751p671j22002j55563j03832q3153o2610Q0413
31206c29011K49730K02584k4270j07745M0198J07214q5409k46999r3778J56240
31196a31246J31809q0176r8585J00734J51425p8935k55275r5170K08661K82553
31186A35795P1027j58991j87295m1333J13195J54923R0634J6891j373q56k9657
31175A62960m0883K0886P4281j111j32962j12536P3174J63217j5691k77881l21834
31164d08380j22205R3131J75380J74593J58677J05670J1357m7165k1686L3862
31154A53234N5250M9733L9478P839m2358n6019j4989J2655k0098n8150m8040l6698
31142D1837o2681m1538Q9071J86914P2354j51834j87818J6207J63637M6058j62057
$$ plain form
31131 10150 -192740 -297116 -333661 -326640 -207800 4264 144912 139986 117206 158689 140131
31120 140131 -18327 -136373 -33025 153228 165045 39316 34291 196818 297269 204274
31110 204274 45009 -61785 -172412 -318172 -363001 -204920 28865 120859 10859 -173060
31100 -173060 -255601 -154275 34808 96390 -46320 -178066 -71459 131485 83525 -215313
31090 -215313 -355055 -115632 190506 178474 -73258 -204106 -89106 98016 199095 184548
31080 184548 55220 -120897 -160290 8371 149236 -1695 -333120 -493434 -374507 -181692
31070 -181692 -49764 101569 292692 366600 250424 88201 -6774 -115904 -295904 -389561
31060 -389561 -229713 93197 328130 350330 226317 61887 -90572 -204462 -255658 -232564
$$ packed form
31131A0150k02890j04376l6545P021J18840K12064J40648m926k2780M1483j8558
31120A40131j58458j18046J03348J86253J1817j25729n025J62527J00451r2995
31110B04274j59265j06794j10627j45760m4829J58081K33785R1994j10000j83919
31100a73060q2541J01326J89083O1582j42710j31746J06607K02944m7960k98838
31090b15313j39742K39423L06138j2032k51732j30848J15000J87122J01079j4547
31080A84548j29328j76117l9393J68661J40865j50931l31425j60314J18927J92815
31070a81692J31928J51333J91123P3908j16176j62223r4975j09130j80000r3657
31060c89561J59848L22910K34933K2200j24013j64430j52459j13890n1196K3094
$$ [...]
##END NTUPLES=NMR SPECTRUM
##END=
