##TITLE=31Pdec_PR164_2E1
 D2O, 24 sc
 5.2.2020
##JCAMPDX= 6.0         $$ Bruker NMR JCAMP-DX V2.0
##DATA TYPE= NMR SPECTRUM
##DATA CLASS= NTUPLES
##ORIGIN= UXNMR, Bruker Analytische Messtechnik GmbH
##OWNER= root
$$ XWIN-NMR		Version 3.5
$$ Wed Feb  5 14:25:12 2020 Russian Standard Time (UT+4h)  she@DPX200
##.OBSERVE FREQUENCY= 81.013821
##.OBSERVE NUCLEUS= ^31P
##.ACQUISITION MODE= SIMULTANEOUS
##.ACQUISITION SCHEME= undefined
##.AVERAGES= 24
##.DIGITISER RES= 17
##SPECTROMETER/DATA SYSTEM= spect
##.PULSE SEQUENCE= zgpg30
##.SOLVENT NAME= CDCl3
##.SHIFT REFERENCE= (INTERNAL, CDCl3, 0, 182.463)
##AUDIT TRAIL= $$ (NUMBER, WHEN, WHO, WHERE, WHAT)
$$ ##TITLE= Audit trail, XWIN-NMR		Version 3.5
$$ ##JCAMPDX= 5.01
$$ ##ORIGIN= Bruker BioSpin GmbH
$$ ##OWNER= she
$$ F:/spectra/data/she/nmr/P31/1/pdata/1/auditp.txt
$$ ##AUDIT TRAIL=  $$ (NUMBER, WHEN, WHO, WHERE, WHAT)
(   1,<2020-02-05 14:24:10.28 +0400>,<she>,<DPX200>,
      <created by zg, POWCHK disabled, PULCHK disabled
       configuration hash MD5:
       00 E9 B6 7A A2 85 ED C7 34 08 36 98 17 FE 4E 26
       data hash MD5: 32K
       FF 70 44 80 E9 74 1E 55 BC 76 DD 0B 64 32 02 D7>)
(   2,<2020-02-05 14:24:12.82 +0400>,<she>,<DPX200>,
      <Start of raw data processing
       efp BC_mod = 2 LB = 1 FT_mod = 6 PKNL = 1 PHC0 = -1333.217 PHC1 = 94.80132 SI = 64K 
       data hash MD5: 64K
       A2 A5 BB C5 FA C5 83 3F A4 A5 1C 05 5C 27 5F 8B>)
(   3,<2020-02-05 14:24:34.48 +0400>,<she>,<DPX200>,
      <pk PHC0 = -4.641266 PHC1 = 2.4 
       data hash MD5: 64K
       C6 99 50 C2 D3 F2 98 E0 BE 50 4E 25 6E 57 0A DC>)
(   4,<2020-02-05 14:24:37.57 +0400>,<she>,<DPX200>,
      <abs ABSG = 5 
       data hash MD5: 64K
       B1 67 3D 0E 78 05 AD 1C D6 CF 9C 18 7B 5E 2B 24>)
$$ ##END=
$$ 
$$ hash MD5
$$ 73 69 CC DB 73 6B 85 2D 7A 2E 15 50 85 DF A0 9B
##$RELAX= 
##$RELAX= 
##$RELAX= 
##$RELAX= 
##$RELAX= 
##$RELAX= 
##$RELAX= 
##$RELAX= 
$$ Bruker specific parameters
$$ --------------------------
##$DU= <F:/spectra>
##$EXPNO= 1
##$NAME= <P31>
##$PROCNO= 1
##$TYPE= <nmr>
##$USER= <she>
##$AMP= (0..31)
100 100 100 100 100 100 100 100 100 100 100 100 100 100 100 100 100 100 
100 100 100 100 100 100 100 100 100 100 100 100 100 100 
##$AQSEQ= 0
##$AQ_mod= 1
##$AUNM= <au_zg>
##$AUTOPOS= <>
##$BF1= 81.014009
##$BF2= 200.13
##$BF3= 200.13
##$BF4= 200.13
##$BF5= 200.13
##$BF6= 200.13
##$BF7= 200.13
##$BF8= 200.13
##$BYTORDA= 1
##$CFDGTYP= 0
##$CFRGTYP= 5
##$CHEMSTR= <none>
##$CNST= (0..31)
1 1 145 1 1 1 1 1 1 1 1 1 1 1 1 1 1 1 1 1 1 1 1 1 1 1 1 1 1 1 1 1 
##$CPDPRG= <waltz16>
##$CPDPRG1= <>
##$CPDPRG2= <waltz16>
##$CPDPRG3= <>
##$CPDPRG4= <mlev>
##$CPDPRG5= <mlev>
##$CPDPRG6= <mlev>
##$CPDPRG7= <mlev>
##$CPDPRG8= <mlev>
##$CPDPRGB= <>
##$CPDPRGT= <>
##$D= (0..31)
0 1 0 0 0 0 0 0 0 0 0 0.03 2e-05 3e-06 0 0 0 0 0 0 0 0 0 0 0 0 0 0 0 0 
0 0 
##$DATE= 1580898249
##$DBL= (0..7)
120 120 120 11 120 120 24 19 
##$DBP= (0..7)
150 150 150 150 150 150 150 150 
##$DBP07= 0
##$DBPNAM0= <>
##$DBPNAM1= <>
##$DBPNAM2= <>
$$ [...]
##$SUBNAM3= <"">
##$SUBNAM4= <"">
##$SUBNAM5= <"">
##$SUBNAM6= <"">
##$SUBNAM7= <"">
##$SUBNAM8= <"">
##$SUBNAM9= <"">
##$SW= 369.568048894756
##$SWIBOX= (0..15)
0 1 3 0 0 0 0 0 0 0 0 0 0 0 0 0 
##$SW_h= 29940.119760479
##$TD= 32768
##$TD0= 1
##$TE= 0
##$TE2= 300
##$TE3= 300
##$TEG= 300
##$TL= (0..7)
0 120 53 12 22 120 120 120 
##$TP= (0..7)
150 150 150 150 150 150 150 150 
##$TP07= 0
##$TPNAME0= <>
##$TPNAME1= <>
##$TPNAME2= <>
##$TPNAME3= <>
##$TPNAME4= <>
##$TPNAME5= <>
##$TPNAME6= <>
##$TPNAME7= <>
##$TPOAL= (0..7)
0.5 0.5 0.5 0.5 0.5 0.5 0.5 0.5 
##$TPOFFS= (0..7)
0 0 0 0 0 0 0 0 
##$TUNHIN= 0
##$TUNHOUT= 0
##$TUNXOUT= 0
##$USERA1= <user>
##$USERA2= <user>
##$USERA3= <user>
##$USERA4= <user>
##$USERA5= <user>
##$V9= 5
##$VALIST= <valist>
##$VCLIST= <CCCCCCCCCCCCCCC>
##$VD= 0
##$VDLIST= <DDDDDDDDDDDDDDD>
##$VPLIST= <PPPPPPPPPPPPPPP>
##$VTLIST= <TTTTTTTTTTTTTTT>
##$WBST= 1024
##$WBSW= 4
##$XGAIN= (0..3)
0 0 0 0 
##$XL= 0
##$YL= 0
##$YMAX_a= 84481
##$YMIN_a= -98637
##$ZGOPTNS= <>
##$ZL1= 120
##$ZL2= 120
##$ZL3= 120
##$ZL4= 120
##$ABSF1= 182.463
##$ABSF2= -187.1042
##$ABSG= 5
##$ABSL= 3
##$ALPHA= 0
##$AQORDER= 0
##$ASSFAC= 0
##$ASSFACI= 0
##$ASSFACX= 0
##$ASSWID= 0
##$AUNMP= <proc_1d>
##$AZFE= 0.1
##$AZFW= 0.5
##$BCFW= 0
##$BC_mod= 2
##$BYTORDP= 0
##$COROFFS= 0
##$CY= -3
##$DATMOD= 1
##$DC= 0
##$DFILT= <>
##$DTYPP= 0
##$F1P= 0
##$F2P= 0
##$FCOR= 1
##$FTSIZE= 65536
##$FT_mod= 6
##$GAMMA= 0
##$GB= 0
##$INTBC= 1
##$INTSCL= 5.30512e-09
##$ISEN= 30
##$LB= 1
##$LEV0= 0
##$LPBIN= 0
##$MAXI= 10000
##$MC2= 0
##$MEAN= 0
##$ME_mod= 0
##$MI= 50
##$NCOEF= 0
##$NC_proc= -2
##$NLEV= 6
##$NOISF1= 182.463
##$NOISF2= 159.3651
##$NSP= 0
##$NTH_PI= 0
##$NZP= 0
##$OFFSET= 182.463
##$PC= 4
##$PHC0= -1337.858
##$PHC1= 97.20132
##$PH_mod= 1
##$PKNL= yes
##$PPARMOD= 0
##$PSCAL= 0
##$PSIGN= 0
##$REVERSE= no
##$SF= 81.0140089999434
##$SI= 65536
##$SIGF1= 159.3651
##$SIGF2= -187.1042
##$SINO= 113.3802
##$SIOLD= 16384
##$SREGLST= <1H.CDCl3>
##$SSB= 0
##$STSI= 65536
##$STSR= 0
##$SW_p= 29940.119760479
##$SYMM= 0
##$S_DEV= 0
##$TDeff= 32768
##$TDoff= 0
##$TI= <>
##$TILT= no
##$TM1= 0
##$TM2= 0
##$TOPLEV= 0
##$USERP1= <user>
##$USERP2= <user>
##$USERP3= <user>
##$USERP4= <user>
##$USERP5= <user>
##$WDW= 1
##$XDIM= 65536
##$YMAX_p= 456114450
##$YMIN_p= -5498768
$$ End of Bruker specific parameters
$$ ---------------------------------
##NTUPLES= NMR SPECTRUM
##VAR_NAME=  FREQUENCY,     SPECTRUM/REAL,   SPECTRUM/IMAG
##SYMBOL=    X,             R,               I
##VAR_TYPE=  INDEPENDENT,   DEPENDENT,       DEPENDENT
##VAR_FORM=  AFFN,          ASDF,            ASDF
##VAR_DIM=   65536,         65536,           65536
##UNITS=     HZ,            ARBITRARY UNITS, ARBITRARY UNITS
##FACTOR=    0.456856943014862, 1,           1
##FIRST=     14782.0589164792, 0,            0
##LAST=      -15158.0608439998, 0,           0
##MIN=       -15158.0608439998, -5498768,    0
##MAX=       14782.0589164792, 456114450,    0
$$ Real data points
##PAGE= N=1
##DATA TABLE= (X++(R..R)), XYDATA
$$ [...]
37474a0668q5223o3724o2039l5235J053n278l6593j5854O3595J03892L9548n9112
37462a65638q0977k7962J825l0983n0375J1970R8763Q8784m0508j66598j59694
37451e21393l7167N9933M3360j8009m254Q4071J29350O7488k5253n0612k4443
37440b96929l0623q3025j11455p2449l116M1644M7926K5810j6823o1521p3898
37429f34459l2734M9415J36177J82789J56414P0792j2376m7972n3051n1017q265
37418b44287J02280K00636J64677R065r9375m8754P5705J12205J9740j08240j75418
37407H234j57440p8052J9940Q9333J12382J13326J10867Q6457L2930m821J0572
37396C43728L9735J8065m2521o9178m0876j8532m6952q4577o6140P61M6205L5916
$$ y = [-10668, -95891, -159615, -221654, -256889, -255836, -261114, -297707, -313561, -249966, -146074, -106526, -165638, -246615, -274577, -272752, -303735, -354110, -342140, -243377, -154593, -195101, -361699, -521393, -558560, -498627, -455267, -473276, -477530, -393459, -264109, -196621, -221874, -272486, -296929, -327552, -410577, -522032, -594481, -597597, -555953, -508027, -482217, -499040, -560561, -634459, -667193, -617778, -481601, -298812, -142398, -71606, -83982, -131954, -185005, -236022, -244287, -142007, 58629, 223306, 232371, 132996, 84242, 159947, 272152, 291892, 183652, 8234, -149206, -227258, -207318, -117985, -5603, 107723, 218590, 305047, 337977, 333156, 343728, 383463, 401528, 359007, 289829, 248953, 230421, 183469, 98892, 32752, 33513, 79718, 115634]
37384A15634J5431L6005O6617K9609p4156j39140r3945p816J3604q784K5259J06951
37372H5269J11242J421r3134o5201K2543N8667M4114L4113J7944k5157l3678L8447
37360A96590R8202L4041q8493j09539k4527J8811k8600m7611K9116R4090L8937
37349B11017p9086j33233r4888k5944J9405J7951k9457p1818m0215M9722R9983
37338g6563P1526L4425L4108J5116n4893r6717n0085P725j0443m1654K0561J20949
37326b5945J03258m1319j42211q9446K7529P1034L7607J6889L9368M7985j650
37315D3099p5917j05606o3867J0839O0949O5200M1436J1362j0426m051L5169O5027
37303G3214L8256j8819l4303r739k7084j02696j29742l4490R4652J25297O2261
$$ y = [115634, 131065, 167070, 233687, 263296, 189140, 50000, -43945, -51761, -38157, -46941, -21682, 85269, 196511, 197932, 104798, 39597, 62140, 120807, 164921, 199034, 216978, 191821, 158143, 196590, 294792, 328833, 240340, 130801, 106274, 125085, 96485, 48874, 77990, 172080, 211017, 131931, -1302, -96190, -122134, -102729, -84778, -114235, -186053, -226268, -176546, -76563, -5037, 29388, 63496, 78612, 23719, -72998, -123083, -115358, -125801, -167455, -146894, -25945, 77313, 35994, -106217, -195663, -168134, -97100, -59493, -42604, -3236, 44749, 43099, -32818, -138424, -202291, -191452, -130503, -65303, -23867, -12505, -22931, -26982, 8187, 73214, 111470, 92651, 58348, 48609, 21525, -81171, -210913, -245403, -150751, -25454, 36807]
37292C6807R655L304p553m1196n7153m1042k1701q029J1967K3125J0665R718M4518
37279b6915N5816j0405q1925n0488M8569Q6092M6735K9221M6684O515q9874j18342
37267e8317n4309k9932r2349j05289k059P0012J4653n997J52663L04312J74701
37256C68089j40805k71305j04375P6792M1749q4466q7104P701M3300P761O345
37245a36318N3340O7404L0182M555J2976J2325j8070n1682o6349m9261K3039J33307
37233A5448J82184Q8017q6485j93516j77286j07173m4987J7290P4999P5765J4439
37222a41305k5003J5588P9296Q4633M6092K8378K7316j1580p6110q4914j1346
37211f8955P2087R6193O9865K3446m6037j20693j23117j4921J06669J04744j4748
$$ y = [36807, 46462, 49766, 42213, 1017, -56136, -97178, -118879, -126908, -114941, -91816, -81151, -71433, -26915, 28901, 18496, -63429, -113917, -65348, 20744, 67479, 96700, 143384, 149899, 60025, -58317, -112626, -142558, -234907, -340196, -342255, -272243, -257590, -263587, -110924, 193388, 368089, 227284, -44021, -148396, -71604, -29855, -114321, -201425, -193724, -150424, -142663, -136318, -82978, -15574, 14608, 19163, 32139, 44464, 26394, -25288, -91637, -140898, -117859, 15448, 197632, 285649, 199164, 5648, -171638, -278811, -323798, -306508, -231509, -155744, -141305, -166308, -150720, -71424, 13209, 59301, 87679, 114995, 103415, 27305, -57609, -68955, 3132, 99325, 169190, 192636, 146599, 25906, -97211, -112132, -5463, 99281, 84533]
37200H4533j06045p6956R391N1096L5513Q73m6290r7991r3535J702J03792R9265
37188c4652R486l9456p844J5752j2832r412P9581J49421Q0952o3739j19513n4043
37176f299Q709n873l1479n812K1654l506k8339J8057R0242Q5727L886n4761l7550
37163E4656M404J5218K631j4934n0862r9441j04813l1720P3675J38975J48231
37152A36020J27719Q3975R904o6184r1233m7838K7369P8652O3391k4184j27755
37141A69836j58086r3609k2194k7677o8631m6404L2997O6133J9085k5066j1822
37130a65438M672k0471l2471J7058O6644M5200K54J5772O1753M8680r651k1796
37118A0206J2812K302o4740q7218k6986J6594l1992j01560q7702J80Q0124J11118
$$ y = [84533, -21512, -98468, -89077, -37981, -2468, -1595, -47885, -145876, -239411, -237709, -133917, -34652, -25166, -64622, -72466, -56714, -69546, -78958, 623, 150044, 230996, 167257, 47744, -6299, 2410, -3463, -34942, -40754, -19100, -22606, -50945, -32888, 57354, 143081, 146967, 92206, 54656, 59060, 74278, 76909, 61975, 11113, -88328, -193141, -224861, -151186, -12211, 136020, 263739, 347714, 357618, 291434, 200201, 152363, 179732, 258384, 321775, 297591, 169836, 11750, -81859, -104053, -131730, -200361, -246765, -213768, -147635, -128550, -153616, -165438, -160766, -181237, -213708, -196650, -130006, -84806, -84552, -68780, -7027, 41653, 32002, 10206, 23018, 25320, -39420, -126638, -153624, -137030, -169022, -270582, -358284, -358104, -277980, -166862]
37106a66862R5637M0127j6056j992P9010J12794K6631q6849r2359k087O1000M4925
37094I3919J574l1837o6352q6460n4184N974K4381n082k5143k3501m0236o2770
37082b69717k6648N6266Q4494K3374l1681m481M4962K1943o0825j14173q9688
37071c66174q210P8335J09907O0965l045J7398J05350J23813J6536q9695o5516
37060b0336L4902P3373K9930j5971l8234o2327n9622J0748Q0142L8428q0482j24721
37048a34170m7390L7053M4563K7753M2805M6026j072l6057L264O3001M9240l4160
37036F0856j01053r9456n3875k0288l4147p0528m7547O9917J70835J05052q6469
37025a06703j76869n4318J11084J05782l5051j11484n2350L2693N2137K7624j799
$$ y = [-166862, -71225, -31098, -47154, -49146, 29864, 142658, 169289, 82440, -9919, -12006, 48994, 93919, 95493, 63656, -2696, -89156, -143340, -137366, -112985, -118067, -143210, -166711, -206947, -269717, -296365, -240099, -155605, -132231, -163912, -168393, -123431, -101488, -162313, -276486, -366174, -374384, -296049, -186142, -125177, -128222, -110824, -5474, 118339, 134875, 45180, -20336, 14566, 87939, 117869, 101898, 63664, 1337, -58285, -47537, 32605, 71033, -9449, -134170, -181560, -144507, -99944, -72191, -29386, 16640, 15568, -20489, -17225, 45776, 95016, 60856, -40197, -139653, -193528, -213816, -247963, -318491, -366038, -296121, -125286, -20234, -106703, -283572, -337890, -226806, -121024, -156075, -267559, -319909, -287216, -235079, -207455, -209254]
37014b09254l1632l7467J2610P5498O7433n931n2419l5818j4217k3311k5077O357
37002b73228M5458Q0412J19535J22329L9600o1138m6419O9479J10451M523r0410
36991A20592l1401Q3008P4118m2344j08722p5247k4353P608N5996R0574K7209
36980A77038j02997j51186o0142N2170O5020j651o2532p8832m3545M3492J25036
36969c8129J02523k8714j36150j08185J0365R9866J14200Q4127M0048M727P975
36958A52653L7543K4455n6424j23739r8517k3028Q573r570j2714J2903J9323j1103
36946g9645m4624n3018k4257N5610J59121J92943J03846k3645o9199m1631l4670
36935A40831n4525k9119K4262o31j04441j42357l9405Q8800J10168N6525L7323
$$ y = [-209254, -240886, -278353, -265743, -190245, -122812, -128743, -181162, -216980, -231197, -254508, -279585, -273228, -227770, -147358, -27823, 94506, 134106, 72968, 26549, 96028, 206479, 211002, 120592, 89191, 172199, 246317, 203973, 95251, 20004, -4349, 3259, 59255, 149829, 177038, 74041, -77145, -137287, -85117, -20097, -21748, -84280, -163112, -206657, -163165, -38129, 64394, 35680, -100470, -208655, -198290, -98424, 15776, 99903, 139951, 144678, 152653, 190196, 214651, 158227, 34488, -64029, -87057, -78484, -88054, -100768, -87865, -68542, -79645, -124269, -177287, -201544, -145934, 13187, 206130, 309976, 286331, 217132, 175501, 140831, 86306, 57187, 81449, 80818, -23623, -165980, -205385, -116585, -6417, 50108, 87431]
36924H7431O5418P0797K7714k2392l8851j0970M4652P8805N2215O190J8071O8929
36912D48009N8005k3145o0312j1331J6512l6754o9572j4986J4715o6946j31857
36901A22338m9314N8184P112j18281j02266K3182M2498m3325k0145J19018J15439
36890A54440j00797k44095j22185O1915O6365j2367K3528R8416K9237j07900j00234
36879b53677K0844L9445o3168r5689r628L3682k3813l7842N5352J10045K9315
36868a95134o0777k1316Q3242J08825M4451j8457l2624q830L9104Q1706P3856
36857I4046K5717J444O599k9820j14539j39142m0556Q2412R4015j0043j27857
36846a57724j74408j18676K4630J70608K00281R1450m0824q4161m4418J6666O8690
$$ y = [87431, 152849, 223646, 251360, 228968, 190117, 179147, 223799, 302604, 354819, 361009, 379080, 448009, 506014, 482869, 422557, 411226, 427738, 390984, 321412, 306426, 321141, 254195, 122338, 73024, 131208, 138320, 20039, -82227, -59045, -16547, -59872, -80017, 39001, 154440, 53643, -190452, -312637, -250722, -184357, -196724, -173196, -74780, -45543, -153443, -253677, -232833, -193388, -256556, -352245, -361873, -328191, -352004, -389846, -334494, -224449, -195134, -255911, -277227, -193985, -85160, -40709, -59166, -91790, -100620, -61516, 20190, 94046, 119763, 121207, 127806, 97986, -16553, -155695, -196251, -113839, -19824, -29867, -157724, -332132, -450808, -426178, -255570, -55289, 36161, -4663, -88824, -133242, -116576, -47886]
36835d7886Q3132J7288r5865j33821m5138O2110P7110L7467K5811J7105m2343
36824d5030r0468l7372N8849O2946k0153n3448J4475Q5812P7406J6509m5696r6645
36812g2815j15816p5044r005J3345J009K0948N9539K9193o2847q8625M496R9972
36800a95650Q8149K1102J320J7919L404k5190n147L9358K6483l8685o1084m170
36788a32191N4631M2754q242k0162K4762P4552P9938M2878j354k9604m8584o7608
36776A1770o9194l2619J5417J4743m3356q4442m2943M2247P4119K6372k9835l1883
36764a49604j129J2691J0988K1708K8534p433n9672m5877M3893R8246K7524r3672
36752a13803j15068j9435N9884L6717k3285l4309j6640j8673r290N1734J09098
$$ y = [-47886, 35246, 52534, -43331, -177152, -222290, -160180, -83070, -45603, -19792, -2687, -45030, -135498, -172870, -114021, -51075, -71228, -124676, -110201, -24389, 53017, 69526, 23830, -72815, -188631, -263675, -272680, -259335, -258326, -237378, -177839, -148646, -211493, -300118, -295622, -195650, -107501, -86399, -85079, -67160, -63756, -88946, -94093, -54735, -28252, -66937, -128021, -132191, -77560, -34806, -43048, -63210, -38448, 36104, 116042, 158920, 157566, 127962, 79378, 11770, -57424, -90043, -74626, -59883, -103239, -187681, -230624, -188377, -114258, -87886, -117721, -149604, -150733, -138042, -127054, -105346, -76812, -84245, -143917, -189794, -145901, -47655, -20131, -113803, -228871, -248306, -188422, -151705, -174990, -209299, -225939, -244612, -253902, -202168, -93070]
36741i3070R1179L9263L6459N2452k278r4890j01132k0546O729o4790j02369k1240
36729b74233O3156K1460q0421r4437j7195M0750M5086M9630O0116L3689j802L0715
36717a23486J10722J23215L0087p4072j01754o2885O949R2155J32524L7983j57780
36706A3658k66228j65410K7969J13923P0164L4173O8358Q9881L9336k2642l6283
36695c3101m2801q6938j09476l5015Q7190J31864O4159l2096q0084p6755m0231
36684b53284J3450L1155l7085j27858j00247O2049J87436J38628M832l9131J2049
36673a08006K3087m2115p4776k0161L8321L8989M1698R2529J13114L0531p2258
36662F0953n8623N3942J04596L036j56439k11184j05728O5606J62363J33206N2081
$$ y = [-93070, -1891, 37372, 73831, 126283, 124005, 29115, -72017, -92563, -85834, -150624, -252993, -274233, -211077, -189617, -270038, -364475, -381670, -340920, -295834, -246204, -186088, -152399, -154201, -123486, -12764, 110451, 140538, 66466, -35288, -98173, -91224, 931, 133455, 171438, 13658, -252570, -417980, -390011, -276088, -205924, -171751, -103393, -13512, 25824, 3182, -33101, -75902, -162840, -272316, -307331, -220141, -88277, -24118, -56214, -136298, -213053, -253284, -239834, -208679, -245764, -373622, -473869, -411820, -224384, -85756, -80924, -120055, -108006, -84919, -127034, -201810, -221971, -183650, -144661, -102963, -10434, 102680, 133211, 60953, 2330, 56272, 160868, 163904, 7465, -203719, -309447, -243841, -81478, 51728, 103809]
36651A03809J5318K3121M995n5326r6672q6927o3103m1151J5021R0652R4113N005
36639H855n5808J368Q8493P9456P240j7775j2215p3444j69321j60099l5151N0596
36627b87805J5953l3724L010O7268O2521J2440p606m343k4048m3844j2756M2121
36615b10813M9205N838k8501l2321l1895k3485K6121R3303R6802J7375n0713k4542
36603a13626L7328Q694j08762j56326l1474J45008J70129L1339q4820o5845j5254
36592a83609n6376j28065r8748J1411P2334N1439K3909R463l7185q4612m6485
36581d66524M1827M5909l3438l5866Q1502J36885R486j44181j19851K6317Q4897
36570c73037J4075m4220k0655M989j7001k3980K6396P6454O9531L0685L730j2439
$$ y = [103809, 119127, 142248, 147243, 91917, -4755, -91682, -154785, -195936, -180915, -90263, 3850, 8855, -46953, -45585, 42908, 122364, 129604, 111829, 99614, 26170, -143151, -303250, -338401, -287805, -271852, -305576, -302566, -235298, -172777, -160337, -167943, -172286, -196334, -240178, -252934, -210813, -161608, -155770, -184271, -216592, -248487, -271972, -245851, -152548, -55746, -38371, -89084, -113626, -76298, -67604, -176366, -332692, -364166, -219158, -49029, -17690, -102510, -168355, -183609, -239985, -368050, -466798, -455387, -383053, -331614, -307705, -298242, -335427, -420039, -466524, -424697, -378788, -412226, -448092, -366590, -229705, -220219, -364400, -484251, -457934, -373037, -358962, -403182, -423837, -418848, -435849, -459829, -433433, -356979, -287448, -256763, -253033, -265472]
36558b65472k7419k5916n496L296j7817m7835o1426n9088n3724n2110n0892l7167
36546g01066p982M802k9339o6320j9160J01017J58480P3492n1395p5613j7352
36535f30436N758k8795m6966l3804m5417p3271l8591N9351J15043O8606j8262
36524f66784o4161m8401K7883J53582K53381K31140J10766L7115R0147J85365
36514C10033K04534J41091O4998J7686m095j3853k3601k6862J0315Q7449J23383
36503H91078O3550M588P9240K29178K59894J42152O6921J34700J90693Q9850n7043
36492B094801p0624N940k341j13530j87275j61669j10457q6318o7428n2407o8275
36481A180417q6923n6247o767j3653o8280r9009r5643r6809q5632k9065J1325
$$ y = [-265472, -292891, -318807, -324303, -321007, -338824, -386659, -448085, -507173, -560897, -613007, -663899, -701066, -709048, -704246, -733585, -799905, -819065, -718048, -559568, -486076, -537471, -613084, -630436, -624678, -653473, -700439, -734243, -779660, -852931, -891522, -832171, -717128, -648522, -666784, -730945, -779346, -751463, -597881, -344500, -113360, -2594, 34521, 124668, 310033, 514567, 655658, 720656, 738342, 734247, 720394, 696793, 669931, 680246, 767695, 891078, 954628, 959216, 1038456, 1267634, 1527528, 1669680, 1736601, 1871301, 2061994, 2151844, 2094801, 2024177, 2030117, 2027776, 1914246, 1726971, 1565302, 1454845, 1368527, 1301099, 1248692, 1180417, 1093494, 1037247, 1030480, 1016827, 948547, 849538, 753895, 657086, 571454, 542389, 553714]
36470E53714m2633j20100q0321M9310R5304J4766m1008J3936P0199L3634j6977
36459E29824L988K7955k3880p2566j6437P1503N2002m6703p8046k0673O12o5412
36447C62167j16791p0755J7803O2127O2375N5976L1138l4579r6942q2972K957
36436A92504O8149M2480l2261n3953N692N7718J3011r0124j32310p5668m506J2624
36424C356J7182O5709J14894Q4941l969n0256j6316K6300Q794m3841o0347j9204
36412A27243L2135L5668j7377q0595j02012p4789k6832K7426Q6738J18228P4025
36401A99858k5443q6893n9899K347L8761O3284Q9896N7012p1082j87654j54398
36390a34211k475J01632Q1644J8101j1341k1733k6668O042N2533J8512r9318j58142
$$ y = [553714, 511081, 390981, 310660, 359970, 455274, 470040, 429032, 442968, 513167, 546801, 529824, 533812, 561767, 537887, 465321, 448884, 520387, 572389, 525686, 447640, 426967, 427579, 362167, 245376, 174621, 192424, 254551, 316926, 372902, 404040, 369461, 272519, 189547, 192504, 260653, 303133, 270872, 216919, 222611, 280329, 293340, 203216, 70906, -4762, -9268, 3356, 20538, 86247, 201141, 286082, 282113, 231857, 215541, 241841, 250635, 206794, 146447, 127243, 159378, 195046, 177669, 97074, -4938, -79727, -106559, -79133, 7605, 125833, 199858, 174415, 87522, 27623, 29970, 68731, 132015, 221911, 278923, 207841, 20187, -134211, -136686, -35054, 46590, 64691, 53350, 31617, 4949, 10991, 63524, 82036, -17282, -175424]
36378a75424o6238P4111J25539J10805J18820J12503J788j46473j62264l2597
36368c9430P3735O8640N1679R2541Q8661l9904j63719j19361K2938N2349o3522
36357B4607j42230p8759J0080j554m9732q327R5696J33872Q4578M6906O0084M6593
36345B21814l5191j01005o9664N925K4880o95K4097J03559J23377L0532n7954
36334B69675r365J19673J44195J2811j07322n9194Q4677J26743J3104j20317j56490
36323C18190j24323q7977l5780M3361P4244k811j05268r9942J1602J10709J40200
36312B42205J42239J27023M5740p6823j23208o0461j2538o9261j33290p1173O7809
36301G8262J18170L7081n6988o9121k6393J6946N8499R7924R6872L5217m7510
$$ y = [-175424, -241662, -167551, -42012, 68793, 187613, 300116, 301904, 155431, -6833, -39430, 34305, 102945, 154624, 247165, 335826, 295922, 132203, 12842, 35780, 88129, 24607, -117623, -196382, -186302, -187856, -237588, -245915, -150219, -16347, 68231, 115137, 175221, 221814, 186623, 85618, 15954, 21879, 46759, 46064, 70161, 173720, 297097, 327629, 269675, 260310, 379983, 524178, 536989, 429667, 370473, 455150, 581893, 594997, 474680, 318190, 193867, 105890, 70110, 113471, 187715, 184904, 79636, -20306, -8704, 102005, 242205, 384444, 511467, 557207, 480384, 357176, 296715, 284177, 214916, 81626, 10453, 78262, 196432, 233513, 176525, 107404, 81011, 97957, 156456, 254380, 351252, 386469, 338959]
36290C38959r8814j01180o1178K221M8936M7684K4992L4748P1392O9682M962o3437
36278C18967p3061l6207j3604m4597j13129j49200p4876R4856K11846J41783m4009
36267B18769j28111k8652R4565Q0922l612J812Q3941Q3162l5065j10926l8375
36256B18430O3272K6406j09473j49178k0576J25675J26456J6113m8046j0221L4828
36245B73686P711m5680m9768j8444o643m673K6922N5219J5564n6860n3351L1679
36233A75362O9056j0916j04759r5473k7813j5021m3116m089J03827J50616P0320
36222B67994l6535m9738Q382K6867l1178r3820r0793l7136M024N477q99K2669
36210d686O3783P3443L3124j5778k3487Q343M0679N1765M5637J8688m0301j11289
$$ y = [338959, 240145, 138965, 77787, 80008, 128944, 176628, 201620, 236368, 307760, 377442, 382404, 318967, 245906, 209699, 196095, 151498, 38369, -110831, -185707, -90851, 120995, 262778, 218769, 90658, 62006, 156571, 237493, 233881, 235693, 319634, 402796, 367731, 256805, 218430, 281702, 308108, 198635, 49457, 28881, 154556, 281012, 297125, 249079, 238858, 273686, 281397, 235717, 185949, 167505, 160862, 156189, 183111, 238330, 253894, 197034, 143683, 175362, 244418, 233502, 128743, 33270, 5457, -9564, -52680, -56769, 47058, 197674, 267994, 231459, 181721, 190103, 216970, 185792, 91972, 1179, -35957, -31933, -26456, -27355, -4686, 59097, 132540, 165664, 149886, 126399, 134742, 175421, 227186, 272823, 291511, 251210, 139921]
36198A39921j41265j02118l1340M214k0345o2995n9283J0705R7223J24689O6329
36187B5735k6109p3498n0314p137m888l1409q202R7380J91046J43346k7484j39845
36175H8621o7959Q9732J44682O7968q264j1067m948l2795k9294L9559Q1063K0343
36163C77641o0324m2660L9520N5403k4821j03726j02808l0999P1923J59730J63426
36152E02305N2716q8124j37276q8625m3563n3882o5317k6529L3943O2685M5808
36141A94141O25m4010n5618l4117k5601m9409m7866J9882Q1234M8181k9358l3560
36129B4524K4421K3823n3026q6822k5796L6590M0252N6958J30234J63596P7872
36118D12626l9173o2153j4808m025l9794m8352j8065q744l3623l5873J6097Q3039
$$ y = [139921, -1344, -103462, -134802, -130588, -150933, -213928, -273211, -262506, -165283, -40594, 25735, -374, -73872, -124186, -131323, -136211, -167620, -175822, -78442, 112604, 255950, 228466, 88621, 20662, 110394, 255076, 323044, 314780, 303713, 298765, 265970, 236676, 276235, 357298, 377641, 317317, 274657, 314177, 369580, 344759, 241033, 138225, 107226, 179149, 338879, 502305, 555021, 466897, 329621, 240996, 197433, 143551, 78234, 51705, 85648, 148333, 194141, 194766, 150756, 95138, 61021, 35420, -13989, -61855, -41973, 39261, 87442, 58084, 24524, 48945, 72768, 19742, -67080, -92876, -56286, -16034, 40924, 171158, 334754, 412626, 373453, 311300, 296492, 292467, 252673, 204321, 186256, 177512, 143889, 108016, 124113, 207152]
36106B07152J05698N6873m0789j15256r7059m298O6090N9657J8770j1680m9236
36095A95922r6135r1903k1335J8103m4822j22753q8776K8770R2319O0296K1899
36084d8415L8279O6268N4370K0622R225L2521P1251Q8690M9101l5865r5473p7278
36072A73296j1924M0339O8056Q1427N5132k7723j07745j04155k4118M4810L9519
36061B26914k8358j08205j58138j77144k05794k62088k98271l09626m45774q21873
36051b588357j192267j074083l54532M50348P72326O42525M93882M84446L98299
36042a967413J59793J7108J17080K56525K29568J39603J61986K23091J50599r431
36032e21491o2230K9324J12197Q5215J1233j0784K9041O5983M0692l3000o6516
$$ y = [207152, 312850, 369723, 328934, 213678, 116619, 112321, 178411, 238068, 256838, 245158, 195922, 99787, 7884, -13451, 4652, -40170, -162923, -251699, -222929, -130610, -70314, -48415, -10136, 56132, 110502, 131124, 140349, 172870, 244121, 332811, 381912, 346047, 250574, 173296, 161372, 201711, 269767, 351194, 406326, 378603, 270858, 166703, 142585, 187395, 226914, 198556, 90351, -67787, -244931, -450725, -712813, -1011084, -1320710, -1766484, -2588357, -3780624, -4854707, -5209239, -4758891, -3986565, -3344040, -2850158, -2365712, -1967413, -1807620, -1790512, -1673432, -1416907, -1187339, -1047736, -885750, -662659, -512060, -521491, -583721, -554397, -442200, -356985, -345752, -356536, -327495, -261512, -220820, -253820, -320336]
36021c20336l708P7074N2995n3152r2667j7614N3244L4803j0071j7905k9286o3562
36009c90185m6080L6853O4068j9434p7304L433J14245J00016N216k7085P551K0041
35997b08665J6389N3522Q3051K8009m7383l2091K4845l874q3716o7522M1735Q8662
35985a07038K4266l6642l1873k9443n8570n0234Q786L4926R888K0152Q3507R8708
35973c3567K9140k2200N856K7935k4894p7934m8962R325J0268k2859k1524n81
35961a69997j5176m4467j7926O6987J25594Q0298n3818j67404j51542k7323N6782
35950c17992J8097l4185K4695J07969M4566j10389j24013L8311J36688L5079r2920
35939b74094p0555L758k7188q5104j2675J21995J32890L7778J6807R2953J02505
$$ y = [-320336, -324044, -246970, -193975, -247127, -339794, -357408, -304164, -269361, -279432, -297337, -326623, -390185, -436265, -399412, -335344, -354778, -432082, -428649, -314404, -214388, -209172, -236257, -228706, -208665, -192276, -138754, -55703, -27694, -75077, -107168, -82323, -86197, -169913, -237435, -195700, -107038, -82772, -119414, -151287, -180730, -239300, -289534, -280748, -245822, -235934, -215782, -132275, -33567, -4427, -26627, -20771, 7164, -17730, -95664, -144626, -135301, -125033, -147892, -169416, -169997, -185173, -229640, -247566, -180579, -54985, 25313, -28505, -195909, -347451, -374774, -317992, -299895, -334080, -309385, -201416, -156850, -267239, -391252, -352941, -216253, -181174, -274094, -344649, -340891, -368079, -453183, -465858, -343863, -210973, -173195, -156388, -63435, 39070]
35928C9070j2433j09364q4691j5789k072j9591m891L4537N7846N3566K5437j2359
35916e0734j5362L5450O5630m234j10437j07487J5885J11125Q3388J912l8746
35905a3610l8472k1330K8833R2879Q8153m425q0302n7786M625J8331J745J1486
35893C0127J8430l2845r8422q9099j8391J6714j1695l6081k0227j1010m1412o6127
35881c60038l3143L5139P0390L9675k3789n5267j9820M7700P5412M3989J7149
35870a62603N2575J15172J26540P3650J0825k5653m0087l0465N162J9726m0554
35859A04288j31097j33921k2756P8264N5509m2676q4349l3694K6824K9582R61
35848a53065N329O1364J21489J10835J987j28144j54949n7588L5964J5388n4336
$$ y = [39070, 26637, -82727, -167418, -183207, -185279, -204870, -209761, -175224, -117378, -63812, -38375, -50734, -66096, -30646, 34984, 30750, -79687, -187174, -171289, -60164, 23224, 25136, -13610, -52082, -73412, -44579, 48300, 136453, 132028, 51726, -6060, -1435, 16896, 18641, 30127, 48557, 15712, -82710, -171809, -190200, -173486, -185181, -221262, -241489, -252499, -293911, -360038, -393181, -358042, -287652, -247977, -271766, -327033, -346853, -299153, -223741, -179752, -162603, -110028, 5144, 131684, 205334, 216159, 190506, 150419, 119954, 125116, 144842, 104288, -26809, -160730, -183486, -105222, -49713, -92389, -176738, -210432, -183608, -154026, -153065, -147736, -86372, 35117, 145952, 147939, 19795, -135154, -192742, -156778, -141390, -195726]
35837a95726l3308P6452J37006Q9087K5365K1796L0627J294j8621P956J0390o3831
35825H8487j19515m7578P9004R7450O009m1743J2296N5321J0719m2857k8747n667
35813F3179m6002r5930p3170j9147k7505p6180o1937J9417N3490j7990j06564
35802c88339j00052o215P2240O8349J7631M635O2888J35170J41526Q0154K7772
35791A15759L2476N4125L8816K783n638J0945J0551j7540m5534n1460k7106L1831
35779A50008R6762J00821K0335o8971q1325l6625j5308k8694k2600Q956J2916
35768A36275k0571m0391k5213M12M2152J19441J64210O9747j17137j91900n9419
35757G7606J18793J45805M4869l0612m1314n7718q0080m3301K1629J1146n4450
$$ y = [-195726, -229034, -152582, -15576, 73511, 98876, 120672, 151299, 152593, 133972, 141928, 152318, 88487, -31028, -78606, 398, 97848, 103857, 62114, 74410, 129731, 140450, 97593, 68846, 63179, 17177, -78753, -151923, -171070, -198575, -274755, -336692, -317275, -263785, -281775, -388339, -488391, -494606, -422366, -354017, -336386, -331751, -268863, -133693, 7833, 87987, 115759, 148235, 202360, 241176, 243959, 238321, 249266, 259817, 242277, 196743, 145283, 118177, 150008, 246770, 347591, 367926, 298955, 217630, 181005, 165697, 137003, 114403, 123359, 136275, 115704, 75313, 50100, 50512, 92664, 212105, 376315, 446062, 328925, 137025, 77606, 196399, 342204, 387073, 356461, 315147, 257429, 177349, 134048, 155677, 166823, 112373]
35746A12373l3650R5102J66384Q0569l4341l0065K5565k6641j63016k01258p2436
35735h1414Q8042J34322O8499k0909p0010n2934K2266Q7143N8626m6881j13072
35724G3678p5257k035J7206o838j2436Q129K1708K3626K5499J2666k1985l8922
35712B5039j0952J5818j1456n9841n8590r012K9859L6839L0247M301m6602o8502
35700a22852j4992M8121J9621o8150q4838p821M8305K8026Q678L1755J8842o2692
35688a57997r9901j4597Q1999M9189o4488j01327k2179P6971J16774Q1422k3167
35677g7301j33784j21685M0748J74184J12090l8854m5795R2408J57200O9120j2207
35666B16124R262J3129q1746j35052j9958J34503J23791k7041j22795q4364k348
$$ y = [112373, 78723, 173825, 340209, 420778, 386437, 356372, 381937, 355296, 192280, -8978, -81414, 6628, 140950, 209449, 188540, 118530, 65596, 87862, 175005, 233631, 186750, 73678, -1579, -3614, 13592, 6754, -5682, 2447, 24155, 47781, 73280, 85946, 63961, 25039, 14087, 29905, 18449, -41392, -99982, -108994, -79135, -42296, -12049, -7748, -54350, -122852, -137844, -89723, -70102, -138252, -223090, -230911, -182606, -154580, -145902, -114147, -95305, -157997, -257898, -272495, -190496, -141307, -205795, -307122, -329301, -252330, -135556, -54134, -77301, -211085, -332770, -292022, -117838, -5748, -44602, -90397, 2011, 159211, 228331, 216124, 225386, 238515, 156769, 21717, 1759, 136262, 260053, 233012, 110217, 25853, 23505]
35655B3505M3571N5735L6821j6763n3801k7261M061m1974j09882p1827N0953R0393
35643a6469j1399r9049l0509J14759J50622K7230j35988k09664j60263k8053J17085
35632b81698J99392J77835Q0059k4600q2244p5981j9830M1264N1169N63m6922
35621A9007k1189O7027J35090J22809N2045q107j0511M1835J15964J82682K35068
35610I31720K79818L11898L06560K47867J60713R5989P6166O9561L3473k4110
35600B489655m7701p118N1945N3519j5416q2969p5222j382O4931P7133N7721M6049
35588B611145L7859L561m9246o8184k1670M8574N7358m5137k26062l88839m38553
35577A520806l53329k07395j06661q6816r5070q3216p5050j04295j33320j03798
$$ y = [23505, 67076, 122811, 159632, 142869, 89068, 61807, 65868, 23894, -85988, -157815, -106862, -16469, -27868, -126917, -157426, -42667, 107955, 135185, -803, -210467, -370730, -398783, -281698, -82306, 95529, 175588, 150988, 68744, -7237, -27067, 14197, 65366, 65929, 19007, -2182, 64845, 199935, 322744, 374789, 366682, 356171, 398006, 513970, 696652, 931720, 1211538, 1523436, 1829996, 2077863, 2238576, 2334565, 2410731, 2480292, 2513765, 2489655, 2441954, 2434836, 2486781, 2540300, 2524884, 2441915, 2366693, 2365311, 2430242, 2507375, 2565096, 2611145, 2649004, 2652565, 2603319, 2535135, 2513465, 2562039, 2619397, 2574260, 2348198, 1959359, 1520806, 1167477, 960082, 853421, 766605, 671535, 588319, 513269, 408974, 275654, 171856]
35567A71856l7911k172J1995O3945J20752P5082n5161r7113J6790J07429J2390
35556C87882j36752j01275P9154J29260l9415j95948j45100Q356O9942M3731M8849
35545A48684Q2103M7512m7304r2394m7830J6151L6017Q388n1090j08139r8555
35534a06457r145O4976L9615k4241j3683N3419O9480K7425J7864M4979J1701q4566
35522I1367j07298K580J10031P7502m0850r7259n5950O50R460k1336n5588n5016
35510a41707m023M4437J4330n5674k1257J40394K30139R1096j22321j26257Q5545
35499A34702K26745J27098n4942j06941n7323n4405r5921o7994J7512K3626p2300
35488A9857j16014q797J35922J57206O8811N030K056l5125j44388k07651j07590
$$ y = [171856, 133945, 131773, 143768, 207713, 328465, 403547, 348386, 251273, 268063, 375492, 387882, 251130, 149855, 229009, 358269, 318854, 122906, -22194, -13838, 56104, 99835, 148684, 230787, 278299, 230995, 138601, 90771, 106922, 142939, 151327, 100237, -7902, -106457, -115602, -50626, -11011, -35252, -48935, 4484, 73964, 101389, 119253, 164232, 175933, 91367, -15931, -13351, 96680, 174182, 133332, 36073, -19877, -19227, -9767, -31103, -86691, -141707, -145730, -101293, -86963, -142637, -163894, -23500, 206639, 297735, 175414, 49157, 134702, 361447, 488545, 433603, 326662, 269339, 214934, 119013, 51019, 68531, 92157, 19857, -96157, -104954, 30968, 188174, 256985, 262015, 264071, 228946, 84558, -123093, -230683]
35477b30683Q7578J88365J18807J725j5186N3847Q1240J8673m6713l3761J8559
35466B42451K2867k8921p2217p2404n5252m6227m1071l8108m4086m0620J887O5290
35454a06411R2374P1106N3760O6612N9990q724r2061j06887m1722L7065O1802
35443H6904J0272q7802j49067q6113Q0315J96608J38079k8631j22750p2495K5620
35432i060O6255N5315M4223L3855o38m5566o5368n5069l6958k4795j6808p921
35420f2535N723J9461J7395j332m409L1239P2071O7452K3517j4336l7766p0913
35408D5567j02944j01316q4272r2717r2680j1052J18729J66037R5466K7525M6860
35397A5203P5169K6668k7552J9292J10156R8878j6598q8081m2048K8539K6153
$$ y = [-230683, -143105, 45260, 164067, 165792, 150606, 204453, 285693, 304366, 257653, 223892, 242451, 265318, 236397, 164180, 91776, 36524, -9703, -50774, -88882, -132968, -173588, -171701, -106411, -14037, 57069, 110829, 177441, 237431, 228707, 136646, 29759, -11963, 25102, 86904, 97176, 9374, -139693, -225806, -145491, 51117, 189196, 160565, 37815, -34680, -9060, 57195, 112510, 156733, 190588, 189950, 144384, 79016, 23947, -13011, -37806, -54614, -62535, -56812, -37351, -19956, -21288, -25697, 5542, 77613, 145065, 168582, 154246, 116480, 45567, -57377, -158693, -242965, -335682, -428362, -439414, -320685, -154648, -59182, -31657, 15203, 90372, 117040, 89488, 108780, 218936, 317814, 301216, 213135, 171087, 199626, 225779]
35386B25779j6429j8207K2347N2308O1875Q0939R8334N7720m6497j22139p9970
35375C16060L7369R2697L2091m9900o3404n3050q7813j06428j5488J07967R0123
35364C00224o4855j59756r7636k72K8364N4748J25873J26532j5964j52065j19011
35353B6182N653N0111K5571M7741Q5112K0419j01482j23602m0754J0898L947L1852
35341D1648Q1918L4044r6240j45899p3159j4815k8620p946P8200R3568j3314q2762
35329a33377Q3J14973J15103N2266L8948M4630M306n166J06363K31139J83160
35318G52428j4415j45296r8465M549O018q3605j29242n6966N5775P6245j4779
35307C52247r3398o5183m140k6494q4877m1542P8158R9357j1521q0821k3872J0545
$$ y = [225779, 209350, 191143, 213490, 265798, 327673, 408612, 506946, 564666, 518169, 396030, 316060, 353429, 446126, 478217, 428317, 364913, 311863, 224050, 117622, 102134, 210101, 300224, 235369, 75613, -22023, -22295, 6069, 60817, 186690, 313222, 297258, 145193, 26182, 31835, 81946, 107517, 155258, 240370, 260789, 159307, 35705, -5049, 5849, 9796, 41648, 123566, 157610, 61370, -84529, -157688, -172503, -201123, -209069, -130869, -37301, -50615, -133377, -133294, -18321, 96782, 149048, 187996, 232626, 236932, 231766, 338129, 569268, 752428, 738013, 592717, 494252, 498801, 504819, 421214, 291972, 235006, 290781, 367026, 352247, 258849, 193666, 189526, 163032, 78155, 36613, 114771, 214128, 202607, 121786, 97914, 108459]
35295A08459q2629j49225k0685J84929K19970O4055q2282r6738l5461K6367P2066
35284B08826P3972N035p6523q1977k9659j6469o2470r1334n6712J0810P3897J17637
35272G5033J21162P8120K8680P755o356l5271m7084k2926q324k4415p836P2555
35260B31093J23953O0531n2250r6980p4287n8089n4820k8403L001J2578L4633
35249A00960P8474O6216k3580o6421Q598O2097k9066j23726k8368J54814J65530
35238C65528J651r2962k7687M2647K8916J6021K5252m0983j54145j42804n645
35227A5789L8411p8191j30350K2992J87539J46290r287p2083m6871n8255q7493
35216g1509l4210O8129J09899R5613R3982Q2426J5494l7959l745L4263l5620j33937
$$ y = [108459, 25830, -123395, -144080, 40849, 260819, 324874, 242592, 145854, 110393, 136760, 208826, 282798, 287833, 211310, 129333, 99674, 83205, 20735, -70599, -127311, -116501, -42604, 75033, 196195, 274315, 302995, 310750, 304394, 269123, 222039, 199113, 190789, 166374, 158538, 231093, 355046, 415577, 363327, 266347, 192060, 133971, 79151, 50748, 53749, 66327, 100960, 179434, 245650, 222070, 155649, 164247, 226344, 197278, 73552, 45184, 199998, 365528, 367179, 274217, 246530, 289177, 318093, 334114, 359366, 318383, 164238, 21434, 15789, 54200, -23991, -154341, -131349, 56190, 202480, 193193, 121110, 74239, 15984, -71509, -105719, -37590, 72309, 167922, 261904, 344330, 359824, 321865, 318120, 352383, 316763, 182826]
35204A82826r8922M0557J04444M3903j7297j5865k3253o5619n9118K1370P0374
35193A83400K0154m9218m3008J2350M3707N0727O4026M9539m6774j79901k17646
35182a12644r4906Q9844J72181J08776K4901M9359J41576J50292L2167q1345o6483
35171D13718L0430P5103K3484n8083j06868j18131j03522o2477J669P0878J14082
35160B80283R4862J1806o6258o4901j4425j6179p6411p7655K9581J16952N5235
35149B72890q6498j34098m2826P5748J20427Q3136m109r3801j11925k7681P3855
35138A25118Q4089K3130o64K9894K3140m5922o9480K7001J50685J53880K5806
35127E26677j03727j27902o6065m084J6656K1243L0944J6072n0571j18808j00901
$$ y = [182826, 83904, 124461, 228905, 272808, 255511, 239646, 216393, 150774, 91656, 113026, 183400, 203554, 154336, 111328, 123678, 167385, 218112, 282138, 331677, 284903, 105002, -112644, -207550, -117706, 54475, 163251, 188152, 237511, 379087, 529379, 561546, 480201, 413718, 444148, 519251, 542735, 484652, 377784, 259653, 156131, 93654, 95323, 166201, 280283, 375145, 386951, 320693, 255792, 241367, 225188, 148777, 71122, 100703, 217655, 272890, 186392, 52294, 9468, 85216, 205643, 288779, 284670, 190869, 78944, 51263, 125118, 209207, 232337, 231673, 261567, 284707, 238785, 169305, 196306, 346991, 500871, 526677, 422950, 295048, 228983, 224899, 241555, 262798, 293742, 309814, 259243, 140435, 39534]
35116C9534L420Q5985P1082J9887L5764J08105J25717L2150j02437j72150j45278
35105A01779o8399j218K8578K5135N230j2829r232K6328P1117Q1027N0582L1025
35093C29123M9722N2178r666p1745l9309M8501N9401k1325n9185J0792P3174J6580
35081D38241r0749j09968k7620N7064P5386L4054k4315l5042M7703J59116J53093
35070F76963n120j62668j74188q0278n249J8334J7167k2678r2283r2864K2782
35059I9918J27202R0789n023m25P0365M1859q9799j54350q7203j0583l865P207
35047H6092P0128R5001J6637p4034o1735K9454R1119P5551J9444j8925l391M4760
35035C70101L9836o9600j92288j79677l1627R1615Q9816M0041M5723Q1235O4864
$$ y = [39534, 42954, 128939, 200021, 219908, 255672, 363777, 489494, 521644, 419207, 247057, 101779, 33380, 32162, 60740, 85875, 91105, 78276, 69044, 95372, 166489, 247516, 298098, 329123, 378845, 431023, 421357, 349612, 310303, 358804, 418205, 396880, 337695, 348487, 421661, 438241, 347492, 237524, 209904, 266968, 342354, 376408, 352093, 317051, 364754, 523870, 676963, 671843, 509175, 334987, 254709, 249460, 267794, 284961, 262283, 170000, 77136, 99918, 227120, 317909, 312886, 312461, 382826, 424685, 334886, 180536, 93333, 82750, 78885, 86092, 156220, 251221, 267858, 193824, 132089, 161543, 252662, 328213, 347657, 328732, 325341, 370101, 409937, 340337, 148049, -31628, -63255, 28360, 118176, 158217, 203940, 285175, 350039]
35024C50039K587l0839r616J8249M920m5688r0237q7285l6141K1932N1514N4228
35012B03663L7082p609n8185n8616j0456o1n9883q3112J7293J41875J34506J9541
35000B76038m7243k3307l809k2296r137M3868N2782j671m8040p0315j10513j16421
34988h0064J0876J84058J71554m7393j94216q0791J18557J43160J5316n5194r21
34977A84942O8314P4050L0840m3029j19584j17621r022Q2847L3550q1860q7678
34966A5749K8304J05501N6613k5974k7970N0595J51484K45052L11355L06770K03315
34955A420794L4148j23639k01607j85060j25078q9179q6099p0094k8791r928l4490
34944E00977n0533j9902J2888l084l7930l7673j9457l6475q2820j04834q4228
$$ y = [350039, 352626, 321787, 312171, 330420, 335340, 289652, 199415, 112130, 75989, 97921, 149435, 203663, 240745, 233136, 174951, 116335, 105879, 105818, 45935, -37177, -19884, 121991, 256497, 276038, 228795, 205488, 201679, 179383, 170246, 214114, 266896, 265225, 217185, 146870, 36357, -80064, -69188, 114870, 286424, 239031, 44815, -35976, 82581, 225741, 241057, 185863, 184942, 253256, 327306, 358146, 315117, 195533, 77912, 68890, 151737, 185287, 103427, 15749, 44053, 149554, 206167, 180193, 152223, 202818, 354302, 599354, 910709, 1217479, 1420794, 1454942, 1331303, 1129696, 944636, 819558, 730379, 644280, 574186, 545395, 535467, 500977, 450444, 430542, 443430, 440346, 402416, 364743, 345286, 308811, 225991, 121157, 36929]
34933C6929m7343j0539K6408M5618K0435m3272j04892j21920p5347J2624P9058
34922a82241P3702J9233j9056j9047o949R755M2007O0623K6155k4903k1994J3270
34910b9445m55m2824p528R4981J15135N921p9712k7487N9968M5933k1365j9295
34898I3827L6055M6499J3521O048J5385o412k2490K2821O3526n932j38448j77872
34886e3472q5241J9803M6696L3012L7944M9787L2791j3076o5441j00527r4408
34875a92132m3603K3960Q4465J32445J41026P3753l0091o6904j7015J3050l8192
34864H0762q1706l2970L7711K5326l6504n0262j7725L485K6755Q0994J02659K9231
34852A67756o5166p4113l2457l2650l8555M1139J49152J41409K4756n4646m7282
$$ y = [36929, -10414, -20953, 5455, 51073, 71508, 28236, -76656, -198576, -273923, -261299, -182241, -108539, -89306, -108362, -127409, -134358, -124603, -82596, -21973, 4182, -20721, -42715, -29445, -29900, -72724, -80252, 14729, 129864, 135785, 56073, 28586, 88554, 134487, 113122, 93827, 129882, 176381, 189902, 195950, 211335, 204923, 182433, 205254, 268780, 262848, 124400, -53472, -138713, -118910, -72214, -39202, -1258, 48529, 81320, 68244, 2803, -97724, -192132, -235735, -211775, -127310, 5135, 146161, 219914, 189823, 122919, 105904, 118954, 80762, -944, -33914, 3797, 29123, -7381, -57643, -75368, -71883, -45128, 35866, 138525, 167756, 102590, 28477, -3980, -36630, -75185, -34046, 115106, 256515, 281271, 226625, 179343]
34841A79343m0002o1666l7657L7943O0625r681p9554p2388k1615K0460M9470N5635
34829H0913J2718n2839p3693l4374K4787P7193J00976M8704o8330j27086n0820
34818f1851M9944M1197j4177J6296P3509O378j25339j16288L1688J02552L3031
34807C6940l17Q1526J23807L7212m1941k0897k0970j20541j68910m6294J00360
34796d0025Q9687l796r488M0610O101q0943o8563M2580R7563L5884m0292m1147
34784B8171J5353Q0561J25579J17481M3016m9861j03191j14336r7750m1047L8204
34773D2180O6898K3685o623L2128O5790J9730l9575j1062O8042Q3760K3023l5516
34761C32460o2318q5746r7040o6453k7686l4715n7760k8442L4523N0934J2134
$$ y = [179343, 139341, 77675, 40018, 77961, 138586, 128905, 49351, -23037, -44652, -24192, 25278, 80913, 93631, 40792, -32901, -67275, -42488, 34705, 135681, 184385, 116055, -11031, -61851, -11907, 29290, 15113, 31409, 104918, 111296, -14043, -130331, -98643, 3909, 36940, 36623, 118149, 241956, 279168, 237227, 216330, 195360, 74819, -94091, -140385, -40025, 49662, 45866, 36378, 76988, 83089, 2146, -66417, -23837, 73726, 109610, 69318, 28171, 43524, 124085, 249664, 367145, 410161, 360300, 257109, 142773, 45023, 3976, 42180, 109078, 132763, 126140, 158268, 224058, 243788, 204213, 193151, 261193, 344953, 367976, 332460, 270142, 184396, 87356, 20903, -6783, -41498, -99258, -127700, -93177, -42243, -30109]
34750c0109j5575o591P064K2790O4958R6946M5962o4200j06329j7144J05366J21646
34738B24784J6347j01554j30541o4024L6697J10341J24473P1436k2170q5278n3635
34727A26876M3217R5099N1175q298J45K8377j3352q5989p3812J6051N4954M136
34715B38579k4435M1511J21329J19532N9544J2867o312j4490j2754j3831l2382
34704D89158k4911N8271J48070J17961k832l2982R3679K26752K34125J71271J28809
34693A607371Q4636K3292L2816J36439J77069L5361j58129j96200p9272L5362
34683A698745P4380P2055L4148m9460j10839p8047L84L4924L9913P1265R1851
34672A879319M0782l0929m0790k7402p4569j47277j59544j44013j85924k39910
$$ y = [-30109, -45684, -52275, -45211, -22421, 42537, 139483, 185445, 121245, 14916, -2228, 103138, 224784, 241131, 139577, 9036, -54988, -18291, 92050, 216523, 287959, 265789, 180511, 126876, 170093, 265192, 316367, 308069, 308214, 336591, 323239, 237250, 163438, 179489, 234443, 238579, 214144, 255655, 376984, 496516, 556060, 568927, 562615, 548125, 535371, 521540, 489158, 464247, 522518, 670588, 788549, 785717, 752735, 846414, 1073166, 1307291, 1478562, 1607371, 1692007, 1715299, 1748115, 1884554, 2061623, 2096984, 1938855, 1742655, 1663383, 1698745, 1773125, 1845180, 1879328, 1829868, 1719029, 1640982, 1641366, 1676290, 1716203, 1787468, 1879319, 1920101, 1889172, 1848382, 1820980, 1746411, 1599134, 1439590, 1295577, 1109653, 869743]
34662H69743j90816o2241J4670J8532M2750R1933O0770o2240j45003j12198m5973
34651D79927l0405k6577K4654P6018L5986q8701j76422j16222O1066J86572J25079
34640E50975n4401j49813q5119N300j840m0719L368R1563J00825J5437p8746j27453
34628B29377j22100n1121M9912P5840m459o5463p661P1968L3073p8562j17341
34617A3463p4809n6832q1738p1998r177N3151R3442J10898O9665k0922n3097J9181
34605h773P0097J657p0705j3898P3398K7917q1864p8968K245m551p3558l6288
34593a93291Q8921J17851L7266K1897J01962J07014j7220j10344p4675n666J1612
34582H5327J1632J1100k2508m1356K6814R2193J0129j36264j29290J5563P3788
$$ y = [869743, 678927, 616686, 631356, 649888, 692638, 784571, 845341, 783101, 638098, 525900, 479927, 449522, 422945, 447599, 523617, 559603, 470902, 294480, 178258, 239324, 425896, 550975, 496574, 346761, 261642, 266942, 265102, 224383, 227751, 319314, 420139, 435576, 356830, 229377, 107277, 56156, 106068, 181908, 177449, 111986, 104325, 176293, 209366, 130804, 13463, -61346, -118178, -199916, -271914, -281091, -227940, -134498, -23600, 46065, 25143, -27954, -8773, 61324, 62981, -7724, -21622, 51776, 79693, -2171, -81139, -78894, -83445, -157003, -193291, -104370, 13481, 50747, 72644, 174606, 281620, 264400, 154056, 79381, 73715, 85327, 96959, 108059, 85551, 44195, 71009, 163202, 173331, 37067, -92223, -76660, -2872]
34571b872P524O237J02628J05295j7372n4347M4659N7210q5042j39164K534R1321
34559A18611k7515j16037K5111J73501O7490j23130q2114J23345J79185L3199
34549C71646r4011r6782n4241K397R0628J15872j0317j55015j26653J5372O7179
34538A26075K0492K7676Q9854O3849m7286q5722k0262J8398m963J6989R4081Q6774
34526C85955m5836j49435j02694J8151P3782L3564m3014r2066p2924N454P0019
34515H0956O7735M6246O7458Q3099J0757j01265j19483k5242N8829M7872j2716
34504B04246m5282l2881n45J9072l591n7563p7675k5476M4142N7106K4268P835
34492A13656K3371L9777L8377J6949j8868k4590N3408J68340J81521M7395j00141
$$ y = [-2872, 4652, 10889, 113517, 218812, 201440, 147093, 191752, 248962, 163920, 24756, 27290, 118611, 91096, -24941, 170, 173671, 241161, 118031, 35917, 159262, 338447, 371646, 277635, 180853, 126612, 129009, 219637, 335509, 325192, 170177, 43524, 58896, 126075, 146567, 174243, 264097, 327946, 280660, 194938, 174676, 193074, 188111, 205100, 299181, 385955, 340119, 190684, 87990, 106141, 179923, 213487, 170473, 78407, 5483, 10937, 80956, 148691, 194937, 262395, 345494, 356251, 254986, 135503, 110261, 169090, 216962, 204246, 158964, 126083, 125538, 144610, 141019, 83456, 5781, -19695, 24447, 81553, 105821, 113656, 137027, 176804, 215181, 232130, 213262, 188672, 242080, 410420, 591941, 639336, 539195]
34481E39195j22843m9359Q042J2218j0574m4723n8102m82Q5006O7795n6450j01134
34469B68589L3569J70967J18631k3285l4597N2463J6950j55925k19803n1876J43837
34458C19520J26389n3377j48266n1779Q9263Q7209n3140j58951j14727Q845P9698
34447A30684P9975P2007N6411j095m3157J0693Q5835L7347q1538o2125J06457
34436C91494J76536K6413j45606j45875o1501m1394l1132O4335J50629J06001
34426D89900J4653J6081O2464L9518j0223N44J0305m7754n1111J15273K96171
34415I35821K70999J21927J15677K85239M18590M41786N26959P66418R56812P99923
34405E640151K23509n17302j008498j010536o92110m42506m06934l73866j87826
$$ y = [539195, 416352, 366993, 375035, 387253, 376679, 331956, 273854, 273372, 358378, 426173, 369723, 268589, 302158, 473125, 591756, 568471, 533874, 586337, 603287, 447362, 227559, 175683, 319520, 445909, 392532, 244266, 192487, 281750, 368959, 315819, 156868, 42141, 50986, 130684, 210659, 282666, 339077, 337982, 294825, 305518, 391353, 428700, 347162, 285037, 391494, 568030, 594443, 448837, 302962, 241461, 200067, 168935, 233270, 383899, 489900, 504553, 520634, 583098, 622616, 612393, 612937, 623242, 575488, 524377, 639650, 935821, 1206820, 1328747, 1444424, 1729663, 2148253, 2590039, 3116998, 3883416, 4840228, 5640151, 5863660, 5346358, 4337860, 3327324, 2635214, 2192708, 1785774, 1411908, 1224082]
34396A224082j7331m3233j36333r5091O185j2657r5108p2688R525q482r2882r6456
34384E69531m4330n5802q1708n563Q8997M1564p9870q3446J5654M8509j776k2027
34372C89733j4668n0519o6074K0788R3132J0104j11325p5709N2150Q6813O3697
34361C98122J15020J45902l380j93863j68117O084N6446k3079j7831P5051O9812
34350D60167j5089K790Q6632M3077p8414n6541P3943P4908n3368r1564k0736j1518
34338D14287m3838L9689J53169P6404j07909j29085j7210j5788q3081J8167K00541
34327E05346J57643n2936q3460P5298J04298k5801l5841P0653J2794j59063j00233
34316D68698J44373J53941j01751j83747K8903J55593M4350k878J11514Q9010
$$ y = [1224082, 1206751, 1163518, 1027185, 932094, 938279, 925622, 830514, 757826, 767351, 758869, 665987, 569531, 525201, 469399, 387691, 382128, 471125, 512689, 432819, 349373, 365027, 413536, 411760, 389733, 375065, 324546, 258472, 279260, 372392, 382496, 271171, 195462, 247612, 334425, 398122, 513142, 659044, 655664, 461801, 293684, 299768, 356214, 333135, 315304, 390355, 460167, 445078, 447868, 534500, 577577, 499163, 442622, 516565, 591473, 538105, 446541, 425805, 414287, 370449, 410138, 563307, 639711, 531802, 402717, 385507, 369719, 286638, 304805, 505346, 662989, 610053, 526593, 601891, 706189, 680388, 644547, 715200, 727994, 568931, 468698, 613071, 767012, 665261, 481514, 510417, 666010, 710360, 707482, 818996, 908006]
34306I08006j19129j60475L1903Q8370o8469n5681J95891K39835n4934k14868
34296G90449l226J78642N6079o7745L4960J10805J1822j600J35032R0854j48782
34285A187290j22278K37655L67466N6698j57931L0708J81055q083j50556J4512
34275A636536J18887m0675o6006J98829K77347M541p5804K35208L38295j7071
34265B610087j88536J53561L78715J13393m1129K74483M36594R7266n1428L82810
34255D165816O65257L43314J44777N19388P10848L07504J86638P95665J142018
34246H981225P18432O36265J485124K046969J678191J774028L094906M097452
34238B4512592M006155M771649P484114J0018738J1333481J4452489K1352045
$$ y = [908006, 788877, 628402, 660305, 748675, 680206, 624525, 820416, 1060251, 1005317, 790449, 787223, 965865, 1021944, 954199, 989159, 1099964, 1111786, 1110186, 1245218, 1336072, 1187290, 1065012, 1302667, 1670133, 1726831, 1568900, 1599608, 1780663, 1772580, 1622024, 1636536, 1755423, 1714748, 1648742, 1847571, 2124918, 2129459, 2053655, 2288863, 2627158, 2610087, 2421551, 2575112, 2953827, 3067220, 3026091, 3300574, 3737168, 3834434, 3783006, 4165816, 4831073, 5174387, 5319164, 5838552, 6549400, 6856904, 7043542, 7839207, 8981225, 9699657, 10335922, 11821046, 13868015, 15546206, 17320234, 20415140, 24512592, 28518747, 33290396, 40774510, 50793248, 62126729, 76579218, 97931263]
34231I7931263K9484270L8759915N5676673P9977581R1051080O3233668o89799
34224D55424651o3532475q9464037p7885010n4624343l8656209k9287879k0676669
34217H1298029j3706435j0777207r529657p097655m750967m344579m467946l352971
34209B3270612k096922k150243k488487j783042r13392j063635j455021j016588
34201A0303282m32686o56820j054857p41453k68131m15259o76425l82586m8781
34192E626284k67549m86651j41382J82831q4676l38441K7817M28949K50859Q5776
34182E283817N68403J012753N07923m96646r56324q29773p35625p08262m46351
34173C199915j99611l23249m73844k20390Q2006n6543l08753j49567J39846K4418
$$ y = [97931263, 127415533, 166175448, 221852121, 301829702, 392880782, 456114450, 455424651, 391892176, 302428139, 224543129, 169918786, 131262577, 101974698, 81298029, 67591594, 56814387, 47284730, 40187075, 35436108, 31091529, 26623583, 23270612, 21173690, 19023447, 16534960, 14751918, 13838526, 12774891, 11319870, 10303282, 9870596, 9213776, 8158919, 7417466, 7149335, 6734076, 6057651, 5675065, 5626284, 5358735, 4872084, 4730702, 4913533, 4828857, 4490416, 4518233, 4947182, 5198041, 5283817, 5852220, 6864973, 7372896, 6876250, 5919926, 5090153, 4354528, 3646266, 3199915, 3000304, 2677055, 2203211, 1982821, 2064827, 2008284, 1699531, 1549964, 1689810, 1714228]
34163A714228k59727j74587J06305P9763j29117r0111N9429n8307k46950j07929
34153H92997J34695K4969k48807j97090O9189R2346p5144o3961M6892n5540k09906
34142D10640o5493J81826J10306j21351o5767J54570P9780k00589k05886M4094
34132C22130J01696n2989k3993J93497J93713n8162j57478l839O7621n4857j06223
34121D21116m917K7320m2715o852J08811N6982j15854j03579Q4964J19876m6364
34110D98788j02012M0339J03262k6871j19372n1165Q477k8473k1371O8734P4132
34099D44468n7373j61624j46408q9765k9285O6165J30570Q2192J7237N1880P8774
34088C86831k5277j05779J0727J42293L4137j61241j30090M4043N3133n6317o608
$$ y = [1714228, 1454501, 1279914, 1386219, 1465982, 1336865, 1246754, 1306183, 1247876, 1000926, 892997, 1027692, 1052661, 803854, 606764, 675953, 768299, 693155, 629194, 676086, 620546, 410640, 345147, 526973, 637279, 515928, 450161, 604731, 684511, 483922, 278036, 322130, 423826, 370837, 346844, 540341, 734054, 675892, 518414, 514575, 582196, 527339, 421116, 416199, 443519, 400804, 393952, 502763, 559745, 443891, 340312, 425276, 545152, 498788, 396776, 437115, 540377, 513506, 394134, 342969, 351446, 322973, 301602, 370336, 444468, 387095, 225471, 79063, -10702, -39987, 26178, 156748, 238940, 256177, 308057, 386831, 361554, 255775, 266502, 408795, 442932, 281691, 151601, 195644, 248777, 192460, 185852]
34077A85852J31582N2965j63959j43725J03748J81305M260q9774J2706L5932j02849
34066B08043j25902M4308J11087l1089q4546R1320K06768O4975r9416n7707M9324
34055C77165L8346J134N0018Q1717K1111p201N5725O9191j0552j6760Q8070R3078
34043H41042p2811j72367o3205O0185K1431n8115l5230J270m4140p4715k0245
34032C83100J1155k8975j2238Q5695P5845j02006k19158j21691K8670N9747N1733
34021B11877J04163J18933K1130n8391j8822K9303q318m2689j6886k8940r1139
34010B20221n0133R7082J15513o1654j62423k1293J29888O1293p7383n6411M1659
33999B36359K6726m9619m6282j5193m7560m3878Q5933J89297J09446k9646l8137
$$ y = [185852, 317434, 370399, 206440, 62715, 166463, 347768, 352028, 262254, 274960, 310892, 208043, 82141, 126449, 237536, 206447, 121901, 213221, 419989, 484964, 385548, 327841, 377165, 415511, 416645, 466663, 548380, 569491, 562290, 618015, 687206, 676654, 659894, 747964, 841042, 768231, 595864, 532659, 592844, 614275, 556160, 520930, 522200, 478060, 403345, 383100, 394255, 365280, 353042, 438737, 514582, 412576, 193418, 71727, 100397, 160144, 211877, 316040, 434973, 456103, 397712, 378890, 408193, 399875, 357186, 340300, 311360, 220221, 170088, 267170, 382683, 321029, 158606, 137313, 267201, 328494, 251111, 194700, 236359, 263085, 213466, 167184, 151991, 104431, 60553, 146486, 335783, 445229, 415583, 377446]
33988C77446K5683J3073l0982j359L1486k2290n7653L1483J24812Q8661K3571
33977F03931N0220O1322m1935r1674O1169K20054J39222n0963p3350K3834Q338
33966I10168q1887l8155Q6891P5246r056R5608L59677N01474N08758O51897R05206
33955C965827Q27500K11367n30157q69122p74450n80515m72704l74846k25562
33946A177338j07614r9541j51464j51393o4183K3625R886p8667j10001l9081K1574
33935D30479j2991o1864k9836K0161j4566q8281r3142m5873k6751j4113N1103
33924A14326J10012O9881j9780m4521j5288j4910k4490K1567P4592M5169k4883
33913B91675l7223j2489j7990r587O2395Q8555l7581j83559j45776K2429J02531
$$ y = [377446, 403129, 416202, 385220, 383861, 415347, 393057, 335404, 366887, 491699, 580360, 603931, 654151, 715473, 673538, 581864, 643033, 863087, 1002309, 951346, 877996, 901830, 910168, 828281, 790126, 877017, 952263, 943207, 1038815, 1398492, 1899966, 2408724, 3060621, 3965827, 4793327, 5004694, 4474537, 3605415, 2830965, 2250450, 1777746, 1402900, 1177338, 1069724, 970183, 818719, 667326, 603143, 626768, 636654, 557987, 447986, 408905, 430479, 417488, 355624, 325788, 345949, 331383, 243102, 149960, 104087, 77336, 63223, 114326, 224338, 294219, 274439, 229918, 214630, 199720, 175230, 196797, 271389, 316558, 291675, 254452, 241963, 223973, 214386, 276781, 365336, 327755, 144196, -1580, 20849, 123380]
33902A23380O0919L7087M1757l5358j45213j16620K2543O7880L980L0874J73627
33891B64856J93054o773j86289j36392K2063P1357J1922k7742j9262p792O053
33880A85055K2422j678n3154m5448K1716L2371l7558m8438O8027J68848J17793
33869D29956m055l9429J5277N2186K6002l0473q4670j06328o7764o687n23l5900
33857A47592k1159L4328R733r7878j15195L2673J67373J18539j8517n4576j998
33846B00915n206p1718p9269n930M1914K6708L4024J03239J43086O8486p0442
33835C85807j50328j18091l6477m370m5170p9638l0014O0863P3196j9052j00368
33824f3642p4179O625L1975n074k0277K2948O5904M6434j5814m5142l485N7711
$$ y = [123380, 184299, 221386, 263143, 227785, 82572, -34048, -11505, 56375, 60355, 91229, 264856, 457910, 451137, 264848, 128456, 150519, 221876, 233798, 206056, 186794, 179002, 185055, 207477, 205799, 152645, 107197, 128913, 161284, 123726, 75288, 143315, 312163, 429956, 425901, 386472, 401749, 453935, 479937, 449464, 364794, 258466, 190702, 184015, 183492, 147592, 126433, 160761, 170494, 72616, -42579, -9906, 157467, 276006, 257489, 202913, 200915, 195709, 123991, 44722, 38792, 80706, 107414, 141438, 244677, 387763, 456249, 385807, 235479, 117388, 80911, 76541, 31371, -48267, -78281, -17418, 55778, 36726, -63642, -137821, -131196, -99221, -104295, -124572, -101624, -35720, 10714, -5100, -50242, -53727, 3984]
33812C984N5022j6026o6391l6249K0365K8628J3879M2183Q6760O8203M308o573
33800A98093M8979P7853M0091N414K0587M0570L4203M7143J07249J62604J64199
33789I46985J29725Q9773N2616M6417J04078J82952J97650J52798J35140J54203
33779B192337J15653j1844j29984j56811j20429o7693p504J6256n7936j65710
33769A606335j48327J858R4196L0569l2560N5485J82296J49565j5118j12264o1464
33758A750571L3645O3309O047j14945k38040k63140j61436m3343j7069m5286m9256
33747I21057o3403j40310j88235q9019P2405R5859l0283j12173n4988J2863k3524
33736D00249q6732o2654R355K3361j4057j6436K6291L8994r960o2868n9765p691
$$ y = [3984, 59006, 42980, -23411, -59660, -39295, -10667, 3212, 45395, 132155, 200358, 204666, 198093, 247072, 324925, 365016, 370430, 391017, 431587, 465790, 512933, 620182, 782786, 946985, 1076710, 1166483, 1219099, 1265516, 1369594, 1552546, 1750196, 1902994, 2038134, 2192337, 2307990, 2296146, 2166162, 2009351, 1888922, 1821229, 1813725, 1829981, 1772045, 1606335, 1458008, 1459866, 1554062, 1584631, 1552071, 1607556, 1789852, 1939417, 1924299, 1812035, 1750571, 1784216, 1847525, 1853572, 1738627, 1500587, 1237447, 1076011, 1032668, 1015599, 970313, 921057, 857654, 717344, 529109, 440090, 512495, 608354, 578071, 465898, 410910, 423773, 400249, 313517, 250863, 260218, 283579, 269522, 253086, 279377, 318371, 308411, 245543, 185778, 178087]
33724A78087M6933P0669N7138K1675n567l569J1932M062l1206n0109k1707K1438
33712B99776L2669L0009O0373R1203L2810j00596j62341q1371R081k9959j12701
33701F8953o4298P7328J04921k2023j08729m1163M5885J4391n6932l5865L6790
33690A9258M2615p471j9170J5450L7702M2587M9903K4870m5356o9111J9460J16652
33678B27389Q4180k9418o0947J3497O0966J2202n8917q1453o9282m2014O789M5131
33666A08123K5455j3351J5583R2960J02452J8989m1440o637L9615L51q1347r8685
33654A62068l9550K0434M0927M9496O5987O4581K4025k6810l9792j2946q8l9718
33642B68614r0191p2075K3947J17111J38798J04222N7442L379o0890r9667q2325
$$ y = [178087, 225020, 295689, 352827, 374502, 368935, 365366, 377298, 381360, 350154, 300045, 278338, 299776, 332445, 362454, 422827, 514030, 546840, 446244, 283903, 202532, 211613, 181654, 68953, 4655, 81983, 186904, 164881, 56152, 14989, 60874, 75265, 18333, -17532, 19258, 61873, 54402, 35232, 50682, 88384, 130971, 180874, 205744, 160388, 91277, 110737, 227389, 311569, 282151, 221204, 234701, 295667, 307869, 248952, 167499, 98217, 56203, 62992, 108123, 133578, 120227, 135810, 228770, 331222, 350211, 308771, 302134, 341749, 342100, 260753, 162068, 122518, 142952, 183879, 233375, 299362, 363943, 387968, 361158, 321366, 308420, 308332, 268614, 178423, 106348, 130295, 247406, 386204, 490426, 547868, 551247, 490357, 390690, 308365]
33631C08365l8359j5420j2140Q01K5107M4405N4523M4642q222q3711j08164n0733
33619A61094J9999K7363j4749m3832l4836L618N6754P9820K0853q1678j11559
33608H2847m1420J9793J3929L3073J26893J60141K2960j45017j40182j0149L4770
33597A57638m0298q0522l3748j0906m4427k7249O1433R4904L2401K142O2205Q1201
33585B54774k4075j14480m0629J12223J48732L4789r8249j46740j05802r021Q5404
33574I6926R6188J1392n9839j8878P8720R8520J0482q9296j14486o5383J5284
33563E9630Q9897J27895J12179N3137k0611p3888o6749J1539R6049Q9211j7351
33552D60938j12740r6282L294P4924N5943k0721q3413r3264p0177n9170o3982
$$ y = [308365, 270006, 254586, 242446, 243247, 268354, 312759, 367282, 411924, 403702, 319991, 211827, 161094, 181093, 208456, 193707, 149875, 115039, 118657, 175411, 255231, 276084, 194406, 82847, 41427, 61220, 75149, 108222, 235115, 395256, 418216, 273199, 133017, 122868, 157638, 117340, 36818, 3070, -7836, -52263, -79512, -18079, 76825, 109226, 111368, 173573, 254774, 230699, 116219, 75590, 187813, 336545, 371334, 273085, 126345, 20543, 11522, 96926, 193114, 204506, 144667, 125789, 204509, 303029, 313511, 224215, 109729, 44346, 59630, 149527, 277422, 389601, 442738, 422127, 348239, 281490, 293029, 389078, 478289, 460938, 348198, 251916, 255210, 330134, 386077, 365356, 281943, 188679, 118502, 59332, -4650]
33541d650l4738M9565J22687J13081N0103J0522q645o0813j13564p0511N7692
33530A10729J34205Q6729k37l1384k3298k1010m164M3820O7202K4325l3349m7620
33518C05948m7376p6796r8013n2548L1258P3927N1248J202l7192l8819R483P7685
33506B00007J05858Q6284P3355Q1195N6717Q43J3301J36915K49894K13513N6860
33495A274742q3778j44599j51562j20874n8971k0007m8516r0323o4194K241J2002
33484E06161m4474p7901m1584J2821K7407L886l0471n4767m9880j8903l060k4696
33472B04539l8546K50N2312M9510J109l3721m4980n6930n1042m142K9897q676
33460I9580n9459j8349P4147P1830l8728j00797l2880N0542M1180M778L2470O0402
$$ y = [-4650, -39388, 10177, 132864, 245945, 296048, 306570, 297925, 237112, 123548, 53037, 110729, 244934, 331663, 331426, 300042, 276744, 255734, 251570, 295390, 362592, 386917, 353568, 305948, 258572, 181776, 83763, 31215, 62473, 136400, 187648, 188850, 151658, 112839, 122322, 200007, 305865, 392149, 465504, 546699, 603416, 604259, 617560, 754475, 1004369, 1217882, 1274742, 1190964, 1046365, 894803, 773929, 714958, 694951, 646435, 556112, 491918, 494159, 506161, 461687, 383786, 342202, 355023, 382430, 386316, 355845, 301078, 251198, 232295, 229235, 204539, 165993, 166243, 218555, 268065, 269174, 235453, 190473, 133543, 82501, 78359, 108256, 99580, 40121, 21772, 95919, 167749, 129021, 28224, -4656, 45886, 87066, 91844, 124314, 184716]
33448A84716r701j06856q2726M1301R4738J9101n7239l3027K7516K7789j7873
33437H7739n1008p3064r3070n9917M9487J41910J19013K8656j0051N639j8547
33426A26787q3705p6579L5385J27690R5086j1335q8480j16436j16334p5640l680
33415a87241K8540m343k1306K5256M8027k0722p5998N734J42211J54170M4725
33404A39053k1599P700K1541k9228n6482j9714L451j5183L796P1533P3529k4595
33392A53802q0995K698J10944Q7552l7480j16930q9486l920Q0177J19480Q5822
33381C11664J4999j4795m155l4984j08376j11684j3547N3011o565j00360j03089
33370a17881k2238Q2712J96529K64515J86645J6561k2830J35952K77890K75061
$$ y = [184716, 175015, 68159, -14567, 26734, 121472, 140573, 83334, 50307, 77823, 105612, 87739, 36731, -36333, -129403, -189320, -139833, 2077, 121090, 149746, 139695, 145334, 126787, 43082, -33497, 1888, 129578, 224664, 213329, 124849, 8413, -107921, -183561, -187241, -158701, -163044, -184350, -159094, -111067, -131789, -207787, -202053, -59842, 94328, 139053, 117454, 125154, 146695, 117467, 60985, 41271, 44722, 29539, 33335, 104868, 178397, 153802, 72807, 75505, 186449, 274001, 236521, 119591, 30105, 26185, 106362, 225842, 311664, 326663, 311868, 307713, 272729, 164353, 52669, 39122, 92133, 85568, -14792, -117881, -140119, -57407, 139122, 403637, 590282, 606843, 584013, 719965, 997855, 1272916]
33360A272916L24602N54251O48474K55415l94604p15187n51144l05910k72941
33351H15872k87784j56533j0491j9966q1025l5554L7768n860j01730r9225j6820
33340C8652L4395N8524J07369J13847k517j40332j26411J9168J05485M1435o8940
33329A80675r9166l8922M6994R2013N0752o3152j50166j08434L7113J39381Q4456
33318A71544p8232j75372q9499R6464J72915N7404q6114o4201P5844J31651N7790
33307B70194J401K1145p285j32758j95800q8475M1638K0331p3997n8134M9092
33296a52648Q8598N0879O8750J47944J37150o611j26839j03621j4855J4967q764
33285I4950j2286J2920K6339J5977j3209o9013j28149j20020j9984Q6495R9184
$$ y = [1272916, 1597518, 2151769, 2800243, 3055658, 2661054, 1945867, 1394723, 1088813, 815872, 528088, 371555, 361064, 341098, 260073, 224519, 262287, 256427, 154697, 55472, 38652, 73047, 131571, 238940, 352787, 350270, 209938, 83527, 102695, 208180, 249615, 180675, 81509, 42587, 89581, 181594, 232346, 169194, 19028, -89406, -52293, 87088, 171544, 93312, -82060, -171559, -75095, 97820, 155224, 69110, 4909, 80753, 212404, 270194, 271595, 292740, 285455, 152697, -43103, -131578, -89940, -69609, -143606, -201740, -152648, -64050, -13171, 55579, 203523, 340673, 334062, 207223, 103602, 88747, 103714, 94950, 82664, 95584, 121923, 137900, 124691, 55678, -72471, -192491, -212475, -125980, -26796]
33274b6796L1304j9525n159L2747M7041M1786K8583j4722r8130j63958j33274
33263b80103r876J07481J34591Q7727L6903J1356p313k5977k7818j0435J0760
33252B7296L1771N0959M3162p735o2359o7479l3602j1241m048K1290N0166L3788
33240G1968j2261k0606N259j2525q0446r7711j5179P7122Q6272M2396J5960L135
33228F3384k1879k6318J4777M6573K6235J4697O9327J13126L9364r8984j43017
33217I7285n4974M0438M6849N054j3916j4191k8286m9195n9362o6715o8525l0698
33205a96236N2030J14529Q9902K296n2985k4474L4448M0261o164k3402K4643O3664
33193A18512J6903p0111r1395l8425J581n126m925J8038J0445k2151O426R3075
$$ y = [-26796, 4508, -15017, -20176, 12571, 59612, 101398, 129981, 115259, 17129, -146829, -280103, -289979, -182498, -47907, 39820, 76723, 88079, 80766, 54789, 26971, 16536, 27296, 59067, 110026, 153188, 145453, 83094, 15615, -17987, -29228, -33276, -11986, 38180, 71968, 59707, 39101, 44360, 31835, -48611, -146322, -161501, -84379, 1893, 44289, 60249, 63384, 41505, 15187, 29964, 76537, 102772, 117469, 186796, 299922, 339286, 240302, 97285, 42311, 82749, 129598, 134652, 120736, 106545, 78259, 29064, -30298, -97013, -165538, -196236, -144206, -29677, 60225, 62521, 9536, -14938, 19510, 59771, 53607, 30205, 54848, 118512, 135415, 65304, -26091, -64516, -62935, -68061, -72986, -54948, -44503, -66654, -60228, 32847]
33181C2847R5670m6910j76189j27278K7962J02248P0025N2699Q5461Q3047K0553
33170B20135k5148k3849k7613m0992m277O5094O0808l4960r8726n5432J651l4868
33158A823j12883j03234N664R3893O8661l4008j02887o7378L8152J10418Q5018
33147a6761L739m4266k8020J5812N2519P0817N6292J4812R133Q9574J90045J83809
33135E97505N7105o4102q8933p1647r8526j48114j39341o7773j1807j5481l0579
33124h1693Q190Q4615J07838K4448r4895j18691j4425J00408J00158N13q1315
33113C5151p5503p404O9855J17324J02814K4005o4146r8906p6883l2856J2182
33102E633L4236m996q2181r0237J5403J16064Q9684J189j0091L3458N329p6803
$$ y = [32847, 128517, 81607, -94582, -221860, -193898, -91650, -21625, 31074, 116535, 199582, 220135, 194987, 171138, 143525, 102533, 98256, 163350, 224158, 189198, 90472, 35040, 36691, 1823, -111060, -214294, -208630, -114737, -46076, -80084, -182971, -250349, -212197, -101779, -16761, -13022, -57288, -85308, -69496, -16977, 53840, 110132, 124944, 134077, 223651, 413696, 597505, 654610, 590508, 501575, 429928, 331402, 183288, 43947, -23826, -35633, -51114, -81693, -73503, 11112, 118950, 143398, 48503, -70188, -84613, 15795, 115953, 116466, 35151, -40352, -47756, 22099, 139423, 242237, 266242, 202096, 103190, 26307, -6549, 5633, 39869, 34873, -47308, -137545, -122142, -6078, 83606, 84795, 74704, 108162, 113491, 36688]
33090C6688p4686R312K9989j7332L0860J76748J77702o1487k67948j84345L7585
33079a06914Q5480l2444n4480P6439J43855M6197m7355l545O5146J9225p4667
33068A16937p5436M113M8023K8812J4341L4368N3173M6917K0385k8771q7790r8377
33056G6695k6154N9161N3701l5725r5877o5096r509j2682n8324p2773l5193J4175
33044b07601M5305N4599K7544m3043r9494n6536P5560J71317J38444L1671l4426
33033A03340l5731l1683m6228m4260j8675j5030n1854q3902p0177k7247Q806L1737
33021b80904N4761Q1802J02115R1876K9753n6936q5223j2474P9550P1912k5564
33010E0668q2292l3066L6854K9232l0469n2916j7347K2957K9078J0316r204j1715
$$ y = [36688, -37998, -28686, 1303, -16029, 14831, 191579, 369281, 307794, 39846, -144499, -106914, -21434, -53878, -108358, -31919, 111936, 158133, 110778, 107233, 172379, 191604, 116937, 41501, 45614, 93637, 122449, 136790, 171158, 224331, 271248, 291633, 262862, 175072, 76695, 50541, 109702, 163403, 127678, 31801, -33295, -42804, -55486, -113810, -186583, -221776, -207601, -162296, -107697, -80153, -123196, -222690, -279226, -203666, -32349, 106095, 137766, 103340, 67609, 35926, -10302, -54562, -73237, -88267, -140121, -224023, -294200, -321447, -312641, -280904, -226143, -144341, -42226, 49650, 79403, 22467, -62756, -75230, 4320, 76232, 50668, -31624, -64690, -27836, 1396, -29073, -81989, -99336, -76379, -47301, -36985, -46189, -57904]
32998e7904J3219N5487Q0461N9181j158n9574o8436j6005M0330J7749p8373j29242
32986a44265n1826P1880R8038J5041o5672q0881n9751j8840N0964R6638M7363
32975d1311m2628m6093K4869K6099o5214r2637J6170J19670R6909K8995K1758
32964D6587K2565l6982p9608l3929K906n8389j00713R872J59373J47127J5504
32953I4313l4544J2564p65q3204p0870N6498J11647J4719p6636m0737K7399J5722
32941B6106k3959j6737j2458o0942q6354k0831N7935N1867J304l699K2150J4981
32929e0637o586J6128O7044Q7516P4887O2628N1385L3460L0639M1699J7229m9204
32917C76188q1955m5673j8850n9523q9654k1629Q2725J05472N7831L3810K8915
$$ y = [-57904, -44685, 10802, 91263, 150444, 149286, 89712, 21276, 5271, 45601, 63350, -15023, -144265, -196091, -124211, -26173, -11132, -76804, -157685, -217436, -236276, -185312, -88674, -41311, -83939, -130032, -105163, -79064, -144278, -236915, -220745, -101075, -4166, 24829, 46587, 69152, 32170, -47438, -81367, -78461, -136850, -237563, -227691, -68318, 78809, 94313, 59769, 72333, 71568, -11636, -82506, -26008, 85639, 100358, 23722, -17015, 10384, 26106, 2147, -14590, -27048, -87990, -174344, -195175, -137240, -85373, -84069, -87768, -65618, -50637, -57223, -41095, 25949, 113465, 188352, 250980, 302365, 335825, 366464, 408163, 425392, 376188, 294233, 248560, 229710, 170187, 80533, 58904, 141629, 247101, 304932, 338742, 367657]
32906C67657m0016j51525j73974o7178M5148N2511Q39j347N8877J02188P5966
32895B69146J3074j7211J0387M6752K4501m7471p7040r624Q0194P5781k6106j15066
32883B27317j11264l7254N2884J34881J85913J75506J28529J33801K32747L42235
32873A465295L48727K51349J47930R4515N4257j497k0702M3795J25931J07245
32863B616845j9915j31101j34209p8181n0053l9557P303N3404J0074r4920j15001
32852B024689J0325J54888J75035R1957K1585q823o7355j72475k52202k59698
32842A717926k41856k56659k80161k42053j29458j5805J7540k9166p7874o8326
32832C94108k8472k4344n9410p5057m8599k3791k3362l950N6924R7005N9129r688
$$ y = [367657, 327641, 176116, 2142, -65036, -19888, 32623, 33462, 32115, 90992, 193180, 269146, 282220, 265009, 275396, 322148, 346649, 299178, 222138, 212514, 292708, 368489, 342383, 227317, 116053, 78799, 131683, 266564, 452477, 627983, 756512, 890313, 1123060, 1465295, 1814022, 2065371, 2213301, 2307816, 2362073, 2360576, 2339874, 2383669, 2509600, 2616845, 2596930, 2465829, 2331620, 2253439, 2203386, 2163829, 2171132, 2224536, 2234610, 2139690, 2024689, 2035014, 2189902, 2364937, 2456894, 2478479, 2469656, 2402301, 2229826, 1977624, 1717926, 1476070, 1219411, 939250, 697197, 567739, 551934, 569474, 540308, 462434, 394108, 365636, 341292, 281882, 206825, 158226, 134435, 111073, 107123, 164047, 261052, 320181, 310493]
32820C10493k8182p495j7606n6660n7401j5829l354l4162l0650L5503P0175k534
32808A62298j05416j05710q80Q6171P6047R029m4218o4153n8113k7753P009Q152
32796e7537k0559k2256K5012N6340R534p1211q8895l0342K6165L6860M4046P9668
32784a3175R6252M2516n1245j18717j40188j21206m0260R9687K02242J63201K5312
32773A44419n0461R045J00653R9809K0302l8770l6714q392J5320K6233N439n3065
32761B33818r8618p5137j1311J1079j9327l0596K595K659q2682j67719j31832
32750c67071O24Q3228N0188m666J3829O0338M0454k6665m2592N084K7338j1315
32738a71226l5301R231O6418P3174O0231P6641Q9617M6648k3907o4802q5341j07196
$$ y = [310493, 282311, 274816, 257210, 200550, 143149, 127320, 123966, 89804, 59154, 94657, 164832, 162298, 56882, -48828, -49708, 36463, 112510, 121539, 77321, 13168, -44945, -72698, -65689, -57537, -78096, -100352, -75340, -19000, -9466, -80677, -169572, -199914, -173749, -136889, -92843, -13175, 83077, 125593, 74348, -44369, -184557, -305763, -346023, -246336, -44094, 119107, 144419, 93958, 103003, 203656, 303465, 323767, 284997, 248283, 239891, 255211, 281444, 286883, 233818, 135200, 60063, 48752, 59831, 40504, 9908, 12503, 15162, -67520, -235239, -367071, -366447, -283219, -233031, -237697, -223868, -163530, -123076, -149741, -192333, -187249, -159911, -171226, -206527, -197296, -130878, -57704, 2527, 79168, 168785, 215433, 191526, 126724, 41383, -65813]
32726f5813p7091M0749J35110O8423q9194j19914K4518J43506R0798j6290o528
32715A28274P2455N4881n8333r9783l837R0706M8500o9240r4382K0376J36978
32704B26595J00152o8067j81470j10168N5201J20059M2709k2770M2158J55859
32694C60258J68758P0973k6091n8059n5272m9973l3176m422R796k817k8506n4499
32682B96970p0233n7976k2246n429l0060n2356k2913L3558N4296K9806J055j2808
32670A41664k2062j8272J6392N7688N6595Q877m1602o7539q1187r3548r0380n2523
32658a85897K0256R5441J10863L2253p4336q8589O863Q4840M8951k3957n058Q6148
32646A07778J16694M0361n4751q7413o2795j1303M8282P4813K9000n2419q7551
$$ y = [-65813, -142904, -102155, 32955, 101378, 12184, -107730, -83212, 60294, 151092, 134802, 128274, 200729, 255610, 197277, 97494, 93657, 184363, 232863, 163623, 69241, 89617, 226595, 326747, 258680, 77210, -32958, 22243, 142302, 185011, 162241, 204399, 360258, 529016, 599989, 573898, 515839, 460567, 410594, 377418, 372996, 382792, 379975, 351469, 296970, 226737, 168761, 146515, 141086, 111026, 58670, 35757, 69315, 123611, 153417, 154472, 141664, 119602, 101330, 117722, 175410, 232005, 240882, 199280, 131741, 50554, -42994, -133374, -185897, -165641, -70200, 40663, 72916, -1420, -90009, -83146, 1694, 50645, 26688, 21630, 107778, 224472, 264833, 210082, 122669, 59874, 48571, 96853, 171666, 200666, 148247, 60696]
32635F0696o1574k9742j4008R059J9972l2775j17466j28329m3575L2222K7640
32624b77880N035M6819J31838J85692J75828J00915l3316j65601j87072p3745
32614i1487N3505P3885J0778l9756n4590o4966n1392K6359J17930J17213J8849
32603A16328n7592l0066L6894L1635m8816j00050n2093L8223N4735l5614j36158
32592a82574j31057k4072O6906N3396k5670o6928k7687M5187R0369R4290P4642
32581c3198L6777k2145p0185m3717O7024J56955J00702p4689j86758j18075K8985
32570a58324P5513N824m3297j265N5275M8194M422k1748l3261m5753l7501J879
32558a50042L2778K1798j1435l2491k6237K0020R8118J33483N1260q6973j21919
$$ y = [60696, -878, -30620, -44628, -35569, -15597, -48372, -165838, -294167, -337742, -305520, -277880, -272845, -226026, -94188, 91504, 267332, 368247, 334931, 169330, -17742, -91487, -37982, 35903, 46681, 6925, -47665, -112631, -164023, -137664, -19734, 97479, 116328, 58736, 28670, 65564, 97199, 48383, -51667, -103760, -65537, -10802, -46416, -182574, -313631, -337703, -270797, -217401, -243071, -309999, -337686, -292499, -202130, -107840, -33198, 3579, -18566, -88751, -132468, -65444, 91511, 192213, 117524, -69234, -187309, -158324, -82811, -76987, -120284, -121549, -66274, -18080, -13658, -35406, -68667, -114420, -151921, -150042, -117264, -95466, -106901, -139392, -165629, -145609, -47491, 85992, 137252, 50279, -71640]
32547g1640k0283N8582j181q6715k9677J22978J65317K7446j33709j53856n4137
32536a76875K7070J4189m6100o6720j9609M3480N7565K0217j9301l5452m2724
32525b44260l6148J3073Q0087Q6438K3274r229M7352J02388N3496l8866l5156
32514D2449O1987J01134O13j40110j79157r8719O120M8487K2606j5003j4468J0581
32502a53480M361m5258p8867m9002J3763N6681P6626Q7187O9864K1325o061J5812
32490A2951K7460j7600n3310j0076L9672j4028j10503q3982O5613J46045N7715
32479E9957o3880o7797m98R180l9981n5308j7020J6527K7489M6822O3953K9698
32467I142n1703j13603j14782p4678k2220L1639O8470O5106L2233P610K899n721
$$ y = [-71640, -91923, -33341, -34522, -121237, -150914, -27936, 137381, 164827, 31118, -122738, -176875, -149805, -135616, -181716, -248436, -268045, -224565, -167000, -146783, -166084, -201536, -244260, -280408, -267335, -187248, -100810, -77536, -86765, -39413, 62975, 116471, 77605, 42449, 104436, 205570, 206183, 66073, -113084, -211803, -205683, -157196, -134590, -149593, -164061, -153480, -149119, -194377, -273244, -322246, -308483, -251802, -175176, -87989, -18125, 3200, -2861, 12951, 40411, 22811, -30499, -40575, -903, -14931, -125434, -209416, -143803, 2242, 59957, -3923, -71720, -72218, -63038, -103019, -158327, -175347, -158820, -131331, -84509, -20556, 9142, -42561, -156164, -270946, -345624, -367844, -336205, -267735, -202629, -170396, -162786, -159887, -165608]
32455a65608k8656m2436k8685r43K0973L6167M6681M0445J1859j6150j6824k844
32443a46021j8396p7295j28964j09270j9617O7806Q7040M1064j5842l5164n452
32432c60111M6655O8852J8838q7800j75677j73970q0021M1844J10706Q5752L455
32421e01477m6431k1005J0626l7469j20645j11926j4448L772j42791l02631k98566
32410a582991j87398j53488k25097k92049l64356n71267q51073q70212m00837
32401e498768L50408R35171J109031R68999P26795N00505L18494J89109J09896
32392b90360O4697M7095O1740R2313R4004L4280o2205j18414p5213K9850Q5366
32381c6847M3931j904N1203J47455J36231Q09j03399p2978Q029K4875M722K7138
$$ y = [-165608, -194264, -236700, -265385, -266328, -245355, -209188, -162507, -122062, -110203, -126353, -143177, -146021, -164417, -241712, -370676, -479946, -499563, -431757, -344717, -303653, -319495, -354659, -360111, -313456, -244604, -225766, -313566, -489243, -663213, -743234, -701390, -590684, -504932, -501477, -547908, -568913, -558287, -595756, -716401, -828327, -842775, -839003, -981794, -1284425, -1582991, -1770389, -1923877, -2148974, -2441023, -2805379, -3376646, -4227719, -5097931, -5498768, -5148360, -4213189, -3104158, -2135159, -1408364, -907859, -589365, -400256, -290360, -225663, -178568, -116828, -24515, 69489, 103769, 41564, -76850, -152063, -122213, -36847, 7084, 5180, 56383, 203838, 340069, 340878, 237479, 164501, 172530, 197405, 202127, 229265]
32369B29265N7265N232r7169j20301l2753M7630K1767o5795j04648n2073M6528
32358f5052J19522J18025M0111o0946j11204q0947q976M2381M5970K2346N564
32347F6794M847N019L948K5750P3008R2401L7945m6676p5421m6729m1533q0238
32335A9115p8110J0424R4930P0863l0508r5327p9347k8774P226R972k1777m7801
32323a69114K517J20575J79736R9677j3069r323P0051N6765p0479j43324o1240
32312F2772O6425R6965L9357j6983m8385p8044r0613n9643j1650R705M453p359
32300c3000j9371q433N9185J41566J26242n473j05602m9813P5652J00387K4021
32289C05361n817N3917P7219j3688j17261j10485k3290L2891K7660Q120r800m6731
$$ y = [229265, 286530, 291762, 194593, 74292, 41539, 89169, 110936, 45141, -59507, -111580, -65052, 54470, 172495, 212606, 151660, 40456, -40491, -49467, -7086, 38884, 61230, 66794, 71641, 76660, 80608, 106358, 179366, 271767, 309712, 263036, 187615, 140886, 99353, 19115, -58995, -48571, 46359, 117222, 86714, -8613, -87960, -116734, -109508, -99536, -121313, -169114, -166597, -46022, 133714, 233391, 220322, 210999, 281050, 337815, 267336, 124012, 62772, 129197, 226162, 265519, 248536, 200151, 122107, 31494, -28149, -39799, -30094, -25641, -33000, -52371, -60804, -1619, 139947, 266189, 260716, 155114, 105301, 180953, 281340, 305361, 299544, 353461, 430680, 416992, 299731, 189246, 165956, 198847, 226507, 234627, 224827, 178096]
32277A78096q1580n8010K7596J07226J17754N6454l3442r3274p8755n344M7067
32266A83788K1946l6125m7534k3140m1682j00684r3344K1145J20955Q0725l9631
32255D6419p4371J0171P6981K8074o3109q0451l0272P799L0550R9056J91044J83381
32243D25272K7204j44631j63974m0163N9234L2446m0936l7595L6227P5705L2452
32232B61241m3823r8507j20883r8310j2427Q9759J04925O632r5837r1968p712
32221a06910N6810P2290P7718P3880K3910m8157o1381j193M3726J818q4377j17023
32209f8889n9088L4072P3658K0235o9825r1555j3500P5925Q6987M9195M3269N9889
32197A40373K9980l3634m9750j7935k0034n8736l7458O0183J15598O4456M471
$$ y = [178096, 96516, 38506, 66102, 173328, 291082, 347536, 314094, 220820, 142065, 136721, 183788, 205734, 169609, 122075, 98935, 57253, -43431, -136775, -115630, 5325, 86050, 46419, -27952, -17781, 59200, 87274, 24165, -56286, -86558, -78759, -48209, 50847, 241891, 425272, 452476, 307845, 143871, 103708, 162942, 195388, 154452, 116857, 153084, 228789, 261241, 217418, 118911, -1972, -100282, -112709, -22950, 81975, 88607, -7230, -99198, -106910, -50100, 22190, 99908, 173788, 197698, 149541, 88160, 86967, 130693, 132511, 48134, -68889, -127977, -93905, -20247, -12, -69837, -161392, -174892, -98967, -11980, 37215, 80484, 140373, 170353, 136719, 86969, 69034, 49000, -9736, -47194, 12989, 128587, 193043, 197514]
32186A97514L0003Q3615P0611J0195l2530o2678r5810q3977j7723K045p3523j11332
32174h3590J1977J79231J79572K4672p9608m5056J9022L4110N3944J01996R6015
32163D92285J380r1375j07618p9052m3161J6329P7107O1286k6455o9982j5015
32152B15729N0864N1402K2849l279o9005j50680j08555R2325K49192J73409k8993
32141D95258j06032j4961O0171J0356p0608p4544l0985k1212n5408q5453o6331
32130D0251J7345J22663J51404N8341n7946o5236J7179N7273K6257L1210J02349
32119E01090J06549l7534j90010j68296j4875N9665k8549j39131j20349k111P5019
32108D1468M5034l3094p0775m0344J6720L6110j0108q0764r9857l6624N9069J09767
$$ y = [197514, 227517, 311132, 381743, 391938, 359408, 296730, 200920, 116943, 99220, 101265, 27742, -83590, -71613, 107618, 287190, 311862, 232254, 187198, 206220, 240330, 294274, 396270, 492285, 493665, 402290, 294672, 215620, 172459, 188788, 265895, 327181, 300726, 230744, 215729, 266593, 317995, 340844, 337565, 268560, 117880, 9325, 101650, 350842, 524251, 495258, 389226, 374265, 434436, 444792, 374184, 299640, 268655, 247443, 192035, 106582, 40251, 57596, 180259, 331663, 390004, 332058, 266822, 284001, 341274, 367531, 398741, 501090, 607639, 570105, 380095, 211799, 196924, 256589, 228040, 88909, -31440, -33551, 41468, 86502, 53408, -17367, -57711, -40991, -4881, -14989, -95753, -195610, -232234, -173165, -63398]
32096f3398Q2819N100o5885p3339k110Q4759R0897P524n4622j2165N8910K8067
32084H6557q4217j25224l7166O5974Q4783O3748O7173N7841r98m3572k5015l2110
32072G7774j19075j43596L3333K63606K69125N5152r1957m2426J3676p5477j70878
32061F9257j04458L3024O6687K5054L3602N7580j1199j04254o1787P6668J08382
32050A88556j1245j08991p6712k03L8962Q2389J39064J05293m3658j41989n5047
32039A16419J03521J24394n217j09342q2353p5K6579q655m5116n2412m4651l5268
32027a2176j5462K5963P4147Q9487N0912n524j6037L6677J00229J08520M2594
32016D79330n8725j23105r3702N371O6134J4200q0345q0955K4214R7851M8978
$$ y = [-63398, 19421, 24521, -41364, -114703, -116813, -32054, 58843, 66367, 11745, -420, 58490, 86557, 2340, -122884, -160050, -94076, -9293, 54455, 121628, 179469, 178471, 134899, 109884, 77774, -41301, -184897, -151564, 112042, 381167, 436319, 344362, 301936, 315612, 240135, 69257, -35201, -2177, 64510, 89564, 123166, 180746, 169547, 65293, 3506, 80174, 188556, 177311, 68320, -8392, -8595, 30367, 112756, 251820, 357113, 313455, 171466, 116419, 219940, 344334, 339117, 229775, 147422, 147347, 173926, 165271, 120155, 67743, 23092, -12176, -27638, -1675, 72472, 161959, 212871, 207347, 191310, 227987, 328216, 436736, 479330, 420605, 297500, 203798, 209169, 275303, 289503, 209158, 128203, 152417, 250268, 299246]
32005B99246m0180m3958K9921Q1099P8760P6048Q2872L8793o1824j15015m2470
31994C83292P5752Q5202l9137j51240j22355o921M3667j278j6454P7491J77042
31983E05061J40620K882p2025k9181J6375j8118n2180J0014J06838J10942L3491
31972G54719P160Q1911J63118J70328J41358J31748J14733O0434L5064J14053
31962A774626K34131K45313J11610m2409j09000j23537j62935k06100j80639r4881
31952A446179k9519k1170l8938o2280r6069j14576q2273l5683m7724r4358o4776
31941G58813N6452J28246M2399j20484k06115j77272j04780m7403l7596j10127
31931A82133k30285k61547j35410M916k0225j52988j73647l3385Q3004N4475j3229
$$ y = [299246, 259066, 215108, 245029, 326128, 404888, 480936, 563808, 602601, 540777, 425762, 383292, 459044, 544246, 505109, 353869, 231514, 224593, 268260, 266982, 250528, 328019, 505061, 645681, 648563, 576538, 547357, 563732, 545614, 493434, 503448, 610286, 721228, 754719, 761879, 843790, 1006908, 1177236, 1318594, 1450342, 1565075, 1625509, 1660573, 1774626, 2008757, 2254070, 2365680, 2323271, 2214271, 2090734, 1927799, 1721699, 1541060, 1446179, 1416660, 1395490, 1356552, 1294272, 1198203, 1083627, 1001354, 965671, 917947, 823589, 758813, 815265, 943511, 985910, 865426, 659311, 482039, 377259, 329856, 292260, 182133, -48152, -309699, -445109, -440193, -460418, -613406, -787053, -820438, -737434, -682959, -696188]
31920f96188K093M3688R824n4332l8304M9719J11278J09818Q0724L7932k3911
31909c67659p1935p4801o6190q2869p8481Q243J31778J83058J35495N8838L789
31898b20734l8201p0445p5506o4867o5899o0092j0141N4778O4023K0838O821N2987
31886d06438Q9244N5304j0348l5645j2637J6337K8530L0593K4821P430r769n503
31874b28081K3032N0196M0920j5658q3922j04442n4160K6732Q0197Q2978M1518
31863a40690k9161r2633r8011m4842m831k6171n4564j5952N9674Q3848N3815M7795
31851b61723Q0222P4298K445n4237l4361R571O402k3347k2361K187P762m52J0139
31838b03455K9193K1833o110k0851j8222j5071m305K9355O7503P8888O2204K7986
$$ y = [-696188, -694095, -650407, -640583, -694915, -733219, -683500, -572222, -462404, -381680, -343748, -367659, -439594, -514395, -580585, -663454, -741935, -733692, -601914, -418856, -283361, -224523, -220734, -258935, -329380, -404886, -469753, -535652, -595744, -605885, -551107, -487084, -466246, -459425, -406438, -317194, -261890, -272238, -307883, -320520, -304183, -275653, -245060, -220239, -212809, -222578, -228081, -205049, -154853, -113933, -129591, -213513, -317955, -372115, -345383, -265186, -182208, -140690, -169851, -262484, -360495, -405337, -410168, -436339, -490903, -506855, -447181, -363333, -309518, -261723, -181501, -107203, -104758, -158995, -193356, -183785, -177383, -200730, -223091, -220904, -213142, -213594, -203455, -174262, -152429, -158539, -179390, -197612, -212683, -216988, -187633, -120130, -41242, 20962, 48948]
31826D8948k9258r4158j09349n5043o305k8969n7907J3461J40941J55756N983
31815a5900j50343j50904k8882O6374O9543L3630J7485K9529N9145Q8709Q5937
31804A04323M1197l238j0845j1291m6374q5770o8682r001K1407O444q66J8312
31792d4384J8832j7874m7540m4830m1013m7640k6906J9088K0170l8334n4805L7938
31780b67298J41448J23365J9496k7335N322J425q3299j42374r1917M748M8766
31769b67653L7418J5121j3137m0112j1350Q5768J52550R5561l3975j09643r7083
31758a86535n6629j7336M1294R9376J00786N0698J0314r097m6575q3990n6474
31747a54168R792J195r3759j32912l9219N8745K4246o0866k5223J09245J59064
$$ y = [48948, 19690, -74468, -183817, -238860, -245165, -274134, -332041, -318580, -177639, -21883, -15900, -166243, -317147, -346029, -279655, -210112, -176482, -158997, -129468, -70323, 18386, 104323, 145520, 142282, 131437, 120146, 73772, -11998, -80680, -89681, -68274, -61830, -62696, -44384, -25552, -43426, -90966, -135796, -176809, -224449, -251355, -232267, -212097, -250431, -305236, -267298, -125850, -2485, 17011, -10324, -5002, -3577, -86876, -229250, -321167, -316419, -267653, -230235, -215114, -228251, -268363, -279713, -193945, -41395, 54166, 20191, -89452, -186535, -243164, -260500, -219206, -119830, -19044, 31654, 41968, 32871, -13704, -97694, -154168, -144376, -143181, -236940, -369852, -409071, -350326, -326080, -386946, -412169, -302924, -143860]
31736a43860P1999m565K1184M5825l2046j31245j25672m5592R1K0140R8588J96124
31724b9029J67162n471j44837j10225K0687P7492K0465m9888n4081j5041M525
31713a18241k1076o4945p1131o788Q2860J04149L5301k5392J3029R7448R6894
31702A22108j4365j23938j34068o6154O334N2066P0447N1715N128j5158K6137
31691a9748P5374M2312p5484j68645j37959j3904P4068M3159n5011j06523p1582
31680d13943j1052J5774K1706L6460M1556J6209L519N5627J35946J56726J05322
31669A63850M8986J4883l6883j00790r4670L745Q3724M6102n0397q0209l5668
31658c7327j3746m3944m5213K9764J06984R5133J1310n2968n4203l0209k4027
$$ y = [-143860, -71861, -76426, -55242, -9417, -41463, -172708, -298380, -343972, -343881, -323741, -225153, -29029, 138133, 132662, -12175, -122400, -101713, -24221, -3756, -53644, -107725, -122766, -118241, -139317, -204262, -275393, -282181, -199321, -95172, -59871, -85263, -72234, 25214, 122108, 107743, -16195, -150263, -216417, -210083, -158017, -87570, -35855, -30727, -45885, -19748, 55626, 97938, 22454, -146191, -284150, -298054, -223986, -180827, -235838, -342361, -413943, -424995, -409221, -387515, -351055, -309499, -293290, -289771, -234144, -98198, 58528, 163850, 212836, 227719, 190836, 90046, -4624, -879, 82845, 128947, 78550, -1659, -37327, -51073, -95017, -140230, -110466, -3482, 91651, 102961, 49993, -4210, -34419, -58446]
31647e8446k5322k137L9924O0918M4553K2125K3181K7844R07m2061m9207j5789
31635B6490l193n0957j09685r9218j4141O4818O4331K535k9547K8275J26071J51405
31623A57184O6361m0696p3228n1657n7267q7883o4253K4743Q4503M8287l5683
31612b9589q2946o6458n649O3534Q3999K3803n0025l4505N0587P6974J1701k7407
31600A4019K2673N7076j0450r2325q3819m1980n6231n9505M9106J82992J69272
31589A50828J8854r8613j15220j08300j06683n5152K4328L1588k8202m1050J0914
31578c16708K2952k3623j8517O1917R0862J7300l0414L6797J16882R2628Q137
31567E8213m1197n5037n6621j5010M9302K4036j06690j77908q4516L9291M0197
$$ y = [-58446, -83768, -85905, -45981, 14937, 59490, 81615, 104796, 132640, 133547, 91486, 42279, 26490, 23297, -27660, -137345, -236563, -250704, -185886, -121555, -119020, -148567, -120292, 5779, 157184, 223545, 182849, 109621, 57964, 697, -87186, -151439, -126696, -42193, 6094, -29589, -112535, -178993, -184642, -121108, -37109, -13306, -63331, -97836, -47249, 29725, 41426, 14019, 36692, 93768, 83318, -9007, -92826, -134806, -191037, -250542, -201436, -18444, 150828, 169682, 71069, -44151, -152451, -259134, -314286, -289958, -258370, -286572, -327622, -316708, -293756, -317379, -335896, -273979, -183117, -165817, -196231, -159434, -42552, 50076, 58213, 17016, -38021, -94642, -109652, -60350, -36314, -143004, -320912, -405428, -366137, -325940]
31556c25940q11O7468J72440J23609n7779j56342r0461J8N918j5262N674L6086
31544b35382L9007M0107M4670J1426m8145o1741k4203j5444n2989m8803L8299
31533c13198J25076J35954J01653O5426L432q6376j24649p2392j7685l8127o2986
31522b83872O179J08036J00730o866o0152j853M4141j7972j00721p9006J4270
31511b77086N7424L6387L4388N6116J5338q4097j08393m660Q2488J6852j10632
31500b85875j12496J2044Q8650M1279j4678K3233R9410J15496O7405K956n4331
31489a6907p7597k8929N9764Q9768L7363k203K9876O2216K4681l5825n4681n8046
31477B9480q0091p9087l6078k5819p6764p9260L2564J28988P8847j7485J4639
$$ y = [-325940, -326751, -259283, -86843, 36766, -21013, -177355, -267816, -267798, -261880, -277142, -271468, -235382, -196375, -156268, -111598, -100172, -148317, -210058, -234261, -249705, -302694, -351497, -313198, -188122, -52168, 49485, 114911, 118343, 31967, -92682, -165074, -182759, -220886, -283872, -277693, -169657, -68927, -75793, -135945, -137798, -93657, -111629, -212350, -291356, -277086, -219662, -183275, -148887, -92771, -77433, -161530, -269923, -274583, -192095, -175243, -285875, -398371, -386327, -297677, -256398, -271076, -247843, -148433, -32937, 34468, 37424, -16907, -94504, -123433, -63669, 26099, 63462, 61259, 91135, 153351, 178032, 142207, 87526, 29480, -50611, -129698, -165776, -191595, -268359, -347619, -315055, -186067, -107220, -124705, -110066]
31466a10066J24940J20402q740q3810m4012k0172p8160j12616n2815K2504M4916
31455a97629N6630Q1167N8265j5901l8206K7455O6680n611j06976j18833m9410
31444b42369J4419K4331k1413r3024j09750j1627J19737J39272O0717M1255J09356
31433C0904J04851l3440j31420n7893N6574M0653m9213o4654j9941q727P452J06437
31421a8417J95082J21487n7601j40649q1107j6882k0026k2616O209P432k0736
31410d7824k235N9298O7713J1960m816M5518N6549k5955j03822q3376q914L0794
31398e110K3164l168l6593n1321j1041N0598M8679j5845m4522m972J7551j6185
31386d8765k3016L5863N4409l5066j05699j6274J43831J64081K1964r1420n3391
$$ y = [-110066, 14874, 135276, 126536, 42726, -1286, -21458, -99618, -212234, -265049, -242545, -197629, -140999, -59832, -1567, -17468, -55674, -28219, 38461, 32850, -74126, -192959, -242369, -227950, -203619, -225032, -318056, -427806, -439433, -319696, -180424, -119707, -78452, 30904, 135755, 102315, -29105, -86998, -30424, 10229, -38984, -103638, -123579, -132306, -124854, -18417, 176665, 298152, 240551, 99902, 18795, 1913, -18113, -40729, -34520, -27088, -47824, -50059, 9239, 76952, 88912, 84096, 129614, 186163, 160208, 56386, -26990, -35904, -5110, 18054, 14886, -21707, -73028, -84069, -33471, 15208, -637, -45159, -50131, -32580, -48765, -71781, -35918, 18491, -16575, -122274, -138548, 5283, 169364, 191328, 99908, 46517]
31375D6517M2151N4388j7463p7238o9335j0153N5644P7860K7400n6855q9338m2935
31363e9357R404k654m6698m3521J0274M2351J7230j6551l439M7058Q4997P5312
31351A14406J0176r0204j63882j40516k7470P6674R7925P3409O8599O1778j3o8945
31339A1937m2837N7775R1613J1334n3947k13Q7006P0759l1196r9009r7987q2620
31327g7385o4114j4267K5580j3860q0732m1852J02242J83744J04077k2035l7999
31316F3399M1689Q6087M1836l0485p0539o9029k2198P1381J59247J55862M6308
31305D73558p6737j13103o5235j5114p459k073M3069Q5115M4200p4216j66213
31294A25792j54440p2484Q10L5005L8663J4483k0912k0927K6786O4108M9782K7910
$$ y = [46517, 88668, 143056, 125593, 48355, -20980, -31133, 24511, 102371, 129771, 72916, -16422, -59357, -49953, -52607, -99305, -142826, -132552, -90201, -72971, -89522, -92961, -45903, 39094, 114406, 124582, 34378, -129504, -270020, -297490, -220816, -122891, -49482, 19117, 80895, 80882, 11937, -30900, 26875, 118488, 129822, 75875, 75662, 162668, 233427, 202231, 103222, 5235, -77385, -141499, -155766, -130186, -144046, -224778, -266630, -164388, 19356, 123433, 101398, 63399, 105088, 191175, 233011, 202526, 131987, 62958, 40760, 112141, 271388, 427250, 473558, 396821, 283718, 218483, 203369, 195910, 193837, 236906, 322021, 366221, 292005, 125792, -28648, -101132, -100322, -65317, -26654, -12171, -33083, -54010, -27224, 36884, 86666, 114576]
31282A14576L7536K1496p0672j50213r6943L5148P5236o021n8624J047P2033N5398
31270B9997M828K674J8036o782l7835k8054j9599n2777n8820K7191J15418O7689
31258F1966q3255j64742j04541n769L0361K9689N2104P8583N7628Q05l3874k4458
31246a05503l17J3682K7612N2176N9765J1284p2751j04986l3827P1338R5790K9551
31234D3814k8690j6846K6786N9279R1459J11041N4468p3342j47098q2523K7518
31223F5866M1713k8007n6412j089N9318O0501J9113k5142m3078o897O8828J01881
31211B56595M3230l3452l9077j6850n8733j20302p9826L3472N2287o0162j34521
31200a57339n5082O7951Q1651O814m3443m8678n7406o0166j4328N4572Q6855Q5963
$$ y = [114576, 152112, 173608, 102936, -47277, -144220, -109072, -33836, -39857, -98481, -97434, -25401, 29997, 34825, 37499, 55535, 48753, 10918, -17136, -36735, -89512, -148332, -121141, -5723, 61966, -21289, -186031, -290572, -296341, -265980, -236291, -184187, -105604, -47976, -47171, -81045, -105503, -105820, -92138, -64526, -12350, 47415, 58699, -14052, -119038, -152865, -81527, 14263, 43814, 15124, -1722, 25064, 84343, 175802, 286843, 341311, 267969, 120871, 38348, 65866, 107579, 79572, 23160, 22071, 81389, 141890, 161003, 135861, 92783, 85886, 154714, 256595, 299825, 266373, 227296, 210446, 151713, 31411, -48415, -14943, 37344, -22818, -157339, -212421, -144470, -62819, -56005, -99448, -148126, -205532, -265698, -280026, -225454, -138599, -52636]
31188e2636Q7515P2416O653o6802p2365j5435L4398N0380N5792M9650J3555k6891
31176A36230l5692m2168q9630j28078o9873M9736R1521J7181m7401p820N5002
31165g0992K4572n8054n9472L1527Q0734J0048q2823n8770P0288J53029Q9017
31154A29104n2876j26763p9825J3715P0441Q5493Q3836N0836k7123r3822p7675
31143b4659n772K0561k4599n2719m475N4001M1495l573J1633P7326R1621J9791
31131B00631n5424o3095l8158m3688o6445n0486L933L8565K2867r173j0563K5963
31119d5073P1470Q8701N1032l7655j27063j45886o7657N3481J31400J31332Q6094
31108A90176L1263l7317j15566j40725n5587Q2862J39016P2066m552O902L9146
$$ y = [-52636, 34879, 107295, 113948, 47146, -25219, -40654, -6256, 44124, 99916, 149566, 163121, 136230, 100538, 58370, -31260, -159338, -229211, -179475, -87954, -70773, -118174, -125994, -70992, -46420, -104474, -163946, -132419, -51685, -41637, -124460, -183230, -112942, 40087, 129104, 76228, -50535, -130360, -116645, -46204, 39289, 123125, 173961, 146838, 53016, -24659, -30431, -9870, -34469, -87188, -91663, -37662, 3833, 260, 11893, 89219, 180840, 200631, 145207, 82112, 43954, 266, -66179, -116665, -112732, -74167, -51300, -60473, -71036, -45073, 26397, 115098, 166130, 128475, 1412, -144474, -212131, -158650, -27250, 104082, 190176, 221439, 184122, 68556, -72169, -127756, -44894, 94122, 166188, 161636, 168538, 207684]
31097B07684k1560j28727j28662q044O7850O001p1746k2604J02029J50837R2951
31086B46009J5350l8066q7735j14213p2746m338j551n5217n8070K0073Q1684N8886
31074i934P311k271J8298L6060N8051P5384M1325l2713n2047J9858Q3986M9500
31062B92808k9950n3592k7487j6883j2467L6507R8371Q8142L596o9091p6458m1110
31050A92386r48J6790j4550p8337r5016k9144K8862r390p1452k8714P3942O1091
31038D5520r0250j83897q0829J03892J68060P4784n5550j21702j15755p5949m5594
31027c77270m7283n1478j1336M6088L2672o1573j25465p7664K0239O8246O6514
31016e18310O7795O2651J1614n6346p8003n8588m8084l9465J4216R1421J06042
$$ y = [207684, 186124, 57397, -71265, -79309, -11459, -5458, -77204, -99808, 2221, 153058, 246009, 261359, 223293, 135558, 21345, -51401, -55739, -57290, -112507, -170577, -150504, -68820, -9934, -2623, -4894, 13404, 49464, 107515, 182899, 224224, 191511, 139464, 159322, 243308, 292808, 262858, 209266, 181779, 164896, 152429, 188936, 287307, 375449, 379045, 309954, 233496, 192386, 191438, 208228, 193678, 115341, 20325, -8819, 20043, 10653, -60799, -89513, -15571, 45520, -44730, -228627, -309456, -205564, -37504, 37280, -18270, -139972, -255727, -331676, -377270, -424553, -476031, -487367, -441279, -408607, -470180, -595645, -673309, -653070, -584824, -518310, -450515, -387864, -376250, -432596, -510599, -569187, -617271, -656736, -642520, -551099, -445057]
31005d45057L2886m6604m7493K1698Q3878Q0193K1971k2995j234N7353O9884J6484
30993a79036k5797l76M2403L6483R749J4055Q093o8076j41289p9857P5635J17184
30981a90829l7172j97304j49481N4890J85489J43536M4818Q140M337l7140q0859
30970b51575l9277P0550J22253M5796p2662j00212k5720M0869K6805j3927M271
$$ y = [-445057, -412171, -458775, -506268, -484570, -400692, -320499, -298528, -321523, -322757, -265404, -195520, -179036, -204833, -205209, -162806, -126323, -116574, -102519, -94426, -162502, -303791, -383648, -308013, -190829, -228001, -425305, -574786, -519896, -334407, -190871, -146053, -137913, -133576, -170716, -251575, -290852, -220302, -98049, -52253, -124915, -225127, -250847, -209978, -183173, -197100, -192829]
$$ [...]
##END NTUPLES=NMR SPECTRUM
##END=
