##TITLE=31Pdec_PR164_2E
 D2O, 24 sc
 11.4.2019
##JCAMPDX= 6.0         $$ Bruker NMR JCAMP-DX V2.0
##DATA TYPE= NMR SPECTRUM
##DATA CLASS= NTUPLES
##ORIGIN= UXNMR, Bruker Analytische Messtechnik GmbH
##OWNER= root
$$ XWIN-NMR		Version 3.5
$$ Thu Apr 11 16:23:30 2019 Russian Standard Time (UT+4h)  she@DPX200
##.OBSERVE FREQUENCY= 81.013821
##.OBSERVE NUCLEUS= ^31P
##.ACQUISITION MODE= SIMULTANEOUS
##.ACQUISITION SCHEME= undefined
##.AVERAGES= 24
##.DIGITISER RES= 17
##SPECTROMETER/DATA SYSTEM= spect
##.PULSE SEQUENCE= zgpg30
##.SOLVENT NAME= CDCl3
##.SHIFT REFERENCE= (INTERNAL, CDCl3, 0, 182.463)
##AUDIT TRAIL= $$ (NUMBER, WHEN, WHO, WHERE, WHAT)
$$ ##TITLE= Audit trail, XWIN-NMR		Version 3.5
$$ ##JCAMPDX= 5.01
$$ ##ORIGIN= Bruker BioSpin GmbH
$$ ##OWNER= she
$$ F:/spectra/data/she/nmr/P31/1/pdata/1/auditp.txt
$$ ##AUDIT TRAIL=  $$ (NUMBER, WHEN, WHO, WHERE, WHAT)
(   1,<2019-04-11 16:22:32.04 +0400>,<she>,<DPX200>,
      <created by zg, POWCHK disabled, PULCHK disabled
       configuration hash MD5:
       00 E9 B6 7A A2 85 ED C7 34 08 36 98 17 FE 4E 26
       data hash MD5: 32K
       52 22 02 09 14 1E 9C C3 4B 96 03 1A F0 8E 2E 01>)
(   2,<2019-04-11 16:22:34.75 +0400>,<she>,<DPX200>,
      <Start of raw data processing
       efp BC_mod = 2 LB = 1 FT_mod = 6 PKNL = 1 PHC0 = -1847.211 PHC1 = 180.599 SI = 64K 
       data hash MD5: 64K
       AD CB 0C 96 AE 6E DB 5F 87 D2 22 77 E8 39 5C 2F>)
(   3,<2019-04-11 16:22:57.34 +0400>,<she>,<DPX200>,
      <pk PHC0 = 18.40007 PHC1 = -110.2 
       data hash MD5: 64K
       DC 28 98 DF 03 39 08 95 23 76 C7 2A D3 FE 8C 30>)
(   4,<2019-04-11 16:23:04.87 +0400>,<she>,<DPX200>,
      <abs ABSG = 5 
       data hash MD5: 64K
       1C C1 26 5D 66 F6 A1 09 BA 8B 0A 75 E5 AC 9D CB>)
$$ ##END=
$$ 
$$ hash MD5
$$ D3 28 5F 09 FE FB 6D 93 40 CF C6 4D B0 CF 30 BB
##$RELAX= 
##$RELAX= 
##$RELAX= 
##$RELAX= 
##$RELAX= 
##$RELAX= 
##$RELAX= 
##$RELAX= 
$$ Bruker specific parameters
$$ --------------------------
##$DU= <F:/spectra>
##$EXPNO= 1
##$NAME= <P31>
##$PROCNO= 1
##$TYPE= <nmr>
##$USER= <she>
##$AMP= (0..31)
100 100 100 100 100 100 100 100 100 100 100 100 100 100 100 100 100 100 
100 100 100 100 100 100 100 100 100 100 100 100 100 100 
##$AQSEQ= 0
##$AQ_mod= 1
##$AUNM= <au_zg>
##$AUTOPOS= <>
##$BF1= 81.014009
##$BF2= 200.13
##$BF3= 200.13
##$BF4= 200.13
##$BF5= 200.13
##$BF6= 200.13
##$BF7= 200.13
##$BF8= 200.13
##$BYTORDA= 1
##$CFDGTYP= 0
##$CFRGTYP= 5
##$CHEMSTR= <none>
##$CNST= (0..31)
1 1 145 1 1 1 1 1 1 1 1 1 1 1 1 1 1 1 1 1 1 1 1 1 1 1 1 1 1 1 1 1 
##$CPDPRG= <waltz16>
##$CPDPRG1= <>
##$CPDPRG2= <waltz16>
##$CPDPRG3= <>
##$CPDPRG4= <mlev>
##$CPDPRG5= <mlev>
##$CPDPRG6= <mlev>
##$CPDPRG7= <mlev>
##$CPDPRG8= <mlev>
##$CPDPRGB= <>
##$CPDPRGT= <>
##$D= (0..31)
0 1 0 0 0 0 0 0 0 0 0 0.03 2e-05 3e-06 0 0 0 0 0 0 0 0 0 0 0 0 0 0 0 0 
0 0 
##$DATE= 1554985351
##$DBL= (0..7)
120 120 120 11 120 120 24 19 
##$DBP= (0..7)
150 150 150 150 150 150 150 150 
##$DBP07= 0
##$DBPNAM0= <>
##$DBPNAM1= <>
##$DBPNAM2= <>
$$ [...]
##$SUBNAM3= <"">
##$SUBNAM4= <"">
##$SUBNAM5= <"">
##$SUBNAM6= <"">
##$SUBNAM7= <"">
##$SUBNAM8= <"">
##$SUBNAM9= <"">
##$SW= 369.568048894756
##$SWIBOX= (0..15)
0 1 3 0 0 0 0 0 0 0 0 0 0 0 0 0 
##$SW_h= 29940.119760479
##$TD= 32768
##$TD0= 1
##$TE= 0
##$TE2= 300
##$TE3= 300
##$TEG= 300
##$TL= (0..7)
0 120 53 12 22 120 120 120 
##$TP= (0..7)
150 150 150 150 150 150 150 150 
##$TP07= 0
##$TPNAME0= <>
##$TPNAME1= <>
##$TPNAME2= <>
##$TPNAME3= <>
##$TPNAME4= <>
##$TPNAME5= <>
##$TPNAME6= <>
##$TPNAME7= <>
##$TPOAL= (0..7)
0.5 0.5 0.5 0.5 0.5 0.5 0.5 0.5 
##$TPOFFS= (0..7)
0 0 0 0 0 0 0 0 
##$TUNHIN= 0
##$TUNHOUT= 0
##$TUNXOUT= 0
##$USERA1= <user>
##$USERA2= <user>
##$USERA3= <user>
##$USERA4= <user>
##$USERA5= <user>
##$V9= 5
##$VALIST= <valist>
##$VCLIST= <CCCCCCCCCCCCCCC>
##$VD= 0
##$VDLIST= <DDDDDDDDDDDDDDD>
##$VPLIST= <PPPPPPPPPPPPPPP>
##$VTLIST= <TTTTTTTTTTTTTTT>
##$WBST= 1024
##$WBSW= 4
##$XGAIN= (0..3)
0 0 0 0 
##$XL= 0
##$YL= 0
##$YMAX_a= 29190
##$YMIN_a= -32878
##$ZGOPTNS= <>
##$ZL1= 120
##$ZL2= 120
##$ZL3= 120
##$ZL4= 120
##$ABSF1= 182.463
##$ABSF2= -187.1042
##$ABSG= 5
##$ABSL= 3
##$ALPHA= 0
##$AQORDER= 0
##$ASSFAC= 0
##$ASSFACI= 0
##$ASSFACX= 0
##$ASSWID= 0
##$AUNMP= <proc_1d>
##$AZFE= 0.1
##$AZFW= 0.5
##$BCFW= 0
##$BC_mod= 2
##$BYTORDP= 0
##$COROFFS= 0
##$CY= -3
##$DATMOD= 1
##$DC= 0
##$DFILT= <>
##$DTYPP= 0
##$F1P= 0
##$F2P= 0
##$FCOR= 1
##$FTSIZE= 65536
##$FT_mod= 6
##$GAMMA= 0
##$GB= 0
##$INTBC= 1
##$INTSCL= 5.30512e-09
##$ISEN= 30
##$LB= 1
##$LEV0= 0
##$LPBIN= 0
##$MAXI= 10000
##$MC2= 0
##$MEAN= 0
##$ME_mod= 0
##$MI= 50
##$NCOEF= 0
##$NC_proc= -4
##$NLEV= 6
##$NOISF1= 182.463
##$NOISF2= 159.3651
##$NSP= 0
##$NTH_PI= 0
##$NZP= 0
##$OFFSET= 182.463
##$PC= 4
##$PHC0= -1828.811
##$PHC1= 70.399
##$PH_mod= 1
##$PKNL= yes
##$PPARMOD= 0
##$PSCAL= 0
##$PSIGN= 0
##$REVERSE= no
##$SF= 81.0140089999434
##$SI= 65536
##$SIGF1= 159.3651
##$SIGF2= -187.1042
##$SINO= 113.3802
##$SIOLD= 16384
##$SREGLST= <1H.CDCl3>
##$SSB= 0
##$STSI= 65536
##$STSR= 0
##$SW_p= 29940.119760479
##$SYMM= 0
##$S_DEV= 0
##$TDeff= 32768
##$TDoff= 0
##$TI= <>
##$TILT= no
##$TM1= 0
##$TM2= 0
##$TOPLEV= 0
##$USERP1= <user>
##$USERP2= <user>
##$USERP3= <user>
##$USERP4= <user>
##$USERP5= <user>
##$WDW= 1
##$XDIM= 65536
##$YMAX_p= 427388457
##$YMIN_p= -4475811
$$ End of Bruker specific parameters
$$ ---------------------------------
##NTUPLES= NMR SPECTRUM
##VAR_NAME=  FREQUENCY,     SPECTRUM/REAL,   SPECTRUM/IMAG
##SYMBOL=    X,             R,               I
##VAR_TYPE=  INDEPENDENT,   DEPENDENT,       DEPENDENT
##VAR_FORM=  AFFN,          ASDF,            ASDF
##VAR_DIM=   65536,         65536,           65536
##UNITS=     HZ,            ARBITRARY UNITS, ARBITRARY UNITS
##FACTOR=    0.456856943014862, 1,           1
##FIRST=     14782.0589164792, 0,            0
##LAST=      -15158.0608439998, 0,           0
##MIN=       -15158.0608439998, -4475811,    0
##MAX=       14782.0589164792, 427388457,    0
$$ Real data points
##PAGE= N=1
##DATA TABLE= (X++(R..R)), XYDATA
$$ [...]
37158B39967M3972J9208k71687k34821K54320N52092K78857j49660l13903l79354
$$ 239967 283939 303147 31460 -203361 50959 603051 881908 732248 418345 38991
37148C8991n51522o11888l93680j45188l4352J63412M96139N21819M2136l73197
$$ 38991 -512531 -1124419 -1518099 -1663287 -1697639 -1534227 -1038088 -516269 -474133 -847330
37138h47330j71638K93955L02046j11706k51984J39088N40738M58161L2715k95646
$$ -847330 -1018968 -725013 -422967 -534673 -786657 -647569 -106831 351330 384045 88399
37128H8399l38263j92058O316J80544K96323L42959K93251J16463r8772j41923
$$ 88399 -249864 -441922 -435606 -255062 41261 384220 677471 793934 695162 553239
37118E53239N7053K57504J67049j97002n49703o54489m53324p841M88011P38425
$$ 553239 610292 867796 1034845 837843 288140 -366349 -819673 -827514 -339503 398922
37108C98922O15137L31199J43133j3488l19940o03477m59788R9312N00341L05959
$$ 398922 1014059 1345258 1488391 1474903 1154963 551486 91698 191010 691351 997310
37098I97310k15643m58516k22192J72816L78514L31920J14603j97191m63987m96588
$$ 997310 781667 323151 100959 273775 652289 984209 1098812 901621 437634 -58954
37088e8954k75303j6516R0538Q7713Q7769P0551K080K885J56504K55040L9085
$$ -58954 -334257 -350773 -260235 -172522 -84753 -14202 -12122 -9237 147267 402307 441392
37077D41392l39387m34460j35447J81361K54916K97261M94019N35314Q2672n40334
$$ 441392 102005 -332455 -467902 -286541 -31625 265636 759655 1294969 1377641 837307
37067H37307o49710j39195L63789L33376q0714m17156m59648k71510k465J44647
$$ 837307 187597 48402 412191 745567 664853 247697 -211951 -483461 -485926 -341279
37057c41279J6569k33997k22490J64260N58746N78235K78162l9832k37067l31378
$$ -341279 -324710 -558707 -781197 -616937 -58191 520044 798206 758374 521307 189929
37047A89929l03204j78915j35308k44245k65376R533L41456L17973l3741k73050
$$ 189929 -113275 -292190 -427498 -671743 -937119 -927586 -586130 -268157 -301898 -574948
37037e74948j75201L1878J09338J13408J26500L3985k00049l12793r3704K26246
$$ -574948 -750149 -718271 -608933 -495525 -369025 -335040 -535089 -847882 -941586 -715340
37027g15340K50773j3205j79035n2037J30400R4220j03284k27311j79487p911
$$ -715340 -464567 -477772 -656807 -708844 -578444 -484224 -587508 -814819 -994306 -1002217
37017a002217K26202M16080L78582O4694k68562k93511N309L36671M45322K91748
$$ -1002217 -776015 -359935 18647 83341 -185221 -478732 -473423 -136752 308570 600318
37007F00318l6776l77174m92128k68087P8399K20359J41515P9648P1003r1061
$$ 600318 563542 186368 -305760 -573847 -495448 -275089 -133574 -53926 17077 -73984
36997g3984l86383m65572j81635J60394K89817L05311K75071k7127n89661q27610
$$ -73984 -460367 -925939 -1107574 -947180 -657363 -352052 -76981 -104108 -693769 -1521379
36987a521379l40148L54168M87595J74730J34700M59794N20739J17348j69111
$$ -1521379 -1861527 -1507359 -1019764 -845034 -710334 -250540 270199 387547 218436
36978B18436O79J81598P689j52339P8999L43938J56028k37249k68617J8477J24106
$$ 218436 219115 400713 408402 256063 335062 679000 835028 597779 329162 347639 471745
36967D71745n4601j75735j18557p1934k6073K14483N03221M24997j3496l06756
$$ 471745 417144 241409 122852 50918 24845 239328 742549 1167546 1154050 847294
36957H47294k10283p3634k08134l96279l30389j40766j08537j42555K9339L06812
$$ 847294 637011 563377 355243 -41036 -371425 -512191 -620728 -763283 -733944 -427132
36947d27132K95896p0279l79632l11261m2927Q5671O0883Q4982J50259P3282q1220
$$ -427132 -131236 -201515 -581147 -892408 -935335 -849664 -788781 -703799 -553540 -480258 -561478
36936e61478p50L34241M86660J94948j63371j22134J27990O2130k62521k55212
$$ -561478 -562228 -227987 258673 453621 290250 168116 296106 358236 95715 -159497
36926a59497J94470M26192R633n48961n38603m7101K75282J67971m6120o9760
$$ -159497 34973 461165 470798 -78163 -616766 -663867 -388585 -220614 -266734 -336494
36916c36494M1912J21951Q6888q7246l02134l16027l8847K60875K99103J73609
$$ -336494 -294582 -172631 -85743 -172989 -475123 -791150 -829997 -569122 -270019 -96410
36906i6410J28999J10297p5668k96748k23399J29450L87275L37486J16048j09914
$$ -96410 32589 142886 67218 -229530 -452929 -323479 63796 401282 517330 407416
36896D07416k93664l44340j59121J43263L06482K58678J04323j19744l72143m09705
$$ 407416 113752 -230588 -389709 -246446 60036 318714 423037 303293 -68850 -478555
36886d78555o3358L60317L90958P7497r9342N709L0817k18348m33388l17760L585
$$ -478555 -541913 -181596 209362 286859 187517 193226 224043 5695 -427693 -745453 -741868
36875g41868K87582M95226O06353M74331R6764k52638l52135k55863q8368J10305
$$ -741868 -454286 40940 647293 1121624 1218388 965750 613615 357752 269384 379689
36865C79689K61293K67973K06820J88580P0305k77711n04880j81496L45683K60582
$$ 379689 640982 908955 1115775 1304355 1374660 1096949 592069 410573 756256 1016838
36855A016838m13086o75385q5232M66762J45577m86144l93322K70898M68626q1481
$$ 1016838 603752 -71633 -156865 309897 455474 -30670 -423992 -153094 315532 234051
36845B34051o18085o12646l45679j07858K62417P56032Q76520L76309k40905l95454
$$ 234051 -384034 -996680 -1342359 -1450217 -1187800 -431768 444752 821061 580156 184702
36835A84702k14484k11774m63439n47758k15071K49954M10611K27444P8529K37916
$$ 184702 -29782 -241556 -704995 -1252753 -1467824 -1217870 -807259 -579815 -501286 -263370
36825b63370M78042L77002k7509k20177L9426L23894J84624j61090k24723n2827
$$ -263370 214672 591674 564165 343988 383414 707308 891932 730842 506119 453292
36815D53292q2430l31789l52183j1219K63591J72285m3372r6279j09102k68062
$$ 453292 370862 39073 -313110 -324329 -60738 111547 68175 -28104 -137206 -405268
36805d05268l78184j36982L37128N87792L86390r129j79026j3410J90249J11510
$$ -405268 -783452 -920434 -583306 4486 390876 381747 202721 189311 379560 491070
36795D91070j60583k40373k3233J30434l1659k24475j12901P9680n2093l37179
$$ 491070 330487 90114 66881 197315 165656 -58819 -171720 -92040 -144133 -481312
36785d81312k62405J41277L27897J62963R3584K56807J88195k65946m92735p2235
$$ -481312 -743717 -602440 -274543 -111580 -17996 238811 427006 161060 -331675 -403910
36775d03910M41199L34604j51407k47546J28672L54099J68192J08J49439K99791
$$ -403910 37289 371893 220486 -27060 101612 455711 623903 624011 773450 1073241
36765A073241R7297k66845l72186j72156K6951L8675k3209j2227R886j03401l01729
$$ 1073241 1170538 903693 531507 359351 386302 424977 401768 389541 399427 296026 -5703
36754e703l37942j14618J12038N1077j93883k64330p6915R1228P0420R665K4955
$$ -5703 -343645 -458263 -346225 -295148 -489031 -753361 -830276 -739048 -668628 -658963 -634008
36743f34008j2689j75020k88991k44024j78666j64817l3125K62968M50864L63824
$$ -634008 -646697 -821717 -1110708 -1354732 -1533398 -1698215 -1731340 -1468372 -1017508 -653684
36733f53684K14193J67988M0666k45102l31295o725K91358J12004k24083j12165
$$ -653684 -439491 -271503 -230837 -475939 -807234 -813959 -522601 -410597 -634680 -746845
36723g46845L33283M65163J33188j87837k28380j78584j21316Q4433K93685J39948
$$ -746845 -413562 51601 184789 -3048 -231428 -410012 -531328 -446895 -153210 -13262
36713a3262k68067l72273m1144K20753J08969q6510j19850j39646j52331J39452
$$ -13262 -281329 -653602 -694746 -473993 -365024 -451534 -571384 -711030 -863361 -723909
36703g23909O16409O03567p2963n98350l33019J82657R8911m22128n78718k15996
$$ -723909 -107500 496067 423104 -175246 -508265 -325608 -226697 -648825 -1227543 -1443539
36693a443539J40869K89901M89774O84998M76079n5466k84206J229K58269O4952
$$ -1443539 -1302670 -1012769 -522995 162003 638082 582616 298410 299639 557908 622860
36683F22860k62026k47926K7976J71021P4929o7388j31887j46142j37048j01708
$$ 622860 360834 112908 140884 311905 386834 319446 187559 41417 -95631 -197339
36673a97339m8209K6077R6609N3148j44197k79268j09004K16310K63761q9696
$$ -197339 -245548 -219471 -122862 -69714 -213911 -493179 -602183 -385873 -122112 -211808
36663b11808m73706n30500l19523r5470M2402J20358J42774J42677J98285K69050
$$ -211808 -685514 -1216014 -1535537 -1631007 -1588605 -1468247 -1325473 -1182796 -984511 -715461
36653g15461J95335k7038j68533q5965O9827J00126L5686K7977J14219K20692
$$ -715461 -520126 -547164 -715697 -801662 -731835 -631709 -596023 -568046 -453827 -233135
36643b33135K71994J97040m0447l28349m53651l37423j02734J17435K79480L24277
$$ -233135 38859 235899 195452 -132897 -586548 -923971 -1026705 -909270 -629790 -305513
36633c05513J86138m0845j47413p5785M0042J08808J40169R3282n0383r2236J42489
$$ -305513 -119375 -160220 -307633 -383418 -343376 -234568 -94399 -1117 -51500 -143736 -1247
36622a247L70854J14171n20190q21090m31837J65321L86892K78402J64435N8684
$$ -1247 369607 483778 -36412 -857502 -1289339 -1124018 -737126 -458724 -294289 -235605
36612b35605j17153j41899J45494M10167K77974l9277j11501k7967j74691m75134
$$ -235605 -352758 -494657 -349163 61004 338978 299701 188200 160233 -14458 -489592
36602d89592m95342j97279N3619J75256M00572O16899L83549k38456n41090j40214
$$ -489592 -984934 -1182213 -1128594 -953338 -552766 64133 447682 209226 -331864 -472078
36592d72078M48423N34424J29064k34491k30758J3186J75206K3307l72253o11188
$$ -472078 -23655 510769 639833 405342 174584 187770 362976 386283 14030 -597158
36582e97158l75665J02511K99605J27998o511R1607J58187N2826L5051K06466
$$ -597158 -972823 -870312 -570707 -442709 -449220 -357613 -199426 -146600 -111549 94917
36572I4917K12811j43277m62740l35694K6862J72893Q0787K1352M9727O8147J33799
$$ 94917 307728 164451 -298289 -633983 -607121 -434228 -353441 -332089 -282362 -214215 -80416
36561h0416K84830L03986N6598j95091k14709k17365m08135m43485L2971N89210
$$ -80416 204414 508400 564998 369907 155198 -62167 -470302 -913787 -880816 -291606
36551b91606M76483k03092n59575j96142K98804L22214M8211o8143k2081p0766
$$ -291606 184877 -18215 -577790 -773932 -475128 -152914 -104703 -172846 -194927 -265693
36541b65693j90207j52937N1942K21081K51309K05711J40602M4050r4224k41425
$$ -265693 -455900 -608837 -556895 -335814 -84505 121206 261808 305858 211634 -29791
36531b9791l11896k10720J2684J20453k4912k02989j17872J21719J29643j49135
$$ -29791 -341687 -552407 -539723 -419270 -444182 -647171 -765043 -643324 -513681 -662816
36521f62816l19817j14741K47831M14885L07758M0179k68306m19922j82706L38945
$$ -662816 -982633 -1097374 -849543 -434658 -126900 -86721 -355027 -774949 -957655 -618710
36511f18710O10358K39924m71473q11221m47514K34287N71005K84347k91689n97868
$$ -618710 -8352 231572 -239901 -1051122 -1498636 -1264349 -693344 -408997 -700686 -1298554
36501a298554m50953j81966j17216j15158J25885M55234L95550r5322m38539j97513
$$ -1298554 -1749507 -1931473 -2048689 -2163847 -2037962 -1582728 -1187178 -1282500 -1721039 -1918552
36491a918552L35866N77890M07338J96134K50651M84538N85392L49842j04671
$$ -1918552 -1582686 -1004796 -597458 -401324 -150673 333865 919257 1269099 1164428
36482A164428m16777l64631j43929q4457j66288j26242J1320m4175k49403j71637
$$ 1164428 747651 383020 239091 154634 -11654 -137896 -126576 -170751 -420154 -591791
36472e91791K73387N50783K92408j23504j85220j2966k2229j79889j62012m531
$$ -591791 -318404 232379 524787 401283 216063 203097 180868 979 -161033 -165564
36462a65564j082r2446N2640L89859M90916K27691k8470J0690J90185K52802J79408
$$ -165564 -166646 -259092 -206452 183407 674323 902014 873544 884234 1074419 1327221 1506629
36451A506629N9149q3056k05576k20851j22345K7392K07575L43657K18925k14154
$$ 1506629 1565778 1482722 1277146 1056295 933950 961342 1168917 1512574 1731499 1517345
36441A517345n44582l24612K49733M99653J39708m11130o53973n29917k14406
$$ 1517345 972763 648151 897884 1397537 1537245 1126115 472142 -57775 -272181
36432b72181J73620M61954M04774L0926k62553j99460J5796K7500j89862l75703
$$ -272181 -98561 363393 768167 799093 536540 337080 352876 380376 190514 -185189
36422a85189l39830j04799J71826K97806K02983O5077J16237K85814K50540j00184
$$ -185189 -525019 -629818 -457992 -160186 42797 107874 224111 509925 760465 660281
36412F60281m75607n36865k38524K18726N54331N25865J59144j35822K063L39329
$$ 660281 184674 -352191 -590715 -371989 182342 708207 867351 731529 733592 1072921
36402A072921L20755j03353m02943l03112j42016j95451k17084J2704K07419Q1500
$$ 1072921 1393676 1290323 887380 584268 442252 246801 29717 42421 249840 331340
36392C31340j09017j9955J62639P6783j54525j60333K2007P2559j3337J0729J18216
$$ 331340 222323 202368 365007 441790 287265 126932 148939 221498 208161 218890 337106
36381C37106P3802p4564o7495P0692P6067q0623k00452k40523k54047r7070K97371
$$ 337106 410908 336344 268849 339541 415608 334985 134533 -105990 -360037 -457107 -159736
36370a59736N11387J14131n51723p05717k23211K72079M04112M00279L86451J32495
$$ -159736 351651 465782 -85941 -791658 -1014869 -742790 -338678 61601 448052 580547
36360E80547k87615l67909j5839K12082O5845K4987L35617M40893j8546m12755
$$ 580547 292932 -74977 -90816 121266 187111 212098 547715 988608 970062 557307
36350E57307j19737L48327J44070n01042o85633l17153r6736j96981q1900L21158
$$ 557307 437570 785897 929967 428925 -256708 -573861 -670597 -867578 -949478 -628320
36340f28320L88864j9088j95353J87801M43574M3098m12934j47954M97053N81965
$$ -628320 -239456 -258544 -453897 -266096 177478 220576 -192358 -340312 156741 738706
36330G38706j151m70687l66609k2495J87007L49372N64668N59942R7097n49364
$$ 738706 737555 266868 -99741 -122236 64771 414143 978811 1538753 1635850 1086486
36320A086486q46607o10672j46110J59054K09443J57210J02400k2413k29622k98135
$$ 1086486 239879 -370793 -516903 -357849 -148406 8804 111204 88791 -140831 -438966
36310d38966l1794L61030M37274J21460j59599o6964K21579L49087K52302P3503
$$ -438966 -470760 -109730 327544 449004 289405 222441 444020 793107 1045409 1118912
36300A118912j09080j95891r843L52353M21956J0738l53499j57071K24261N1674
$$ 1118912 1009832 813941 804098 1156451 1578407 1589145 1235646 1078575 1302836 1354510
36290A354510n49981p02261j45793L47446J98631j41253n0178K49349J77879j76538
$$ 1354510 804529 102268 -43525 303921 502552 361299 311121 560470 738349 561811
36280E61811k44771O3069K67067J04259j77794l14303l16961k33600k9859K28338
$$ 561811 317040 380109 647176 751435 573641 259338 -57623 -291223 -321082 -92744
36270i2744L97671M70616M80571K84803j87597n70615m17319J00312L55490J71349
$$ -92744 304927 775543 1256114 1540917 1353320 782705 365386 465698 821188 992537
36260I92537J1161J39649J98104r3415l75743k44213L6559m2400l81129m26337
$$ 992537 1003698 1143347 1341451 1248036 872293 628080 664639 622239 241110 -185227
36250a85227n9387K27937P8375k63932l50589p1910L12586M60468K02572k83937
$$ -185227 -244614 -16677 61698 -202234 -552823 -624733 -312147 148321 350893 66956
36240F6956n37449k64859K49697M19837P0394l64120m07386o6320K96261L89065
$$ 66956 -470493 -735352 -485655 -65818 4576 -359544 -766930 -833250 -536989 -147924
36230a47924J84401j16130j93396J21640N67326O27655J44856m10048m59684J1670
$$ -147924 36477 -79653 -273049 -151409 415917 1043572 1188428 778380 318696 330366
36220C30366M86829N03129L5151n99640r95408q69170k56259M48589P80137N90429
$$ 330366 817195 1320324 1355475 755835 -239573 -1108743 -1365002 -916413 -136276 454153
36210D54153J22030k40595k32581J32515M99212L95451k36257q14604p11507l1416
$$ 454153 576183 335588 103007 235522 734734 1130185 893928 79324 -632183 -663599
36200f63599N21954N51278L35647K10299O4833k49714m53323k49089Q4151N3641
$$ -663599 -141645 409633 745280 955579 1020412 770698 317375 68286 152437 206078
36190B06078k50829l01287k1381R5665j48284l12343q8544J80166J42593O3613
$$ 206078 -44751 -346038 -367419 -271754 -420038 -732381 -820925 -640759 -498166 -434553
36180d34553K83371M97703K35407k38640k37457K40719M71549J26857k89734l30925
$$ -434553 -151182 346521 581928 343288 105831 346550 818099 944956 655222 324297
36170C24297k39659l33601l57451L0526N44005O15062K23687j42754k23306j88856
$$ 324297 84638 -248963 -606414 -575888 -31883 583179 806866 664112 440806 251950
36160B51950j82434j32006n1103r9263k36194j68388K07130N79203O09931L42739
$$ 251950 69516 -62490 -113593 -212856 -449050 -617438 -410308 168895 778826 1121565
36150A121565O3566q3333j62168k22385j97037m5452J14973J11633m3211j05879
$$ 1121565 1185131 1101798 939630 717245 520208 474756 589729 701362 658151 552272
36140E52272R7307L69287L29539o8216m27051m20219j82461k0442K3358O1886
$$ 552272 649579 1018866 1348405 1280189 853138 432919 250458 230016 253374 315260
36130C15260M6801q5903j16856J82059N44507M53503p2248m19497k61824k8601
$$ 315260 362061 276158 159302 341361 885868 1339371 1267123 847626 585802 557201
36120E57201k02351n51498m94796J1638M33697M36440K43183J37504J3886l21551
$$ 557201 354850 -196648 -691444 -679806 -246109 190331 433514 571018 584904 263353
36110B63353o52983n19529J23362O98683O30037K7168m55468m01011m4186J40436
$$ 263353 -389630 -909159 -785797 -87114 542923 570091 114623 -286388 -330574 -190138
36100a90138K5804j42868j24486J22664M87664P21780N20692j28868p36471p39735
$$ -190138 -164334 -307202 -431688 -309024 178640 900420 1421112 1292244 555773 -183962
36090a83962j71455L64213M15781J24875j13621j54925j26507j45083j77466j11690
$$ -183962 -355417 8796 424577 549452 435831 280906 154399 9316 -168150 -279840
36080b79840R2934K85590K31336m4430j80790J4989J90155m1363l92095k67854
$$ -279840 -186906 98684 330020 285590 104800 119789 309944 268581 -123514 -391368
36070c91368K29249L63913n7218l44235p5316J90264r9587m92656k95460K04078
$$ -391368 -162119 201794 144576 -199659 -274975 -84711 -184298 -676954 -972414 -768336
36060g68336K10011k02042k01914L57896O44596J85435m07707m44076j26227q236
$$ -768336 -558325 -760367 -962281 -604385 40211 225646 -182061 -626137 -752364 -760600
36050g60600q0557J2288K45764L02109J56749O6012R8827J02845L9460j1058q3943
$$ -760600 -841157 -828869 -583105 -280996 -124247 -58235 40592 143437 182897 171839 87896
36039H7896k27614k63580j0376L08228K55597j93636n58004m52418q565L90782
$$ 87896 -139718 -403298 -413674 -105446 150151 -43485 -601489 -1053907 -1062472 -671690
36029f71690N39307M56071K39734L4066k2695L0506k6183k91322n52834n58405
$$ -671690 -132383 323688 563422 597488 574793 605299 579116 287794 -265040 -823445
36019h23445l76638k86829l52657l44982j40869L4411p5377l59670m78697l16011
$$ -823445 -1200083 -1486912 -1839569 -2184551 -2325420 -2291009 -2366386 -2726056 -3204753 -3520764
36009c520764n7092J49537L33257M67161M02487J78669J05034L03824M35809J93502
$$ -3520764 -3577856 -3428319 -3095062 -2627901 -2225414 -2046745 -1941711 -1637887 -1202078 -1008576
35999a008576j57044j35861J91875L04975N9544q8863J69412N18837N44643L27515
$$ -1008576 -1165620 -1301481 -1109606 -804631 -745087 -833950 -664538 -145701 398942 726457
35989G26457J71920P1175j44048l46797k56846M5871J72243n705k06019k22108
$$ 726457 898377 969552 825504 478707 221861 267732 439975 434270 228251 6143
35979F143k15452l71649n30592l93172J9971L35825K75743P594m4476K68568N97452
$$ 6143 -209309 -580958 -1111550 -1504722 -1484751 -1148926 -873183 -865589 -910065 -641497 -44045
35968d4045N18508J00833j78971j04238K744j68480l87685k31835K23971M68738
$$ -44045 474463 575296 396325 292087 294831 126351 -261334 -493169 -269198 199540
35958A99540K75395k6033o8975Q0789J18910p5721l70836n68418n35177k72469
$$ 199540 474935 448902 379927 460716 579626 503905 133069 -435349 -970526 -1242995
35948a242995N0097K34211K62162K40451J55341q7540l56328l23833O3739M22140
$$ -1242995 -1192898 -958687 -696525 -456074 -300733 -388273 -744601 -1068434 -1004695 -582555
35938e82555M23263K13281J13530J34530P6777o6190j41548j60594k40674k88459
$$ -582555 -159292 53989 167519 302049 378826 312636 171088 10494 -230180 -518639
35928e18639j10292J65071J61277j65733l87429j96972J72857L17197J63414j05790
$$ -518639 -628931 -463860 -302583 -468316 -855745 -1052717 -879860 -562663 -399249 -505039
35918e05039l58911m76667k57408K94320P54743P19227L44359R5932O5828k9817
$$ -505039 -863950 -1340617 -1598025 -1303705 -548962 170265 514624 610556 676384 646567
35908F46567k27290k19903J6626M8707k96345n18379j63341M11891N03928P6307
$$ 646567 419277 199374 216000 264707 -31638 -550017 -713358 -301467 202461 278768
35898B78768k39431r1930J81010J79272n27n4761J9141j3131k19989l90444k69426
$$ 278768 39337 -52593 128417 307689 307162 252401 271542 258411 38422 -352022 -621448
35887f21448J78155O62640P34572K26799m52526o81767l24919J59187L53686L32708
$$ -621448 -443293 219347 953919 1180718 728192 46425 -278494 -119307 234379 567087
35877E67087L42804L51790J77987j39038l82858m63273m39859l34058j31411R9551
$$ 567087 909891 1261681 1439668 1300630 917772 454499 14640 -319418 -450829 -351278
35867c51278K69126L66123L49901R3181l55159o03900l18709K68762N45577K26929
$$ -351278 -82152 283971 633872 727053 371894 -232006 -550715 -281953 263624 490553
35857D90553l56764p00333o25643l02127K2305K14362K95411L52056L72581K33842
$$ 490553 133789 -566544 -1192187 -1494314 -1472009 -1257647 -962236 -610180 -237599 -3757
35847c757o7457k95243k51323n8508M0010M9606J26835K06938P2289k07258k57643
$$ -3757 -71214 -366457 -617780 -676288 -636278 -586672 -459837 -252899 -180610 -387868 -645511
35836f45511P4143M67151N32917K48367j35506m02272m53779k72728L9359K86904
$$ -645511 -571368 -104217 428700 677067 541561 139289 -314490 -587218 -547859 -260955
35826b60955L35730J83387r3913l19493k23430K53845O88540N49565q4269n34225
$$ -260955 74775 258162 164249 -155244 -378674 -124829 563711 1113276 1029007 494782
35816D94782l81015L5642J72856r12j31597m8942J22339K49697K81111J54638
$$ 494782 113767 149409 322265 321353 189756 140814 263153 512850 793961 948599
35806I48599j13594l27261l10369j34700J4148P5375O2617n3897k23789k58846
$$ 948599 835005 507744 197375 62675 76823 152198 214815 160918 -62871 -321717
35796c21717j18928o1110k44028l83265j28880L64821O10521M45405J65234M4057
$$ -321717 -440645 -501755 -745783 -1129048 -1257928 -893107 -282586 162819 328053 372110
35786C72110N8819Q7388O9955m5882k55985l93612l11163j29257n4606k7668J42464
$$ 372110 430929 518317 588272 542390 286405 -107207 -418370 -547627 -602233 -629901 -487437
35775d87437L64444L46520O9138j84763k62504k38052j01039K16562M87289L52648
$$ -487437 -122993 223527 292665 107902 -154602 -392654 -493693 -277131 210158 562806
35765E62806o3621k11891N3583K27386j9677l05022j94666R4518J34498K4348
$$ 562806 499185 287294 340877 568263 548586 243564 48898 143416 277914 302262
35755C02262J26117L49893L07640K2911j07644k284K6367j03257r2252J52772
$$ 302262 428379 778272 1085912 1108823 1001179 998895 1025262 922005 829753 982525
35745I82525K94513J15152j46591k30664k29676k69755k00317N6984J80477r3996
$$ 982525 1277038 1392190 1245599 1014935 785259 515504 315187 372171 552648 458652
35735D58652m15522k30834L25655N05420J5737n02509l64452K00118M32167J46253
$$ 458652 43130 -187704 137951 643371 659108 156599 -207853 -7735 424432 570685
35725E70685j17717l0225L9175k74498o26047m27692K34751O71591N10883P5230
$$ 570685 452968 422743 461918 187420 -438627 -866319 -631568 40023 550906 626136
35715F26136j97845k54520k08468n3834J62931K26463R2272O3237L19818N24106
$$ 626136 428291 173771 -34697 -88531 74400 300863 393135 456372 776190 1300296
35705A300296K59477l09770o14109m25785n0384J86612K55604K00935l751k50904
$$ 1300296 1559773 1250003 635894 210109 159725 346337 601941 802876 799125 548221
35695E48221k77365l2355J79057J11945o5903n8510P8980J8926l21919o05090
$$ 548221 270856 238501 417558 529503 463600 405090 484070 502996 181077 -424013
35685d24013m93743q1525K47480L05992K62571K90420K72861L9846k49010k60537
$$ -424013 -917756 -999281 -751801 -445809 -183238 107182 380043 419889 170879 -89658
35675h9658j4685Q4230j45994l61381k13728J24213K71151K30960K71936L65065
$$ -89658 -104343 -20113 -166107 -527488 -741216 -617003 -345852 -114892 157044 522109
35665E22109K07682k04434m70687l49401o9155N4060J1699k3953L3137J74568
$$ 522109 729791 525357 54670 -294731 -363886 -309826 -298127 -322080 -288943 -114375
35655a14375L38795L62920J17963k30577l53760k29125j73682k90752k48770J56202
$$ -114375 224420 587340 705303 474726 120966 -108159 -281841 -572593 -821363 -665161
35645f65161N62000N13719J33904p5854L4356J40936L2743p0765R7756M21001
$$ -665161 -103161 410558 544462 468608 502964 643900 676643 605878 703634 1124635
35635A124635N21994K16834k65525m94991k65735J64460L13722N006m33227n74245
$$ 1124635 1646629 1863463 1597938 1102947 837212 1001672 1315394 1320400 887173 312928
35625C12928l79297j34440j5788N9113J72766K36669J55505l077j16809j87301
$$ 312928 -66369 -200809 -216597 -157484 15282 251951 407456 404379 287570 100269
35615A00269k86419l72751l05173p3244J13296Q0674m0304K2414K69483M14715
$$ 100269 -186150 -558901 -864074 -937318 -824022 -743348 -783652 -761238 -491755 -77040
35605g7040L38168K61196K97624J67067k93376o26006l00347L76010N37348m492
$$ -77040 261128 522324 819948 987015 693639 67633 -232714 143296 680644 676152
35595F76152m74119k97260J16719J61255l948J22848M34795M07534K4100k02435
$$ 676152 202033 -95227 21492 182747 178799 301647 736442 1143976 1168076 965641
35585I65641q2906K9641n9553q4903R6490J70228p6947k90676l8572M91461O97688
$$ 965641 882735 912376 852823 767920 864410 1034638 957691 667015 628443 1119904 1817592
35574A817592L82802n416j5748K13804K17583q0216k32556M3275L55545J58726
$$ 1817592 2200394 2194978 2179230 2393034 2610617 2530401 2297845 2341120 2696665 2855391
35564B855391l87321n80875k20854R1150q4970l47947j78066J67210J01180k91584
$$ 2855391 2468070 1887195 1666341 1757491 1672521 1324574 1146508 1313718 1414898 1123314
35554A123314m04724q4065K45309L52535M07776M09250J12952l45416m38469p3565
$$ 1123314 718590 634525 879834 1232369 1640145 2049395 2162347 1816931 1378462 1304897
35544A304897J85518j0467k77222j67468J59333K98080J83885l4302k97066m75407
$$ 1304897 1490415 1479948 1202726 1035258 1194591 1492671 1676556 1642254 1345188 869781
35534H69781l18558Q7077K16287j54624n08709l18652J61014L09214K0411l26749
$$ 869781 551223 638300 854587 699963 191254 -127398 33616 342830 363241 36492
35524C6492m99409m91639k22754K91868O41132M40506m8083k26416m108J65749
$$ 36492 -462917 -954556 -1177310 -885442 -244310 196196 148113 -78303 -82411 83338
35514H3338L0859j81428k15434o2202K01412M26975L16788j98185n92107l22770
$$ 83338 114197 -67231 -282665 -344867 -143455 283520 600308 402123 -189984 -512754
35504e12754K67102K99033l12753o32610q9167O35470O18307K5440k49521O5610
$$ -512754 -245652 53381 -259372 -891982 -981149 -345679 272628 298068 48547 114157
35494A14157L81748K74747L6873L2468P8355j66700n46646n92332k44241L8169
$$ 114157 495905 770652 807525 839993 918348 751648 205002 -387330 -631571 -593402
35484e93402m3298k06788p2165K24505K59883K2908n9493J77306L60133J78913
$$ -593402 -636700 -843488 -915653 -691148 -431265 -408357 -467850 -290544 69589 248502
35474B48502j34804k04174n4195N7254P4357O1615n0092k44579j99377K53010
$$ 248502 113698 -90476 -144671 -87417 -13060 48555 -1537 -246116 -445493 -192483
35464a92483O55420M56611j29650l92223j89353q9058l72076n78883l06891J38619
$$ -192483 462937 919548 789898 397675 208322 119264 -252812 -831695 -1138586 -999967
35454i99967K76008J75865K19339M26482M55665J37948l02350n01153k72819K12301
$$ -999967 -723959 -548094 -328755 97727 553392 691340 388990 -112163 -384982 -172681
35444a72681M93011K53193k51275m59141k43456l3488j03222j79614J0144K38362
$$ -172681 320330 573523 322248 -136893 -380349 -413837 -517059 -696673 -686529 -448167
35434d48167J87474J5816Q0968L22245L51987M7980l19613m93018m48753k60194
$$ -448167 -260693 -244877 -163909 158336 510323 558303 238690 -254328 -703081 -963275
35424i63275j1418J62730J55816J4457j09571o8803K30698O84635Q64860L82947
$$ -963275 -974693 -811963 -656147 -641690 -751261 -820064 -589366 95269 960129 1343076
35414A343076m69247q33593l23916M07983N07783r275m67142n22280l90306k38805
$$ 1343076 873829 40236 -283680 124303 632086 622811 155669 -366611 -756917 -995722
35404i95722L0067L56340M23309J52251r1379J9189L36725M43455J34459l78884
$$ -995722 -965655 -609315 -186006 -33755 -125134 -105945 230780 674235 808694 429810
35394D29810o43911l66861K43544O15597M35952k224k27902j58341o990J20733
$$ 429810 -214101 -580962 -337418 278179 714131 711907 484005 325664 318674 439407
35384D39407K02443R9522k05445l55653n3893M02027M91313K30069L4516k7541
$$ 439407 641850 741372 535927 180274 126381 528408 1019721 1249790 1284306 1256765
35374A256765k20509m61093l74948o4367o1849l79454l87758J06508M60859K51287
$$ 1256765 1036256 575163 200215 135848 73999 -305455 -693213 -586705 -125846 125441
35364A25441o3595l7159j7516l67811o16896k33799L20168K73060j49369j46155
$$ 125441 61846 24687 7171 -360640 -977536 -1211335 -891167 -618107 -767476 -913631
35354i13631K16949J62681k78239j81660O01558R56329K49565n53040l56731L74656
$$ -913631 -696682 -534001 -812240 -993900 -392342 563987 813552 260512 -96219 278437
35344B78437M54916j19564l05346K07900N68631K14342l20545l97927k05265j97564
$$ 278437 733353 613789 308443 516343 1084974 1299316 978771 580844 375579 178015
35334A78015k87755j64498P4879J78228K45437M24371M35668J7358m15646k53191
$$ 178015 -109740 -274238 -199359 -21131 224306 648677 1084345 1101703 686057 432866
35324D32866K96506M14819q6632m91761l28581m2818j46367l60502j79105K00897
$$ 432866 729372 1144191 1057559 565798 237217 194399 48032 -312470 -491575 -290678
35314b90678J91100k07687m02484j08941L20627M88950L88017J82674j7235q3993
$$ -290678 -99578 -307265 -709749 -818690 -498063 -9113 378904 561578 544343 460350
35304D60350O5416K50533J88874p3092k08308j11851K758L6884J17548J98603
$$ 460350 525766 776299 965173 892081 683773 571922 574680 611564 729112 927715
35294I27715K5360l27966l72922M9560L91085J62732k93310k93271J78353M89235
$$ 927715 953075 625109 252187 301747 692832 855564 562254 268983 447336 936571
35284I36571K84689j22304k96494j66162J06535L45665L46474L614m00730l74481
$$ 936571 1221260 1098956 802462 636300 742835 1088500 1434974 1438588 1037858 663377
35274F63377J23958N06948K85131k93818o38133o09121n13259m32160r3987M87625
$$ 663377 787335 1294283 1579414 1285596 647463 38342 -474917 -907077 -1001064 -513439
35264e13439P62899L69977k45824l85612o7973P1187j99758l66137j9625M69920
$$ -513439 249460 619437 373613 -11999 -79972 -8785 -208543 -574680 -594305 -124385
35254a24385M98086P2825l14930m24832m08983l52755j47279J78801L90882L62148
$$ -124385 373701 446526 131596 -293236 -702219 -1054974 -1202253 -1023452 -632570 -270422
35244b70422J75525n9652k09815m6841M36455P45359M14262k22800l76227L5536
$$ -270422 -94897 -154549 -364364 -411205 25250 770609 1184871 962071 585844 621380
35234F21380K38563j74562n88285l55675J83865K89462k8236j32684K04854N64048
$$ 621380 859943 685381 97096 -258579 -74714 214748 186512 53828 258682 822730
35224H22730N79661L12769o1181m33995o17350m51816j02502J10016J58613K35485
$$ 822730 1402391 1715160 1653979 1219984 602634 150818 48316 158332 316945 552430
35214E52430K93390R4060k87903m60464k87111n9161l084l621O3556R5912K0328
$$ 552430 845820 939880 651977 191513 -95598 -154759 -157843 -161464 -97908 -1996 18332
35203A8332l5856Q528N1309N1227J23661K54560K16787n1453k57585j48872J27590
$$ 18332 -17524 -8996 42313 93540 217201 471761 688548 637095 379510 230638 358228
35192C58228K58705J73585L3681l1659k1031j2213j13129l27755m36349k10466
$$ 358228 616933 790518 824199 792540 771509 759296 646167 318412 -117937 -328403
35182c28403K22843M87870M67696L85235L19152N9527l80242n68335k99211k7016
$$ -328403 -105560 382310 850006 1235241 1554393 1613920 1233678 665343 366132 339116
35172C39116k12452n54509m09729K03652N92986L60625j33428l62205k42229p561
$$ 339116 126664 -427845 -837574 -633922 -40936 319689 186261 -175944 -418173 -425734
35162d25734J56879J62788k4504k79006l48560j41756J62900L66956M33515L67145
$$ -425734 -268855 -106067 -130571 -409577 -758137 -899893 -736993 -370037 63478 430623
35152D30623J44311j36145k58116j70068n9296l8012K669R7350P0088q7727l4088
$$ 430623 574934 438789 180673 10605 -48691 -86703 -84034 13316 83404 -4323 -38411
35141c8411L73689O37416K33581m93608o69619j41452K62525m0608n22319l68393
$$ -38411 335278 972694 1206275 712667 43048 -98404 164121 123513 -398806 -767199
35131g67199K98503O48888L55348r8181k78211l24306m55182n06391k66139J06571
$$ -767199 -468696 180192 535540 437359 159148 -165158 -620340 -1126731 -1392870 -1286299
35121a286299L18444L37893K83188J48104q1484k30584j42296N3980J33592J07754
$$ -1286299 -967855 -629962 -346774 -198670 -280154 -510738 -653034 -599054 -465462 -357708
35111c57708J24941J74123J38883L4376n3191j44757k40290j60539J77459M51667
$$ -357708 -232767 -58644 80239 114615 61424 -83333 -323623 -484162 -306703 144964
35101A44964K66382k53115n54849l62235L8162K40938J54114n9538j98334j21380
$$ 144964 411346 158231 -396618 -758853 -720691 -479753 -325639 -385177 -583511 -704891
35091g04891J35780L17899K32837M4684M2025J90558K29245J33653J00212J19350
$$ -704891 -569111 -251212 -18375 26309 68334 258892 488137 621790 722002 841352
35081H41352M167j66898j22379O0440K3021j94856j53486J56891J70522k78509
$$ 841352 845519 678621 556242 616682 639703 444847 291361 448252 618774 340265
35071C40265n51264k27540J64178O0407j42655J78247O66565N05874j47167l32023
$$ 340265 -210999 -438539 -274361 -213954 -356609 -178362 488203 994077 846910 514887
35061E14887J51623M30250J4319m40602k64574J95750K72690L1787n0425K8385
$$ 514887 666510 1096760 1111079 670477 405903 601653 874343 906130 855705 884090
35051H84090m6952j86989n2856K28333J88824j72055l42396j32370L5596j48502
$$ 884090 837138 650149 597293 825626 1014450 842395 499999 367629 403225 254723
35041B54723l89620k97561L6526L04499M66869N82557M42930j29013p50049p71772
$$ 254723 -134897 -432458 -395932 -91433 375436 957993 1400923 1271910 521861 -249911
35031b49911j35561N22763P10265N62963L43003k2321n33815p15751j98581N36386
$$ -249911 -385472 137291 847556 1410519 1753522 1731201 1197386 481635 283054 819440
35021H19440O26767j1040n88772n56130k03473k405M9769J17051Q9003j12764
$$ 819440 1446207 1435167 846395 290265 86792 84387 134156 251207 340210 227446
35011B27446j98057N9799L65243L25625N9315q3653j33811k99360l84774m7745
$$ 227446 29389 89188 454431 780056 839371 755718 621907 322547 -62227 -109972
35001a09972M70166N34158O1189l55046l60274k59179l34952l59451r6642K17143
$$ -109972 360194 894352 955541 600495 240221 -18958 -353910 -713361 -810003 -592860
34991e92860K73040J70037J33694J09585J331j7077J83169L52811K53510J03941
$$ -592860 -319820 -149783 -16089 93496 94827 77750 260919 613730 867240 971181
34981I71181J91968K97150L0333m20418m77525p6393K07614L2188k51783k16427
$$ 971181 1163149 1460299 1490632 1070214 592689 516296 723910 756098 504315 287888
34971B87888L4780J63492J30411R6341O2276l8717q1045O1730J85865o229l72354
$$ 287888 322668 486160 616571 712912 775188 736471 655426 717156 903021 896792 524438
34960E24438m14899J8258M53818M02034l898k38255j12069L6885j05904l76093
$$ 524438 109539 127797 581615 983649 979751 741496 629427 666312 560408 184315
34950A84315l92276j15987R2678j2306k12942j41737J71040L02771K4576l51918
$$ 184315 -207961 -323948 -231270 -243576 -456518 -598255 -427215 -124444 -99868 -451786
34940d51786l82895q2893J50183J25009N6325J43046K81256L34297L65271L81522
$$ -451786 -834681 -917574 -767391 -642382 -586057 -443011 -161755 172542 537813 919335
34930I19335J72340k72520m86913j27458L80210L57783r5382k51767P0504K44859
$$ 919335 1091675 819155 332242 204784 584994 942777 847395 595628 666132 910991
34920I10991o4466l34892j28966J33960m5644l32899j77385J61300R1393j75929
$$ 910991 846525 511633 382667 516627 470983 138084 -39301 121999 213392 37463
34910C7463K1888M97777L81405l47672o40097m3518M86247P0707o96390o93706
$$ 37463 59351 557128 938533 590861 -49236 -92754 393493 464200 -232190 -925896
34900i25896K3226M35429J51851j83388m7822K44889K03304r0007k18249o0418
$$ -925896 -902670 -467241 -315390 -498778 -546600 -301711 -98407 -188414 -406663 -467081
34890d67081J33180J42301L7997N3359K56809L99746J94163k55453n05777l43396
$$ -467081 -333901 -191600 -153603 -100244 156565 556311 750474 495021 -10756 -354152
34880c54152m6804P2088R6779K25444L40858K11652p3314k40974k59105k60257
$$ -354152 -400956 -328868 -232089 -6645 334213 545865 472551 231577 -27528 -287785
34870b87785j82768R3679L42627J85123k93428n55901l32571N6169K22875K04358
$$ -287785 -470553 -376874 -34247 150876 -142552 -698453 -1031024 -974855 -751980 -547622
34860e47622K39343L37093L11520J00617j46954k62553k37179k11676k78577k99361
$$ -547622 -308279 28814 340334 440951 293997 31444 -205735 -417411 -695988 -995349
34850i95349n6108L57879N40355L47296J63401K89724L69565p0050p19693p89892
$$ -995349 -1051457 -693578 -153223 194073 357474 647198 1016763 946713 227020 -562872
34840e62872j84034L27702K43907m5421n3021M9616p9896k64730j74553K2090
$$ -562872 -746906 -419204 -175297 -220718 -273739 -224123 -304019 -568749 -743302 -721212
34830g21212k6331j73861k8301L12578M06024K39712K18120L81600K96346j54374
$$ -721212 -747543 -921404 -949705 -637127 -231103 8609 226729 608329 904675 750301
34820G50301m94255m08647k12648k32681k27607J19002N19488M42264o0046m14655
$$ 750301 256046 -152601 -365249 -597930 -825537 -706535 -187047 255217 195171 -219484
34810b19484l35084p7668Q6764J77060K15670J06973m1160R2658M88982O18267
$$ -219484 -554568 -632236 -545472 -368412 -152742 -45769 -86929 5729 494711 1112978
34800A112978J69054l83184l81487N6059K14443j46290m64820k59434J76826K75913
$$ 1112978 1282032 898848 517361 573420 787863 641573 176753 -82681 94145 370058
34790C70058K4410j15724O8483L03426K87763O1665j39316j76825r1881m0697
$$ 370058 394468 278744 347227 650653 938416 1000081 860765 683940 592059 551362
34780E51362j70879m33927n40949k70146J92986M20390K71802M4782J7575P2736
$$ 551362 380483 -53444 -594393 -864539 -671553 -251163 20639 65421 82996 155732
34770A55732m3691k61700k62157J6570K23855O9310k43328k74926K4571K18403
$$ 155732 112041 -149659 -411816 -395246 -171391 -102081 -345409 -620335 -595764 -377361
34760c77361l550l52967l15876J34876N06323M58743J90916M2920J5926q5539
$$ -377361 -380911 -733878 -1049754 -914878 -408555 50188 241104 284024 299950 214411
34750B14411k47986k70821r2123J55398L51341M36154L28429L2503k22144j99939
$$ 214411 -33575 -304396 -396519 -241121 110220 546374 874803 907306 685162 485223
34740D85223O46O7678p7661k14599k04704j46106r2542O8969L26521M16605J96203
$$ 485223 485869 553547 475886 261287 56583 -89523 -182065 -113096 213425 630030 826233
34729H26233p6716p6287J22593J59100r8736l87147m03349j57109Q5818J19994
$$ 826233 749517 673230 795823 954923 856187 469040 65691 -91418 -5600 114394
34719A14394Q585j4089J51344K99638J53485k39141m97427l72064o2212P5832
$$ 114394 122979 108890 260234 559872 713357 474216 -23211 -395275 -457487 -381655
34709c81655J5429L9294K60881M08237J98595k28392m40037k39744J15250K76594
$$ -381655 -366226 -326932 -66051 342186 540781 312389 -127648 -367392 -252142 24452
34699B4452K15940J32715Q6528l0289j79607j33150J46577L35029J54995k22498
$$ 24452 240392 373107 459635 429346 249739 116589 263166 598195 753190 530692
34689E30692m08736k92363p1212R3922J91827K01054R9029J2936J02428K86231
$$ 530692 121956 -170407 -241619 -147697 44130 245184 344213 357149 459577 745808
34679G45808L20484J52329l5387j25715j63478j46172O982K31789L18120J90656
$$ 745808 1066292 1218621 1183234 1057519 894041 747869 754851 986640 1304760 1495416
34669A495416k5068k25752l71008l24236J2355L78637L58035p30j55930J66691
$$ 1495416 1470348 1244596 873588 549352 561707 940344 1298379 1297649 1141719 1308410
34659A308410N69661N67922K16326j27045l27550m16956k96495Q1633M04391K91772
$$ 1308410 1878071 2445993 2662319 2535274 2207724 1790768 1494273 1575906 1980297 2272069
34649B272069j51105m27311k92045j3347L9282j66049l54668k73545M9186L13509
$$ 2272069 2120964 1693653 1401608 1388261 1427543 1261494 906826 633281 682467 995976
34639I95976K51222m7836k18651p0729J99450L06840K00808L573j67265k04856
$$ 995976 1247198 1199362 980711 909982 1109432 1416272 1617080 1620653 1453388 1248532
34629A248532n1514J54473J82496M8406o745N3865K102j78771j92823p4J0126
$$ 1248532 1197018 1351491 1533987 1582393 1575648 1629513 1631615 1452844 1260021 1259947 1270073
34618A270073k79152l68143M9923M45481K22235k95210l57798L5809K51383J14147
$$ 1270073 990921 622778 672701 1118182 1340417 1045207 687409 723218 974601 1088748
34608A088748N4160K00954J70845j41048l32693k41562k01157l27228k53682J19731
$$ 1088748 1142908 1343862 1514707 1373659 1040966 799404 598247 271019 17337 137068
34598A37068L00243J7852k53377o6107K46154J31267k84687m34605j62599J82380
$$ 137068 437311 455163 201786 135679 381833 513100 228413 -206192 -368791 -186411
34588a86411L08141J91321r1619l47660k68659J65132M74839K67693j64650k57497
$$ -186411 121730 313051 221432 -126228 -394887 -229755 245084 512777 348127 90630
34578I0630j283J28029l9892j68745k2250J99747K39891J24328l907r7818j34133
$$ 90630 89347 217376 177484 8739 -13511 186236 426127 550455 546548 448730 314597
34567C14597p0906K1427o794j43118j95653p8828O7867J02221M1914m6523j39635
$$ 314597 243691 265118 258324 115206 -80447 -159275 -91408 10813 52727 6204 -133431
34556a33431j74761n4068J77775L04764J89898m2780j52036l2305K16710L93239
$$ -133431 -308192 -362260 -184485 120279 310177 267397 115361 83056 299766 693005
34546F93005L42557R2703j40615j79637j18459k01180m42799n42876k83105J31417
$$ 693005 1035562 1128265 987650 808013 689554 488374 45575 -497301 -780406 -648989
34536f48989L05724J66784L1924J29965K65771J30594j86196k68848K2392L08953
$$ -648989 -343265 -176481 -144557 -14592 251179 381773 195577 -73271 -50879 258074
34526B58074K23860n1901p7960J50932J80067k02645o05606n51951r4248L16753
$$ 258074 481934 430033 352073 503005 683072 480427 -125179 -677130 -771378 -454625
34516d54625M02639K58523Q6173l9117j44674k57028l33050k40824J09369N41304
$$ -454625 -51986 206537 292710 253593 108919 -148109 -481159 -721983 -612614 -71310
34506g1310O59075K80504k65595m67168k23121P3674O1008j61177k14962M1964
$$ -71310 587765 868269 602674 135506 -87615 -13941 47067 -114110 -329072 -287108
34496b87108L21387K48982j71385n33910m85925j03654K59929L93551L51223K42989
$$ -287108 34279 283261 111876 -422034 -907959 -1011613 -751684 -358133 -6910 236079
34486B36079J09393p761o7342j21640k39489l42086k96683j42007L768K05224
$$ 236079 345472 337711 270369 148729 -90760 -432846 -729529 -871536 -867768 -662544
34476f62544N68297Q63045O96871J43008k38867j79935o1562k42015m63256l11724
$$ -662544 -94247 768798 1465669 1608677 1369810 1189875 1128313 886298 423042 111318
34466A11318Q5711K78983J59658l6862j95657l33347k97381O2595M84647N07235
$$ 111318 197029 476012 635670 598808 403151 69804 -227577 -164982 319665 826900
34456H26900R7141l12607m10382k81071j07054N0143J53153J88735K66638M37119
$$ 826900 924041 611434 201052 -80019 -187073 -136930 16223 204958 471596 908715
34446I08715M72744J64220k40567k85579M0936L11576K97920J63234J1091k63088
$$ 908715 1381459 1545679 1305112 1019533 1060469 1372045 1669965 1833199 1844290 1581202
34436A581202n73961n88742k48962O9585J07563M2490P1375P4339o8063j89335
$$ 1581202 1007241 418499 169537 239122 346685 389175 460550 534889 466826 277491
34426B77491j39628o5185j25453k01983j24528O2067K47609M04915M37797K15204
$$ 277491 137863 72678 -52775 -254758 -379286 -317219 -69610 335305 773102 988306
34416I88306q0550m6864K78634L15488j83298o40040m85003k7292Q0552j20554
$$ 988306 907756 860892 1139526 1455014 1271716 631676 146673 119381 199933 79379
34406G9379q4000K35124L04987o7935m25700l79217q7202J43814K70806L46245
$$ 79379 -4621 230503 535490 467555 41855 -337362 -424564 -280750 -9944 336301
34396C36301L22634J98025O4032p8860k64893l22361p0724K40912J71476j68278
$$ 336301 658935 856960 920992 842132 577239 254878 184154 425066 596542 428264
34386D28264j62297L37574O73601L60187j48431j66900J82758K58717m9172k31265
$$ 428264 265967 603541 1277142 1637329 1488898 1321998 1504756 1763473 1714301 1483036
34376A483036l9390J94513K06981J98681L63554M76841K63945j14404k61520o9797
$$ 1483036 1443646 1638159 1845140 2043821 2407375 2884216 3148161 3033757 2772237 2702440
34366B702440K08466L15959K04871m1588l16122n20791o08142n88906m57113j77776
$$ 2702440 2910906 3226865 3431736 3390148 3074026 2553235 1945093 1356187 899074 721298
34356G21298J84293M13115L32049M144l43804n49655n85883m70419k42593j3624
$$ 721298 905591 1318706 1650755 1654899 1311095 761440 175557 -294862 -537455 -551079
34346e51079R1093P8704R1571K16490L48881L04935N3711k12181k69981j20085
$$ -551079 -459986 -381282 -289711 -73221 275660 580595 634306 422125 152144 32059
34336C2059J3124k8097j19945m4800J62361K44534J12876k2477l524L9435k0469
$$ 32059 45183 17086 -102859 -147659 14702 259236 372112 349635 346111 385546 365077
34325C65077k7137J61454L03922R6029k54524k44110J26111K71330j01539n28660
$$ 365077 337940 499394 803316 899345 644821 400711 526822 798152 696613 167953
34315A67953m90325j51199O368l9282O7344L82472N82074N06227L28975J82512
$$ 167953 -322372 -473571 -467203 -506485 -439141 -56669 525405 1031632 1360607 1543119
34305A543119L5310l4519J08770K61664K1542n03448o25975m5777N61842M05517
$$ 1543119 1578429 1543910 1652680 1914344 1935886 1432438 806463 760686 1322528 1728045
34295A728045k82341n55194q2968M59053M28165M1777j49249j35598k88942n86582
$$ 1728045 1445704 890510 807542 1266595 1694760 1736537 1587288 1451690 1162748 576166
34285E76166n98253k43227J3683p6945r6149L50471Q69662P58283O3576m42624
$$ 576166 -22087 -265314 -251631 -328576 -424725 -74254 795408 1553691 1617267 1174643
34275A174643l61978j30180j92532l07965o7854L48025M54707K24372L2764O65
$$ 1174643 812665 682485 489953 181988 114134 462159 916866 1141238 1174002 1174667
34265A174667q0928k29583k00997K0751J43254P3501N6422J67426J20955j84582
$$ 1174667 1093739 864156 663159 683910 827164 900665 957087 1124513 1245468 1060886
34255A060886l58755j03230K32344J22825k93743l47757J84038O97390N67944
$$ 1060886 702131 598901 831245 954070 660327 312570 496608 1193998 1761942
34246A761942N282k63063j6976K07044l493k75807o3826M11718M52930J0661k10230
$$ 1761942 1767224 1504161 1487185 1694229 1690736 1414929 1351103 1762821 2215751 2226412 2016182
34235B016182R8869L75562K21658J13845M52661O42769L9193p40368n75251L74439
$$ 2016182 2115051 2490613 2712271 2826116 3278777 3921546 3960739 3220371 2645120 3019559
34225C019559Q58061M63970J07321L90660P18621N12934J93407K96322N52232
$$ 3019559 3877620 4341590 4448911 4839571 5558192 6071126 6264533 6560855 7113087
34216G113087N58796N58228P99689Q80890N34198L83538J027328J942083K232115
$$ 7113087 7671883 8230111 9029800 9910690 10444888 10828426 11855754 13797837 16029952
34207A6029952K009072K090855K712682L481410M304307N423640O768874Q193255
$$ 16029952 18039024 20129879 22842561 26323971 30628278 36051918 42820792 51014047
34199E1014047J0153280J3264103J7397456K2117416K7692266L4515998M1585666
$$ 51014047 61167327 74431430 91828886 113946302 141638568 176154566 217740232
34192B17740232M6633499M7803166M4354189L6175147K4109191J0573033k121843
$$ 217740232 264373731 312176897 356531086 392706233 416815424 427388457 425266614
34185D25266614j4511019k8984914m4911912n6619371n8286403n0140737l8129236
$$ 425266614 410755595 381770681 336858769 280239398 221952995 171812258 133683022
34178A33683022k7935938k0984929j5964863j1978862r121858p268464n780334
$$ 133683022 105747084 84762155 68797292 56818430 47696572 40428108 34647774
34171C4647774m327221l214965k767118k760051k634231k127582j532782j262536
$$ 34647774 30320553 27105588 24338470 21578419 18944188 16816606 15283824 14021288
34163A4021288j275052j152726p41818m00985m77544q19824j015601q87590n48484
$$ 14021288 12746236 11593510 10851692 10450707 9973163 9153339 8137738 7250148 6701664
34154F701664j77062N6429M1703j04430j11023O4537J58382K4520j62217k65382
$$ 6701664 6524602 6581031 6622734 6518304 6407281 6471818 6630200 6654720 6492503 6227121
34144F227121l84923n11261m01229o6646N1953k45349n04273l12079l000j22860
$$ 6227121 5842198 5330937 4929708 4863062 4915015 4669666 4165393 3853314 3850314 3727454
34134C727454n06532n16270l6169L79591L17980m5514l26901l46269j47286O0738
$$ 3727454 3220922 2704652 2668483 3048074 3366054 3320540 2993639 2647370 2500084 2560822
34124B560822R942k92353m45034j66152K45992L21466J00275j8685N5818P3237
$$ 2560822 2570764 2278411 1833377 1667225 1913217 2234683 2334958 2316273 2372091 2445328
34114B445328l3754r0469j02546k55161m89865n22876k95164j0370K33963M36680
$$ 2445328 2411574 2321105 2218559 1963398 1473533 950657 655493 645123 879086 1315766
34104A315766M02106k8535m90179m11682J18407L77448M2145l64337k95646N8617
$$ 1315766 1717872 1689337 1199158 787476 905883 1283331 1325476 961139 665493 724110
34094G24110J76783j9720j79507q6288J20148J98845Q2900o4835j8987K23107
$$ 724110 900893 881173 701666 615378 735526 934371 1017271 952436 933449 1156556
34084A156556L88484K94137J18819Q0375L9341k19156m95431m37428j61008o5534
$$ 1156556 1545040 1839177 1957996 2038371 2077712 1858556 1363125 925697 764689 699155
34074F99155j14941O7859L96776L33871j53211l81531j39M28034K98446j74173
$$ 699155 584214 652073 1048849 1382720 1229509 847978 847839 1275873 1574319 1400146
34064A400146m40649m43221m21585l25572j1515K78037K11037m8053p0114J54098
$$ 1400146 959497 516276 94691 -230881 -242396 35641 246678 198625 128511 282609
34054B82609K38186K6413k29983k83836j30442J20391L10552K35830j33199m86350
$$ 282609 520795 547208 317225 33389 -97053 23338 333890 569720 436521 -49829
34044d9829m76670j34423K11435L24331J97862n0122k25848j51193J04811K36300
$$ -49829 -526499 -660922 -449487 -125156 72706 22584 -203264 -354457 -249646 -13346
34034a3346R0687j49362k95768l77947l79680j26748L10362M94889K42295j9578
$$ -13346 77341 -72021 -367789 -745736 -1125416 -1252164 -941802 -446913 -204618 -224196
34024b24196J00186L34270K55762J9979L5800K12931J82007K3591Q2333K25098
$$ -224196 -124010 210260 466022 486001 521801 734732 916739 940330 1022663 1247761
34014A247761L5570l24788k43368K97928N82838K49251k01401k47924m4244N7771
$$ 1247761 1283331 958543 715175 1013103 1595941 1845192 1643791 1395867 1351623 1409394
34004A409394P8632J10154l0761m00546o05741l38198R6298K10641J5974j38652
$$ 1409394 1488026 1598180 1567419 1166873 561132 222934 319232 529873 545847 407195
33994D07195j54795j90558k55639k00527j5621J67153K78918K84313R4398k51355
$$ 407195 252400 61842 -193797 -394324 -409945 -242792 36126 320439 414837 163482
33984A63482m77316l88339j33839O1509K16906L91073M06451J20694k17988k56468
$$ 163482 -313834 -702173 -836012 -774503 -557597 -166524 239927 360621 142633 -113835
33974a13835m2179J06596J00378Q0658M9130r7640k43829j79985l887J9743m8827
$$ -113835 -156014 -49418 50960 131618 180748 83108 -160721 -340706 -344593 -324850 -373677
33963c73677O6306K84672K51065M0767J57759O20838P04185J1786p52596o88914
$$ -373677 -307371 -22699 228366 269133 426892 1047730 1751915 1763701 1011105 322191
33953C22191K0218M32751K32622J9504K00729L66290N7522m51752n93208l30310
$$ 322191 342409 775160 1007782 1027286 1228015 1594305 1651827 1200075 606867 276557
33943B76557p1334M751O4511J74583J85305O4796j7305R370L4974L4814J14330
$$ 276557 205223 209974 274485 449068 634373 699169 681864 691234 726208 761022 875352
33932H75352K28925J81979J0452L2773L31674N24495L13943l6041j16541k256
$$ 875352 1104277 1286256 1296708 1329481 1661155 2185650 2499593 2463552 2347011 2344755
33922B344755l2912j59902m2808K57773K63374j34789m22935k50329K5690m6768
$$ 2344755 2311843 2151941 2109133 2366906 2630280 2495491 2072556 1822227 1847917 1801149
33912A801149k71254j73416J60560J95872j87388n06497m18293j53073m2312m4928
$$ 1801149 1529895 1356479 1517039 1712911 1525523 1019026 600733 447660 405348 360420
33902C60420O455M1407m9978j12547L7264K42387K18818K6563l1654O9741M4124
$$ 360420 366875 408282 358304 245757 283021 525408 744226 770789 739135 808876 853000
33891H53000j83304k97515q6311K12233K68072J06619m8006j58129l04414l93446
$$ 853000 669696 372181 285870 498103 766175 872794 824788 666659 362245 -31201
33881c1201k75054p2214m0049j10929M2205M16756N45935J57928l52425m10282
$$ -31201 -306255 -378469 -418518 -529447 -487242 -70486 475449 633377 280952 -129330
33871a29330q923L54341L65974J74742J3582j03809k08881j85851M4972K99759
$$ -129330 -138253 216088 582062 756804 770386 666577 457696 271845 316817 616576
33861F16576K94011J9l06374l67034j99323M375J33329K08051K18773Q5291j48179
$$ 616576 910587 910606 604232 237198 37875 42250 175579 383630 602403 687694 539515
33850E39515k35694k6930K48900K34547m1245j83869k9521R2966j14236m10608
$$ 539515 303821 276891 525791 760338 719093 535224 505703 598669 484433 73825
33840G3825l44290O9113L40874J62357k24991l68207j14605K74022M00753J19886
$$ 73825 -270465 -201352 139522 301879 76888 -291319 -405924 -131902 268851 388737
33830C88737k70027k87275J61356N85431M70860p8004m94166m54716j48837J03716
$$ 388737 118710 -168565 -7209 578222 1049082 971078 476912 22196 -126641 -22925
33820b2925J73088M5822k30326m35677l05734J02117M02001L45438P0241j93401
$$ -22925 150163 195985 -34341 -470018 -775752 -673635 -271634 73804 144045 -49356
33810d9356l85766m55564k38786K56435O54754N78543J09438l22569m30788k74563
$$ -49356 -435122 -890686 -1129472 -873037 -218283 360260 469698 147129 -283659 -558222
33800e58222m7851J39994K72975L49902L43250K26162N2576l8632J3064P9282
$$ -558222 -606073 -466079 -193104 156798 500048 726210 778786 740154 753218 832500
33790H32500K8919m9210o868N2218j03581m15744n45991l37368K7981L54162N82020
$$ 832500 861419 812209 805341 857559 753978 338234 -207757 -545125 -517144 -162982 419038
33779D19038N87410K34919k68629m90794l75717k94519l57351k09084K48871N23772
$$ 419038 1006448 1241367 972738 481944 106227 -188292 -545643 -754727 -505856 17916
33769A7916L08961L3937J39354L34646J86992m4674Q9655K99417k382n64872n51148
$$ 17916 326877 360814 500168 834814 1021806 977132 1066787 1366204 1363822 798950 247802
33758B47802J23927O23559M55631N9992n5292L9633J73680M29072O71773M41984
$$ 247802 371729 995288 1450919 1510911 1455619 1495252 1668932 2098004 2769777 3211761
33748C211761k58758p02512m24537Q2706J49996j20052k20568r0198p990o005
$$ 3211761 2953003 2250491 1825954 1908660 2058656 1938604 1718036 1627838 1619848 1613843
33738A613843L1748j9515k60735l88536j33795J78855R6382j69275n8037L83384
$$ 1613843 1645591 1626076 1365341 976805 843010 1021865 1118247 948972 890935 1274319
33728A274319N48185K26681j57162l10471m07928n13643l07265L06903Q18267
$$ 1274319 1822504 2049185 1892023 1581552 1173624 659981 352716 659619 1477886
33719A477886P17290J66126k63451k93005j02391K9900l161j33558k12066j57536
$$ 1477886 2195176 2361302 2097851 1804846 1702455 1732355 1729194 1595636 1383570 1226034
33709A226034p0249r1997j49415k6935K65284M18716K23322j43813l42117k49765
$$ 1226034 1155785 1063788 914373 887438 1152722 1571438 1794760 1650947 1308830 1059065
33699A059065l3970N9982o0168k36278k13759J3399J17494j18190m07270l21282
$$ 1059065 1025095 1085077 1024909 788631 574872 588271 705765 587575 180305 -140977
33689a40977M6914J87722m4061k07129K0076L38909L04685k6026k37640j31596
$$ -140977 -94063 93659 49598 -157531 -137455 201454 506139 480113 242473 110877
33679A10877J23828K71123J67419j46463m02050l03185O1103K24069m0254l64450
$$ 110877 234705 505828 673247 526784 124734 -178451 -117348 106721 66467 -297983
33669b97983l18360k3896J18912R0734J81165L83576L71512R9839n1262J29497
$$ -297983 -616343 -640239 -521327 -430593 -249428 134148 505660 605499 554237 683734
33659F83734L51328K83277J4076j94834l36881n31164o48338m26228O4048L80390
$$ 683734 1035062 1318339 1332415 1137581 800700 269536 -378802 -805030 -740982 -360592
33649c60592K40383j12141k17936L1811L08418K93854L5727k06437l01832k78632
$$ -360592 -120209 -232350 -450286 -418475 -110057 183797 219524 13087 -288745 -567377
33639e67377j34002J39882L61613K73406o7170k66359j10875J35097J46964J9418
$$ -567377 -701379 -561497 -199884 73522 6352 -260007 -370882 -235785 -88821 -69403
33629f9403N0399K29381K85481J51472K6324J586l1642q5554k5338J20930J31521
$$ -69403 -19004 210377 495858 647330 673654 675240 643598 558044 532706 653636 785157
33618G85157k6252j03982r197j2925k95428n63609m29216L329K53234J07961j37178
$$ 785157 758905 654923 645726 632801 337373 -226236 -655452 -652123 -398889 -290928 -428106
33607d28106j11424J80511M28534M12538K17838P0845M1060j303j22901j78455
$$ -428106 -539530 -359019 69515 482053 699891 770736 811796 810493 687592 509137
33597E09137n6939P5983K4308o8725N6248K41860O6509l99688n24045m5566M41225
$$ 509137 452198 528181 552489 483764 540012 781872 848381 448693 -75352 -120918 320307
33586C20307L51045j0778j0697K33039Q6091m34009n65304j4004N09530L31199
$$ 320307 671352 660574 649877 882916 969007 534998 -30306 -44310 465220 796419
33576G96419k19819l82882p4342J50702J4642j86522j79993j09945j91142l09749
$$ 796419 576600 193718 119376 270078 284720 98198 -81795 -191740 -382882 -692631
33566f92631j99750J24747L19587J24364k57678l15471J54711P03072P19089K36592
$$ -692631 -892381 -767634 -448047 -323683 -581361 -896832 -742121 -39049 680040 916632
33556I16632q3388J27632M28215K52838k23316l67518n7091J86225M4044j61846
$$ 916632 833244 960876 1389091 1641929 1418613 1051095 994004 1180229 1224273 1062427
33546A062427p9557R3331r128k85913l48746j73524j18871l03071l88029j18100
$$ 1062427 982870 1076201 1067073 781160 432414 258890 140019 -163052 -551081 -669181
33536f69181K71092M10093L09436K29934K11043Q2863j02423m2237L08590N46612
$$ -669181 -398089 12004 321440 551374 762417 845280 742857 700620 1009210 1555822
33526A555822L55368l5667k12271j84361k69632m91000n21657k50260J5894L7805
$$ 1555822 1911190 1875523 1663252 1478891 1209259 718259 196602 -53658 -37764 41
33516D1k9537K2877J22193J37842J37546J65321O2055j87029k24445J65679N73046
$$ 41 -29496 -6619 115574 253416 390962 556283 618338 431309 206864 372543 945589
33505I45589M71196K8086j41349O8552J68069l2901j18468J34438K88121m0862
$$ 945589 1416785 1444871 1303522 1372074 1540143 1507242 1388774 1523212 1811333 1770471
33495A770471n09692n64155k43458K2767J15209J90267J76156j02539l94613k16156
$$ 1770471 1260779 696624 453166 475933 591142 781409 957565 855026 460413 244257
33485B44257L81581P71232N96427J85635m5334j47301l34131n09485m43809j89111
$$ 244257 625838 1397070 1993497 2179132 2133798 1986497 1652366 1142881 699072 509961
33475E09961J469K6906l4687j17739j66010p1017J65518L32792K92180K18696
$$ 509961 511430 538336 503649 385910 219900 148883 314401 647193 939373 1158069
33465A158069L07962L80867J17724l68963n75498k95006O9111M4942l01637n12917
$$ 1158069 1466031 1846898 1964622 1595659 1020161 725155 794266 839208 537571 24654
33455B4654l29054Q5832M17937M96448L35406O2361j56083k25109j96958j78631
$$ 24654 -304400 -218568 199369 695817 1031223 1093584 937501 712392 515434 336803
33445C36803j70226p8602J01125K21502J59780j0982j09334p1658n255j8300q4926
$$ 336803 166577 87975 189100 410602 570382 559400 450066 378408 373153 354853 269927
33434B69927j11426o1136L9164J49164K00877J07723r9778k07853n5951J74249
$$ 269927 158501 97365 136529 285693 486570 594293 494515 286662 230711 404960
33424D04960J16305k70546n66255m15480k550K14513J02978q6152j74304k30328
$$ 404960 521265 250719 -315536 -731016 -733566 -519053 -416075 -502227 -676531 -906859
33414i06859k66987j26232J72590K83250Q5l39872k47174K36674N88948N26102
$$ -906859 -1173846 -1300078 -1127488 -844238 -844153 -1184025 -1431199 -1194525 -605577 -79475
33404g9475L23338L07493L51177J27565l10630n26564k82504J23620K31862n136
$$ -79475 243863 551356 902533 1030098 719468 192904 -89600 34020 265882 260746
33394B60746j93441k7993L13839M12176J48763j63445k14934p5501j031j3897
$$ 260746 67305 39312 353151 765327 914090 750645 535711 460210 459179 445282
33384D45282Q0095K95142L73480J81119o2539j34386j68214l86707o17897m55245
$$ 445282 525377 820519 1193999 1375118 1312579 1178193 1009979 623272 5375 -449870
33374d49870R2680M97541M05728J02528K8468J15983r483l30054m13704j18682
$$ -449870 -357190 140351 546079 648607 677075 793058 783575 453521 39817 -78865
33364g8865J46248O1289j00289O0759L82944L67015k7143k81212q9114J94062
$$ -78865 67383 128672 28383 89142 472086 839101 811958 530746 441632 635694
33354F35694J01785k48348l39963p338L41758K90906n4295k45310p4945J88842
$$ 635694 737479 489131 149168 141830 483588 774494 720199 474889 399944 588786
33344E88786J64003j61834m01788k24964K33765M91914K44581k87279n70721l15421
$$ 588786 752789 590955 189167 -35797 197968 689882 934463 647184 76463 -238958
33334b38958K06596M29498J13866l49747l75165Q4150M32803J86512l70308n34504
$$ -238958 -32362 397136 511002 161255 -213910 -129760 303043 489555 119247 -415257
33324d15257r2329M35375M80759P5247l00157k92476K9978L17333K71141n6437
$$ -415257 -507586 -72211 408548 483795 183638 -108838 -78860 238473 509614 453177
33314D53177k75628j15569J77880J62381j13151j39562K41314N23381L00381q9834
$$ 453177 177549 61980 239860 402241 289090 149528 390842 914223 1214604 1124770
33304A124770j00037J77608K06988j34132m18345l42282o8358J32919J84735R3462
$$ 1124770 1024733 1202341 1409329 1275197 856852 514570 446212 579131 763866 857328
33294H57328j24146l35111l77311k78333j64853j5801K25601L94488K94999O3696
$$ 857328 733182 398071 20760 -257573 -422426 -438227 -212626 181862 476861 540557
33284E40557j8345J3698o6630j94523j24338N4364L3868j22571p7207J18141R2397
$$ 540557 522212 535910 469280 274757 150419 204783 238651 116080 38873 157014 249411
33273B49411r1868J5297L47364K75153k95353o25895l31158r247j53403k75919
$$ 249411 157543 172840 520204 795357 500004 -125891 -457049 -466296 -619699 -895618
33263h95618J48381O05983L28396l75474n40107J6731N76602O44351L68311q656
$$ -895618 -747237 -141254 187142 -188332 -728439 -711708 -135106 509245 877556 868900
33253H68900l46915l86241m3715K08211m8922m10620k48790J81339J42568k72306
$$ 868900 521985 135744 92029 300240 251318 -159302 -408092 -226753 -84185 -356491
33243c56491k73280K25381M33674M3152l13626k11987k5237l4609O7429L74453
$$ -356491 -629771 -404390 29284 72436 -241190 -453177 -478414 -513023 -445594 -71141
33233g1141M09026M3087j26019J59898K72343j88799o06381l73902R6426J71928
$$ -71141 337885 380972 254953 414851 687194 498395 -107986 -481888 -385462 -213534
33223b13534O9156K78988N68601M44388O5713j63934l81701p58190p72744j5439
$$ -213534 -144378 134610 703211 1147599 1213312 1049378 667677 -90513 -863257 -878696
33213h78696P75751O13753j58287l78159Q8691K90425r2061k99155N2518L28348
$$ -878696 -102945 510808 352521 -25638 63053 353478 261417 -37738 14780 343128
33203C43128P7599k26775j44445q63j15665j51218J72473M54895L18277P6141
$$ 343128 420727 193952 49507 48644 -67021 -218239 -45766 409129 727406 803547
33193H03547Q9695Q2369k39799m66736j50657K72094P7574n14749n85292R1016
$$ 803547 893242 975611 735812 269076 118419 390513 468087 -46662 -631954 -540938
33183e40938P16223O44066J77689o1387p363j9147k11196l18266j39382J70541
$$ -540938 175285 819351 997040 935653 928290 909143 697947 379681 240299 410840
33173D10840L03487J57668r0225k38021k80549l18107l36971k34982l8554Q1387
$$ 410840 714327 871995 781770 543749 263200 -54907 -391878 -626860 -665414 -584027
33163e84027L4360r3169j73134j23097J05407M23552N32756K32868j94099k31384
$$ -584027 -549667 -642836 -815970 -939067 -833660 -410108 122648 355516 161417 -69967
33153f9967J74326M96859L32611j19976m53406n72622n64905l66991P4091M98100
$$ -69967 104359 601218 933829 813853 360447 -212175 -777080 -1144071 -1069980 -571880
33143e71880N57955K76232j2112j12759j05945q1044j7080N7340L1507q9677j38307
$$ -571880 -13925 262307 250195 137436 31491 -49553 -66633 -9293 22214 -67463 -205770
33132b05770k1243J29899J47415O8110N2698J05893N0196j58004k66064p6562
$$ -205770 -227013 -97114 50301 118411 171109 277002 327198 169194 -96870 -173432
33122a73432J61000L1340l81146n10943j33259K67349K39613M7877J58862M11327
$$ -173432 -12432 18908 -362238 -873181 -1006440 -739091 -499478 -451601 -292739 118588
33112A18588L04131j12667l12775j71334p5546j45870n3924K60078L80552J48729
$$ 118588 422719 310052 -2723 -174057 -249603 -395473 -449397 -189319 191233 339962
33102C39962l6164Q5004K33714J81099J28613J80257N9023k65871l12972P6460
$$ 339962 303798 388802 622516 803615 932228 1112485 1171508 905637 592665 669125
33092F69125K85652j06702n27908l14281J38670J6166n12516n24901J62027P02687
$$ 669125 954777 848075 320167 5886 144556 160722 -351794 -876695 -714668 -11981
33082a1981N11283m043k13833q0809Q7784J61017J47351J5130j93694l20709k96057
$$ -11981 499302 495259 281426 200617 288401 449418 596769 611899 418205 97496 -198561
33071a98561j79264K228J92194J65474j79955m62960k14213L70726N81929J91111
$$ -198561 -377825 -375597 -183403 -17929 -197884 -660844 -875057 -504331 77598 268709
33061B68709k15975j04756K74616L25066p2895n21567o77293n31488k21366J47338
$$ 268709 52734 -52022 222594 547660 474765 -46802 -724095 -1255583 -1476949 -1329611
33051a329611M57956N46073L26273n2092k71183j74611J5821n626j47482l6668
$$ -1329611 -871655 -325582 691 -51401 -322584 -497195 -481374 -487000 -634482 -671150
33041f71150L32306M73923J47698k06053j16551K15072L12923J87998J58508J71226
$$ -671150 -338844 135079 282777 76724 -39827 175245 488168 676166 834674 1005900
33031A005900p0634m34333m45325m0365L16183K92642j893l38241n21695l05681
$$ 1005900 935266 500933 55608 15243 331426 624068 622175 283934 -237761 -543442
33021e43442L02429P08734L18502n37891q96845m45229J31395K08117l4938j59203
$$ -543442 -241013 467721 786223 248332 -648513 -1093742 -962347 -754230 -789168 -948371
33011i48371j37511j32418q6923R5582K78118K67804N3903k31344l65758j14883
$$ -948371 -1085882 -1218300 -1305223 -1209641 -931523 -663719 -609816 -841160 -1206918 -1321801
33001a321801M09451O25405J91233l54801k86639J79248K46259j15316j74571
$$ -1321801 -912350 -286945 -95712 -450513 -737152 -557904 -311645 -426961 -601532
32992f01532J97386K88119j17830l13116J9691K11609j16458l01109J16977M61748
$$ -601532 -404146 -116027 -233857 -546973 -527282 -315673 -432131 -733240 -616263 -154515
32982a54515J15643l37805j75685J49105j02316n13742k32537M46765N41123L6881
$$ -154515 -38872 -376677 -552362 -403257 -505573 -1019315 -1251852 -805087 -263964 -227083
32972b27083k14834j2606O5390q8433Q511L15811K53193j30858j45055K52360
$$ -227083 -441917 -454523 -389133 -477566 -469055 -153244 99949 -30909 -175964 76396
32962G6396L03814j77445m22366l4869L60053K31258p0241j24670j47042l42791
$$ 76396 380210 202765 -219601 -254470 105583 336841 266600 141930 -5112 -347903
32952c47903l75235m4364K24357J22846J3803J96038K93646j9347l22883j49003
$$ -347903 -723138 -767502 -543145 -420299 -406496 -210458 83188 63841 -259042 -408045
32942d08045J80796J25551j38911r8483J49241R1457k69571m07247j16711K37585
$$ -408045 -227249 -101698 -240609 -339092 -189851 -98394 -367965 -775212 -891923 -654338
32932f54338L18473J82334L4888j7484K4884N0453q2282k88828k81008j7386J67845
$$ -654338 -335865 -153531 -118643 -136127 -111243 -60790 -143072 -431900 -712908 -730294 -562449
32921e62449J07618R6583L30916M64597J56239l07802m38960k86254k13113k06561
$$ -562449 -454831 -358248 -27332 437265 593504 285702 -153258 -439512 -652625 -859186
32911h59186l204K90855L20860J05602m8767j46918l96302n88981k96550K93524
$$ -859186 -862390 -571535 -250675 -145073 -193840 -340758 -737060 -1326041 -1622591 -1329067
32901a329067M74325J05259j30512J61914M34344J14642m29070m64792k0612K55962
$$ -1329067 -854742 -749483 -879995 -718081 -283737 -169095 -598165 -1062957 -1083569 -827607
32891h27607J44274N9250K31761L25962N6538l07517l42786n1490K47705L88080
$$ -827607 -683333 -624083 -392322 -66360 -9822 -317339 -660125 -711615 -463910 -75830
32881g5830M23815L71955J88478l3595j07151k8467n482j46458k92647k48336
$$ -75830 347985 719940 908418 874823 767672 739205 733723 587265 294618 46282
32871D6282m4195J22579J13669n7214k62598l33847j96163K1956J26041J15594
$$ 46282 2087 124666 238335 181121 -81477 -415324 -611487 -589531 -463490 -347896
32861c47896J33454J52955L822k11061j08995L31359N24812P9898m93131m23270
$$ -347896 -214442 -61487 -57665 -268726 -377721 -46362 478450 558348 65217 -358053
32851c58053J85055M96749J68039k49408k29264M8620J84587J69907J74655J65467
$$ -358053 -172998 323751 491790 242382 13118 61738 246325 416232 590887 756354
32841G56354Q6000O4998J27715M1395k38659l31306j0742L15439J62478k53978
$$ 756354 842354 907352 1035067 1076462 837803 506497 495755 811194 973672 719694
32831G19694k94708J82774O55732O63341L04495l0373j19847k7460O1176N9483
$$ 719694 424986 607760 1263492 1926833 2231328 2200955 2081108 2053648 2114824 2174307
32821B174307P6547K21821L35058J53730k15474l50129j65448q6691l31857m95010
$$ 2174307 2250854 2472675 2807733 2961463 2745989 2395860 2230412 2143721 1811864 1316854
32811A316854k21532J63218K06937R6191K41930M39388J94958l05229l79827J7254
$$ 1316854 1095322 1258540 1465477 1561668 1803598 2242986 2437944 2132715 1752888 1770142
32801A770142J79697j97348n36827l49732J7966L6030j83107k17038p2700m9639
$$ 1770142 1949839 1752491 1215664 865932 883898 919928 736821 519783 447083 397444
32791C97444j27598k1819K57835L62471J30925j83180k80946j80006j11934j90100
$$ 397444 269846 248027 505862 868333 999258 816078 535132 355126 243192 53092
32781E3092k83744k12678r818J00189K0482n7996M3698J73901P9225j31135o3875
$$ 53092 -230652 -443330 -453148 -352959 -332477 -390473 -346775 -172874 -93649 -224784 -288659
32770b88659L95626Q79995R59236N43182j38129p00328p70623l16570J66755J49354
$$ -288659 106967 986962 1946198 2489380 2351251 1650923 880300 563730 730485 879839
32760H79839k21636l19599j3404J02695k96617o15870j85367O46860R19743L91680
$$ 879839 658203 338604 325200 427895 131278 -484592 -669959 -23099 896644 1288324
32750A288324j90566k04305P3329N9958k30680l21662r0238M4454j78611l79919
$$ 1288324 1097758 893453 966782 1026740 796060 474398 384160 428614 250003 -129916
32740a29916o3726N74450P94525L18177k37635k07826J81463J82980l33723o89349
$$ -129916 -193642 380808 1175333 1493510 1255875 1048049 1229512 1412492 1078769 389420
32730C89420m05495J34687K94030L3554j94744j34657O4063J78752J36671k9296
$$ 389420 -16075 118612 412642 446196 251452 116795 180858 359610 496281 466985
32720D66985k06248k37922j19598o6898k06552l11154p4088M15964P15493N46619
$$ 466985 260737 22815 -96783 -163681 -370233 -681387 -755475 -339511 375982 922601
32710I22601R2919k49946k82580j29705n0320j55658l01183k76189p3016J26333
$$ 922601 1015520 765574 482994 353289 302969 147311 -153872 -430061 -503077 -376744
32700c76744K10813K34220K41081J88417Q4092J332r6238l06748m96721l54594
$$ -376744 -165931 68289 309370 497787 581879 583211 486973 180225 -316496 -671090
32690f71090J09992M27262K63764j09971k25015m4638J29800J69562J63895J08419
$$ -671090 -561098 -133836 129928 19957 -205058 -249696 -119896 49666 213561 321980
32680C21980n6942j87336r6490P2656K6403j59590j08650K41344N04862M19266
$$ 321980 265038 77702 -18788 53868 80271 -79319 -187969 53375 558237 977503
32670I77503J51828q8996l39598n75358n21299r0503L03265K63148K6005J23647
$$ 977503 1129331 1040335 700737 125379 -395920 -486423 -183158 79990 105995 229642
32660B29642N27754O14157O3620o22182p47007k93821J29137R3876k01544l06766
$$ 229642 757396 1371553 1435173 812991 65984 -227837 -98700 -4824 -206368 -513134
32650e13134q2045K33321L61346K46420M3686l5871R2686K73404K31014r5794
$$ -513134 -595179 -361858 -512 245908 289594 253723 346409 619813 850827 755033
32640G55033m10278l75791j8566L38986M82484M39652K61061m6986l28953l28153
$$ 755033 344755 -31036 -49602 289384 771868 1211520 1472581 1425595 1096642 768489
32630G68489p3964M9367j69124m01341k18594K64969N12047K74271j26553k74040
$$ 768489 694525 743892 574768 173427 -45167 219802 731849 1006120 879567 605527
32620F05527j50271k3636k0277n407J26293K10511L515m07270n71519k01778L92019
$$ 605527 455256 431620 411343 405936 532229 742740 746255 338985 -232534 -434312 -42293
32609d2293O22124L24818j19342l51309l95345l85556k76410q209L00179N02736
$$ -42293 579831 904649 785307 433998 38653 -346903 -623313 -631522 -331343 171393
32599A71393N57348M07135K4120l33232l02398j5066l3246m39219n66880o5645
$$ 171393 728741 1135876 1159996 826764 524366 509300 476054 36835 -530045 -595690
32589e95690L86903J02354m29567k64370M38169O30025N3301m00341j80003J31716
$$ -595690 -208787 -106433 -536000 -800370 -362201 267824 321125 -79216 -259219 -127503
32579a27503o8338m22619l46635k0408M0941j11298o9920J72465L01970K65958
$$ -127503 -195841 -618460 -965095 -985503 -944562 -1055860 -1125780 -953315 -651345 -385387
32569c85387K34604J94548O7690K3198J98087L13559N5122l45137m03634j25420
$$ -385387 -150783 43765 111455 134653 332740 646299 701421 356284 -47350 -172770
32559a72770M4238q6214k87572l76551l87302l01958m5281K45975L32035K42680
$$ -172770 -128532 -214746 -502318 -878869 -1266171 -1568129 -1613410 -1367435 -1035400 -792720
32549g92720J96773K07285J29550J2852l074l6626k42011l49699k290M95841M32831
$$ -792720 -595947 -388662 -259112 -246260 -249334 -285960 -527971 -877670 -879960 -384119 48712
32538D8712k15766o35288l40384J72809K90698J67227K50129M44057L59374N9886
$$ 48712 -167054 -802342 -1142726 -969917 -679219 -511992 -261863 182194 541568 601454
32528F01454n8697M1436L5507j59118k71116j57746J6380R6314Q5392k4138k47651
$$ 601454 542757 584193 619700 460582 189466 31720 48100 144414 229806 205668 -41983
32517d1983m30003l66229j10340R5321J79776K68214L75482L58310J78149l6596
$$ -41983 -471986 -838215 -948555 -853234 -673458 -405244 -29762 328548 506697 470101
32507D70101j81319k10553n9029K11027K94025O616l33262k91030R823Q2510r7608
$$ 470101 288782 78229 19200 230227 524252 530868 197606 -93424 -83601 -1091 -98699
32496i8699o1192K73615L51799j03028n39794l91476O1630J71484j08318l04884
$$ -98699 -159891 113724 465523 362495 -177299 -568775 -507145 -335661 -443979 -748863
32486g48863k20465o4219O0121K39403L83443K78703O263j27986p0236k4356k4018
$$ -748863 -969328 -1033547 -973426 -734023 -350580 -71877 -65614 -193600 -263836 -288192 -312210
32475c12210P0050J79754P9849j37867j38084R2802K22555J41090N4298j5205
$$ -312210 -242160 -62406 17443 -120424 -258508 -165706 56849 197939 252237 237032
32465B37032k45884m65281k48224K49685K82159l25583p32497l08325L67337M06941
$$ 237032 -8852 -474133 -722357 -472672 -190513 -516096 -1248593 -1556918 -1189581 -782640
32455g82640m0619j63567J70319L40643R7959j02342N4543K96157L19425K04555
$$ -782640 -823259 -986826 -816507 -475864 -377905 -480247 -425704 -129547 189878 394433
32445C94433R6908l8997j84553j91375o3051L3016P1266J25323O4503k47366m88461
$$ 394433 491341 452344 267791 76416 13365 46381 117647 242970 307473 60107 -428354
32434d28354j79951M91713P46623K64051l92412o02788m07125j56339K6666J38473
$$ -428354 -608305 -116592 630031 894082 501670 -101118 -508243 -664582 -637916 -499443
32424d99443J09402J8555P8380J87767o075l86842l31430K77108O79542L67416
$$ -499443 -390041 -371486 -293106 -105339 -111414 -498256 -829686 -552578 126964 494380
32414D94380r9654m7150J87239q0421n90337n11227J60620N84543L94869Q4066
$$ 494380 394726 347576 534815 454394 -135943 -647170 -486550 97993 492862 576928
32404E76928L137j07213l84119m73430k08832L6264P623l2277J15305K01643P2083
$$ 576928 580065 472852 88733 -384697 -593529 -557265 -549642 -581919 -466614 -264971 -192888
32393a92888J5369J85625K29612p1905l23009j78981K796k24667n55660l93261
$$ -192888 -177519 8106 237718 165813 -157196 -336177 -333381 -558048 -1113708 -1506969
32383a506969J33032L46766R2760r5589Q4787K84450J45785j83685l96246m41308
$$ -1506969 -1373937 -1027171 -934411 -1030000 -945213 -660763 -514978 -698663 -1094909 -1536217
32373a536217l74131j65130Q8633P1149l45482p97379p93457k83633L20289O15417
$$ -1536217 -1910348 -2075478 -1986845 -1915696 -2261178 -3058557 -3852014 -4135647 -3815358 -3199941
32363c199941N59625M04369L79636M48913L89673J48470p456J37355L42968J87817
$$ -3199941 -2640316 -2235947 -1856311 -1407398 -1017725 -869255 -876711 -739356 -396388 -208571
32353b08571k71884m78491j21796M20692N98376L76229J49836J58620K63544K23177
$$ -208571 -480455 -958946 -1080742 -660050 -61674 314555 464391 623011 886555 1109732
32343A109732l4261l71832n31378l36707P6224L52012L40461K42872K10778Q0815
$$ 1109732 1075471 703639 172261 -164446 -88222 263790 604251 847123 1057901 1138716
32333A138716k45337m59062k75170K6508k6863l34555l79542r4819M9587j02193
$$ 1138716 893379 434317 159147 185655 158792 -175763 -555305 -650124 -600537 -702730
32323g02730j13207K41656N24703L63045O3663K6414M4098k27616n13446l20149
$$ -702730 -815937 -574281 -49578 313467 377130 403544 447642 220026 -293420 -613569
32313f13569J72247L41759J03977o1218j697n3982k52933j58382L04180N47649
$$ -613569 -441322 -99563 4414 -56804 -58501 -112483 -365416 -523798 -219618 328031
32303C28031K20932k13420k18516L5433J06088L7191J39139L50229L73210K27541
$$ 328031 548963 335543 117027 152460 258548 295739 434878 785107 1158317 1385858
32293A385858J50072J07481j01129l66127l62752p6010J81140K38940J89227Q1317
$$ 1385858 1535930 1643411 1542282 1176155 813403 737393 918533 1157473 1346700 1428017
32283A428017j22566l09418k95303j46668j00050j75807j89631j16708r9621j11520
$$ 1428017 1305451 996033 700730 554062 454012 278205 88574 -28134 -127755 -239275
32273b39275J9493K31244K45817K8359j26599n8640M0508j1082j08563q8001J6842
$$ -239275 -219782 11462 257279 285638 159039 100399 140907 129825 21262 -66739 -49897
32262d9897Q0977N9893l1086j37006j36955J3506J41199R0860K7764J78469L43815
$$ -49897 31080 90973 59887 -77119 -214074 -200568 -59369 31491 59255 237724 581539
32251E81539J21409l67890n01603o5627L71830K84142p4985j53499M1659O0147
$$ 581539 702948 335058 -166545 -232172 139658 423800 348815 195316 236975 297122
32241B97122k11833l79325j41951K92784M82479K44079j74633l39520q0084K80518
$$ 297122 85289 -294036 -435987 -143203 339276 583355 408722 69202 -10882 269636
32231B69636K80626o7212k58948m481L36037K55064j94521n02444l79923k2344
$$ 269636 550262 483050 224102 219621 555658 810722 616201 113757 -266166 -288510
32221b88510K60907L85540M09615L29720R5378k29777m24645l07564J0690J88891
$$ -288510 -27603 357937 767552 1097272 1192650 962873 538228 230664 241354 430245
32211D30245O8105j23047j49700j61091l80368n83618l70575J13029L00555J06782
$$ 430245 498350 375303 225603 64512 -315856 -899474 -1270049 -1157020 -856465 -749683
32201g49683P0030M06180N96958K76320j25087j26024N661j64475l61836q0855
$$ -749683 -679653 -273473 323485 599805 474718 348694 354355 189880 -171956 -252811
32191b52811M17234M35520j158j69148J83834M89125K95245j50222m38289m90306
$$ -252811 164423 599943 598785 429637 613471 1102596 1397841 1247619 809330 319024
32181C19024l05874J79294P06926P07675M8652o41573p23194k91162J00581J42046
$$ 319024 13150 192444 899370 1607045 1655697 1014124 290930 -232 100349 242395
32171B42395p3024k99018k85144Q0899N39372N99041J26357m18863n22142j79402
$$ 242395 169371 -129647 -414791 -333892 205480 804521 930878 512015 -10127 -189529
32161a89529K24938L66021J59827k41826m76562k48828K65469N52598M15826J70238
$$ -189529 35409 401430 561257 319431 -157131 -405959 -140490 412108 827934 998172
32151I98172O1985p2103l30844m11032j35108R8191j05028m19994k57079K64265
$$ 998172 1060157 988054 657210 246178 111070 209261 104233 -315761 -572840 -308575
32141c08575M38539M9084l06372j17275L41737M93860K51540k6019j29593j69849
$$ -308575 129964 179048 -127324 -244599 97138 590998 842538 816519 686926 517077
32131E17077k12478j03847K07679M12203J67313l54298n43165j24051M00192L64901
$$ 517077 304599 200752 408431 820634 987947 633649 90484 -33567 366625 731526
32121G31526j59643m88175k91084L3018O3645n3452L143J68247J95914J22752
$$ 731526 571883 83708 -207376 -174358 -110713 -164165 -161022 7225 203139 325891
32111C25891J24109J34117O452j30526p4218N9435M1868l2007N2956J50099k2561
$$ 325891 450000 584117 590569 460043 385825 445260 487128 455121 508077 658176 635615
32100F35615k81822j82729J92312K69586q8437l28356j16646J10514r6370m21464
$$ 635615 353793 171064 363376 632962 544525 216169 99523 210037 113667 -307797
32090c07797l01089J40376K82014k7084k82251j20343J98030K48092J5580j92937
$$ -307797 -608886 -468510 -186496 -213580 -495831 -616174 -418144 -170052 -154472 -347409
32080c47409j88020m4775P7569J08861Q6319P5721Q6010P5953N4667R8105J97821
$$ -347409 -535429 -580204 -502635 -393774 -307455 -231734 -145724 -69771 -15104 83001 280822
32069B80822J86719n1293l53651m20855j82134J20043K24739J11054n1084r0896
$$ 280822 467541 416248 62597 -358258 -540392 -420349 -195610 -84556 -135640 -226536
32059b26536L7499K06860J93243o8243l16172k39581O3282J61672p0186j98194
$$ -226536 -189037 17823 211066 142823 -173349 -412930 -349648 -187976 -258162 -456356
32049d56356J35266N85707N25558l8907m53595l46783o7379j3552k8078J63863
$$ -456356 -321090 264617 790175 751268 297673 -49110 -116489 -130041 -158119 5744
32039E744L25595O0360m26585n13102p8565L19217K76570L8475l1261m416j05858
$$ 5744 331339 391699 -34886 -547988 -626553 -307336 -30766 7709 -23552 -27968 -133826
32028a33826k38346j60376P8569K17744J71602O7124n334n9535j14290j75546
$$ -133826 -372172 -532548 -453979 -236235 -64633 2491 -2843 -62378 -176668 -352214
32018c52214k10289p0266L35372P14838N90430N06l98285k20199Q8836o722k68352
$$ -352214 -562503 -632769 -297397 417441 1007871 1008377 610092 389893 478729 472007 203655
32007B03655j49242K32651L19919J06933R7823L22759K37572k69896n77967k98157
$$ 203655 54413 287064 606983 713916 811739 1134498 1372070 1102174 524207 226050
31997B26050J72394L76248L86125L11076p5441p18415r54169m20748K58379L67051
$$ 226050 398444 774692 1160817 1471893 1396452 678037 -276132 -696880 -438501 -71450
31987g1450J61202K80230N54743L35524k54210m11956K3232L17391O5466k35222
$$ -71450 89752 369982 924725 1260249 1006039 594083 617315 934706 1000172 764950
31977G64950j39678L6120r0025k50900o1337K53446K42186k5655j49478o7782
$$ 764950 625272 661392 571367 320467 259130 512576 754762 729107 579629 511847
31967E11847k1981n0170j1124K9693q7012k12383o6339K30859K67611j124j58116
$$ 511847 489866 439696 428572 458265 371253 158870 92531 323390 591001 589877 431761
31956D31761J9031K27315J45084q7840j50212m4822l4999k03960l37254k23976
$$ 431761 450792 678107 823191 735351 585139 540317 505318 301358 -35896 -259872
31946b59872R4227L85565M49794K85163Q5954M8785J56417K09465R6543n3533
$$ -259872 -165645 219920 669714 954877 1040831 1089616 1246033 1455498 1552041 1498508
31936A498508m9513J04501K16612J51496o81k3069J61810L43963K20623k05225
$$ 1498508 1448995 1553496 1770108 1921604 1920923 1897854 2059664 2403627 2624250 2419025
31926B419025n24286l75161O2374K59769L9234k04172j09347J17905O3493k10750
$$ 2419025 1894739 1519578 1581952 1841721 1880955 1676783 1567436 1685341 1748834 1538084
31916A538084k44829R3122L68682J93558k50417n00934l89781j07100J17074J55101
$$ 1538084 1293255 1386377 1755059 1948617 1698200 1197266 807485 700385 817459 972560
31906I72560l6880l14429l50298l9610K14362j0958m42830l58304L65081R42228
$$ 972560 935680 621251 270953 231343 445705 434747 -8083 -366387 -1306 940922
31896I40922O98205l4667m43151l23279j25541j15216j03791j4947j05177m30299
$$ 940922 1639127 1604460 1161309 838030 712489 597273 493482 478535 373358 -56941
31886e6941o06542l96511j14134r7607j43763R8533M48121M22512K2455k36627
$$ -56941 -663483 -1059994 -1174128 -1271735 -1415498 -1316965 -868844 -446332 -423877 -660504
31876f60504q8028J62156J71270O806j02141j12112p5839N104N4316q3348l35606
$$ -660504 -748532 -586376 -415106 -408300 -510441 -622553 -698392 -693288 -638972 -722320 -1057926
31865a057926l68373o4844K49181L03869K88681M18755M28509K771n09411m44206
$$ -1057926 -1426299 -1491143 -1241962 -938093 -649412 -230657 197852 200623 -308788 -752994
31855g52994J44552M57288J04214l31749k06273K52116L91437J24627j00185r8716
$$ -752994 -608442 -151154 -46940 -378689 -584962 -332846 58591 183218 83033 -15683
31845a5683j22223k67032k64856J9828L15387L39457J45988p4936k40907k63624
$$ -15683 -137906 -404938 -669794 -649966 -334579 4878 150866 75930 -164977 -428601
31835d28601q894M00839N23764J33037l88086m97128j89579Q5591J02039O4874
$$ -428601 -437495 -36656 487108 620145 232059 -265069 -454648 -369057 -267018 -202144
31825b02144J44264J90812N2347j27443j27959K4863J42342J43362P7269n935
$$ -202144 -57880 132932 185279 57836 -70123 -45260 97082 240444 317713 311778
31815C11778n3865O759J24764P6411k36817n35410m53453m9236K40899J84991
$$ 311778 257913 264672 389436 465847 229030 -306380 -759833 -809069 -568170 -383179
31805c83179J4094j214M9300m4492j85613r3052K18776L92190K06911j33023k93065
$$ -383179 -369085 -370299 -320999 -365491 -551104 -644156 -425380 -33190 173721 40698 -252367
31794b52367k02381l0893P6166Q6967J0747r6562j13043L890R4488p550j78150
$$ -252367 -454748 -485641 -409475 -322508 -311761 -408323 -521366 -517476 -422988 -430538 -608688
31783f08688j19683J74175L05648r561m84229n63607j23530L89995N41671L77617
$$ -608688 -728371 -554196 -248548 -258109 -742338 -1305945 -1429475 -1039480 -497809 -120192
31773a20192K02201J05826n4656k97713l94956j63262K71253N83183N56676K50158
$$ -120192 82009 187835 133179 -164534 -559490 -722752 -451499 131684 688360 938518
31763I38518q6024k30986j81284j24633j88472k64783j83121m42N9245m7990j18597
$$ 938518 852494 621508 440224 315591 127119 -137664 -320785 -321227 -261982 -309972 -428569
31752d28569n0101j9424j54042k41873k2055L72239N53931M08400J87500Q2580
$$ -428569 -478670 -498094 -652136 -894009 -916064 -543825 10106 418506 606006 688586
31742F88586P742j27139k24185k17421k32844l44738l78061j71162J18583K05943
$$ 688586 696328 569189 345004 127583 -105261 -449999 -828060 -999222 -880639 -674696
31732f74696P4560m5552l0561L6114Q2325J35415J79483J38118M3844L1715J03316
$$ -674696 -600136 -645688 -676249 -640135 -557810 -422395 -242912 -104794 -60950 -29235 74081
31721G4081R0215n2614j14252M4977J94753J3066l95009n46292k27673J64772
$$ 74081 164296 111682 -2570 42407 237160 250226 -144783 -691075 -918748 -753976
31711g53976J47817j62314k10988J73722N04627L48591k9332q6531J54273J67536
$$ -753976 -606159 -768473 -979461 -805739 -301112 47479 18147 -68384 85889 253425
31701B53425j98882m35317j45192L36618M33005J20291j55599j60237n3954J4622
$$ 253425 54543 -380774 -525966 -189348 243657 363948 208349 48112 -5842 8780
31691H780Q8263J55834P7792j56624l53747l70681k41464k3136K54135M50481
$$ 8780 97043 252877 330669 174045 -179702 -550383 -791847 -814983 -560848 -110367
31681a10367L79973Q8001j48975j71492q0937J5345J56129L20370L09082L253
$$ -110367 269606 357607 208632 37140 -43797 -28452 127677 448047 757129 760382
31671G60382m10497o13362m59909n4967L41221M54647K19404j02400j97606r6970
$$ 760382 349885 -263477 -723386 -778353 -437132 17515 236919 134519 -63087 -160057
31661a60057o4159j24173n2121J41494J59659q287M1652M05107N23320J2903n88568
$$ -160057 -224216 -348389 -400510 -259016 -99357 -107644 -65992 339115 862435 875338 286770
31650B86770n10953R6317L83540M9682l43502l48094k07521k28881k14208Q0657
$$ 286770 -224183 -127866 255674 305356 -38146 -386240 -593761 -822642 -1036850 -956193
31640i56193L87159K98680q0856l06802k33322p9285K1836J37189K47619K25351
$$ -956193 -569034 -270354 -351210 -658012 -891334 -970619 -948783 -811594 -563975 -338624
31630c38624J18908J16419J69905Q935l42464m25569R430N08485M52928n3709
$$ -338624 -219716 -103297 66608 75543 -266921 -692490 -683060 -174575 278353 224644
31620B24644k89832Q1054N68196N80270J78693j87867l45560l88645k95701o0025
$$ 224644 -65188 15866 584062 1164332 1343025 1155158 809598 420953 125252 65227
31610F5227o103l66902o42410j19501Q81569J112131J04893j008460r86107j16078
$$ 65227 59124 -307778 -950188 -1069689 -188120 924011 1028904 20444 -965663 -1081741
31600a081741M12832K55530N8096J42541J13928j79668k77055M6701L63120L36415
$$ -1081741 -668909 -413379 -355283 -212742 -98814 -278482 -555537 -508836 -145716 190699
31590A90699J93852J39956j9938l17332l60696o5447K4707l39845n35200n7388
$$ 190699 384551 524507 504569 187237 -173459 -238906 -214199 -554044 -1089244 -1146632
31580a146632N16922L74386k06788l01697J82688M65521K38686N8981K62796M04020
$$ -1146632 -629710 -255324 -462112 -763809 -581121 -115600 123086 182067 444863 848883
31570H48883R5421l43906m92053m70481n41552n41448j92054L44493O49879N85271
$$ 848883 944304 600398 108345 -362136 -903688 -1445136 -1637190 -1292697 -642818 -57547
31560e7547L33552R5940j4519K5158O3393q9584l10348k50655Q3202K36236J1833
$$ -57547 276005 371945 357426 382584 445977 356393 46045 -204610 -121408 114828 126661
31549A26661j74336R228K04236n4534m99515m68127J05499O20084O57360L72386
$$ 126661 -47675 -38447 165789 111255 -388260 -856387 -750888 -130804 526556 898942
31539H98942N4797j91934k89650j62594L8388O0241o6590j20789j26352k52580
$$ 898942 953739 761805 472155 309561 347949 408190 341600 220811 94459 -158121
31529a58121l23769L360N22914N82430Q3630k81756j06335R6445j92925n78491
$$ -158121 -481890 -478530 44384 626814 710444 428688 322353 418798 225873 -352618
31519c52618m08835J22655L17696J04820L372J11772j592l67219m21146M3333
$$ -352618 -761453 -638798 -321102 -216282 -212910 -101138 -102730 -469949 -891095 -847762
31509h47762M74624M30511J93744J39259R0966j99864m41190k51001J29242J69911
$$ -847762 -373138 57373 251117 390376 481342 281478 -159712 -410713 -281471 -111560
31499a11560j18632k64950j13649K6409k5775q5834k231J26069J98161K35036
$$ -111560 -230192 -495142 -608791 -582382 -608157 -693991 -696222 -570153 -371992 -136956
31489a36956K09845O7448o4732J58J60154J26210j07339k37314j38191k1281l8777
$$ -136956 72889 140337 75605 75763 235917 362127 254788 17474 -120717 -141998 -180775
31478a80775q0845n7031k8257M0934K85514N62089M68218n9123n40904n87518
$$ -180775 -261620 -318651 -346908 -305974 -20460 541629 1009847 950724 409820 -177698
31468a77698l69617k00193m0266K24410L73506J70408j59604k24186n2349N1114
$$ -177698 -547315 -747508 -787774 -563364 -189858 -19450 -179054 -403240 -455589 -404475
31458d04475O5599J85314L11735J46748k22531l44172p4453K24678K53612J11461
$$ -404475 -338876 -153562 158173 304921 82390 -261782 -336235 -111557 142055 253516
31448B53516m0106k04754k86915n4101L88636N03910L6994n10912n12551o9232
$$ 253516 213410 8656 -278259 -332360 56276 560186 597180 86268 -426283 -495515
31438d95515J88749R627k19363j16338J90263L35228K24988P5947O1629J03543
$$ -495515 -306766 -297139 -516502 -632840 -442577 -107349 117639 193586 255215 358758
31428C58758L4242j33419k07920j01674J8543k1940j27070r9172K184m1658j80067
$$ 358758 393000 259581 51661 -50013 -31470 -53410 -180480 -279652 -277468 -319126 -499193
31417d99193j24426J28622K10270j2256j58972M1503K55215Q5561k26097j78992
$$ -499193 -623619 -494997 -284727 -296983 -455955 -414452 -159237 -73676 -299773 -478765
31407d78765J37331J93711o8314j45689J34005K92124J2243l15114k34114O5549
$$ -478765 -341434 -147723 -216037 -361726 -227721 64403 76646 -238468 -472582 -407033
31397d07033J33284k305K0945K36785L34436K04893O4069O4790J50960K57121
$$ -407033 -273749 -276054 -255109 -18324 316112 521005 585074 649864 800824 1057945
31387A057945L11204J11334m05741q24322o38958j4305L29708J01214k07768j60193
$$ 1057945 1369149 1480483 1074742 250420 -388538 -402843 -73135 28079 -179689 -339882
31377c39882k1473j65582l11173L7647O41489P10134N5865n54122m17957J91886
$$ -339882 -361355 -526937 -838110 -800463 -158974 551160 607025 52903 -365054 -173168
31367a73168M70930J41731l08645l48147j6985K40039J44405j62059l68957l49457
$$ -173168 297762 439493 130848 -217299 -234284 5755 150160 -11899 -380856 -730313
31357g30313j94888k170K04078L41905K73499L6162j12622l2634Q5062K7628r1026
$$ -730313 -925201 -927371 -723293 -381388 -107889 -71727 -184349 -216983 -131921 -104293 -195319
31346a95319m0582J21914J66933R5555Q0761Q9149n0181k44407k31301o2752k1638
$$ -195319 -235901 -113987 52946 148501 229262 318411 268230 23823 -207478 -270230 -291868
31335b91868m2637K13893O07758N08379j85051o95530m87286p9482j32853l38223
$$ -291868 -334505 -120612 487146 995525 810474 114944 -372342 -451824 -584677 -922900
31325i22900m4769M69581L76141k60690m93726L72M63230L53599J16481K09071
$$ -922900 -967669 -498088 -121947 -382637 -876363 -875991 -412761 -59162 57319 266390
31315B66390K60490j46054n79584m29929M5646J55845r5946j39092J19077K14309
$$ 266390 526880 380826 -198758 -628687 -583041 -427196 -523142 -662234 -543157 -328848
31305c28848M1306K3372K47728K07076k98290o65559l47299K83865M57980Q8999
$$ -328848 -287542 -264170 -16442 190634 -107656 -773215 -1120514 -836649 -378669 -289670
31295b89670k24064j46247O831q7063k14583k0369L50672M01081J1801l46123
$$ -289670 -513734 -659981 -653150 -740213 -954796 -975165 -624493 -223412 -211611 -557734
31285e57734k44393J54165L99441L72349K80628J97437K6881j10385N4223L82285
$$ -557734 -802127 -647962 -248521 123828 404456 601893 628774 518389 572612 954897
31275I54897L48426j51193n14150l21093j7267j74033n04341l41823J71892K51947
$$ 954897 1303323 1152130 637980 316887 299620 125587 -378754 -720577 -548685 -296738
31265b96738k14549m37445k0053L93834K13045j34443K5010M63666M61528m067
$$ -296738 -511287 -948732 -968785 -574951 -361906 -496349 -471339 -7673 453855 449788
31255D49788k95702j74634k4454l1173Q0890L46222L18988j48053m93675k42390
$$ 449788 154086 -20548 -45002 -76175 4715 350937 669925 521872 28197 -214193
31245b14193K60444L83801J23590m2388K7545K9183j60040k76977j58119M872
$$ -214193 46251 430052 553642 511254 538799 567982 407942 130965 -27154 -22282
31235b2282J7605n1512q3927r1530o7263N2145J52782m070l27259l50148Q7705
$$ -22282 -4677 -56189 -140116 -231646 -298909 -246764 -93982 -98052 -425311 -775459 -687754
31224f87754M57537K40576k57507l04595J78416N13702K76113j69587l34466k79631
$$ -687754 -230217 10359 -247148 -551743 -373327 140375 416488 246901 -87565 -367196
31214c67196k81691k58485l476K77897J93282j72876l12533l1678L00477L32710
$$ -367196 -648887 -907372 -910848 -632951 -439669 -612545 -925078 -956756 -656279 -323569
31204c23569J65723L8076o6591k36708l17131j02374K69397M13394J81830j66011
$$ -323569 -157846 -119770 -186361 -423069 -740200 -842574 -573177 -159783 22047 -143964
31194a43964k99570j58617P2245J95411J54161M3273R196Q7697J40164K6834j64669
$$ -143964 -443534 -602151 -529906 -334495 -180334 -137061 -127865 -40168 99996 126830 -37839
31183c7839j88364J5570J82435O3370j83375j53058K24128M86270K00813m12084
$$ -37839 -226203 -210633 -28198 35172 -148203 -301261 -77133 409137 609950 197866
$$ [...]
##END NTUPLES=NMR SPECTRUM
##END=
