##TITLE=31Pdec_PR163_2
 D2O, 24 sc
 18.1.2019
##JCAMPDX= 6.0         $$ Bruker NMR JCAMP-DX V2.0
##DATA TYPE= NMR SPECTRUM
##DATA CLASS= NTUPLES
##ORIGIN= UXNMR, Bruker Analytische Messtechnik GmbH
##OWNER= root
$$ XWIN-NMR		Version 3.5
$$ Fri Jan 18 15:55:27 2019 Russian Standard Time (UT+4h)  she@DPX200
##.OBSERVE FREQUENCY= 81.013821
##.OBSERVE NUCLEUS= ^31P
##.ACQUISITION MODE= SIMULTANEOUS
##.ACQUISITION SCHEME= undefined
##.AVERAGES= 24
##.DIGITISER RES= 17
##SPECTROMETER/DATA SYSTEM= spect
##.PULSE SEQUENCE= zgpg30
##.SOLVENT NAME= D2O
##.SHIFT REFERENCE= (INTERNAL, D2O, 0, 182.463)
##AUDIT TRAIL= $$ (NUMBER, WHEN, WHO, WHERE, WHAT)
$$ ##TITLE= Audit trail, XWIN-NMR		Version 3.5
$$ ##JCAMPDX= 5.01
$$ ##ORIGIN= Bruker BioSpin GmbH
$$ ##OWNER= she
$$ F:/spectra/data/she/nmr/P31/1/pdata/1/auditp.txt
$$ ##AUDIT TRAIL=  $$ (NUMBER, WHEN, WHO, WHERE, WHAT)
(   1,<2019-01-18 15:54:25.43 +0400>,<she>,<DPX200>,
      <created by zg, POWCHK disabled, PULCHK disabled
       configuration hash MD5:
       00 E9 B6 7A A2 85 ED C7 34 08 36 98 17 FE 4E 26
       data hash MD5: 32K
       83 75 C2 5A 5D EB 62 F5 E6 90 FB 57 A8 16 D4 FE>)
(   2,<2019-01-18 15:54:28.92 +0400>,<she>,<DPX200>,
      <Start of raw data processing
       efp BC_mod = 2 LB = 1 FT_mod = 6 PKNL = 1 PHC0 = -1439.074 PHC1 = 4.798988 SI = 64K 
       data hash MD5: 64K
       45 95 88 1D 39 76 F8 67 E1 2E 2E FB 70 3C DF BE>)
(   3,<2019-01-18 15:54:50.43 +0400>,<she>,<DPX200>,
      <pk PHC0 = -64.18517 PHC1 = 124.6 
       data hash MD5: 64K
       0B 08 AC D6 BD B0 FF EB EC CB D5 FB 7F BF 34 AC>)
(   4,<2019-01-18 15:54:53.89 +0400>,<she>,<DPX200>,
      <abs ABSG = 5 
       data hash MD5: 64K
       F1 0D 66 52 18 BD 1F CD 26 59 1B 3F E8 FB EF FA>)
$$ ##END=
$$ 
$$ hash MD5
$$ F4 23 C5 8D 66 54 E0 68 67 2A 67 EC 49 05 E9 AF
##$RELAX= 
##$RELAX= 
##$RELAX= 
##$RELAX= 
##$RELAX= 
##$RELAX= 
##$RELAX= 
##$RELAX= 
$$ Bruker specific parameters
$$ --------------------------
##$DU= <F:/spectra>
##$EXPNO= 1
##$NAME= <P31>
##$PROCNO= 1
##$TYPE= <nmr>
##$USER= <she>
##$AMP= (0..31)
100 100 100 100 100 100 100 100 100 100 100 100 100 100 100 100 100 100 
100 100 100 100 100 100 100 100 100 100 100 100 100 100 
##$AQSEQ= 0
##$AQ_mod= 1
##$AUNM= <au_zg>
##$AUTOPOS= <>
##$BF1= 81.014009
##$BF2= 200.13
##$BF3= 200.13
##$BF4= 200.13
##$BF5= 200.13
##$BF6= 200.13
##$BF7= 200.13
##$BF8= 200.13
##$BYTORDA= 1
##$CFDGTYP= 0
##$CFRGTYP= 5
##$CHEMSTR= <none>
##$CNST= (0..31)
1 1 145 1 1 1 1 1 1 1 1 1 1 1 1 1 1 1 1 1 1 1 1 1 1 1 1 1 1 1 1 1 
##$CPDPRG= <waltz16>
##$CPDPRG1= <>
##$CPDPRG2= <waltz16>
##$CPDPRG3= <>
##$CPDPRG4= <mlev>
##$CPDPRG5= <mlev>
##$CPDPRG6= <mlev>
##$CPDPRG7= <mlev>
##$CPDPRG8= <mlev>
##$CPDPRGB= <>
##$CPDPRGT= <>
##$D= (0..31)
0 1 0 0 0 0 0 0 0 0 0 0.03 2e-05 3e-06 0 0 0 0 0 0 0 0 0 0 0 0 0 0 0 0 
0 0 
##$DATE= 1547812464
##$DBL= (0..7)
120 120 120 11 120 120 24 19 
##$DBP= (0..7)
150 150 150 150 150 150 150 150 
##$DBP07= 0
##$DBPNAM0= <>
##$DBPNAM1= <>
##$DBPNAM2= <>
$$ [...]
##$SUBNAM3= <"">
##$SUBNAM4= <"">
##$SUBNAM5= <"">
##$SUBNAM6= <"">
##$SUBNAM7= <"">
##$SUBNAM8= <"">
##$SUBNAM9= <"">
##$SW= 369.568048894756
##$SWIBOX= (0..15)
0 1 3 0 0 0 0 0 0 0 0 0 0 0 0 0 
##$SW_h= 29940.119760479
##$TD= 32768
##$TD0= 1
##$TE= 0
##$TE2= 300
##$TE3= 300
##$TEG= 300
##$TL= (0..7)
0 120 53 12 22 120 120 120 
##$TP= (0..7)
150 150 150 150 150 150 150 150 
##$TP07= 0
##$TPNAME0= <>
##$TPNAME1= <>
##$TPNAME2= <>
##$TPNAME3= <>
##$TPNAME4= <>
##$TPNAME5= <>
##$TPNAME6= <>
##$TPNAME7= <>
##$TPOAL= (0..7)
0.5 0.5 0.5 0.5 0.5 0.5 0.5 0.5 
##$TPOFFS= (0..7)
0 0 0 0 0 0 0 0 
##$TUNHIN= 0
##$TUNHOUT= 0
##$TUNXOUT= 0
##$USERA1= <user>
##$USERA2= <user>
##$USERA3= <user>
##$USERA4= <user>
##$USERA5= <user>
##$V9= 5
##$VALIST= <valist>
##$VCLIST= <CCCCCCCCCCCCCCC>
##$VD= 0
##$VDLIST= <DDDDDDDDDDDDDDD>
##$VPLIST= <PPPPPPPPPPPPPPP>
##$VTLIST= <TTTTTTTTTTTTTTT>
##$WBST= 1024
##$WBSW= 4
##$XGAIN= (0..3)
0 0 0 0 
##$XL= 0
##$YL= 0
##$YMAX_a= 35929
##$YMIN_a= -47139
##$ZGOPTNS= <>
##$ZL1= 120
##$ZL2= 120
##$ZL3= 120
##$ZL4= 120
##$ABSF1= 182.463
##$ABSF2= -187.1042
##$ABSG= 5
##$ABSL= 3
##$ALPHA= 0
##$AQORDER= 0
##$ASSFAC= 0
##$ASSFACI= 0
##$ASSFACX= 0
##$ASSWID= 0
##$AUNMP= <proc_1d>
##$AZFE= 0.1
##$AZFW= 0.5
##$BCFW= 0
##$BC_mod= 2
##$BYTORDP= 0
##$COROFFS= 0
##$CY= -3
##$DATMOD= 1
##$DC= 0
##$DFILT= <>
##$DTYPP= 0
##$F1P= 0
##$F2P= 0
##$FCOR= 1
##$FTSIZE= 65536
##$FT_mod= 6
##$GAMMA= 0
##$GB= 0
##$INTBC= 1
##$INTSCL= 5.30512e-09
##$ISEN= 30
##$LB= 1
##$LEV0= 0
##$LPBIN= 0
##$MAXI= 10000
##$MC2= 0
##$MEAN= 0
##$ME_mod= 0
##$MI= 50
##$NCOEF= 0
##$NC_proc= -4
##$NLEV= 6
##$NOISF1= 182.463
##$NOISF2= 159.3651
##$NSP= 0
##$NTH_PI= 0
##$NZP= 0
##$OFFSET= 182.463
##$PC= 4
##$PHC0= -1503.259
##$PHC1= 129.399
##$PH_mod= 1
##$PKNL= yes
##$PPARMOD= 0
##$PSCAL= 0
##$PSIGN= 0
##$REVERSE= no
##$SF= 81.0140089999434
##$SI= 65536
##$SIGF1= 159.3651
##$SIGF2= -187.1042
##$SINO= 113.3802
##$SIOLD= 16384
##$SREGLST= <1H.CDCl3>
##$SSB= 0
##$STSI= 65536
##$STSR= 0
##$SW_p= 29940.119760479
##$SYMM= 0
##$S_DEV= 0
##$TDeff= 32768
##$TDoff= 0
##$TI= <>
##$TILT= no
##$TM1= 0
##$TM2= 0
##$TOPLEV= 0
##$USERP1= <user>
##$USERP2= <user>
##$USERP3= <user>
##$USERP4= <user>
##$USERP5= <user>
##$WDW= 1
##$XDIM= 65536
##$YMAX_p= 285779317
##$YMIN_p= -9434463
$$ End of Bruker specific parameters
$$ ---------------------------------
##NTUPLES= NMR SPECTRUM
##VAR_NAME=  FREQUENCY,     SPECTRUM/REAL,   SPECTRUM/IMAG
##SYMBOL=    X,             R,               I
##VAR_TYPE=  INDEPENDENT,   DEPENDENT,       DEPENDENT
##VAR_FORM=  AFFN,          ASDF,            ASDF
##VAR_DIM=   65536,         65536,           65536
##UNITS=     HZ,            ARBITRARY UNITS, ARBITRARY UNITS
##FACTOR=    0.456856943014862, 1,           1
##FIRST=     14782.0589164792, 0,            0
##LAST=      -15158.0608439998, 0,           0
##MIN=       -15158.0608439998, -9434463,    0
##MAX=       14782.0589164792, 285779317,    0
$$ Real data points
##PAGE= N=1
##DATA TABLE= (X++(R..R)), XYDATA
$$ [...]
46165C14878K03507j61707n86635n90522j40033K69374L46853L41448M32702L43144
$$ 314878 518385 356678 -229957 -820479 -960512 -691138 -344285 -2837 429865 773009
46155G73009p2623l76245j79000J96581K22599l1643j70739k08550l78586m66579
$$ 773009 700386 324141 145141 341722 564321 532678 361939 153389 -225197 -691776
46145f91776p0104N76099P61348L14409j97802l60892l63745m18950l62286q6912
$$ -691776 -761880 -185781 575567 889976 692174 331282 -32463 -451413 -813699 -900611
46135i00611J58621K09146K70606M63123M89920J18085l44229m32185j55756R7737
$$ -900611 -741990 -532844 -262238 200885 690805 808890 464661 32476 -123280 -25543
46125b5543J18218J0058r9645j84558k01350r8086N1288Q3365n5035k13933j65803
$$ -25543 92675 102733 3088 -181470 -382820 -480906 -429618 -346253 -401288 -615221 -781024
46114g81024J48259M62780L88766r2098m75212l24073J16567K60628N4470K3496
$$ -781024 -632765 -169985 218781 126683 -348529 -672602 -556035 -295407 -240937 -217441
46104b17441L79698O21289K95469k76947m38613j00744J84869l0525n60558p97542
$$ -217441 162257 783546 1079015 802068 363455 262711 447580 417055 -143503 -941045
46094i41045l61798M17199P30498K07889n09341n15889J14552M37813O1010l11145
$$ -941045 -1302843 -885644 -155146 52743 -456598 -972487 -857935 -420122 -359112 -670257
46084f70257q5061K69296J11158k08877L5675O12748O22185m5638n41175m02004
$$ -670257 -755318 -486022 -374864 -583741 -548066 64682 686867 641229 100054 -301950
46074c01950j31268j91056k63628N5572M84439M96407J18363j81684j46346Q5156
$$ -301950 -433218 -624274 -887902 -832330 -347891 148516 266879 85195 -61151 24005
46064B4005K52678J94410l5117j39391R4168L90676K65724k21585m61490k08100
$$ 24005 276683 471093 435976 296585 390753 781429 1047153 825568 364078 155978
46054A55978K8956j78064m61685k58595K71149M85945K00407j56282k21227p1523
$$ 155978 184934 6870 -454815 -713410 -442261 43684 244091 87809 -133418 -204941
46044b04941N8051N5425p3720k14279j75305P1749K84536K73624J65245J24504
$$ -204941 -146890 -91465 -165185 -379464 -554769 -483020 -198484 75140 240385 364889
46034C64889N4731j39215k51286j03906P5964L1811k9274J77209L82412J47360
$$ 364889 419620 280405 29119 -74787 1177 32988 3714 180923 563335 710695
46024G10695k93755l04885Q6001J93367j55060k98186J19722N07567L01339j37063
$$ 710695 416940 112055 198056 391423 236363 -61823 57899 565466 866805 729742
46014G29742k06466m6442j03675k01182J04803N26633L33751m01838p47890k83192
$$ 729742 523276 476834 373159 171977 276780 803413 1137164 735326 -12564 -295756
46004b95756K71551J57576l45305m61904q3556K15260J10580r9813p5696O7871
$$ -295756 -24205 133371 -211934 -673838 -757394 -542134 -431554 -531367 -607063 -539192
45994e39192J5685k51257m22206k46411J75669N03289N07243K75619P0485L7139
$$ -539192 -523507 -774764 -1196970 -1443381 -1267712 -764423 -257180 18439 88924 126063
45984A26063J15031J89561K15818J82280O5853j23383l16710m36358m25597k54007
$$ 126063 241094 430655 646473 828753 894606 771223 454513 18155 -407442 -661449
45974f61449J2357J76104R5801q3703o8378J66645L00813J28465j10505p1392
$$ -661449 -649092 -472988 -377187 -460890 -529268 -362623 -61810 66655 -43850 -115242
45964a15242J70176K13766q2671l98641l96939j39096P8335J29990J21233J30162
$$ -115242 54934 268700 186029 -212612 -609551 -748647 -670312 -540322 -419089 -288927
45954b88927R3140k9239j21667m8371J31701J90213J7334j76885p3657L04188
$$ -288927 -195787 -225026 -346693 -395064 -263363 -73150 -55816 -232701 -306358 -2170
45944b170N00886J55637m57022o72430k64608K46195K78064p3185k64895j02142
$$ -2170 498716 654353 197331 -475099 -739707 -493512 -215448 -288633 -553528 -655670
45934f55670Q8906N1299n3021k736J26495J66880J40641J12269O790j72531j85050
$$ -655670 -566764 -515465 -568486 -571222 -444727 -277847 -137206 -24937 -18147 -190678 -375728
45923c75728Q0194K92496J08420k52077k90060J3387K06793J15722M7592J55677
$$ -375728 -295534 -3038 105382 -146695 -436755 -423368 -216575 -100853 -53261 102416
45913A02416J46073j45408l72799k10765J28196K66679K09092J38035k969k77366
$$ 102416 248489 103081 -269718 -480483 -352287 -85608 123484 261519 258550 -18816
45903a8816l89832o4129M03737M85991J81171q0367j60099k65467l57278j55683
$$ -18816 -408648 -472777 -69040 416951 598122 517755 357656 92189 -265089 -420772
45893d20772K17783K68898m9397j98469L9673J89281m6980k25083K6972K62421
$$ -420772 -202989 65909 16512 -181957 -142284 46997 17 -225066 -198094 64327
45883F4327l5627m56911k42357M36233O64901J77278l15156k84986n9504n9907
$$ 64327 28700 -428211 -670568 -234335 430566 607844 292688 7702 -51802 -111709
45873a11709j09734O4636K33615R3037j28759m3888J98174J34617k49145m96268
$$ -111709 -221443 -156807 76808 169845 41086 -2802 195372 329989 80844 -415424
45863d15424l56894l4951K29413L97555M19555J95910j43561k79779j56913p4276
$$ -415424 -772318 -807269 -577856 -180301 239254 435164 291603 11824 -145089 -219365
45853b19365j83620k32813k7653J74804N9222j97639j65711J56511L10045N4939
$$ -219365 -402985 -635798 -663451 -488647 -429425 -627064 -792775 -636264 -326219 -271280
45843b71280k80418k67678O6443L38040L04516R5293J2303K00526M73928M54280
$$ -271280 -551698 -819376 -752933 -414893 -110377 -15084 -2781 197745 671673 1125953
45833A125953j0783n69615o85166k72613J99670L32049K45000K22274J95095o1686
$$ 1125953 1115170 545555 -139611 -412224 -212554 119495 364495 586769 781864 720178
45823G20178l94073l80208J5929L13557J61313k18078l99400k89788p9710J10762
$$ 720178 326105 -54103 -38174 275383 436696 218618 -180782 -470570 -550280 -439518
45813d39518K79881L80421L52294K43119J10377j00778l85695m96543k01199L00793
$$ -439518 -159637 220784 573078 816197 926574 825796 440101 -56442 -257641 43152
45803D3152N02005J98347k46954l67253j46516M9394j2378j80491j87398r139
$$ 43152 545157 743504 496550 129297 -17219 32175 19797 -160694 -348092 -357231
45793c57231J38042R1749q1482k05092j74820J9182L23643N64685M83271L2180
$$ -357231 -219189 -127440 -208922 -414014 -588834 -569652 -246009 318676 801947 834127
45783H34127m17384m13309J1994L61184L16554R0056N796L3885j9195j04038m0125
$$ 834127 416743 3434 15428 376612 693166 783222 789018 822903 803708 699670 659545
45772F59545J06137Q8816j26563l25440l61646k57295m3788K19756L31222J65526
$$ 659545 765682 854498 727935 402495 40849 -216446 -260234 -40478 290744 456270
45762D56270l7447L4014K15399O1035l68321m54687K2677M23504J50529m16980
$$ 456270 418823 452837 668236 729271 360950 -93737 -71060 352444 502973 85993
45752H5993m51498J22693N78394M56833P7667j09436j22050j53670j36343N6004
$$ 85993 -365505 -242812 335582 792415 870082 760646 638596 484926 348583 404587
45742D04587K57135K24060L9511k7003L6199j5306k67341n10483n39026l59079
$$ 404587 661722 885782 925293 898290 934489 919183 651842 141359 -397667 -756746
45732g56746o8815K48478M53235L85826Q6198j82337k40772j87629j77069j57249
$$ -756746 -825561 -577083 -123848 261978 348176 165839 -74933 -262562 -439631 -596880
45722e96880J2059K95098N08170N38425L82601O4302k96913m32948k07442R3157
$$ -596880 -584821 -289723 218447 756872 1139473 1203775 906862 473914 266472 359629
45712C59629N6864k37254k50156K24162O43654L97101l30785p53457m70867R9766
$$ 359629 416493 179239 -70917 153245 796899 1194000 863215 109758 -361109 -261343
45702b61343L31944J17987j64141k01744m9764N6517J5796o3302l8644P6866J34337
$$ -261343 70601 188588 24447 -177297 -227061 -170544 -154748 -218050 -256694 -179828 -45491
45691d5491M2298j19095k06654j81885j18525q1606n7867R80R0138J09353m3348
$$ -45491 -3193 -122288 -328942 -510827 -629352 -710958 -768825 -767845 -677707 -568354 -611702
45680f11702k75057k83658Q4670N08037M81539j0970m06368k84683J02870K51892
$$ -611702 -886759 -1170417 -1085747 -577710 -96171 -107141 -513509 -798192 -695322 -443430
45670d43430R1009n6938j1675J10222J72560J36265k0346k14565k05010P1562
$$ -443430 -352421 -409359 -421034 -310812 -138252 -1987 -22333 -236898 -441908 -370346
45660c70346K59218N7533k17858m2473M39048N37510O5613l69933l06205l6565
$$ -370346 -111128 -53595 -271453 -313926 125122 662632 728245 358312 52107 15542
45650A5542K5795J5384J93999L44728J42819j99360k35016j9383K0958j68240
$$ 15542 41337 56721 250720 595448 738267 538907 303891 284508 305466 137226
45640A37226k14648J4021K09949J54283n694j07976j95113k47499q1665K78625
$$ 137226 -77422 -63401 146548 300831 295137 187161 -7952 -255451 -337116 -58491
45630e8491M42684J28301l94944n88281k81685J62015K93695O2444j64448l2132
$$ -58491 384193 512494 117550 -470731 -752416 -590401 -296706 -234262 -398710 -430842
45620d30842L67322N55676K24494l60062o42345l99252R2826M60334N79399N10711
$$ -430842 -63520 492156 716650 356588 -285757 -685009 -592183 -131849 447550 958261
45610I58261L29110J27062K3315L5181K5947j26027l61021n02821m45430k37416
$$ 958261 1287371 1414433 1437748 1472929 1498876 1372849 1011828 509007 63577 -173839
45600a73839k1762Q2809O8539J0515n5137j63748k84470k48328M9172M14898M92942
$$ -173839 -195601 -112792 -44253 -33738 -88875 -252623 -537093 -785421 -736249 -321351 171591
45589A71591J74150k41043l55366r7221K24062K73872O1296r5809J6999K32006
$$ 171591 345741 104698 -250668 -347889 -123827 150045 211341 115532 132531 364537
45579C64537K38942J3583j87935k20395j78452j19552L6561K40692K68811R8582
$$ 364537 603479 617062 429127 208732 30280 -89272 -52711 187981 456792 555374
45569E55374L479P6042L0638k38079l18064O5767M45628K47212k50805k98757
$$ 555374 558853 634895 665533 427454 109390 175157 620785 867997 617192 318435
45559C18435J24357K80860j14842m61288k85560M7862M5272j26008o6921J22288
$$ 318435 442792 723652 608810 147522 -138038 -90176 -44904 -170912 -237833 -115545
45549a15545J07744l0253J2604J62739J10878r3920j22909L8794Q6297l0163j3369
$$ -115545 -7801 -38054 -25450 137289 248167 154247 31338 70132 156429 126266 112897
45538A12897K29062L80511K04373j15019k81351k54494j55564m3893N4049Q4472
$$ 112897 341959 722470 926843 811824 530473 275979 120415 76522 130571 215043
45528B15043P1628J20183K11748J84156K0508n5757O6514J50828l9110l24566
$$ 215043 286671 406854 618602 802758 823266 767509 834023 984851 945741 621175
45518F21175l41256r7104L6267r2668j86226P112K72908K56939n064j93391k02604
$$ 621175 279919 182815 219082 126414 -59812 -52700 220208 477147 472083 278692 76088
45507G6088j79172j28726R3212L46715K19987l13228o56018l41108K91271N53408
$$ 76088 -103084 -231810 -138598 208117 428104 114876 -541142 -882250 -590979 -37571
45497c7571L01290n7628k39935k75899j56566J60270M20028K93638l9988q6059
$$ -37571 263719 206091 -33844 -309743 -466309 -306039 113989 407627 367639 281580
45487B81580J38908J05054k63392l46603J08509M18321K0396n22841l28642M31120
$$ 281580 420488 525542 262150 -84453 24056 442377 462773 -60068 -388710 42410
45477D2410Q03511M74162M8402m5347q3717l24377n06952l85208j70043j01593
$$ 42410 845921 1320083 1368485 1323138 1239421 915044 408092 22884 -147159 -248752
45467b48752n6414Q4134J05056j33418l25526j57346J73623K74303J58629J29557
$$ -248752 -305166 -221032 -115976 -249394 -574920 -732266 -558643 -284340 -125711 3846
45457C846K32587K34465M5929k02159m24585n75657m68827O37M95395N31091J66514
$$ 3846 236433 470898 516827 314668 -109917 -685574 -1154401 -1153764 -658369 -127278 39236
45446C9236m0167J33736K52874l9088m10847l52617M3357K81468K35514K08139
$$ 39236 -931 132805 385679 346591 -64256 -416873 -373516 -92048 143466 351605
45436C51605K95718K33283n2867k39916j48921n2477j68695k39112J3915L17896
$$ 351605 647323 880606 827739 587823 438902 386425 217730 -21382 -7467 310429
45426C10429K07574k19107l99685j29687J86031J84407K2723K2421J62417J74100
$$ 310429 518003 298896 -100789 -230476 -44445 139962 162685 185106 347523 521623
45416E21623m7260l36461m67455l50131j03928K0238q8421k06775l7114L42773
$$ 521623 474363 137902 -329553 -679684 -783612 -763374 -851795 -1058570 -1095684 -752911
45406g52911N35981L72295J19290N8631J35571J62024R2253o3987l32954n98858
$$ -752911 -216930 155365 274655 333286 468857 630881 723134 659147 326193 -272665
45396b72665o01090l12100n0954k313Q0908M16432P35209O51203K52991o8463
$$ -272665 -873755 -1185855 -1236809 -1239122 -1158214 -741782 -6573 644630 897621 829158
45386H29158j92632k54907k22686M0891L60181L64803M2740k29449k38831j41243
$$ 829158 636526 381619 158933 199824 560005 924808 967548 738099 499268 358025
45376C58025q7666l0531M0495L6091M470P9254J52716l325k47298j73514J75942
$$ 358025 270359 239828 280323 316414 320884 400138 552854 549529 302231 128717 304659
45365C04659K41088j67639m57794j46005L16029J86940m02242o10050j29147L95333
$$ 304659 545747 378108 -79686 -225691 90338 277278 -124964 -735014 -864161 -468828
45355d68828L32214j04399k93534r6264Q8252r015j78399q9449K38969M58313
$$ -468828 -136614 -241013 -534547 -630811 -542559 -551574 -729973 -819422 -580453 -122140
45345a22140L19119j8092j58549L8696K48900Q6356l32256m68405r6418K99993
$$ -122140 196979 178887 20338 59034 307934 394290 62034 -406371 -502789 -202796
45335b02796J34966m32646o56879k28383K97720L16412K0383J6892L46967M44616
$$ -202796 -67830 -500476 -1157355 -1385738 -1088018 -771606 -751223 -734331 -387364 57252
45325E7252O4974k97353j25233L97483O79198M75018N2056k38336k92262k37570
$$ 57252 122226 -175127 -300360 97123 776321 1251339 1303395 1065059 772797 535227
45315E35227k63079m07732m62624k27396J20959J86668m8059j37609J51180M60514
$$ 535227 272148 -135584 -598208 -825604 -704645 -517977 -566036 -703645 -552465 -91951
45305i1951M01475J18652m9026j17214k36497k36454Q8838M49254L65865r0960
$$ -91951 309524 428176 379150 261936 25439 -211015 -122177 327077 692942 601982
45295F01982l86519k90853p3282L7831R1256Q8019r7393l81231m60361k38202
$$ 601982 215463 -75390 -148672 -110841 -19585 68434 -28959 -410190 -870551 -1108753
45285a108753N7094K19444K39443J57739M3254M5764J68658J41893j31463k50663
$$ -1108753 -1051659 -832215 -592772 -435033 -391779 -346015 -177357 -35464 -166927 -417590
45275d17590Q8866M63263L07939j23970j69217P2972q1726n93437o26475K7480
$$ -417590 -328724 134539 442478 318508 149291 222263 140537 -452900 -1079375 -1051895
45265a051895N19380L25633N6112L18392O75288M47547j61256m93242m39964l19318
$$ -1051895 -532515 -206882 -150770 167622 842910 1290457 1129201 635959 195995 -123323
45255a23323k07715l5994M6705l8534m5822J04222Q0753j66137j17920L62567
$$ -123323 -331038 -367032 -320327 -358861 -404683 -300461 -219708 -385845 -503765 -141198
45245a41198N40057j4245n22495j98315L76988K03084m09747l78486K59898M31034
$$ -141198 398859 384614 -137881 -336196 40792 243876 -165871 -544357 -284459 146575
45235A46575r4949l51126J08510M94699K14832j70071k6638K83535J28949l11628
$$ 146575 51626 -299500 -190990 303709 518541 348470 321832 605367 734316 422688
45225D22688m03753l4041L53560M06765J45139j79598k73330q2475N5105j39931
$$ 422688 18935 -15106 338454 745219 890358 710760 437430 354955 410060 270129
45215B70129l70015j83271K08388K17383q1106m9486L17059K77400l18754o08849
$$ 270129 -99886 -283157 -74769 142614 61508 12022 329081 606481 287727 -321122
45205c21122j13807M14516K11636k89055k75695J17204K15441J9541O3991L70496
$$ -321122 -434929 -20413 191223 -97832 -373527 -256323 -40882 -21341 42650 413146
45195D13146M28907Q3884k97128m45271l70143o9021L57141M78382L7040m92625
$$ 413146 842053 925937 628809 183538 -186605 -255626 101515 579897 616937 124312
45185A24312m67800m0376J02530j65196k89358J0734L77729M79859L95407K27480
$$ 124312 -343488 -383864 -281334 -446530 -735888 -725154 -347425 132434 527841 755321
45175G55321n5924k66552p8709L57961M59455O3090l20474l42356l06009m85194
$$ 755321 699397 432845 354136 712097 1171552 1234642 914168 571812 265803 -219391
45165b19391n40977j22608M08401M50201O8907j57685l4928J03057Q6511J48414
$$ -219391 -760368 -882976 -474575 -24374 44533 -113152 -148080 -45023 41488 189902
45155A89902L65674M04180P5967k67038k33893M165j658k70716l94464k00134
$$ 189902 555576 959756 1035723 768685 534792 538957 537299 266583 -127881 -328015
45145c28015J6459J7487p959J74209M00911L72276J60167R2841K11243K05280
$$ -328015 -311556 -294069 -302028 -127819 273092 645368 805535 898376 1109619 1314899
45135A314899q2535m10921m87030l04852m1210J58427J90791J5418k07614j97500
$$ 1314899 1232364 821443 334413 29561 -11649 146778 337569 352987 145373 -52127
45125e2127Q4427L14049J94291j63188l88293k94345m8402N5580p3924k18404
$$ -52127 32300 346349 540640 377452 -10841 -305186 -353588 -298008 -371932 -590336
45115e90336j11147J66667K22846o5984k55540N8422N48010N55709P7173k47924
$$ -590336 -701483 -534816 -311970 -377954 -633494 -575072 -27062 528647 605820 357896
45105C57896j35704R806r2199j56416m249P772l05496m44545r237N26617N00451
$$ 357896 222192 231998 139799 -16617 -20866 -13094 -318590 -763135 -772372 -245755 254696
45094B54696R6988m0401R8458N426l31081l81843l0583K27450J37492J3537O2212
$$ 254696 351684 311283 409741 415167 84086 -297757 -328340 -100890 36602 50139 112351
45083A12351N6825j02227j34858M8822J13031p3676j42786Q4435J71390j97633
$$ 112351 169176 66949 -67909 -19087 93944 20268 -122518 -38083 133307 -64326
45073f4326n43300k52632M10634O16156J59917k89037j91573J68071K17790q1414
$$ -64326 -607626 -860258 -449624 166532 326449 37412 -154161 13910 231700 150286
45063A50286k95672j98904k2702j7543o9584O9505L41803M30857K26562j2236
$$ 150286 -145386 -344290 -366992 -384535 -454119 -384614 -42811 388046 614608 602372
45053F02372k9721J20178K49614K85006J81113j59644o40554q68548n98533j03361
$$ 602372 572651 692829 942443 1227449 1408562 1248918 608364 -260184 -858717 -962078
45043i62078J99376K91089L72506L72131J18607j56734p0458K05870J13204l53417
$$ -962078 -762702 -471613 -99107 273024 391631 234897 164439 370309 483513 130096
45033A30096n22517p4787M31255M09243P3849l3142R6152Q3135j26109k53186
$$ 130096 -392421 -467208 -35953 373290 447139 413997 510149 593284 467175 213989
45023B13989k38102k74993l39664j61854K58129N02360K76372j60767l07513l7612
$$ 213989 -24113 -299106 -638770 -800624 -542495 -40135 236237 75470 -232043 -269655
45013b69655K77531K63229J5896n0664J92099L62543J04784l46969m45321p6913
$$ -269655 7876 271105 287001 236337 428436 790979 895763 548794 103473 26560
45003B6560L26916M09842K32745l7918l44752n21202l19814J19392K65939m9025
$$ 26560 353476 763318 996063 958145 613393 92191 -227623 -108231 157708 108683
44993A08683l05849q4609K42283R7097l60109m71404q6759K75280K41818J4146
$$ 108683 -197166 -281775 -39492 57605 -302504 -773908 -860667 -585387 -343569 -329423
44983c29423q0668N08J65737L53439M21802K07301j72915l54487j79239J15756
$$ -329423 -410091 -409583 -243846 109593 531395 738696 565781 211294 32055 147811
44973A47811K33909J13476j49432m05355m35256j23564K78354L56518Q9730j08301
$$ 147811 381720 495196 345764 -59591 -494847 -618411 -340057 16461 106191 -2110
44963b110n959J40112P0903n1895N275Q9103p6575l73243m30341j82205Q3400
$$ -2110 -8069 132043 202946 151051 156326 245429 168854 -204389 -634730 -816935 -733535
44952g33535J80294J79605J32975n347j50362j25181M000k7082k04071j75169
$$ -733535 -553241 -373636 -240661 -246008 -396370 -521551 -517551 -544633 -748704 -923873
44942i23873J61573M05174K63682M2789J27700L09515J60769j50770q6734K91385
$$ -923873 -762300 -357126 -93444 -50655 77045 386560 547329 396559 309825 601210
44932F01210L17821j73112m89326j76748K27309Q6566k82085j83824K44520K64607
$$ 601210 919031 745919 256593 79845 307154 393720 111635 -72189 172331 436938
44922D36938k14000n13476l36991j60912k74137k55175J95432O07384M58174J674
$$ 436938 222938 -290538 -627529 -788441 -1062578 -1317753 -1122321 -514937 -56763 -55089
44912e5089j94470j26792j68213l03682j92947J44427L04103J47922j3905O1323
$$ -55089 -249559 -376351 -544564 -848246 -1041193 -896766 -592663 -444741 -458646 -397323
44902c97323K48343L25374K22327l5428l43990m72828k77086M4380J71702J17903
$$ -397323 -148980 176394 398721 363293 19303 -453525 -730611 -686231 -514529 -396626
44892c96626J63448L58094M28079K24062o2827k22961k78996l01496k28270j2217
$$ -396626 -233178 124916 552995 777057 714230 491269 212273 -89223 -317493 -329710
44882c29710K32734L54427L04619J09758j51916l19297k66108p9591L8643M7798
$$ -329710 -96976 257451 562070 671828 519912 200615 -65493 -145084 -106441 -58643
44872e8643O2531J03328Q6169L9088N4507M1248j41175k93055n1721M30330M82522
$$ -58643 3888 107216 193385 232473 286980 328228 187053 -106002 -157723 272607 755129
44861G55129j22554o75817m60862J86259L49311j28161m71559j84493K65717K63742
$$ 755129 632575 -43242 -504104 -317845 31466 -96695 -568254 -752747 -487030 -223288
44851b23288k7968m7427K36213L58125J74910N0547J71200K11454r0259m42048
$$ -223288 -251256 -298683 -62470 295655 470565 521112 692312 903766 813507 371459
44841C71459m11666n1729K31790K49618J26241l4689k17998l06204j90439m2340
$$ 371459 -40207 -91936 139854 389472 515713 481024 263026 -43178 -233617 -275957
44831b75957j03452k18468j1541M21542N02146M5659l49844j47312L11768L16269
$$ -275957 -379409 -597877 -609418 -187876 314270 359929 10085 -137227 174541 490810
44821D90810j56118m32735j15039M42056O71712M28246k6918l81995m89210m01147
$$ 490810 334692 -98043 -213082 228974 900686 1328932 1302014 920019 430809 29662
44811B9662k82352k04181o8261J59114K70269Q9386j88754k09778M1977K33825
$$ 29662 -252690 -456871 -525132 -366018 -95749 -6363 -195117 -404895 -362918 -129093
44801a29093J56232o1859k08279k01972m6945J74393K51999N1064k16427j90337
$$ -129093 27139 -34720 -242999 -444971 -491916 -317523 -65524 -14460 -230887 -421224
44791d21224J29173L46897K19164l1643o7390J23696K81549K25349K7308r4276
$$ -421224 -292051 54846 274010 242367 174977 298673 580222 805571 832879 738603
44781G38603j6549J09130n352l70738n98221l88379L1773K46782K50226L10978
$$ 738603 722054 831184 825832 455094 -143127 -531506 -499733 -252951 -2725 308253
44771C08253L85369J80737k12049l12769K027K72025J64063q3261j65601j77704
$$ 308253 693622 874359 662310 349541 351568 623593 787656 704395 538794 361090
44761C61090k62059k50153l5959R5919n7840j76074Q6907M64200M57399J16131
$$ 361090 99031 -151122 -187081 -91162 -149002 -325076 -238169 226031 683430 799561
44751G99561j13463j43885k54279m25761l03776J08529L14735P6277k08180j42740
$$ 799561 686098 542213 287934 -137827 -441603 -333074 -18339 57938 -150242 -292982
44741b92982P5550N1270j48053j33770J64824L93765K86462k0410k33738k44668
$$ -292982 -217432 -166162 -314215 -447985 -283161 110604 397066 376656 142918 -101750
44731a01750j34037N249J25005J74866J27453N2784O7241J63470J71497k6808
$$ -101750 -235787 -230538 -105533 69333 196786 249570 316811 480281 651778 624970
44721F24970k99839m00029k74582j08226n0458n5478l6784j4746j9785L229P8688
$$ 624970 325131 -74898 -349480 -457706 -508164 -563642 -600426 -615172 -634957 -631728 -553040
44710e53040J17454P0477L4571P0027N7755q0451j57807L2126L25644L35933L788
$$ -553040 -435586 -365109 -330538 -260511 -202756 -283207 -441014 -408888 -83244 252689 256477
44699B56477k76590j76107J56360L42465K51244M2281j33415k38730k04350N4108
$$ 256477 -20113 -196220 -39860 302605 553849 596130 462715 223985 19635 73743
44689G3743L93753M52557R0882l22996l24417J1732J55528j08976l42722q8249
$$ 73743 467496 920053 1010935 687939 363522 375254 530782 421806 79084 -9165
44679i165M34537O00372J96725l75055o53293n43613k19002P6832J08591j50989
$$ -9165 425372 1025744 1222469 847414 194121 -349492 -568494 -491662 -383071 -534060
44669e34060l65159j85914K17461L41725J00544m5574J59515L61126J98585j17490
$$ -534060 -899219 -1085133 -867672 -525947 -425403 -470977 -311462 49664 248249 130759
44659A30759j89831m0372O8992J25249K38334K65833L3746k36054j99312K2180
$$ 130759 -59072 -99444 -30452 94797 333131 598964 632710 396656 197344 219524
44649B19524K0117j91378j79432J47922L22219M3378l29878l12703J6593K05130
$$ 219524 239641 48263 -131169 16753 338972 382350 52472 -260231 -243638 -38508
44639c8508J03329k573J13810K94884K54526j9972k56151k35983l1944J18358
$$ -38508 64821 62248 176058 470942 725468 705496 449345 213362 181418 299776
44629B99776P9400j06690l18844m10122k49959J02884L37209K34526J6931L8340
$$ 299776 379176 272486 -46358 -456480 -706439 -603555 -266346 -31820 -14889 23451
44619B3451J75344k9021n52701p66032l50273J91054L11624J99358K64982L28673
$$ 23451 198795 169774 -382927 -1148959 -1499232 -1308178 -996554 -797196 -532214 -203541
44609b03541P980m04548k52962L97059P57323M46391p8824l34689l84753l98633
$$ -203541 -195561 -600109 -853071 -456012 301311 747702 668878 334189 -50564 -449197
44599d49197k60253O9561K87512J69636j03717k79371l33725k67951p551L01483
$$ -449197 -709450 -639889 -352377 -182741 -286458 -565829 -899554 -1167505 -1175056 -873573
44589h73573L28015R9687M8973K73385K81751j59581m74978j13019N05691N36150
$$ -873573 -545558 -445871 -396898 -123513 158238 -1343 -476321 -589340 -83649 452501
44579D52501n4080m86518l24945L7002J20434Q497J7450J47297J71615M4130o7760
$$ 452501 398421 -88097 -413042 -376040 -255606 -247109 -229659 -82362 89253 133383 65623
44568F5623p1246o2038j39668k31677j79855J7561J53456Q3619m2279R376J76438
$$ 65623 -5623 -67661 -207329 -439006 -618861 -601300 -447844 -364225 -406504 -397128 -220690
44557b20690J79833j3813j07429N6461K42243K07605P3245P8575J79184J41818
$$ -220690 -40857 -54670 -162099 -105638 136605 344210 417455 496030 675214 817032
44547H17032q8656l30107l87184k02091J12596L12924K42430M4108n4136j33490
$$ 817032 728376 398269 11085 -191006 -78410 234514 476944 521052 466916 333426
44537C33426m02352o32462l32136L61679O19781J19788l49207n8114M93514L75812
$$ 333426 -68926 -701388 -1033524 -671845 -52064 67724 -281483 -339597 153917 529729
44527E29729k69328n00428j13382J53873l8189j48112J43653L41595R2830j30161
$$ 529729 260401 -240027 -353409 -199536 -237725 -385837 -242184 99411 192241 62080
44517F2080R8393L31069J1078n01474m70736K0087K44062R510j53558L2422K06862
$$ 62080 160473 491542 502620 1146 -469590 -449503 -205441 -195931 -349489 -317067 -110205
44506a10205J16615O9712L33023N95674M32299l1667l15883k60578j48105k20055
$$ -110205 6410 76122 409145 1004819 1437118 1405451 1089568 828990 680885 460830
44496D60830l71304l55170j05122K01693L10649J08528k51653m46518k71455J48796
$$ 460830 89526 -265644 -370766 -169073 141576 250104 -1549 -448067 -719522 -570726
44486e70726M68195M39450J18670k16433l17809j58362P7819J75050O8264j26538
$$ -570726 -102531 336919 455589 239156 -78653 -237015 -159196 15854 84118 -42420
44476d2420k32048j53607N7419K48370K93730K11575J30983J18120Q8153m6583
$$ -42420 -274468 -428075 -370656 -122286 171444 383019 514002 632122 720275 673692
44466F73692k01301k14637j02884o4909j88129k99593k09043K6601K15687K96831
$$ 673692 472391 257754 154870 89961 -98168 -397761 -606804 -580203 -364516 -67685
44456f7685L11779K03685j01789m16822l83803L2912L90010K92187j02470l27742
$$ -67685 244094 447779 345990 -70832 -454635 -421723 -31713 260474 158004 -169738
44446a69738k19941j1767J07058K03673L35340L57769J47512j60182l06954k00051
$$ -169738 -389679 -401446 -294388 -90715 244625 602394 749906 589724 282770 82719
44436H2719J9351J23925j4648k84773l69999p4717L67555N09104K65278L7403
$$ 82719 102070 225995 211347 -73426 -443425 -518142 -150587 358517 623795 661198
44426F61198J33941L26538K19196j41127l47301k43251j11000j97127l36414k00564
$$ 661198 795139 1121677 1340873 1199746 852445 609194 498194 301067 -35347 -235911
44416b35911K32117O12565N86710J47527l58643n43456l12894Q2180L06625K14986
$$ -235911 -3794 608771 1195481 1343008 984365 440909 128015 210195 516820 731806
44406G31806j00815m08191m40902p5649M60583O82919L39339k45055m99516k60874
$$ 731806 630991 222800 -218102 -293751 166832 849751 1189090 944035 444519 183645
44396A83645Q7006J27498j31214l72315l79624k21906j06765j29228j49760N5329
$$ 183645 270651 398149 266935 -105380 -485004 -706910 -813675 -942903 -1092663 -1037334
44386a037334M60759O91888M34069r1107l10286k5767L07356K02644k00825l86479
$$ -1037334 -576575 115313 549382 458275 147989 122222 429578 632222 431397 44918
44376D4918k01176L0053R7704J88303M29878N52293L07144n7088j37313j7984
$$ 44918 -156258 -126205 -28501 159802 589680 1141973 1449117 1392029 1254716 1236732
44366A236732j02567l62630l01030K07708N76120L15461k45772m71125l06259
$$ 1236732 1134165 771535 470505 678213 1254333 1569794 1324022 852897 546638
44357E46638j70730k06722j94930r7409j09663j89365r0027R9931K6017k27371
$$ 546638 375908 169186 -25744 -123153 -232816 -422181 -512208 -412277 -386260 -613631
44347f13631j16265M62968Q60630N97487M9898k03918k08588k88219l29894m4995
$$ -613631 -729896 -266928 593702 1191189 1241087 1037169 828581 540362 210468 165473
44337A65473L49062L66376K3287k23742k14242j88787k21940j30202M7575L8475
$$ 165473 514535 880911 904198 680456 466214 277427 55487 -74715 -27140 11335
44327A1335j32500j26520J00401J94686M7773J5104K73046M48154K00591k17209
$$ 11335 -121165 -247685 -147284 47402 95175 110279 383325 831479 1032070 814861
44317H14861l33850j02955J51722K10693P9727j77443m38789m89699k47859O2724
$$ 814861 481011 378056 529778 740471 820198 642755 203966 -285733 -533592 -470868
44307d70868J58849L0721j28301j99829j71494j3084K58296M46513L25436n2131
$$ -470868 -312019 -281298 -409599 -609428 -780922 -794006 -535710 -89197 236239 184108
44297A84108l37538k46998J09940L22163J26642k63797l85458j02018K10213J75654
$$ 184108 -153430 -400428 -290488 31675 158317 -105480 -490938 -592956 -382743 -207089
44287b07089p5288j51596L959J02095K5645j5952J02296J99606R5102j39969l47379
$$ -207089 -282377 -433973 -430014 -327919 -302274 -318226 -215930 -16324 78778 -61191 -408570
44276d08570m51878l68416j06N34630Q89435Q38875M81966M9044k83158l54825
$$ -408570 -860448 -1228864 -1228970 -694340 195095 1033970 1515936 1564980 1281822 926997
44266I26997q8846L05336M52140K44630o8420k84748m45624n57950m70937j86049
$$ 926997 838151 1143487 1595627 1840257 1771837 1487089 1041465 483515 12578 -173471
44256a73471L2104L5185j4983L692l9727j94668k33219m7109R7058N752n8122
$$ -173471 -141367 -106182 -121165 -117473 -157200 -351868 -585087 -632196 -535138 -529386 -587508
44245e87508J90994N12711M53167M2262k42294j46313Q2129Q8433j71128m23798
$$ -587508 -396514 116197 569364 611626 369332 223019 305148 393581 222453 -201345
44235b01345l53731O3285M29815L08410j83522m42536j95923J09011J0920k40975
$$ -201345 -555076 -491791 -61976 246434 62912 -379624 -575547 -466536 -455616 -696591
44225f96591j07088L58012N67742K69401j29242j49549J86160M55863L12189j65463
$$ -696591 -803679 -445667 122075 391476 262234 112685 298845 754708 1066897 901434
44215I01434m97964k95920K01372L30809j08941n42171m51443j02593n081o0848
$$ 901434 403470 107550 308922 639731 530790 -11381 -462824 -565417 -570498 -631346
44205f31346J33463M26756K97794j91069l62434O9542N96950O75255L35254j18583
$$ -631346 -497883 -71127 226667 35598 -326836 -257294 339656 1014911 1350165 1231582
44195A231582m95848o13831l08993J87226L16618q3049m87902l90076L9848K75049
$$ 1231582 735734 121903 -187090 136 316754 233705 -254197 -644273 -604425 -329376
44185c29376J38490j08793j92747q0459P9706J08080l1098j55763r9030K2977
$$ -329376 -190886 -299679 -492426 -572885 -493179 -385099 -416197 -571960 -670990 -648013
44175f48013Q598l3093J57532M49643L93708o3359l92582k15323J86607L43303
$$ -648013 -639415 -672508 -514976 -65333 328375 265016 -127566 -342889 -156282 187021
44165A87021K14932N2447m5499j25343j66200j58800k12485l60877m41594l39230
$$ 187021 401953 454400 408901 283558 117358 -41442 -253927 -614804 -1056398 -1395628
44155a395628j43834N4077K60713L70838K20154k0548N3975L84376L72917j57246
$$ -1395628 -1539462 -1485385 -1224672 -853834 -633680 -654228 -600253 -215877 157040 -206
44145b06m98946q4288N41574M78075j64590m79907j68001J47231L2731j67011
$$ -206 -499152 -583440 -41866 436209 271619 -208288 -376289 -229058 -196327 -363338
44135c63338q2402Q3956P3312P5642K82635M17326J84188j76331k60089j38334
$$ -363338 -445740 -361784 -288472 -212830 69805 487131 671319 494988 234899 96565
44125I6565j36497k04510n1195K15756J71419j70457k52694J75961N96940M44047
$$ 96565 -39932 -244442 -295637 -79881 91538 -78919 -331613 -155652 441288 885335
44115H85335p6288l17412j23790N9897m4235j75439o4028J02532L7038j19591
$$ 885335 809047 491635 367845 427742 383507 208068 144040 246572 283610 164019
44105A64019n559L57416N40797K94057j54574m47828m94852m10917k73641r8189
$$ 164019 158460 515876 1056673 1350730 1196156 748328 253476 -157441 -431082 -529271
44095e29271N7560J02026j142j86420k83042j00576L44979P11668O31000J67229
$$ -529271 -471711 -369685 -370827 -557247 -840289 -940865 -595886 115782 746782 914011
44085I14011k07701j65871J25220K81098J48016j35752l56041l66971j60056P7628
$$ 914011 706310 540439 665659 946757 1094773 959021 602980 236009 75953 153581
44075A53581R5247j14466k66721j55222P9732J89416J57405J16846P5387l7816
$$ 153581 248828 134362 -132359 -287581 -207849 -18433 138972 255818 331205 293389
44065B93389j36975m9048J88867L20970J97183o0844k54483l21332l01525k13470
$$ 293389 156414 107366 296233 617203 814386 753542 499059 177727 -123798 -337268
44055c37268m2798J99350M51574O07581N50130K45579j65762m19699l30829K0005
$$ -337268 -380066 -180716 270858 878439 1428569 1674148 1508386 1088687 757858 777863
44045G77863L09552K43995j40097m84018m82758k13704k019p584q9562o9920M4853
$$ 777863 1087415 1331410 1191313 707295 224537 10833 8814 1230 -88332 -158252 -113399
44034a13399J59666K51259L26647L17548J31241k10635n35565o31569m28984j04214
$$ -113399 46267 297526 624173 941721 1072962 862327 326762 -304807 -733791 -838005
44024h38005O5250J4813l3150R7183K69309K68111J48114J05047J23504M9294
$$ -838005 -772755 -757942 -791092 -693909 -424600 -156489 -8375 96672 220176 269470
44014B69470p5860q3530k2252p5324j79683j16762N2323Q4725O0630K57495M99245
$$ 269470 193610 110080 87828 12504 -167179 -283941 -231618 -146893 -86263 171232 670477
44003F70477K75333l42036o04187k13833J60951m4593l95013k51180J40717J42213
$$ 670477 945810 603774 -413 -214246 -53295 -97888 -492901 -744081 -603364 -461151
43993d61151j48011j42276J36399J31501j72651j86034K03604L74649M1757k25864
$$ -461151 -609162 -751438 -615039 -483538 -656189 -842223 -638619 -263970 -222213 -448077
43983d48077M8179M56938L82508l4531j72149J11035L42904J83960j41145k29317
$$ -448077 -399898 57040 439548 405017 232868 343903 686807 870767 729622 500305
43973E00305l6501J17735l161k35927k40349q87J10824j08535l23928j22307L37055
$$ 500305 463804 581539 578378 342451 102102 101215 212039 103504 -220424 -342731 -5676
43962e676M94356J37960l67728n76662l67620J05133N38032N87009J88125k52482
$$ -5676 488680 626640 258912 -317750 -685370 -580237 -42205 544804 732929 480447
43952D80447l08058r6755l4786j48969j25372L2163j0426k28144j64810K82863
$$ 480447 172389 75634 40848 -108121 -233493 -201330 -211756 -439900 -604710 -321847
43942c21847O08279M68777J57599J2325r5004l11226l75127r8997J67703O1971
$$ -321847 286432 755209 912808 925133 830129 518903 143776 44779 212482 274453
43932B74453j73913j25775N4502p3175m32971n12556j74270J64693J92323P8894
$$ 274453 100540 -25235 29267 -43908 -476879 -989435 -1163705 -999012 -806689 -727795
43922g27795J03957K64092L64317K66399o701k50837k10033J01410L19396J91630
$$ -727795 -623838 -359746 4571 270970 264269 13432 -196601 -95191 224205 415835
43912D15835l2734K8699K74356K56301j15075m19061l40561o5131Q5416J03051
$$ 415835 383101 411800 686156 942457 827382 408321 67760 2629 88045 191096
43902A91096J65533K65695K22610O743j49232l1285K47565L33034O2553k94920
$$ 191096 356629 622324 844934 851677 702445 671160 918725 1251759 1314312 1019392
43892A019392l74491k11913j55543k84344k53789J30444N17445M71754R0592j69274
$$ 1019392 644901 432988 277445 -6899 -260688 -130244 387201 858955 949547 780273
43882G80273j29250j8842n1701j85356k75598k16514L8150L74200N10635L23030
$$ 780273 651023 632181 580480 395124 119526 -96988 -58838 315362 825997 1149027
43872A149027P4533O7125J82401Q7742k04317l67196l05791k53082k98068k48764
$$ 1149027 1223560 1290685 1473086 1560828 1356511 989315 683524 430442 132374 -116390
43862a16390o0960K8909l2119N8406M06934N94005K65397k47821l49217m3505
$$ -116390 -177350 -148441 -180560 -122154 284780 878785 1144182 896361 547144 503639
43852E03639J01398j72265m56595l25004O6643K77759K04088Q3954L3817p2764
$$ 503639 605037 432772 -23823 -348827 -282184 -4425 199663 283617 317434 244670
43842B44670k65665l34529j43051J36335K56658K00743Q8381o2053k57110l33463
$$ 244670 -20995 -355524 -498575 -362240 -105582 95161 183542 121489 -135621 -469084
43832d69084j26880J96575K79051Q2044l9325J17894K80421J30174j73278j97055
$$ -469084 -595964 -399389 -120338 -38294 -77619 40275 320696 450870 277592 80537
43822H0537J34936M07316K51723j71551l50901m5040L75940L29904k17971o02245
$$ 80537 215473 622789 874512 702961 352060 307020 682960 1012864 794893 192648
43812A92648k69502M35300O64458J80914l90932m91510k77249j21894Q09K27640
$$ 192648 -76854 358446 1022904 1203818 812886 321376 44127 -77767 -76958 150682
43802A50682L42181J37823o7317J24998M35217K44823l74713o57103k73135J76579
$$ 150682 492863 630686 563369 688367 1123584 1368407 993694 336591 63456 240035
43792B40035P6885l23942l56148J00465N29937N08477J37959k26616l94483m02805
$$ 240035 316920 -7022 -363170 -262705 267232 775709 913668 687052 292569 -110236
43782a10236l15287r3974K79611N99836N25050M036n20103n58772j61851J96925
$$ -110236 -425523 -519497 -239886 359950 885000 889036 368933 -189839 -351690 -154765
43772a54765K66000K27078K39015J49492j55103m13747k94678J09961L66770K47373
$$ -154765 111235 338313 577328 726820 571717 157970 -136708 -26747 340023 587396
43762E87396j6938o2141J62891L59044K48176r6661l48478l21605j48096k3490
$$ 587396 570458 508317 671208 1030252 1278428 1181767 833289 511684 363588 340098
43752C40098N8238J75344K26261M4549k68492l64445p0354L54898M69148J02324
$$ 340098 398336 573680 799941 844490 575998 211553 141199 496097 965245 1067569
43742A067569m52595o85994l64062J96558M44022K08725j52838k69561j59300
$$ 1067569 614974 -71020 -435082 -238524 205498 414223 261385 -8176 -167476
43733a67476n588J55510K87530J95099j48325l63749j46693K28356L08148J57912
$$ -167476 -173064 -17554 269976 465075 316750 -46999 -193692 34664 342812 500724
43723E00724J51589K36705L3643l69843m01587P7023M55146K45432k27918l40214
$$ 500724 652313 889018 922661 552818 151231 228254 683400 928832 700914 360700
43713C60700R497M01497M52851J17908l53464n79256l64940M1080K24899J45763
$$ 360700 370197 771694 1224545 1342453 988989 409733 44793 85873 310772 456535
43703D56535R5077J52320J12294k7394r848J65264J99357Q1132J23015K53659
$$ 456535 551612 703932 816226 788832 778984 944248 1143605 1224737 1347752 1601411
43693A601411k9327o99775r36469l06317M58596M89407Q016j90179j112N4711
$$ 1601411 1572084 872309 -64160 -370477 88119 577526 585542 395363 394251 448962
43683D48962j53266k50784j08554M4472J70942L94095M89068J08243m95043o56018
$$ 448962 295696 44912 -63642 -19170 151772 545867 1034935 1143178 648135 -7883
43673g883k64378J06789J12649K7908R7507J43313M1678J2052J50831J75662p4186
$$ -7883 -272261 -165472 -52823 -24915 72592 215905 257583 269635 420466 596128 521942
43662E21942l10629k47489k668J86591K75837K28795o1109m10064l43580K04542
$$ 521942 211313 -36176 -38844 147747 423584 652379 591270 181206 -162374 42168
43652D2168N97946L18002k56886l69910N1381L67518J65164k72071m71294l39668
$$ 42168 640114 958116 701230 331320 382701 750219 915383 643312 172018 -167650
43642a67650q9418J16091K52287L13237K67394J17319o3881j72995j59766o6455
$$ -167650 -257068 -140977 111310 424547 691941 809260 745379 572384 412618 346163
43632C46163L2777J03860J25324N8980n5509o4903P2995J14524j67604n42847
$$ 346163 378940 482800 608124 667104 611595 546692 619687 734211 566607 23760
43622B3760n11436k479M58722M50621J99089J48607K60757J37613k64678m74492
$$ 23760 -487676 -490155 -31433 419188 618277 766884 1027641 1165254 900576 426084
43612D26084j50824M17235O48208L46197j53653m56093n13404m87726l75715j9975
$$ 426084 275260 692495 1340703 1686900 1533247 1077154 563750 76024 -299691 -319666
43602c19666M76477O30902J39314n76092p32159j44731N03181N15440K5274k82591
$$ -319666 156811 787713 927027 350935 -381224 -525955 -22774 492666 517940 235349
43592B35349r7434K24775K51615j572k46342l33396k77603n7942L22048O24783
$$ 235349 137915 362690 614305 612733 366391 32995 -244608 -302550 19498 644281
43582F44281N25284N3420l39271l01627Q006K07910K01134J35148J4127k56236
$$ 644281 1169565 1222985 883714 582087 590093 798003 999137 1134285 1148412 892176
43572H92176m70674k34482L78202O92292K49284n32411q37855m08929K74624O15325
$$ 892176 421502 187020 565222 1257514 1506798 974387 136532 -272397 2227 617552
43562F17552M23805m6129l30505j31801L35132N28685K78364J5456N8789N9314
$$ 617552 1041357 995228 664723 532922 868054 1396739 1675103 1690559 1749348 1808662
43552A808662l87237r15883q19541j29147M21093M77360M18726N36476N61797
$$ 1808662 1421425 505542 -313999 -443146 -22053 455307 874033 1410509 1972306
43543A972306K69875m4499n1884R9809R6697q0985l00517n33073o91916n48546
$$ 1972306 2242181 2197682 2145798 2245607 2342304 2261319 1960802 1427729 735813 187267
43533A87267r6208K94217L33542J53441k675q9421p3227J50192M05508K55970
$$ 187267 91059 385276 718818 872259 869584 780163 706936 857128 1262636 1518606
43523A518606l04299o34806l28343J42254J43759j73924k42086k8069N5336l5670
$$ 1518606 1214307 579501 251158 393412 537171 363247 121161 93092 148428 112758
43513A12758K5562K19985J76615j00655j73493O0575J75876j6760j15041J69398
$$ 112758 138320 358305 534920 434265 260772 321347 497223 480463 365422 534820
43503E34820M69647L22131j13166l22100j86833l9904p2254q5548J11600L50630
$$ 534820 1004467 1326598 1213432 891332 704499 664595 592341 506793 618393 969023
43493I69023L14705j5075l13108l41309k62003l44864m67731k38059L33391O75064
$$ 969023 1283728 1268653 955545 614236 352233 7369 -460362 -698421 -365030 310034
43483C10034M19221k6190n8627K39724L08876L9134j04456R0873K27625k7184
$$ 310034 729255 703065 644438 884162 1193038 1232172 1127716 1218589 1446214 1419030
43473A419030l98204m45782k03490k7362l4785l2417J00419K36015J98569j8307
$$ 1419030 1020826 575044 371554 344192 309407 276990 377409 613424 811993 793686
43463G93686k36800k48462m0639J29238J8393k36890k40816J15921M47759L49156
$$ 793686 556886 308424 267785 397023 415416 178526 -62290 53631 501390 850546
43453H50546q9710m06455l01612R7149M45407N31896M21190K98226J97932k4253
$$ 850546 760836 354381 52769 149918 595325 1127221 1548411 1846637 2044569 2020316
43443B020316l85129n93475m02168l8777M3255j62115j76940K03746N22394L15246
$$ 2020316 1635187 1041712 639544 600767 644022 481907 304967 508713 1031107 1346353
43433A346353j54981k40432J56278M35833J46997l95827n47983j67236K63761
$$ 1346353 1191372 950940 1107218 1543051 1690048 1294221 746238 579002 842763
43424H42763L00236N4488p0773J0420q296k87095n09371k87059K66845O30695
$$ 842763 1142999 1197487 1126714 1137134 1128838 841743 332372 45313 312158 942853
43414I42853M92107M1261l41193m52175k93002K6212L01149L31872J33200n8208
$$ 942853 1434960 1476221 1135028 682853 389851 416063 717212 1049084 1182284 1124076
43404A124076o1887N6732J11158j088k31883l93894k57463J77144N16000L37753
$$ 1124076 1062189 1118921 1230079 1228991 997108 603214 345751 522895 1038895 1376648
43394A376648k22626n41183k83046J72736K90145Q7870j5125J19351K11622Q1446
$$ 1376648 1154022 612839 329793 502529 792674 880544 865419 984770 1196392 1277838
43384A277838o4922J8263K40803L23210J72208o0313k15711k63156k19927j00037
$$ 1277838 1212916 1231179 1471982 1795192 1967400 1907087 1691376 1428220 1208293 1108256
43374A108256J4242p684j47040j65358J03088M40684M41262M8334l16154k69147
$$ 1108256 1122498 1114814 967774 802416 905504 1346188 1787450 1835784 1519630 1250483
43364A250483P0765K89401J96683m1156j86774j65815o4667k1712p4823p2929
$$ 1250483 1321248 1610649 1807332 1766176 1579402 1413587 1348920 1327208 1252385 1179456
43354A179456J23148L30719K10369j62582k70482P0578L32750O9426l27524k31857
$$ 1179456 1302604 1633323 1843692 1681110 1410628 1481206 1813956 1883382 1555858 1324001
43344A324001J85640K45667j02468k33828P0212L04732J55766l1342M5337J71722
$$ 1324001 1509641 1755308 1652840 1419012 1489224 1793956 1949722 1918380 1963717 2135439
43334B135439J61796K20596M12493M01999J19308N3911M34235P44580N80572L51793
$$ 2135439 2297235 2517831 2930324 3332323 3451631 3505542 3939777 4684357 5264929 5616722
43324E616722N06235O70000L23401j97066k50978m0152k46471p85711r20018n12764
$$ 5616722 6122957 6792957 7116358 6919292 6668314 6628162 6381691 5595980 4675962 4163198
43314D163198j88506k14975j83709N5028P4486k41384l63982n0294J82985k7928
$$ 4163198 3974692 3759717 3576008 3631036 3705522 3464138 3100156 3049862 3232847 3204919
43304C204919k35357M141K90261L6267m99374n78150j13272K82096K87518K49347
$$ 3204919 2969562 2973703 3263964 3300231 2800857 2222707 2109435 2391531 2679049 2928396
43294B928396M72188O89829N06638L8084k04861J7790L65551L51412l8313l41416
$$ 2928396 3400584 4090413 4597051 4635135 4430274 4448064 4813615 5165027 5126714 4785298
43284D785298k49456N401O5122K457J25514L80857L93555Q7025j77414j48543
$$ 4785298 4535842 4541243 4606365 4608822 4734336 5115193 5508748 5595773 5418359 5269816
43274E269816L5671K04281L63848M25186J68328l14370n60692l71301j08425j01429
$$ 5269816 5305487 5509768 5873616 6298802 6467130 6152760 5592068 5220767 5112342 5010913
43264E010913j58978Q325K71378L69389L64077L92183K83255j11870m80313m37458
$$ 5010913 4851935 4860260 5131638 5501027 5865104 6257287 6540542 6428672 5948359 5510901
43254E510901j52954p0291j62053k4560L58037N22288K50185j22360k38777j42513
$$ 5510901 5357947 5287656 5125603 5101043 5459080 5981368 6231553 6109193 5870416 5727903
43244E727903m4832m0508j56784l39593l26889P2364N00372L25777m27862r28809
$$ 5727903 5683071 5642563 5485779 5146186 4819297 4891661 5392033 5717810 5289948 4361139
43234D361139o23863j1656J23820j32362n2791N40806J005514Q62888M22932J60569
$$ 4361139 3737276 3725620 3849440 3717078 3664287 4205093 5210607 6073495 6496427 6656996
43224F656996L245l16703n69170k72542M69858R40519P18292J76061j08307n1460
$$ 6656996 6660241 6343538 5774368 5501826 5971684 6912203 7630495 7806556 7698249 7646789
43214G646789P5539J47469K05469K23656K21936M18601Q72041J136636P62075
$$ 7646789 7722328 7869797 8075266 8298922 8520858 8939459 9811500 10948136 11710211
43205A1710211O4549j44168L42335Q41483P87106N01644O29733J201932J685861
$$ 11710211 11774760 11630592 11972927 12814410 13601516 14103160 14732893 15934825 17620686
43196A7620686J740631J525473J368668J457828J827655K410365L059563L616181
$$ 17620686 19361317 20886790 22255458 23713286 25540941 27951306 31010869 34627050
43188C4627050L972524M148172M424257N263594O836837Q785786J0833916J3410009
$$ 34627050 38599574 42747746 47172003 52435597 59272434 68058220 78892136 92302145
43180I2302145J7049408K1327891K5182083K8121006K9917258K9088125K3602147
$$ 92302145 109351553 130679444 155861527 183982533 213899791 242987916 266590063
43173B66590063J4166771N022483o19953m948489j2828228k4748660l5014474
$$ 266590063 280756834 285779317 285159364 280210875 267382647 242633987 207619513
43166B07619513l7883480l3551375k6770762k1211425j7063858j3251143r703351
$$ 207619513 169736033 136184658 109413896 88202471 71138613 57887470 48184119
43159D8184119p051361n494966m702897m244948l741133k983733k150493j627269
$$ 48184119 41132758 35637792 30934895 26689947 22948814 19965081 17814588 16187319
43151A6187319j519099j562156j516447j391258j282111j206893j110782r04404
$$ 16187319 14668220 13106064 11589617 10198359 8916248 7709355 6598573 5694169
43143E694169n64126k69701k57407m36705m25521j23839Q2016p5273l00295k37873
$$ 5694169 5130043 4860342 4602935 4166230 3740709 3616870 3698886 3623613 3323318 3085445
43133C085445p6366k06469n32402o05002k95521R9734L26984L67656K66722J11877
$$ 3085445 3009079 2802610 2270208 1665206 1369685 1469419 1796403 2164059 2430781 2542658
43123B542658O8166J35294N4666k38638l48598J466M25095M09489J19153Q2156
$$ 2542658 2610824 2746118 2800784 2562146 2213548 2215014 2640109 3049598 3168751 3250907
43113C250907L12934M07973L32326L72139M08545N4139m74627m91332j5808N3777
$$ 3250907 3563841 3971814 4304140 4676279 5084824 5138963 4664336 4173004 4157196 4210973
43103D210973o97857j449666j262150l42948L59521L79099J1555l01576l66267
$$ 4210973 3513116 2063450 801300 458352 817873 1196972 1208527 906951 540684
43094E40684k05923j8140k7841j70603j33442J53213L82134L65441K74371K26166
$$ 540684 334761 316621 288780 118177 -15265 137948 520082 885523 1159894 1386060
43084A386060Q3696j40696j85630p1904j64279m21574k46058N02082J033334P46584
$$ 1386060 1469756 1329060 1143430 1071526 907247 485673 239615 741697 1775031 2521615
43074B521615J63321M7986K12822M6342k95778k25713J04603K3492m42612o08125
$$ 2521615 2684936 2732922 2945744 2992086 2696308 2470595 2575198 2598690 2156078 1547953
43064A547953l27522j39093j87149l4772L15026K60780k57723m76599p6259K26638
$$ 1547953 1220431 1081338 894189 859417 1174443 1435223 1177500 700901 624642 851280
43054H51280j02045m83388j98796M33111O17123K71199j00222l00921m69465n15468
$$ 851280 749235 265847 67051 500162 1117285 1388484 1288262 987341 517876 2408
43044B408k40281J52113K67134J17613J8962M5831M8286K6822M6089k5973k48080
$$ 2408 -237873 -85760 181374 298987 317949 363780 412066 438888 484977 459004 210924
43033B10924l00843O5386M97065M76103J08335p3577N0947J18539m0122k16401
$$ 210924 -89919 -24533 472532 948635 1056970 983393 1034340 1152879 1112757 896356
43023H96356k85952l28057k99212q6191J37918J03324n1660J9118K18896J36729
$$ 896356 610404 282347 -16865 -103056 34862 138186 86526 105644 324540 461269
43013D61269j93809l04172j09220m1660k35304k69918K8512K17104J8303j58230
$$ 461269 267460 -36712 -145932 -187592 -422896 -692814 -664302 -447198 -428895 -587125
43003e87125P3993L93835L24234L2740K1049L27873N77447N93264M64179J82908
$$ -587125 -513132 -119297 204937 237677 258726 586599 1164046 1757310 2221489 2404397
42993B404397k91311p20358p79468n05199k01539N843J84281K87028K09184P2965
$$ 2404397 2113086 1392728 613260 108061 -93478 -87635 96646 383674 592858 665823
42983F65823R4326K15791K03421M4945q7818k01116m21909o12688m61577j1778
$$ 665823 760149 975940 1179361 1224306 1136488 935372 513463 -99225 -560802 -572580
42973e72580K90053J98814j1062L813J71856J86779j9896k13086j87867m437J12229
$$ -572580 -282527 -83713 -94775 -90962 80894 267673 247777 34691 -153176 -157613 -45384
42962d5384L4088j35886k04116j36058o8018o2820k8640M5954M464j67191j87500
$$ -45384 -11296 -147182 -351298 -487356 -555374 -618194 -646834 -600880 -596416 -763607 -951107
42951i51107J01796L84895K89498j3787n3338J93244K70876p685k71881j86838
$$ -951107 -849311 -464416 -174918 -188705 -242043 -48799 222077 214392 -57489 -244327
42941b44327R1678K56939K69601J98354r873l04648l74434o3880K74219K18375
$$ -244327 -152649 104290 373891 572245 562372 257724 -116710 -180590 93629 312004
42931C12004r1255j68488O1718J78494j6410j54527R9775M61103L93914j04855
$$ 312004 220749 52261 113979 292473 276063 121536 221311 682414 1076328 971473
42921I71473m84482l88468o3680Q9213N8167P9564J79356J71285K1065r9823j09693
$$ 971473 486991 98523 34843 124056 182223 261787 441143 612428 633493 533670 423977
42910D23977q2517k0966J28402K14661K445l63606m20911q5321J42693o6713l48732
$$ 423977 341460 320494 448896 663557 666002 302396 -118515 -203836 -61143 -127856 -476588
42899d76588k57434R567J0653j50294m9924K47204K67363o1473l07606k39394
$$ -476588 -734022 -724455 -713802 -864096 -914020 -666816 -399453 -460926 -768532 -1007926
42889a007926l9583J79345M49564N24383Q9330m97698m41866K80998P32821L88500
$$ -1007926 -1047509 -868164 -418600 105783 195113 -302585 -744451 -463453 269368 657868
42879F57868r0351J1506L12923P3525n02675o03825j30816K15852O9040j90088
$$ 657868 567517 579023 891946 965471 462796 -141029 -271845 -55993 13047 -177041
42869a77041j89706m7535L4086Q6412J30297O6608n6068m4295Q4594J10647K4157
$$ -177041 -366747 -414282 -380196 -293784 -163487 -96879 -152947 -197242 -112648 -2001 22156
42858B2156M9242J97413J94955m2769k36983j75367J2149J34145J89433K10895
$$ 22156 71398 268811 463766 420997 184014 8647 20796 154941 344374 555269
42848E55269J39540j6954j43242k22276l33137l91301k01666J37590K24686q2428
$$ 555269 694809 677855 534613 312337 -20800 -412101 -613767 -476177 -251491 -333919
42838c33919l96657l16160L6012K31394J19249o0578o0274R2015J85552R2207
$$ -333919 -730576 -1046736 -1010724 -779330 -660081 -720659 -780933 -688918 -503366 -411159
42828d11159p5441o7496K00243M89633M85220J51323k65412n11153m63219j20688
$$ -411159 -486600 -554096 -353853 135780 621000 772323 506911 -4242 -467461 -588149
42818e88149L19383M86573K19558j43808j50729J56575L37704J98205m2487j98412
$$ -588149 -268766 217807 437365 293557 142828 299403 637107 835312 792825 594413
42808E94413l02667l15605j07727J63259J20385k18857l45927o922L83342L66215
$$ 594413 291746 -23859 -131586 31673 152058 -66799 -412726 -419648 -36306 329909
42798C29909R3524L795J52863K52060J66842J9287q1529j26841j20825j07628
$$ 329909 423433 427228 580091 832151 998993 1018280 936751 809910 689085 581457
42788E81457j71073k68171k30569m5796Q6459Q4959Q6900J00730p0221l73033
$$ 581457 410384 142213 -88356 -134152 -47693 37266 124166 224896 154675 -218358
42778b18358m00535l0341K57092Q3910j98083o0244L57192M98892K56830P779
$$ -218358 -618893 -649234 -392142 -308232 -506315 -566559 -209367 289525 546355 554134
42768E54134o7150j34406k37268k03952l9980M2513Q864J5788N4519j5381r9955
$$ 554134 486984 352578 115310 -88642 -128622 -86109 -77245 -61457 -6938 -22319 -122274
42757a22274K8044K59357K27667r3729l10742k07104q801N9757Q6283J87525K64664
$$ -122274 -94230 165127 392794 299065 -11677 -218781 -227582 -167825 -81542 105983 370647
42746C70647K09599P8815o1765k09145k67526j07738J45297J87878j8115j86269
$$ 370647 580246 659061 597296 388151 120625 12887 158184 346062 327947 141678
42736A41678j76549j87060l43345m31893k46383O0980J91969R6930j1651O8055
$$ 141678 -34871 -221931 -565276 -997169 -1243552 -1182572 -990603 -893673 -905324 -837269
42726h37269L28213N42433M72038J87129N7447K34352L50210O4899l12359k39250
$$ -837269 -509056 33377 505415 692544 749991 984343 1334553 1399452 1087093 847843
42716H47843J76650L20124M5583j67264r7174q8387k79383k75619O4855K34964
$$ 847843 1024493 1344617 1390200 1222936 1125762 1037375 757992 482373 547228 782192
42706G82192o7584l50122j56876J10761j04918m92813l49222K38279N07388J85727
$$ 782192 714608 364486 207610 318371 213453 -279360 -628582 -390303 117085 302812
42696C02812k19683k75039q6707J20704K84040K82911j1478l71948l90496j00174
$$ 302812 83129 -191910 -278617 -157913 126127 409038 397560 25612 -364884 -465058
42686d65058N7449m1223l2522K36835L82357J15590k54909k95752p2681O0153
$$ -465058 -407609 -448832 -481354 -244519 137838 253428 -1481 -297233 -369914 -309761
42676c09761M2249R6190K61414K96431O7236k09255k11897Q2286L35106K22922
$$ -309761 -267512 -171322 90092 386523 453759 244504 32607 114893 449999 672921
42666F72921j61011l97549k67811j4596L8289p6480j29551j03174j31124j59121
$$ 672921 511910 114361 -153450 -168046 -129757 -206237 -335788 -438962 -570086 -729207
42656g29207k5931J70838J62205l3834j04747N9117K11678J75500P6431L8691
$$ -729207 -755138 -584300 -422095 -455929 -560676 -501559 -289881 -114381 -37950 741
42646G41k9314j89685k98332k40046j03200K0903J77598L52005L75469J88792
$$ 741 -28573 -218258 -516590 -756636 -859836 -838933 -661335 -309330 66139 254931
42636B54931j2110m1298N8920J74871K71390K74532O8004k44280l41621j35141
$$ 254931 242821 201523 260443 435314 706704 981236 1049240 804960 463339 328198
42626C28198N2992l0300j80238r0016J50924K33804J20809J9744n327n5867j01358
$$ 328198 381190 350890 170652 80636 231560 465364 586173 605917 600590 544723 443365
42615D43365K345J99111K37374M0218j65019j53696L2790J80076J24704j30226
$$ 443365 445710 644821 882195 922413 757394 603698 636488 816564 941268 811042
42605H11042l97461m11781r5685K79625L42188M9986k49856k22429R7228L81637
$$ 811042 413581 1800 -93885 185740 527928 577914 328058 105629 202857 584494
42595E84494L63501O7309k63281m16305l67385k01071K2517K20370K06078j10182
$$ 584494 947995 1015304 752023 335718 -31667 -232738 -210221 10149 216227 106045
42585A06045m45002l59965J26949M41153J90072k47597k02557L60115P80872N68388
$$ 106045 -338957 -698922 -571973 -130820 59252 -188345 -390902 -30787 750085 1318473
42575A318473k5656l99625l03567K0151K32832K39026J58927J00028L1466j16979
$$ 1318473 1292817 893192 589625 609776 842608 1081634 1240561 1340589 1372055 1255076
42565A255076k96368l68334k83439j20783M7415J79825J58631r7385l48428j82722
$$ 1255076 958708 590374 306935 186152 233567 413392 572023 474638 126210 -56512
42555e6512L60318O51791K86135k64088k67606J97643L78599J796l54313k08561
$$ -56512 303806 955597 1241732 977644 710038 907681 1286280 1288076 933763 725202
42545G25202J10377P0745k10808k27396P5027K46650O3584j57399o7258K22030
$$ 725202 835579 906324 695516 468120 543147 789797 853381 695982 628724 850754
42535H50754L20130O8420k72076k99739J00245N93192P06637L47312q2156j57844
$$ 850754 1170884 1239304 967228 667489 767734 1360926 2067563 2414875 2332719 2174875
42525B174875R3968L27018L53308K96254L35862N16646P94085J068656J163270
$$ 2174875 2268843 2595861 2949169 3245423 3581285 4097931 4892016 5960672 7123942
42516G123942R75119P06281P52368J253913J883013K171119J959767J467352J021382
$$ 7123942 8099061 8805342 9557710 10811623 12694636 14865755 16825522 18292874 19314256
42507A9314256Q03465P49372N86001K8592r44355k008749k726461k854409k457786
$$ 19314256 20117721 20867093 21453094 21481686 20537331 18528582 15802121 12947712 10489926
42498A0489926j820706j263498r33398p18411m42985j51625o0353k08395l56015
$$ 10489926 8669220 7405722 6472324 5753913 5310928 5159303 5098950 4890555 4534540
42489D534540l11119j49241J6633K49934N71438P58594O61874N50098P90032J291121
$$ 4534540 4223421 4074180 4090813 4340747 4912185 5670779 6332653 6882751 7672783 8963904
42479H963904J646885J760563J904914K164295K284944K166818K026446J896097
$$ 8963904 10610789 12371352 14276266 16440561 18725505 20892323 22918769 24814866
42471B4814866J434899N07298m89940j216517j889964k769974l498826l486437
$$ 24814866 26249765 26757063 26267123 25050606 23160642 20390668 16891842 13405405
42463A3405405k746415j853037j215969q59773p60809q78881r39216o91312l34824
$$ 13405405 10658990 8805953 7589984 6730211 5969402 5090521 4151305 3459993 3125169
42454C125169k20437k43045q3617P8611j95588o85660o54128n1523K86187l7521
$$ 3125169 2904732 2661687 2578070 2656681 2461093 1775433 1121305 1069782 1355969 1318448
42444A318448l32030j6879L66718J00089m33712l62186K15227M06688J200k57074
$$ 1318448 986418 969539 1336257 1436346 1002634 640448 855675 1262363 1263563 1006489
42434A006489M8495L75114J69365k99521m73309l18900j57131p3070M1490J02263
$$ 1006489 1054984 1430098 1599463 1299942 826633 507733 350602 277532 319022 421285
42424D21285o4736l20358k85280J30443N12463L97708j27609m39716r1533N66058
$$ 421285 356549 36191 -249089 -118646 393817 791525 663916 224200 132667 698725
42414F98725P17052R2239o43763p18426j86704K76244K86928L9772j80127k93850
$$ 698725 1415777 1508016 864253 145827 -40877 235367 522295 562067 381940 88090
42404H8090k50213R87K87948L44985K21811K02925K81335J34857k73633n15691
$$ 88090 -162123 -161136 126812 471797 693608 896533 1177868 1312725 1039092 523401
42394E23401l11263N9515J84379L0952j84342l19419k75594L1287M10560M22466
$$ 523401 212138 271653 456032 486984 302642 -16777 -292371 -261084 149476 571942
42384E71942l5799m55522l57680N4724K55159J62846J05546J71017J05565j45967
$$ 571942 536143 80621 -277059 -222335 32824 195670 301216 472233 577798 431831
42374D31831k77198j16830R7217J13572K1052m920l8417k01952l17681j15242
$$ 431831 154633 37803 135020 248592 269644 264724 226307 24355 -293326 -408568
42364d08568K61966L34135k7802l35830j54407K38067K50227j10803k46070P4617
$$ -408568 -146602 187533 159731 -176099 -330506 -92439 157788 46985 -199085 -124468
42354a24468L24990O5938l31132k65415J58773L43063J18684j37439k02355k15576
$$ -124468 200522 266460 -64672 -330087 -171314 171749 290433 152994 -49361 -264937
42344b64937j98499K9230L68059M37133J84836k7807p7130k38149n31055n40620
$$ -264937 -463436 -434206 -66147 370986 555822 528015 450885 212736 -318319 -858939
42334h58939j68115P0651j11772k39462J22877N80688N27031J08068q5450L5926
$$ -858939 -1027054 -956403 -1068175 -1307637 -1184760 -604072 -77041 31027 -54423 -18497
42324a8497R2028j8839o1186j0434m7410j00984L4955K15709J32140j06618j42894
$$ -18497 73531 54692 -6494 -16928 -64338 -165322 -130367 85342 217482 110864 -32030
42313c2030k9647j01620k53231m5776M25679N15802O4410k66076j1117L75515
$$ -32030 -61677 -163297 -416528 -462304 -36625 479177 543587 277511 266394 641909
42303F41909K64593j96311l96911j88875L4774J2722j00848r2931J3171O2239
$$ 641909 906502 710191 313280 124405 159179 171901 71053 -21878 -8707 53532
42293E3532k4993j76854k30471j06243O0205O7481p1138j54955r8681q879M1031
$$ 53532 28539 -148315 -378786 -485029 -424824 -357343 -428481 -583436 -682117 -690996 -649965
42282f49965Q1332R1800L8911N8693K81883M71879K36494l27535o47584m82355
$$ -649965 -568633 -476833 -437922 -379229 -97346 374533 611027 283492 -364092 -846447
42272h46447k38177k36662j81852K29164O20638M48216q3370k59645P5060L18089
$$ -846447 -1084624 -1321286 -1503138 -1273974 -653336 -205120 -288490 -548135 -473075 -154986
42262a54986N4825l59893l92327o4948K12697K62678K50755L17188L92851L58365
$$ -154986 -100161 -460054 -852381 -917329 -704632 -441954 -191199 125989 518840 877205
42252H77205J78810j19325m43198o00868m36893n5772K18101J86272j0021j04749
$$ 877205 1056015 936690 493492 -107376 -544269 -600041 -381940 -195668 -205689 -310438
42242c10438l5607O6646J24750J62111J46592J4796j34658j19860k021m8637k55582
$$ -310438 -346045 -279399 -154649 7462 154054 168850 34192 -85668 -87689 -136326 -391908
42231c91908k37219J75291N48412M11654m2466k51667j01845L5939q34K4055J96633
$$ -391908 -629127 -453836 94576 506230 463764 212097 110252 146191 145357 169412 366045
42220C66045K42834M0225j14784K971J59625M8429k18253k99655j25778N5972
$$ 366045 608879 649104 534320 537291 696916 745345 527092 227437 101659 157631
42210A57631L3374j52834k83056j73340J04135K32749L6034k25495j96434K8028
$$ 157631 191005 38171 -244885 -418225 -314090 -81341 -45307 -270802 -467236 -439208
42200d39208P5501l8699Q0117M68820O32876L16328q3965j73944j35380k60502
$$ -439208 -363707 -402406 -322289 146531 779407 1095735 1011770 837826 702446 441944
42190D41944l67390j57836J85881K62318O7877r9681j45239j63790j33272l0412
$$ 441944 74554 -83282 102599 364917 432794 333113 187874 24084 -109188 -139600
42180a39600l4560k02302j93175K09358N69745L61265j59281k85663N5947K65986
$$ -139600 -174160 -376462 -569637 -360279 209466 570731 411450 125787 181734 447720
42170D47720J00070n949K09746L59458R2013l21770m66648l93868l57665k98967
$$ 447720 547790 541841 751587 1111045 1203058 881288 414640 20772 -336893 -635860
42160f35860j6752L70303N21287L23842k6173k97432l67825k14040M6792J98937
$$ -635860 -652612 -282309 238978 562820 536647 239215 -128610 -342650 -295858 -96921
42150i6921J60171O4732J0350r5125k75361k78712J02716O10937P10970K28278
$$ -96921 63250 127982 138332 43207 -232154 -510866 -408150 202787 913757 1142035
42140A142035m13729o67105m29306m8312J41353J36539J11043J06982L9902n1818
$$ 1142035 728306 61201 -368105 -416417 -275064 -138525 -27482 79500 119402 67584
42130F7584R96J88040K29844l3314l45985l61364j30834J719p1436r7277J03305
$$ 67584 68580 256620 486464 453150 107165 -254199 -385033 -383314 -454750 -552027 -448722
42119d48722L36689K90024n3507l56159k64353J84322N11638L04908k01094l20467
$$ -448722 -112033 177991 124484 -231675 -496028 -311706 199932 504840 303746 -16721
42109a6721J62268O15066M17257j45905l44831j13605l9661l06697l82873M4184
$$ -16721 145547 760613 1177870 1031965 687134 573529 533868 227171 -155702 -111518
42099a11518M84118L81357n9769k53973j03407J936j35446l09003l29580k62836
$$ -111518 372600 753957 694188 440215 336808 338744 203298 -105705 -435285 -698121
42089f98121j93534n5221J80508L32728J95318j49554l40209j40214K30328L36022
$$ -698121 -891655 -946876 -766368 -433640 -238322 -387876 -728085 -868299 -637971 -301949
42079c01949J14631k6145J60387L35712J00430l22060m08700j94563k08096n27950
$$ -301949 -187318 -213463 -53076 282636 383066 61006 -347694 -542257 -750353 -1278303
42069a278303n54299M0285P04645P51129K88946l2138O5563K86175L28039K30222
$$ -1278303 -1832602 -1792317 -1087672 -336543 -47597 -79735 -14172 272003 600042 830264
42059H30264J49055Q8371n6289k91557m20183k08756K45045M54563J23892l35156
$$ 830264 979319 1067690 1011401 719844 299661 90905 335950 790513 914405 579249
42049E79249k83694K00353M06415Q0564k22312j13397l650l05677o23724l85131
$$ 579249 295555 495908 902323 982887 760575 647178 643528 337851 -285873 -671004
42039f71004J73011L70512J44887J0761J22781J15135j45379l27267k43385j10188
$$ -671004 -497993 -127481 17406 28167 150948 266083 120704 -206563 -449948 -560136
42029e60136p2472J8247K01837K48232P6316n8510K4488J63128J52765K6100r2817
$$ -560136 -632608 -614361 -412524 -164292 -87976 -146486 -121998 41130 193895 219995 127178
42018A27178j47340p5772J39997K86123Q7050l48349n66277l63342l2859J07816
$$ 127178 -20162 -95934 44063 330186 417236 68887 -497390 -860732 -893591 -785775
42008g85775J19412J99698L26263L50449K38352M0306j97372l49644k45349N8647
$$ -785775 -666363 -466665 -140402 210047 448399 488705 291333 -58311 -303660 -245013
41998b45013K27827N5058k37896k83633l8895J98675J71784q2571l29256l81862
$$ -245013 -17186 37872 -200024 -483657 -522552 -323877 -152093 -234664 -563920 -945782
41988i45782k45103m9162J20640K62461L35649K63338J24623J23052K17333O5772
$$ -945782 -1190885 -1240047 -1119407 -856946 -521297 -257959 -133336 -10284 207049 272821
41978B72821l91981o12632j57974N18000N88731N3096k75584k6261K36224L4585
$$ 272821 -119160 -731792 -889766 -371766 216965 270061 -5523 -31784 204440 239025
41968B39025k32308j8195M20628M33763j4001l70819l40605j13470J39741M31896
$$ 239025 6717 -11478 409150 842913 828912 458093 117488 4018 143759 575655
41958E75655O17258M18387q8026m42978m16809k87069l32342l91207j88350J53126
$$ 575655 1192913 1611300 1523274 1080296 663487 376418 44076 -347131 -535481 -382355
41948c82355K59834O5516j03174k3753J19201O6627r3282q6808N9696K6487k45078
$$ -382355 -122521 -57005 -160179 -183932 -64731 1896 -91386 -178194 -118498 -92011 -337089
41937c37089l50284q294M28274M17587J5734k15843l4703K19959K38756J33359
$$ -337089 -687373 -695667 -267393 150194 165928 -49915 -84618 135341 374097 507456
41927E07456O0170p5687k78472k53147J10315M04744K64260m2742k9120K44842
$$ 507456 567626 491939 213467 -39680 70635 475379 739639 696897 667777 912619
41917I12619L26247J29526m930M8539O3365M337J39212M41279M27547r0493n51218
$$ 912619 1238866 1368392 1363462 1412001 1475366 1479703 1618915 2060194 2487741 2397248 1846030
41906A846030l78331J45229K61251j56835m50636j87107K23767K05277j10879
$$ 1846030 1467699 1612928 1874179 1717344 1266708 1079601 1303368 1508645 1397766
41897A397766j52200J62962L25763J01871p1216J73077M67825K66280k57004m49535
$$ 1397766 1245566 1408528 1734291 1836162 1764946 1938023 2405848 2672128 2415124 1965589
41887A965589j87443N222j30305k22945j7270J63476N9116o409K55670M51644
$$ 1965589 1778146 1783368 1653063 1430118 1412848 1576324 1635440 1629031 1884701 2336345
41877B336345R8538m95201o33294k90924n0823r9468n4201J83809J93942j41276
$$ 2336345 2434883 1939682 1306388 1015464 964641 865173 810972 994781 1188723 1047447
41867A047447l07362l065L14673J78145j34238j24226P2725j6039l29530l70468
$$ 1047447 740085 737020 1051693 1229838 1095600 971374 1044099 1028060 698530 328062
41857C28062p4684O8863j63995l73797k01821J15331J55894n7768j83759j04687
$$ 328062 253378 322241 158246 -215551 -417372 -302041 -146147 -203915 -387674 -492361
41847d92361M490M8042R7512J10330r1055m30941m73777K6093O47326P24318K19747
$$ -492361 -487871 -439829 -342317 -231987 -323042 -753983 -1227760 -1201667 -554341 169977 389724
41836C89724j96210n5865K80490J98793k44365m18528o3271L45837L03500m7549
$$ 389724 193514 137649 418139 616932 372567 -45961 -109232 236605 540105 492556
41826D92556j99114K4645L39178M15381J59585l13233p21972p06332j62411M92564
$$ 492556 293442 318087 657265 1072646 1232231 918998 197026 -509306 -671717 -179153
41816a79153O54277K14620k93199l37424K744K18782L2482l26191m76061l34828
$$ -179153 475124 689744 396545 59121 61865 280647 313129 -13062 -489123 -823951
41806h23951j27652l5296K9950K38028M98470M66329o733n41779n77448o3741
$$ -823951 -951603 -986899 -956949 -718921 -220451 245878 239145 -302634 -880082 -943823
41796i43823M29895M23957J09409j8857R9832J11527p6956j42350K1200L3290
$$ -943823 -513928 -89971 19438 581 100413 211940 134984 -7366 13834 47124
41786D7124k84742m18067J13823Q44258Q42720K3038p14043p19799l02857J0224
$$ 47124 -237618 -655685 -541862 302396 1145116 1168154 454111 -265688 -568545 -558321
41776e58321K20107M43610L82863j65557o84836n14445J66664N80491M34610J25028
$$ -558321 -338214 105396 488259 322702 -362134 -876579 -709915 -129424 305186 430214
41766D30214n9064k33392l75913j95125K50915M30926J38046j29137O2685M10801
$$ 430214 371150 137758 -238155 -433280 -182365 248561 386607 257470 320155 730956
41756G30956L95509O5694j69890k28146l16109m09864k95777n8155k7929k03560
$$ 730956 1126465 1192159 1022269 794123 478014 68150 -227627 -285782 -313711 -517271
41746e17271j63132K93546P51334O65384O4541m67617m80265j32319R5755K9869
$$ -517271 -680403 -386857 364477 1029861 1094402 626785 146520 14201 109956 139825
41736A39825p1931j5629J9102j34987k36889j4272K75972J83624j43162j26779
$$ 139825 67894 52265 71367 -63620 -300509 -314781 -38809 144815 1653 -125126
41726a25126K57642L78533L57l23338k46946k18463n25786n65836J24312P98734
$$ -125126 132516 511049 511406 188068 -58878 -277341 -803127 -1368963 -1244651 -445917
41716d45917N10868k91095l74023L21806O34093J12158l43457j08786J76407j18551
$$ -445917 64951 -226144 -600167 -278361 355732 467890 124433 15647 192054 73503
41706G3503m67027j77243L30572K39289k62987l23971J69619N03739L11241k9531
$$ 73503 -393524 -570767 -240195 -906 -263893 -587864 -418245 85494 396735 367204
41696C67204j57149j45852j03626K4340J65035J37891J2930R042O2198n3820k47787
$$ 367204 210055 64203 -39423 -15083 149952 287843 300773 309815 372013 318193 70406
41685G0406k46751j24111j43801j71020J18758M90773L56977k04295m37035j08787
$$ 70406 -176345 -300456 -444257 -615277 -496519 -5746 351231 146936 -290099 -398886
41675c98886J15518j52686l35697O4136N10611L03954j96838j40108M02524N59960
$$ -398886 -283368 -436054 -771751 -707615 -197004 106950 -89888 -229996 172528 732488
41665G32488O7896l96406l64820j96603k83759l77687j25193K63146L47387J20619
$$ 732488 800384 403978 39158 -157445 -441204 -818891 -944084 -680938 -333551 -212932
41655b12932p4151o2131P1448K30917L44376K80652R812k41113k27583j2577J49331
$$ -212932 -287083 -349214 -277766 -46849 297527 578179 587991 346878 119295 106718 256049
41644B56049J77903K05832K94779L27520K07617R381j20789j22830n2402l727
$$ 256049 433952 639784 934563 1262083 1469700 1479081 1358292 1235462 1183060 1179333
41634A179333j1738j4460M8885R2017o1378l98371o04301l87068J19594M45968
$$ 1179333 1167595 1153135 1202020 1294037 1232659 834288 229987 -157081 -37487 408481
41624D08481L18614l9796k32860j92223j80576l19271l46461K030N19335O96544
$$ 408481 727095 687299 454439 262216 81640 -237631 -584092 -582062 -62727 633817
41614F33817L69073n8183j33968J08173L05730K67392R1524q3611j86265j37875
$$ 633817 1002890 944707 810739 918912 1224642 1492034 1583558 1499947 1313682 1175807
41604A175807N9021J84831K1713k82537l38589n0585K38496K25568K1668q6460
$$ 1175807 1234828 1419659 1441372 1158835 820246 769661 1008157 1233725 1255393 1168933
41594A168933l7531J3666k6325q0617k8830J14693J30193k07462p28958q43661
$$ 1168933 1131402 1145068 1118743 1038126 1009296 1123989 1254182 1046720 317762 -525899
41584e25899k28705N71982O96132J19257k75046N7316N69743M79261j09739m44696
$$ -525899 -754604 -182622 513510 632767 357721 415037 984780 1464041 1354302 909606
41574I09606j86687K90816N14738L70902K5837k49359k44175o1462o1169l25223
$$ 909606 722919 1013735 1528473 1899375 1925212 1675853 1431678 1370216 1309047 983824
41564I83824m52024j83365J26093R3983k8706J38624L17978M3765l58973j77236
$$ 983824 531800 348435 474528 568511 539805 678429 996407 1040172 681199 503963
41554E03963M22756N26897o0022n06839l51600j53499l22295l46236J40789M74629
$$ 503963 926719 1453616 1393594 886755 535155 381656 59361 -286875 -146086 328543
41544C28543L7302n46923l27422M12378O17541J35847k12614r2647l2283k72099
$$ 328543 365845 -181078 -508500 -96122 521419 657266 444652 352005 319722 47623
41534D7623l30748n805J55464j74835m61872j57672M29289O51664M22052Q0292
$$ 47623 -283125 -288930 -133466 -308301 -770173 -927845 -498556 153108 575160 655452
41524F55452k21145m67580m44755p102M95337N45256J30570k82387l57963j52310
$$ 655452 434307 -33273 -478028 -485130 10207 555463 686033 403646 45683 -106627
41514a06627J23781K76980J56555j72666l47717j04493K95662L51099Q388k68283
$$ -106627 17154 294134 450689 278023 -69694 -174187 121475 472574 480962 212679
41504B12679j63140Q1849O9695j94673l74602k95606j21827l5798M0726K62714
$$ 212679 49539 131388 201083 6410 -368192 -663798 -785625 -821423 -780697 -517983
41494e17983N11125M62174N4038l44951l98210k34874j72277j83010j6998K35755
$$ -517983 -6858 455316 509354 164403 -233807 -468681 -640958 -823968 -840966 -605211
41484f05211J92730j43318k63529P3621M26184L62585J38231K13710M38203K96849
$$ -605211 -412481 -555799 -819328 -745707 -319523 43062 181293 395003 833206 1130055
41474A130055j97506m68899k37551J24474J99817L1908j26331j79472j23339O0326
$$ 1130055 932549 463650 226099 350573 550390 582298 455967 276495 153156 213482
41464B13482K51361K11067o0509k38343j22315P6908J02441M9563J33466K61057
$$ 213482 464843 675910 615401 377058 254743 331651 434092 483655 617121 878178
41454H78178J66148j14677k30442j3932K64973K50415n8307l48655l94373k67391
$$ 878178 1044326 929649 699207 685275 950248 1200663 1142356 793701 399328 131937
41444A31937j51946r7696o0245o9374j50285j24489K09315O25823N69489o8863
$$ 131937 -20009 -117705 -177950 -247324 -397609 -522098 -312783 313040 882529 813666
41434H13666o29226n19672o8105j0018l50897m24333l3720K40245M9463j56385
$$ 813666 184440 -335232 -403337 -413355 -764252 -1188585 -1222305 -982060 -932597 -1088982
41424a088982N5634L81941L77449K18049K78825L90112J64129k49804l87539k20550
$$ -1088982 -1033348 -651407 -273958 -55909 222916 613028 777157 527353 139814 -80736
41414h0736o2655N7025K67809L03039j67001p40940o48303M7179M36691J28410
$$ -80736 -143391 -86366 181443 484482 317481 -423459 -1071762 -1024583 -587892 -459482
41404d59482k17359l5390K78672J66362j20619j7736L58528M26141Q4308k03459
$$ -459482 -676841 -712231 -433559 -267197 -387816 -405552 -47024 379117 463425 259966
41394B59966j58099K7129J15947J10199Q7678P3422P8119O7943k9154j49126j05797
$$ 259966 101867 128996 244943 355142 442820 516242 594361 662304 633150 484024 378227
41383C78227P6462J19018l3904n3585J81775K54121j18186m80107k81079K05576
$$ 378227 454689 573707 539803 486218 667993 922114 803928 323821 42742 248318
41373B48318K71019j25108l64187k08379p5074j88231j82618J94079N82923N46198
$$ 248318 519337 394229 30042 -178337 -253411 -441642 -624260 -430181 152742 698940
41363F98940J55930k41595m73864m95709k52840J30334L20021J82631k1575m5881
$$ 698940 854870 613275 139411 -356298 -609138 -478804 -158783 23848 2273 -43608
41353d3608J3740j4300o9070l7007J4300Q24k404N8810P9734Q68q1192j42965
$$ -43608 -29868 -44168 -113238 -150245 -135945 -135121 -137525 -78715 1019 1887 -79305 -222270
41341b22270k93542m54368l16710J52320M90345L26251q6695k47648q8693O6635
$$ -222270 -515812 -970180 -1286890 -1134570 -644225 -317974 -404669 -652317 -741010 -674375
41331f74375N0796j130L5208J25966K15219K75890K50523J11253o0259j67010
$$ -674375 -623579 -624709 -589501 -463535 -248316 27574 278097 389350 329091 162081
41321A62081k01476j90870j55561j55452k06743j53426J24008L85208K83181l2594
$$ 162081 -39395 -230265 -385826 -541278 -748021 -901447 -777439 -392231 -109050 -141644
41311a41644m5331K80383L50784r4208m75828k65767J80109K43534J7008j7104
$$ -141644 -186975 93408 444192 349984 -125844 -391611 -211502 32032 49040 31936
41301C1936J03046r858k57002j86106J40540J79754j78841m39793l13923n1713
$$ 31936 134982 125124 -131878 -317984 -177444 2310 -176531 -616324 -930247 -981960
41291i81960J26751K96659L97852J81214k19489k74559J25604M07082J71584j98170
$$ -981960 -855209 -558550 -160698 20516 -198973 -473532 -347928 59154 230738 32568
41281C2568j55970K16566M27934K66685p6716l32356l15878K770L68642L99831
$$ 32568 -123402 93164 521098 787783 711067 378711 62833 65603 434245 834076
41271H34076N2121l03428l81673k72330j33653L0120J41232M513l06933m14902
$$ 834076 886197 582769 201096 -71234 -204887 -174767 -33535 -29022 -335955 -750857
41261g50857j98723J2100K6952J03040L65423M24565Q778m63141m59293j31170
$$ -750857 -949580 -937480 -910528 -807488 -442065 -17500 -8722 -471863 -931156 -1062326
41251a062326J6447m1537M9637K85375K91146k941k39583k10681q2275p449O1539
$$ -1062326 -1045879 -1087416 -1037779 -752404 -461258 -464199 -703782 -914463 -996738 -1004187 -942648
41240i42648J34358J43654J77424L77456N80556M48289R552l07122k67633r5440
$$ -942648 -808290 -664636 -487212 -109756 470800 919089 928641 621519 353886 258446
41230B58446m1478n8158m5114o2802r9959M9757M17656O24256L26414k50284n34955
$$ 258446 216968 158810 113696 50894 -49065 692 418348 1042604 1369018 1118734 583779
41219E83779l13368O3127J79598K3486j43535j85413j73710j43398M46K50632
$$ 583779 270411 333538 513136 536622 393087 207674 33964 -109434 -108988 141644
41209A41644L58066J20316k72808m14546k01597N3009P6040l7766o1310K7803
$$ 141644 499710 620026 347218 -67328 -268925 -215916 -139876 -177642 -238952 -211149
41199b11149J05364J16684P3152j5999p4039J2093J70258J71328K1625M5815L53910
$$ -211149 -105785 10899 84051 68052 -5987 6106 176364 347692 369317 415132 769042
41188G69042N30144J89698m09428p12883o23068m50912k80373O4768M58492M75390
$$ 769042 1299186 1488884 1079456 366573 -256495 -707407 -987780 -923012 -464520 10870
41178A0870Q7554j77890j6437J87379K878l22820k22654L23310P30838N84782
$$ 10870 98424 -79466 -95903 91476 94354 -228466 -451120 -127810 603028 1187810
41168A187810J08279j94718j01941K09407M07831K54359k50520q08642r73656
$$ 1187810 1296089 1101371 999430 1208837 1616668 1871027 1620507 811865 -161791
41159a61791n33709K06842O45818M76938K726k30693l5814L02761M33390K55484
$$ -161791 -695500 -488658 157160 634098 636824 406131 370317 673078 1106468 1361952
41149A361952j29732n27974o66439l65020J83761N18703M17564J07739j13190
$$ 1361952 1232220 704246 37807 -327213 -143452 375251 792815 900554 787364
41140G87364j98952j70641N2720L91328M73451R7158m00383n72141m63251m23760
$$ 787364 588412 417771 470491 861819 1335270 1432428 1032045 459904 -3347 -427107
41130d27107m92847l87495l3014K86998L24376J28323p8955q8670J43986L64358
$$ -427107 -919954 -1307449 -1340463 -1053465 -729089 -600766 -679721 -768391 -624405 -260047
41120b60047K29436j47727j86954L09235O95310L75533k24215k71560J53045J97175
$$ -260047 -30611 -178338 -365292 -56057 639253 1014786 790571 519011 672056 869231
41110H69231l71979q07356n57755J2016L41617L84590K70825n6305m57908m56582
$$ 869231 497252 -310104 -867859 -855843 -514226 -129636 141189 84884 -373024 -829606
41100h29606O5434N20990M06185j6989k33408k04941j46392k8364J95125K58830
$$ -829606 -764172 -243182 163003 146014 -87394 -292335 -438727 -467091 -271966 -13136
41090a3136K995k27309j02853J10523J8998j87313p3396K68202L95873K54740
$$ -13136 -10141 -237450 -340303 -229780 -210782 -398095 -471491 -203289 192584 447324
41080D47324J25489K4969k10454l90347j86311J94438K22947q6877k09739l1088
$$ 447324 572813 597782 387328 -3019 -189330 5108 228055 141178 -68561 -99649
41070i9649q520k74379l23928R7999M68947K79014j84436l26811j10766P3488
$$ -99649 -108169 -382548 -706476 -608477 -139530 139484 -44952 -371763 -482529 -409041
41060d09041R8131J40846K23268J99700J26760K04294L56826K68405j06251m02994
$$ -409041 -310910 -170064 53204 252904 379664 583958 940784 1209189 1102938 699944
41050F99944l40945r4500j5059j56665k57495j19802J45081K67771J42593n2683
$$ 699944 358999 264499 249440 92775 -164720 -284522 -139441 128330 270923 218240
41040B18240p4620P4017J34619n5233k98885k76299k019J65840L9905j07719K5713
$$ 218240 143620 217637 352256 297023 -1862 -278161 -280180 -114340 -74435 -182154 -156441
41029a56441K44084J01524l63990n70566k06676K97215M00453K05773J56187K46595
$$ -156441 87643 189167 -174823 -745389 -952065 -654850 -254397 -48624 107563 354158
41019C54158J04561k46568l41485p3804P4515j59884l55876j20116K27162J75159
$$ 354158 458719 212151 -129334 -203138 -128623 -288507 -644383 -764499 -537337 -362178
41009c62178j28542j24097K56273M95860K72159j47815l39808j85286J49116M00495
$$ -362178 -490720 -614817 -358544 137316 409475 261660 -78148 -263434 -114318 286177
40999B86177L50213L1470k08487r6959J62518J56004j34841l34584k66134j57251
$$ 286177 636390 667860 459373 362414 524932 680936 546095 211511 -54623 -211874
40989b11874j83558j82328K937J91167J14295j72208l40309j79196J92560M62128
$$ -211874 -395432 -577760 -574823 -383656 -269361 -441569 -781878 -961074 -768514 -306386
40979c06386M15103J37037q2422j03092j10558l02774n05285l53488J53993N66297
$$ -306386 108717 245754 163332 60240 -50318 -353092 -858377 -1211865 -1057872 -491575
40969d91575N33354K12866j3963m1277n6231j65136k33253j28786M6775J02392
$$ -491575 41779 254645 240682 199405 143174 -21962 -255215 -384001 -337226 -234834
40959b34834N4205R1187K18599J71668j41757l41551n9121M16446M39710m4562
$$ -234834 -180629 -89442 129157 300825 159068 -182483 -241604 174842 614552 569990
40949E69990l85421j99899R5437K9779j79714r2432J83282K34923M6821j10335
$$ 569990 184569 -15330 80107 109886 -69828 -162260 21022 255945 302766 192431
40939A92431k35042m50643n19121j38659M05187N31670K35129K6692O7438M4949
$$ 192431 -42611 -493254 -1012375 -1151034 -745847 -214177 20952 47644 115082 160031
40929A60031r5883m1326J86142J64255j17889j43021J88324K71429j64078m82646
$$ 160031 64148 22822 208964 373219 255330 112309 300633 572062 407984 -74662
40919g4662j38640M07674M04330o9210l59341k39011M247J91717L22914K33533
$$ -74662 -213302 194372 598702 529492 170151 -68860 -64613 127104 450018 683551
40909F83551j88285n76188m67107k8529J53804l6216j38400Q1439K89675J84193
$$ 683551 495266 -80922 -548029 -576558 -422754 -458970 -597370 -515931 -226256 -42063
40899d2063n4864j35496r3097r8899j04188M0607K54542K70596R1l09198l40428
$$ -42063 -96927 -232423 -325520 -424419 -528607 -488000 -233458 37138 37229 -271969 -612397
40888f12397p8512J69161J50512l4483j31231j09234j01269l7380K84281O99624
$$ -612397 -690909 -521748 -371236 -405719 -536950 -646184 -747453 -784833 -500552 199072
40878A99072O82556P1990n81266p05611m23331k09489j38939M8282L22656L52088
$$ 199072 881628 953618 372352 -333259 -756590 -966079 -1105018 -1056736 -734080 -381992
40868c81992R3682q9476J2621J85050K02524J62322K12061K21277j7379l91646
$$ -381992 -288310 -377786 -365165 -180115 22409 184731 396792 618069 600690 209044
40858B09044n26411k58935J05015J37559j46799k68613N1139M13455K55415k69043
$$ 209044 -317367 -576302 -471287 -333728 -480527 -749140 -698001 -284546 -29131 -298174
40848b98174m11108Q5578N59091L82964j43766l17984o3729J28178N6648j7679
$$ -298174 -709282 -623704 -64613 318351 174585 -143399 -207128 -78950 -22302 -39981
40838c9981J2870p9326l43816m64457k47396Q9979K74500L00925K60030J39272
$$ -39981 -27111 -106437 -450253 -914710 -1162106 -1072127 -797627 -496702 -236672 -97400
40828i7400l9968j19212m293J78566K39169J32896k6368p1851O9330K37656J57432
$$ -97400 -137368 -256580 -260873 -82307 156862 289758 263390 191539 260869 498525 655957
40817F55957j62633l20486n6682K86809J95509k61835n24750l35452m420J34976
$$ 655957 493324 172838 116156 402965 598474 336639 -188111 -523563 -527983 -393007
40807c93007J06551N2262J2302M0548J71307J98290j08132m81488l40121L27759
$$ -393007 -286456 -234194 -221892 -181344 -10037 188253 80121 -401367 -741488 -413729
40797d13729P56134L92541l28178n94690k65917J36639K42668J58994Q3791L8470
$$ -413729 342405 734946 406768 -187922 -453839 -317200 -74532 84462 168253 206723
40787B06723N884L895l0363j84697l63315l41358p1533K24320L06813J46650j01623
$$ 206723 212607 216502 186139 1442 -361873 -703231 -774764 -550444 -243631 -96981 -198604
40776a98604k42298j62566P6716K72538K83532J84030J38118J63307J33562N193
$$ -198604 -440902 -603468 -526752 -254214 29318 213348 351466 514773 648335 653528
40766F53528r1049m1706M7751m8029l55273n74435l89162J07359M44590L06900
$$ 653528 562479 520773 568524 520495 165222 -409213 -798375 -691016 -246426 60474
40756F0474j04286l61966l27539j85758p9912K7397J54939K20626J95999J40168
$$ 60474 -43812 -405778 -733317 -919075 -998987 -971590 -816651 -596025 -400026 -259858
40746b59858N9207o3092r2878J32551M55988M55978o505n23457o00025k26951
$$ -259858 -200651 -263743 -356621 -224070 231918 687896 681391 157934 -442091 -669042
40736f69042J65096K14850l3132k28507q3069K95922M61715J56370k84572l17638
$$ -669042 -503946 -289096 -322228 -550735 -633804 -337882 123833 280203 -4369 -322007
40726c22007M9456K61587N8953j34677P2539L58747J74694l51540n43858j56491
$$ -322007 -272551 -10964 47989 -86688 -14149 344598 519292 167752 -376106 -532597
40716e32597K98958L11079R204j76467j46563j03577j07501l7328O1928l2994
$$ -532597 -233639 77440 86644 -89823 -236386 -339963 -447464 -484792 -422864 -455858
40706d55858k98000l45098M7815N15721N23787R6213k23031j32229Q9163J16750
$$ -455858 -753858 -1098956 -1051141 -535420 -11633 84580 -138451 -270680 -181517 -64767
40696f4767O3435J60710K76591J25355k25421m31241l53355j36668R0780K56439
$$ -64767 -1332 159378 435969 561324 335903 -95338 -448693 -585361 -494581 -238142
40686b38142J90504j69901m83172l24156K10095O13777O60969N31988K84644k24134
$$ -238142 -47638 -217539 -700711 -1024867 -814772 -200995 459974 991962 1276606 1052472
40676A052472p88213q40263k63397L06778L23320J8655r2175M2734J72831K53759
$$ 1052472 264259 -576004 -839401 -532623 -209303 -190648 -282823 -240089 -67258 186501
40666A86501L27691K22595j35018l72804j47804K43901K58367n8826j81930L6211
$$ 186501 514192 736787 601769 228965 81161 325062 583429 524603 342673 378884
40656C78884J91952M1860j58653j54885o5600o6519p3348M1417J87969K18026
$$ 378884 570836 612696 454043 299158 233558 167039 93691 135108 323077 541103
40646E41103J51952R0482M7336j7184j10149k09140k46041j06623J94928L88025
$$ 541103 693055 783537 830873 813689 703540 494400 248359 141736 336664 724689
40636G24689K25143j25855k47849o8432K7646j95875m22905k36865K39556M78862
$$ 724689 949832 823977 576128 507696 535342 339467 -83438 -320303 -80747 398115
40626C98115K57931o9399o9870K26009M20926K64547r9917l63956l59878j16152
$$ 398115 656046 586647 516777 742786 1163712 1428259 1328342 964386 604508 488356
40616D88356K18695M11050K61544j39365l88201k11752J44093K16399l1103j74696
$$ 488356 707051 1118101 1379645 1240280 852079 640327 784420 1000819 969716 795020
40606G95020K5644K81935K21747j00274l40564l27973j81566p7197n5917j7704
$$ 795020 820664 1102599 1324346 1224072 883508 555535 373969 296772 240855 223151
40596B23151J45189L47491L12578n1481l90059l18848l916R3571j5758R4615M03051
$$ 223151 368340 715831 1028409 976928 586869 268021 264105 357676 341918 436533 839584
40585H39584L29248k63705o64669l52419J94869K86133M7203J639J12142J0274
$$ 839584 1168832 905127 240458 -111961 82908 369041 416244 417883 530025 540299
40575E40299j84400r7364J02261k4460k87442j18807L58265M30190N266k09666
$$ 540299 355899 258535 360796 336336 48894 -69913 288352 718542 723808 514142
40565E14142P2600K52811n4696l22180l3005M12132L54702p2012k18695P5301
$$ 514142 586742 839553 784857 462677 429672 841804 1196506 1124494 905799 981100
40555I81100L67887L42289J34064j8771o9122r4933j64686k57164k29726J8847
$$ 981100 1348987 1691276 1825340 1806569 1737447 1642514 1477828 1220664 990938 1009785
40545A009785L13905L40374O5094k22856l37588l62131l42121j84022M0048Q0633
$$ 1009785 1323690 1664064 1729158 1506302 1168714 806583 464462 280440 320488 401121
40535D01121n2312m6779J47165J54926j78449m30785k26105J72526K78766P9859
$$ 401121 348809 302030 449195 604121 425672 -5113 -231218 -58692 220074 299933
40525B99933p4963l6536P3504J69163K38956K18713R0914k8912q7647j70001k33431
$$ 299933 224970 188434 261938 431101 670057 888770 979684 950772 863125 693124 459693
40514D59693p7302K31885K77572q7427m07344k47071J83838L80798J99907j72253
$$ 459693 382391 614276 891848 804421 397077 150006 333844 714642 914549 742296
40504G42296n47095o75478k83100L93888N66387n2716o07956k28147O06034P09499
$$ 742296 195201 -480277 -763377 -369489 196898 144182 -463774 -691921 -85887 623612
40494F23612k9832n33175k01087L12260K54891j90009m54518m32139k64265J13225
$$ 623612 593780 60605 -140482 171778 426669 236660 -217858 -649997 -914262 -801037
40484h01037O31633P63474J70515n99612o74293q72N92812M71336j19098n10885
$$ -801037 -169404 594070 764585 164973 -509320 -510192 82620 553956 434858 -76027
40474g6027m09651o2443J60212J54018Q2563J03855J78123J76172R8974O3864
$$ -76027 -485678 -548121 -387909 -233891 -151328 -47473 130650 306822 405796 469660
40464D69660R5904Q8374n707r3627j02067p6107n6470J2921J67387L00626K53242
$$ 469660 565564 653938 648231 554604 452537 376430 319960 332881 500268 800894 1054136
40453A054136j041k94521l96391k39211j9807J4289j07873j30074N335L7561j51400
$$ 1054136 1053095 758574 362183 122972 103165 117454 9581 -120493 -115158 -77597 -228997
40442b28997k58799m3234J94770M7678k81140k28006K37629N47213M06028J47964
$$ -228997 -487796 -531030 -336260 -288582 -569722 -797728 -560099 -12886 393142 541106
40432E41106O5587k5601k67795l53779o7083K01668p700m52723m84287K5410N40608
$$ 541106 606693 581092 313297 -40482 -107565 94103 86403 -366320 -850607 -825197 -284589
40421b84589O09275L25572J6229j69373k58067k99107l18485k91058j39532J27755
$$ -284589 324686 650258 666487 497114 239047 -60060 -378545 -669603 -809135 -681380
40411f81380L32922L20585J52937l3379k32707m29521m13736m8826L69825L90987
$$ -681380 -348458 -27873 125064 91685 -141022 -570543 -984279 -1033105 -663280 -272293
40401b72293M1159j80273m218K67760K66809O6740m0290k2746p5585k43450l51418
$$ -272293 -231134 -411407 -415625 -147865 118944 185684 145394 122648 47063 -196387 -547805
40390e47805k74988p6747J24135K75998L79632M35408M08838K35881o9662l21490
$$ -547805 -822793 -899540 -775405 -499407 -119775 315633 724471 960352 890690 569200
40380E69200l31232k06360k52249m75851m78073p2793K90910J32799k49463j41825
$$ 569200 237968 31608 -220641 -696492 -1174565 -1247358 -956448 -823649 -1073112 -1214937
40370a214937M51454O93003J52084m64593k96744M08498O61532J49281l93875
$$ -1214937 -763483 -70480 81604 -382989 -679733 -271235 390297 539578 145703
40361A45703k78236K77700O01536M39945O7030k01576k90702k86029k91052l16362
$$ 145703 -132533 145167 746703 1186648 1253678 1052102 761400 475371 184319 -132043
40351a32043k43966j3883J66335M7745j99395j12248L36665N51469J52397l80130
$$ -132043 -376009 -389892 -223557 -175812 -375207 -487455 -150790 400679 553076 172946
40341A72946l54087J21615L38139O5017k04924j31032r46r0482j29397J58848
$$ 172946 -181141 -59526 278613 343630 138706 7674 6728 -83754 -213151 -54303
40331e4303M15996J21184n11190p15564k56133K39768J98198j36912j76661J37051
$$ -54303 361693 482877 -28313 -743877 -1000010 -760242 -562044 -698956 -875617 -738566
40321g38566L67594L06743J77645J29128k315k78261m07857j80987J40920J92843
$$ -738566 -370972 -64229 113416 242544 240229 -38032 -445889 -626876 -485956 -293113
40311b93113N7093P6398K43671K03936j24234l37117r9760L86506O49345M80146
$$ -293113 -236020 -159622 84049 287985 163751 -173366 -273126 113380 762725 1242871
40301A242871O3697k59010k47421N3880K92327J37479k89391n11915l04507L5013
$$ 1242871 1306568 1047558 800137 854017 1146344 1283823 994432 482517 178010 213023
40291B13023J40152M5965J1506R4585J47602R1387l4718j92508l18760k71898
$$ 213023 353175 399140 410646 505231 652833 744220 709502 516994 198234 -73664
40281g3664J3448L83854O14462O26764M68793J96438j22762l97327n70797n77609
$$ -73664 -60216 323638 938100 1564864 2033657 2230095 2107333 1710006 1139209 561600
40271E61600k71928L39682Q05304N77153k07291p19689m64794R8106K82472J12982
$$ 561600 289672 629354 1434658 2011811 1804520 1084831 620037 718143 1000615 1113597
40261A113597P9053K70713L15175L4396l30576n06821m19908j11127K34532K92469
$$ 1113597 1192650 1463363 1778538 1812934 1482358 975537 555629 444502 679034 971503
40251I71503k1802l13174k09246O4535L3612k54325l00195O6440M65732N45576
$$ 971503 949701 636527 427281 491816 525428 271103 -29092 37348 503080 1048656
40241A048656L61490J36765l208k0077L5952K8142n7338m5788O7412k2301l88444
$$ 1048656 1410146 1546911 1543703 1523626 1559578 1587720 1530382 1484594 1552006 1529705 1141261
40230A141261n61117k16095K11262J96005J9025K34293N74716L31763l35216n02026
$$ 1141261 580144 364049 575311 771316 790341 1024634 1599350 1931113 1595897 1093871
40220A093871O7400N79804N00392K16356J54448J97177L48490J013495K044061
$$ 1093871 1161271 1741075 2241467 2457823 2612271 2809448 3157938 4171433 6215494
40211F215494K345412J173407p27505j943057j951618j337344q11597n56568l57974
$$ 6215494 8560906 9734313 9006808 7063751 5112133 3774789 2963192 2406624 2048650
40202B048650k3178K96699K21695k17100l55246J48540N44080R0696m81243M0215
$$ 2048650 2025472 2322171 2543866 2326766 1971520 2120060 2664140 2754836 2273593 2313808
40192B313808J147567J248705O69645J701725M615940N958207K876803k442860
$$ 2313808 3461375 4710080 5379725 7081450 11697390 17655597 20532400 18089540
40184A8089540n137149l652504r40897K1008n82067j088133j011406r10136r62987
$$ 18089540 12952391 9299887 8358990 8379998 7797931 6709798 5698392 4788256 3825269
$$ [...]
##END NTUPLES=NMR SPECTRUM
##END=
