##TITLE=31Pdec_PR163R_rmk
 D2O, 24 sc
 11.2.2019
##JCAMPDX= 6.0         $$ Bruker NMR JCAMP-DX V2.0
##DATA TYPE= NMR SPECTRUM
##DATA CLASS= NTUPLES
##ORIGIN= UXNMR, Bruker Analytische Messtechnik GmbH
##OWNER= root
$$ XWIN-NMR		Version 3.5
$$ Mon Feb 11 16:04:03 2019 Russian Standard Time (UT+4h)  she@DPX200
##.OBSERVE FREQUENCY= 81.013821
##.OBSERVE NUCLEUS= ^31P
##.ACQUISITION MODE= SIMULTANEOUS
##.ACQUISITION SCHEME= undefined
##.AVERAGES= 24
##.DIGITISER RES= 17
##SPECTROMETER/DATA SYSTEM= spect
##.PULSE SEQUENCE= zgpg30
##.SOLVENT NAME= D2O
##.SHIFT REFERENCE= (INTERNAL, D2O, 0, 182.463)
##AUDIT TRAIL= $$ (NUMBER, WHEN, WHO, WHERE, WHAT)
$$ ##TITLE= Audit trail, XWIN-NMR		Version 3.5
$$ ##JCAMPDX= 5.01
$$ ##ORIGIN= Bruker BioSpin GmbH
$$ ##OWNER= she
$$ F:/spectra/data/she/nmr/P31/1/pdata/1/auditp.txt
$$ ##AUDIT TRAIL=  $$ (NUMBER, WHEN, WHO, WHERE, WHAT)
(   1,<2019-02-11 16:00:45.48 +0400>,<she>,<DPX200>,
      <created by zg, POWCHK disabled, PULCHK disabled
       configuration hash MD5:
       00 E9 B6 7A A2 85 ED C7 34 08 36 98 17 FE 4E 26
       data hash MD5: 32K
       D5 17 3A F5 3D 70 A1 E7 05 BE 1B 83 AE F8 E6 EF>)
(   2,<2019-02-11 16:02:03.14 +0400>,<she>,<DPX200>,
      <Start of raw data processing
       efp BC_mod = 2 LB = 1 FT_mod = 6 PKNL = 1 PHC0 = -1460.89 PHC1 = 77.39893 SI = 64K 
       data hash MD5: 64K
       DF 10 FB F4 48 95 C9 FD 4A A1 50 09 D1 C8 BE F3>)
(   3,<2019-02-11 16:02:19.81 +0400>,<she>,<DPX200>,
      <pk PHC0 = -16.06477 PHC1 = 0 
       data hash MD5: 64K
       28 C5 B9 3C 8D 33 EF 1C D2 A8 76 4D 90 AE C0 37>)
(   4,<2019-02-11 16:02:28.85 +0400>,<she>,<DPX200>,
      <abs ABSG = 5 
       data hash MD5: 64K
       08 2D 65 84 B9 C9 31 B5 F7 F7 61 2C 2F 06 BA DA>)
$$ ##END=
$$ 
$$ hash MD5
$$ 46 6B FF 97 CB 8C A9 44 7A 7D 0D C7 B4 86 85 F4
##$RELAX= 
##$RELAX= 
##$RELAX= 
##$RELAX= 
##$RELAX= 
##$RELAX= 
##$RELAX= 
##$RELAX= 
$$ Bruker specific parameters
$$ --------------------------
##$DU= <F:/spectra>
##$EXPNO= 1
##$NAME= <P31>
##$PROCNO= 1
##$TYPE= <nmr>
##$USER= <she>
##$AMP= (0..31)
100 100 100 100 100 100 100 100 100 100 100 100 100 100 100 100 100 100 
100 100 100 100 100 100 100 100 100 100 100 100 100 100 
##$AQSEQ= 0
##$AQ_mod= 1
##$AUNM= <au_zg>
##$AUTOPOS= <>
##$BF1= 81.014009
##$BF2= 200.13
##$BF3= 200.13
##$BF4= 200.13
##$BF5= 200.13
##$BF6= 200.13
##$BF7= 200.13
##$BF8= 200.13
##$BYTORDA= 1
##$CFDGTYP= 0
##$CFRGTYP= 5
##$CHEMSTR= <none>
##$CNST= (0..31)
1 1 145 1 1 1 1 1 1 1 1 1 1 1 1 1 1 1 1 1 1 1 1 1 1 1 1 1 1 1 1 1 
##$CPDPRG= <waltz16>
##$CPDPRG1= <>
##$CPDPRG2= <waltz16>
##$CPDPRG3= <>
##$CPDPRG4= <mlev>
##$CPDPRG5= <mlev>
##$CPDPRG6= <mlev>
##$CPDPRG7= <mlev>
##$CPDPRG8= <mlev>
##$CPDPRGB= <>
##$CPDPRGT= <>
##$D= (0..31)
0 1 0 0 0 0 0 0 0 0 0 0.03 2e-05 3e-06 0 0 0 0 0 0 0 0 0 0 0 0 0 0 0 0 
0 0 
##$DATE= 1549886444
##$DBL= (0..7)
120 120 120 11 120 120 24 19 
##$DBP= (0..7)
150 150 150 150 150 150 150 150 
##$DBP07= 0
##$DBPNAM0= <>
##$DBPNAM1= <>
##$DBPNAM2= <>
$$ [...]
##$SUBNAM3= <"">
##$SUBNAM4= <"">
##$SUBNAM5= <"">
##$SUBNAM6= <"">
##$SUBNAM7= <"">
##$SUBNAM8= <"">
##$SUBNAM9= <"">
##$SW= 369.568048894756
##$SWIBOX= (0..15)
0 1 3 0 0 0 0 0 0 0 0 0 0 0 0 0 
##$SW_h= 29940.119760479
##$TD= 32768
##$TD0= 1
##$TE= 0
##$TE2= 300
##$TE3= 300
##$TEG= 300
##$TL= (0..7)
0 120 53 12 22 120 120 120 
##$TP= (0..7)
150 150 150 150 150 150 150 150 
##$TP07= 0
##$TPNAME0= <>
##$TPNAME1= <>
##$TPNAME2= <>
##$TPNAME3= <>
##$TPNAME4= <>
##$TPNAME5= <>
##$TPNAME6= <>
##$TPNAME7= <>
##$TPOAL= (0..7)
0.5 0.5 0.5 0.5 0.5 0.5 0.5 0.5 
##$TPOFFS= (0..7)
0 0 0 0 0 0 0 0 
##$TUNHIN= 0
##$TUNHOUT= 0
##$TUNXOUT= 0
##$USERA1= <user>
##$USERA2= <user>
##$USERA3= <user>
##$USERA4= <user>
##$USERA5= <user>
##$V9= 5
##$VALIST= <valist>
##$VCLIST= <CCCCCCCCCCCCCCC>
##$VD= 0
##$VDLIST= <DDDDDDDDDDDDDDD>
##$VPLIST= <PPPPPPPPPPPPPPP>
##$VTLIST= <TTTTTTTTTTTTTTT>
##$WBST= 1024
##$WBSW= 4
##$XGAIN= (0..3)
0 0 0 0 
##$XL= 0
##$YL= 0
##$YMAX_a= 9889
##$YMIN_a= -10003
##$ZGOPTNS= <>
##$ZL1= 120
##$ZL2= 120
##$ZL3= 120
##$ZL4= 120
##$ABSF1= 182.463
##$ABSF2= -187.1042
##$ABSG= 5
##$ABSL= 3
##$ALPHA= 0
##$AQORDER= 0
##$ASSFAC= 0
##$ASSFACI= 0
##$ASSFACX= 0
##$ASSWID= 0
##$AUNMP= <proc_1d>
##$AZFE= 0.1
##$AZFW= 0.5
##$BCFW= 0
##$BC_mod= 2
##$BYTORDP= 0
##$COROFFS= 0
##$CY= -3
##$DATMOD= 1
##$DC= 0
##$DFILT= <>
##$DTYPP= 0
##$F1P= 0
##$F2P= 0
##$FCOR= 1
##$FTSIZE= 65536
##$FT_mod= 6
##$GAMMA= 0
##$GB= 0
##$INTBC= 1
##$INTSCL= 5.30512e-09
##$ISEN= 30
##$LB= 1
##$LEV0= 0
##$LPBIN= 0
##$MAXI= 10000
##$MC2= 0
##$MEAN= 0
##$ME_mod= 0
##$MI= 50
##$NCOEF= 0
##$NC_proc= -5
##$NLEV= 6
##$NOISF1= 182.463
##$NOISF2= 159.3651
##$NSP= 0
##$NTH_PI= 0
##$NZP= 0
##$OFFSET= 182.463
##$PC= 4
##$PHC0= -1476.955
##$PHC1= 77.39893
##$PH_mod= 1
##$PKNL= yes
##$PPARMOD= 0
##$PSCAL= 0
##$PSIGN= 0
##$REVERSE= no
##$SF= 81.0140089999434
##$SI= 65536
##$SIGF1= 159.3651
##$SIGF2= -187.1042
##$SINO= 113.3802
##$SIOLD= 16384
##$SREGLST= <1H.CDCl3>
##$SSB= 0
##$STSI= 65536
##$STSR= 0
##$SW_p= 29940.119760479
##$SYMM= 0
##$S_DEV= 0
##$TDeff= 32768
##$TDoff= 0
##$TI= <>
##$TILT= no
##$TM1= 0
##$TM2= 0
##$TOPLEV= 0
##$USERP1= <user>
##$USERP2= <user>
##$USERP3= <user>
##$USERP4= <user>
##$USERP5= <user>
##$WDW= 1
##$XDIM= 65536
##$YMAX_p= 304809823
##$YMIN_p= -4902172
$$ End of Bruker specific parameters
$$ ---------------------------------
##NTUPLES= NMR SPECTRUM
##VAR_NAME=  FREQUENCY,     SPECTRUM/REAL,   SPECTRUM/IMAG
##SYMBOL=    X,             R,               I
##VAR_TYPE=  INDEPENDENT,   DEPENDENT,       DEPENDENT
##VAR_FORM=  AFFN,          ASDF,            ASDF
##VAR_DIM=   65536,         65536,           65536
##UNITS=     HZ,            ARBITRARY UNITS, ARBITRARY UNITS
##FACTOR=    0.456856943014862, 1,           1
##FIRST=     14782.0589164792, 0,            0
##LAST=      -15158.0608439998, 0,           0
##MIN=       -15158.0608439998, -4902172,    0
##MAX=       14782.0589164792, 304809823,    0
$$ Real data points
##PAGE= N=1
##DATA TABLE= (X++(R..R)), XYDATA
$$ [...]
45673c97077M74670K96464J9495J4559j13324n18769n21032J69464O66238K73524
$$ -397077 77593 374057 393552 408111 294787 -223982 -745014 -575550 90688 364212
45663C64212l17407k16975J42707j85989j014964j336479q29931j7146O91342
$$ 364212 46805 -170170 -27463 -213452 -1228416 -2564895 -3394826 -3411972 -2720630
45654b720630J145036J024094K16285o40852q22161m56991j11403J66401O17209
$$ -2720630 -1575594 -551500 -335215 -976067 -1798228 -2255219 -2366622 -2200221 -1583012
45645a583012J013873R70777O53866M00322M5519n58219q47446l40946L12509
$$ -1583012 -569139 401638 1055504 1455826 1501345 943126 95680 -245266 67243
45636F7243J63352m97951n90022j2491K73822q1343l11986P8315N35231M43150
$$ 67243 230595 -267356 -857378 -869869 -596047 -677390 -989376 -911061 -375830 67320
45626F7320m48l16769m26264m00036j35358L26149O02647M21746k7226l50741
$$ 67320 66872 -249897 -676161 -1076197 -1211555 -885406 -282759 138987 111761 -238980
45616b38980l03891J21388O47154P91495L34261l55960p34755o65660l46579L5126
$$ -238980 -542871 -421483 225671 1017166 1351427 995467 260712 -404948 -751527 -716401
45606g16401K64338J30555j32699L3094N29903M67943l64764p92407M464R13438
$$ -716401 -452063 -321508 -454207 -421113 108790 576733 211969 -580438 -575974 337464
45596C37464M29247q95659j190233j21368P59413N28498k4426j30576j63126m35072
$$ 337464 766711 -128948 -1319181 -1440549 -681136 -152638 -177064 -307640 -470766 -905838
45586i05838l91615K21226O51114L96025L8649N0051j27313r00010j427833p59144
$$ -905838 -1297453 -1076227 -425113 -29088 9561 59612 -67701 -967711 -2395544 -3154688
45576c154688O44683J495849J287922N19753k17081o44486o68530m40973k59571
$$ -3154688 -2510005 -1014156 273766 793519 576438 -68048 -736578 -1177551 -1437122
45567a437122r8575K97805O98881N18436j09545l19470P6901K36176j79454l17809
$$ -1437122 -1535697 -1237892 -539011 -20575 -130120 -449590 -372689 -136513 -315967 -633776
45557f33776K78143O45963j434p84526n28879K99787M44337o9853k12434J62647
$$ -633776 -355633 290330 288896 -495630 -1024509 -724722 -280385 -350238 -562672 -400025
45547d00025K30940j86470l53117k240K59000Q8422j14555p6803q4742l09166
$$ -400025 -169085 -355555 -708672 -710912 -451912 -363490 -478045 -554848 -639590 -948756
45537i48756m26806j47197L83761P86055P08837P4632n94276n23521J76386L56321
$$ -948756 -1375562 -1522759 -1138998 -352943 355894 430526 -163750 -687271 -510885 -154564
45527a54564m98749j204907n19135Q45282J191796L87530r6169M18542R39243
$$ -154564 -653313 -1858220 -2377355 -1532073 -340277 47253 -48916 369626 1308869
45518A308869N74296k07812n81421n25466m33409l90678l17342k20742k4804L21421
$$ 1308869 1883165 1675353 1093932 568466 135057 -255621 -572963 -793705 -818509 -497088
45508d97088N06832K25747k04871k91131k19945m20537n54423l4237O80325O03616
$$ -497088 9744 235491 30620 -260511 -480456 -900993 -1455416 -1489653 -809328 -205712
45498b05712n5695j34658M72933O20335j2553k95619L56440R57056O58803K4438
$$ -205712 -261407 -396065 76868 697203 684650 389031 745471 1702527 2361330 2385768
45488B385768k37932l93649o37505l65915M58879O39124l35573j066869l62760
$$ 2385768 2147836 1754187 1116682 750767 1209646 1848770 1513197 446328 83568
45479H3568P30421O41943j75611l01510N8139k99956j023793o59915N46332P15445
$$ 83568 813989 1455932 1280321 978811 1036950 736994 -286799 -946714 -400382 315063
45469C15063n22024j228036k20181J085420R53320k01832q78545p41411m67602
$$ 315063 -206961 -1434997 -1655178 -569758 383562 181730 -696815 -1438226 -1905828
45460a905828k55105J70393O01273N89611L31459L23744L96934K8245n45599m88257
$$ -1905828 -2160933 -1990540 -1389267 -799656 -468197 -144453 252481 280726 -264873 -753130
45450g53130K96878Q40066M12232m67169p45185j84430M56347M69371J0580k60327
$$ -753130 -456252 383814 796046 328877 -416308 -600738 -144391 324980 335560 75233
45440G5233q0676J73947R4700k51819n44690o38011n34660j92187L14695O25080
$$ 75233 -5443 168504 263204 11385 -533305 -1171316 -1705976 -1898163 -1583468 -958388
45430i58388M64275Q2535l7688J66484L29692K20379n5911l44291n46328m89933
$$ -958388 -494113 -411578 -449266 -282782 46910 267289 211378 -132913 -679241 -1169174
45420a169174q6690M03446O13960N08555K40904k19259q27289j049344m09969
$$ -1169174 -1255864 -852418 -238458 270097 511001 291742 -535547 -1584891 -1994860
45411a994860N98203R18586L48957j94946k9197M51792N96756M09072J71041j61142
$$ -1994860 -1396657 -478071 -129114 -324060 -353257 98535 695291 1104363 1275404 1114262
45401A114262o04010p59697m30307j46160l81456o38483j15201R45554J423836
$$ 1114262 510252 -249445 -679752 -825912 -1207368 -1845851 -1961052 -1015498 408338
45392D08338Q29767j24404n87837n20423l24929j25650J68811M52811N15292L95640
$$ 408338 1238105 1113701 525864 5441 -319488 -445138 -276327 176484 691776 1087416
45382A087416L11660K80694O9456m43276j009233j194836p95463m7080N64957
$$ 1087416 1399076 1679770 1749226 1305950 296717 -898119 -1693582 -1740662 -1175705
45373a175705O99370L77390j14100m45752m17345q2590K38214K23271p1068k24657
$$ -1175705 -476335 -98945 -213045 -658797 -1076142 -1158732 -920518 -697247 -768315 -992972
45363i92972L1868M39976N15157J45955l00005m57073l56741k53156j79945J19787
$$ -992972 -961104 -521128 -5971 139984 -160021 -617094 -973835 -1226991 -1406936 -1287149
45353a287149P43741J261687J068417J71910o48743p04727k04885J20296K6750
$$ -1287149 -543408 718279 1786696 1958606 1309863 605136 400251 520547 547297
45344E47297o9085J24150L46905K79737j7016l56320o69851p69374l62787L36140
$$ 547297 478212 602362 949267 1229004 1211988 855668 185817 -583557 -946344 -610204
45334f10204N16751j86044r61788p73474K33999R62586Q38589L21890k6054j83720
$$ -610204 -93453 -279497 -1241285 -2014759 -1780760 -818174 20415 342305 316251 132531
45324A32531k12671P9810O48299R59199O45969k5307o71099j260373j677778j416475
$$ 132531 -80140 -330 647969 1607168 2253137 2227830 1556731 296358 -1381420 -2797895
45314b797895l55501O20361N98804p998K5966R21040J513214R24514k33206p91243
$$ -2797895 -3153396 -2533035 -1934231 -1942229 -1916263 -995223 517991 1442505 1209299 418056
45304D18056n11408n5400Q8319J6174l4568l55O8902L8347k19709n23794m64870
$$ 418056 -93352 -148752 -60433 -44259 -78827 -79182 -10280 28067 -191642 -715436 -1180306
45293a180306q9798o6625o64676j037765l02765R88466J433624P51288Q5464J62760
$$ -1180306 -1270104 -1336729 -2001405 -3039170 -3341935 -2353469 -919845 -168557 -83093 79667
45283G9667K90156k61866q95753o02961M05151R61073N45087k20964n80124m41241
$$ 79667 369823 107957 -787796 -1390757 -985606 -24533 520554 299590 -280534 -721775
45273g21775j58034j7091J999K05735P82287J267812Q62908l93602j338855j107788
$$ -721775 -879809 -896900 -894901 -689166 93121 1360933 2223841 1830239 491384 -616404
45263f16404k70503J23284K9778N0619J49111j20928m56025j58803M73386M38727
$$ -616404 -886907 -763623 -733845 -683226 -534115 -655043 -1111068 -1269871 -796485 -357758
45253c57758k46029m81680K8880K53634l25731p25112q6974Q73756R79832K38359
$$ -357758 -603787 -1085467 -1056587 -802953 -1128684 -1853796 -1940770 -1067014 -87182 151177
45243A51177n09346q00317n90291J45656J017632J170122M52770j28741M4234
$$ 151177 -358169 -1158486 -1748777 -1603121 -585489 584633 1037403 908662 952896
45234I52896J40977o00423j291499p39795M15618N79428k53693n84296J00725
$$ 952896 1093873 493450 -798049 -1537844 -1122226 -542798 -796491 -1380787 -1280062
45225a280062O71836L71009j41207j77026l5980p0976K8569L97824M92433M5711
$$ -1280062 -608226 -237217 -378424 -555450 -591430 -662406 -633837 -236013 256420 302131
45215C02131l67935k70111O3386L34832P00325J027951O64101m31331j243023
$$ 302131 -65804 -335915 -272529 62303 762628 1790579 2454680 2023349 780326
45206G80326j097095o24535n74354n60260O2582Q41027Q59740K36693j10509R0199
$$ 780326 -316769 -941304 -1515658 -2075918 -2013336 -1172309 -312569 -75876 -186385 -96186
45196i6186K50048P668l45078m92667m47223k89948r5763j0940K0365L43552R72573
$$ -96186 153862 161530 -183548 -676215 -1123438 -1413386 -1509149 -1520089 -1499724 -1156172 -183599
45185a83599J289507Q98276K88508j535l02467j019913j503378r00068K06512
$$ -183599 1105908 2004184 2292692 2291157 1988690 968777 -534601 -1434669 -1228157
45176a228157L89398m12485o98666K65080J274349J004673j00574o53278k76889
$$ -1228157 -838759 -1251244 -1949910 -1684830 -410481 594192 493618 -159660 -436549
45167d36549K08901J48676k60677n19502m36945j71557N659Q268Q5534M50826
$$ -436549 -227648 -78972 -339649 -859151 -1296096 -1467653 -1461994 -1453726 -1368192 -917366
45157i17366P45677L68877m91375p75075Q1801J234589J444821O01375l77000
$$ -917366 -171689 197188 -294187 -1069262 -987461 247128 1691949 2293324 1916324
45148A916324q26062q26166n95724j48379L86839P06909P33151O23703L48020
$$ 1916324 1090262 264096 -331628 -480007 -93168 613741 1346892 1970595 2318615
45139B318615k45408q62985q62174j65706M52434L64235q1358j84358L8724J9901
$$ 2318615 2073207 1210222 348048 182342 634776 999011 917653 733295 772019 791920
45129G91920l52812n82616l94672m1795L15738Q03832J140671N74910q59646j751941
$$ 791920 439108 -143508 -538180 -579975 -264237 539595 1680266 2255176 1395530 -356411
45119c56411r53747O22483J031428m809p82039k68228L99584q5141j001503p92533
$$ -356411 -1310158 -687675 343753 338944 -443095 -711323 -311739 -396880 -1398383 -2190916
45109b190916L66266Q50733J76667l62951J38344R10624R47767M73327J91986
$$ -2190916 -1824650 -973917 -797250 -1160201 -1021857 -111233 836534 1309861 1501847
45100A501847R4374j11243j91282N4878R3320n10465j099841q03857K6093L68064
$$ 1501847 1596221 1484978 1293696 1348574 1441894 931429 -168412 -972269 -946176 -578112
45090e78112J95904L35571P64422M62719p39274j494437p95510N33211J032761
$$ -578112 -382208 -46637 717785 1180504 441230 -1053207 -1848717 -1315506 -282745
45081b82745N26262n5465j91583j45151j29382l1057J04275P0700k1482R7869
$$ -282745 243517 188052 -3531 -148682 -278064 -309121 -204846 -134146 -155628 -57759
45071e7759K79316J81877J5177K91115P93225O62926k14923p70513k21517P14952
$$ -57759 221557 403434 418611 709726 1502951 2165877 1950954 1180441 958924 1673876
45061A673876P87695q4493q33218p03522K9886O97316R15573O33097P7591k76469
$$ 1673876 2461571 2377078 1543860 840338 870224 1567540 2483113 3116210 3193801 2917332
45051B917332j59493N9780j52070o46196p84567m55772k18780l33193l73997n4169
$$ 2917332 2757839 2817619 2665549 2019353 1234786 779014 560234 227041 -146956 -201125
45041b01125K90650L91448N02383P02402M70195l90853j058788p50823L0786K32466
$$ -201125 89525 480973 983356 1685758 2155953 1765100 706312 -44511 -13725 218741
45031B18741j53998k63624R2312J97515k04353m55857j92002L7085j72733l09780
$$ 218741 64743 -198881 -106569 90946 -113407 -569264 -761266 -724181 -896914 -1206694
45021a206694J28947O89112O65291K00983n9475M30L4199J3681J69721L20472
$$ -1206694 -1077747 -388635 276656 477639 418164 418594 452793 466474 636195 956667
45011I56667M4668m60700m32117L38871J022978P54419k39281r04678o34426P7238
$$ 956667 1001335 540635 108518 447389 1470367 2224786 1985505 1080827 446401 523639
45001E23639L36698l0056l59847j59594J76303R06n37670o82171k12615K94913
$$ 523639 860337 830281 470434 310840 487143 488049 -49621 -731792 -944407 -649494
44991f49494M51946N28999O67022M57946j57391l92602J88785O89673J21899r03355
$$ -649494 -197548 331451 998473 1456419 1299028 906426 1095211 1784884 1906783 1003428
44981A003428r81969j39575J91539m73018q43879J8821J089948R12681j98578
$$ 1003428 21459 -118116 73423 -399595 -1243474 -1224653 -134705 777976 579398
44972E79398p38165k80673J39520j58618n49367l05498K24298K80238q7728k06386
$$ 579398 -158767 -439440 -299920 -458538 -1007905 -1313403 -1089105 -808867 -896595 -1102981
44962a102981J09531L78213L55644M01497O97088P28897P4747p19925p56414r2356
$$ -1102981 -993450 -615237 -259593 141904 838992 1567889 1642636 922711 166297 73941
44952G3941L55352K41941K27413O66947Q21591Q2470q04069p35240L9185L52892
$$ 73941 429293 671234 898647 1565594 2387185 2469655 1665586 930346 969531 1322423
44942A322423p897j49228K00824J68115o45363j248516p17678L69564Q16841M46756
$$ 1322423 1314526 1165298 1366122 1534237 888874 -359642 -1077320 -707756 109085 555841
44932E55841J434q2279L7107J70327J90210j33252p05316q53931k06628N48771
$$ 555841 557275 474996 512103 682430 872640 739388 34072 -819859 -1026487 -477716
44922d77716N59160R2747K5878L58116L08466k47147n88998m63046m13365n79108
$$ -477716 81444 174191 200069 558185 866651 619504 30506 -432540 -845905 -1425013
44912a425013l43104L80062O60751L4128n72103k47278M62628N44412J96891L11474
$$ -1425013 -1768117 -1388055 -727304 -693176 -1265279 -1512557 -1049929 -505517 -308626 2848
44902B848P82450O86620k6710l79462k4904K07036j97432n57602k35159K27476
$$ 2848 785298 1471918 1445208 1065746 1040842 1247878 1050446 492844 257685 485161
44892D85161K5657n74224p28425l59782q7729j03641k4010K49575L89018L71576
$$ 485161 510818 -63406 -791831 -1151613 -1239342 -1342983 -1366993 -1117418 -728400 -356824
44882c56824N29805P58071M91429k68961p04961l72846P0012j12638o02622o13447
$$ -356824 172981 931052 1422481 1153520 448559 75713 145725 33087 -569535 -1182982
44872a182982j42841J64806J31857J72571L79979L27374q3845l15237j1410M47797
$$ -1182982 -1325823 -1161017 -1029160 -856589 -476610 -149236 -233081 -548318 -559728 -111931
44862a11931N33729K53777n0762j99411j73738L2633K89220L50274K14370J41730
$$ -111931 421798 675575 624813 425402 251664 284297 573517 923791 1138161 1279891
44852A279891J53769m2997m08263l87256K19931P29427M72215k04766m97126l71712
$$ 1279891 1433660 1390663 982400 595144 815075 1544502 2016717 1811951 1314825 943113
44842I43113m53833q38612q71571k44028M28122M34482j30965o20282o16208j86750
$$ 943113 489280 -349332 -1220903 -1464931 -1036809 -602327 -733292 -1353574 -1969782 -2156532
44832b156532L59105P00374O60818L35551j1101k03041j90735P2061N18920P95217
$$ -2156532 -1797427 -1097053 -436235 -100684 -111785 -314826 -505561 -433500 85420 880637
44822H80637N40786j14229o40349p29885n40824l31071j96689j90880l24512l85503
$$ 880637 1421423 1307194 666845 -63040 -603864 -934935 -1131624 -1322504 -1647016 -2032519
44812b032519j22566L23938N39652M36930L35794L82453L40277P7254k01304l56047
$$ -2032519 -2155085 -1831147 -1291495 -854565 -518771 -136318 203959 281213 79909 -276138
44802b76138m75376m73291o7748N84557P93685K59640l95107m49115j9060K72917
$$ -276138 -751514 -1224805 -1292553 -707996 85689 345329 -49778 -498893 -517953 -245036
44792b45036J81796q4017l21459l79911p0907M64249O08574M7396n81509m33664
$$ -245036 -63240 -147257 -468716 -848627 -919534 -455285 153289 200685 -380824 -814488
44782h14488L34505P51164L49399l15101n00144j05698M24074O34756M32428J77195
$$ -814488 -479983 271181 620580 305479 -194665 -300363 123711 758467 1190895 1368090
44772A368090L25154P51875P14458j41840j104229j272800p73814l84907k52800
$$ 1368090 1693244 2445119 3159577 3017737 1913508 640708 -133106 -518013 -770813
44763g70813J00800O22839O35704O1696k68166R0066M72601J98872l67954m71042
$$ -770813 -670013 -47174 588530 650226 382060 472126 944727 1143599 775645 304603
44753C04603r3080K08084J91837O5272j737L649Q6917J48873j0506l07306l39063
$$ 304603 211523 419607 611444 676716 674979 678628 765545 914418 903912 596606 257543
44742B57543j6479K08884Q0094k9489J36364J21207m35849r13673m92596M72348
$$ 257543 241064 449948 530042 500553 636917 758124 322275 -591398 -1083994 -611646
44732f11646P90714J01982o51073n36938K91937J035146J157491O47356j39043
$$ -611646 179068 281050 -370023 -906961 -615024 420122 1577613 2224969 2085926
44723B085926o64934o28101l35861l16865n25885m03285J97502O91712N83096
$$ 2085926 1420992 792891 457030 140165 -385720 -789005 -591503 100209 683305
44714F83305J00286k65039l99178m07318k26522J68880M54254K94242j37245l33808
$$ 683305 783591 518552 119374 -287944 -514466 -345586 108668 402910 265665 -68143
44704f8143p2101M16637P77717P75651L33781l61759q54100p93603l21153J25877
$$ -68143 -140244 276393 1054110 1829761 2163542 1801783 947683 154080 -167073 -41196
44694d1196L23497L42910K24933o2752l27108k21958K02335L92864M8038l37204
$$ -41196 282301 625211 850144 787392 460284 238326 440661 833525 881563 544359
44684E44359j46042L44357K76607m08010o65057J54022J153462R97523k14554
$$ 544359 398317 742674 1019281 611271 -53786 100236 1253698 2251221 2036667
44675B036667j090179q63814j97701J08558J99877M54074N74850J82822l00924
$$ 2036667 946488 82674 -115027 -6469 193408 647482 1222332 1405154 1104230
44666A104230k38913J39141J04069l60834n74617k77163Q6584J89673J71787J31793
$$ 1104230 865317 1004458 1108527 747693 173076 -104087 -17503 172170 343957 475750
44656D75750j3682j14355Q4417L58237K36747j82055l95906m23253o51391p75242
$$ 475750 462068 347713 432130 790367 1027114 845059 449153 25900 -625491 -1400733
44646a400733l8134J250248J699585Q44563q0186r4871M5877o31392j460223j186796
$$ -1400733 -1438867 -188619 1510966 2355529 2275343 2180472 2226349 1594957 134734 -1052062
44636a052062r4784M54363J67889j3630K78189L63968n3828l45668j38187J10656
$$ -1052062 -1146846 -692483 -524594 -538224 -260035 103933 50105 -295563 -433750 -323094
44626c23094O2756Q32M2619j50686n05738l65636L47990P50403L26605k47347
$$ -323094 -260338 -259506 -216887 -367573 -873311 -1238947 -890957 -140554 186051 -61296
44616f1296k60087q8253l67985p57586m52457N12742J326812J470238J010821
$$ -61296 -321383 -409636 -777621 -1535207 -1987664 -1474922 -148110 1322128 2332949
44607B332949J49360p96035j199164o66469L25373R13014Q25899L80368k05055
$$ 2332949 2482309 1686274 487110 -179359 146014 1059028 1884927 2265295 2060240
44598B060240q19535j043285n42775J83284K66566k51438l86681L34351J116946
$$ 2060240 1240705 197420 -345355 -162071 104495 -146943 -533624 -199273 917673
44589I17673R65192m8258j006890j257736q71575k42644L50016P99651J030800
$$ 917673 1882865 1834607 827717 -430019 -1301594 -1544238 -1194222 -394571 636229
44580F36229R11119L76586l16295o70425n02917k13340j78407j36366L15277Q25729
$$ 636229 1547348 1923934 1607639 937214 434297 220957 42550 -93816 221461 1047190
44570A047190O40318j51292n63669j88108J13284m62331j325796j287173k76408
$$ 1047190 1687508 1536216 972547 784439 897723 435392 -890404 -2177577 -2453985
44561b453985N89913N45681j4112l34021k04858J61212N70902Q02619N59648q5633
$$ -2453985 -1864072 -1318391 -1332503 -1666524 -1871382 -1710170 -1139268 -336649 222999 137366
44551A37366m79113r7017O48497Q01261R6239o64383o73297j36281J65204K1818
$$ 137366 -341747 -438764 209733 1010994 1107233 442850 -230447 -366728 -201524 -179706
44541a79706q8691M6040L5393k58758k59412L49860P80524J69262q63319q14005
$$ -179706 -268397 -222357 -186964 -445722 -705134 -355274 425250 594512 -268807 -1082812
44531a082812M50017J230680L51799j056764j086551L03653J329794Q43642l69923
$$ -1082812 -632795 597885 949684 -107080 -1193631 -889978 439816 1283458 913535
44522I13535q83608k90519P32547J316662J007358K8074p65721o84491j56617
$$ 913535 29927 -260592 471955 1788617 2795975 2824049 2058328 1373837 1217220
44513A217220k66276j086864j298204p2691J420064J383855j33524j268892q33626
$$ 1217220 950944 -135920 -1434124 -1506815 -86751 1297104 1163580 -105312 -938938
44504i38938L07818O86456J35448l94465l28840Q707J73601K00293K98923L91328
$$ -938938 -631120 55336 190784 -203681 -532521 -523814 -350213 -149920 149003 540331
44494E40331K18180k11791m78537j71640N29760Q77208L88030m51992p14004k68678
$$ 540331 758511 546720 68183 -103457 426303 1303511 1691541 1239549 525545 256867
44484B56867J2509m67840j088761q45438K30159J131523J227305Q71242N88228
$$ 256867 269376 -198464 -1287225 -2132663 -1902504 -770981 456324 1327566 1915794
44475A915794L09371k47842q92662j110668p30971j07695L02380L26386J02143
$$ 1915794 2225165 1977323 1084661 -26007 -756978 -864673 -562293 -235907 -133764
44466a33764r4065o2283J56354L20899K32738p3771l48415k96513J36708N37716
$$ -133764 -227829 -290112 -133758 187141 419879 346108 -2307 -298820 -162112 375604
44456C75604L15835m81042r08126k37330Q14289P67350n65125j607339j100749
$$ 375604 691439 210397 -697729 -935059 -120770 646580 81455 -1525884 -2626633
44447b626633J95073P16161L27755J75435O24605P21547p6053q75498o76848J88121
$$ -2626633 -2431560 -1715399 -1387644 -1212209 -587604 133943 57890 -817608 -1494456 -1306335
44437a306335P07436O31915M52770L74820J61124j91284l80854l61737l48989
$$ -1306335 -598899 33016 485786 860606 1021730 830446 449592 87855 -261134
44428b61134k97708K1804M27331M19802k5979l35103j54175K22499M23576M61287
$$ -261134 -558842 -537038 -109707 310095 284116 -50987 -205162 17337 440913 902200
44418I02200L78577p868o24127q79800l99991L13888M75659L5123m05379n01100
$$ 902200 1280777 1272909 648782 -231018 -631009 -317121 158538 193661 -211718 -712818
44408g12818m11689k29264J91331P15071Q22531L13965k82549l23385J85195O86022
$$ -712818 -1124507 -1353771 -1162440 -447369 375162 689127 406578 83193 268388 954410
44398I54410P14436K20778n11977r93913p63531J55218J075802J212226M68046
$$ 954410 1668846 1889624 1377647 383734 -379797 -224579 851223 2063449 2531495
44389B531495m80819q90028o27315j77537n5298k08031n9953O82825J362692R54432
$$ 2531495 2050676 1160648 533333 355796 300498 92467 32514 715339 2078031 3032463
44379C032463n15345j651650j269168Q5500Q36804M00135k91850l21256K8466
$$ 3032463 2517118 865468 -403700 -318200 518604 918739 626889 305633 334099
44370C34099K5469k79112k56209K21608N93152M25336j01626n27866n43065j08855
$$ 334099 359568 80456 -175753 45855 639007 1064343 962717 434851 -108214 -217069
44360b17069M75745O59652J79997m81735n89510j27602J79976n3937l13605k5074
$$ -217069 258676 918328 1098325 616590 27080 -100522 79454 25517 -288088 -313162
44350c13162M87557M40615k28097p29516n17159L8711L05563K62357K93893L93271
$$ -313162 174395 615010 386913 -342603 -859762 -821051 -515488 -253131 40762 434033
44340D34033J56620m05011o31575j15857N67528N35052j87414o82909m01397J72461
$$ 434033 590653 185642 -445933 -561790 5738 540790 353376 -329533 -730930 -558469
44330e58469L36911J41263J02252L11588L91786K06829M7512N7148k1505l31212
$$ -558469 -221558 -80295 21957 333545 725331 932160 979672 1036820 1015315 684103
44320F84103n29471k30792M01024P79809N29429j72682p91620q57901l22294L61430
$$ 684103 154632 -76160 324864 1104673 1634102 1461420 669800 -188101 -510395 -148965
44310a48965N92896J94503m30380p70229p09778m67931k06946Q6270M11171O69975
$$ -148965 443931 638434 208054 -562175 -1271953 -1739884 -1946830 -1860560 -1449389 -779414
44300g79414P79424P09193M17205q2833n71973p29340m69026m2635K67359M08072
$$ -779414 10 709203 1126408 1043575 471602 -257738 -726764 -769399 -502040 -93968
44290i3968M10946J88199k78793o65724n66395o4670K92153K27459J01993K94242
$$ -93968 316978 505177 226384 -439340 -1005735 -1070405 -778252 -550793 -448800 -154558
44280a54558N48687L77395q9171k01749K51389P05816N85821j5778o01466q28271
$$ -154558 394129 771524 682353 480604 731993 1437809 2023630 2007852 1406386 578115
44270E78115o10183n2840M59392M62868j9454m20871l81259j92574k24375l29961
$$ 578115 -32068 -84908 374484 837352 817898 397027 15768 -176806 -401181 -731142
44260g31142k04766N8829K09809K74979L31106K35758L3239J40948N79410N96219
$$ -731142 -935908 -877079 -667270 -392291 -61185 174573 207812 348760 928170 1524389
44250A524389j93533q99557n92553R4183j10496r36928q70783L66960J279082
$$ 1524389 1330856 431299 -161254 -67071 -177567 -1114495 -1985278 -1618318 -339236
44241c39236R06467R9183j71051k33988n19690l75918O23095J346732O05329q18655
$$ -339236 567231 666414 495363 261375 -258315 -634233 -11138 1335594 1940923 1122268
44231A122268j192175l60902K98362J49909o2045J64434L43715J63861R5764M03420
$$ 1122268 -69907 -430809 -132447 17462 -44583 119851 463566 627427 723191 1126611
44221A126611O08128M01202J76896J98268P2375m36214q12837n78375p3336R9314
$$ 1126611 1734739 2135941 2312837 2511105 2583480 2147266 1334429 756054 682718 782032
44211G82032n5773j41846q7792j35450l23684m10913k41383N4812K05849J01593
$$ 782032 726259 584413 496621 361171 37487 -373426 -614809 -559997 -354148 -252555
44201b52555O303K98762Q12103P80553r7544r08377n71217N77843J144106N69790
$$ -252555 -246252 52510 864613 1645166 1547622 639245 68028 645871 1789977 2359767
44191B359767l10074p13017q18671q72983m95752M15661R89645M81349n21724
$$ 2359767 2049693 1336676 518005 -354978 -850730 -435069 554576 1035925 514201
44182E14201q62512l75574J23569J13615j52379k87909j98335Q3850M29801N21563
$$ 514201 -348311 -723885 -600316 -486701 -639080 -926989 -1125324 -1041474 -611673 -90110
44172i0110J94312j94767j65285J97009L64307J26676j72422j83511j8716p2405
$$ -90110 104202 -90565 -255850 -58841 305466 432142 259720 76209 57493 -14912
44162a4912m94276r01702p23283K7394N41588J92645m82449m50647K75725O80672
$$ -14912 -509188 -1410890 -2134173 -2106779 -1565191 -1372546 -1854995 -2305642 -2029917 -1349245
44152a349245M00460K00102M37028L44187l99442o93196K04522J077868N05884
$$ -1349245 -948785 -748683 -311655 32532 -366910 -1060106 -855584 222284 728168
44143G28168o82994o17855M73325N28579q95373j712948n58910J082575J213693
$$ 728168 45174 -572681 -99356 429223 -466150 -2179098 -2738008 -1655433 -441740
44134d41740J83403k98570J32277M27579J18153k18320k47903k69187l30767j18582
$$ -441740 -258337 -556907 -424630 2949 121102 -97218 -345121 -614308 -945075 -1063657
44124a063657K12428J31176k31910j30335N16359Q51631M26738r6228p4112J12020
$$ -1063657 -851229 -720053 -951963 -1082298 -565939 285692 712430 616202 542090 654110
44114F54110j51258n79228m75239O6195L08647N3382j55169j0350J44186N4712
$$ 654110 502852 -76376 -551615 -485420 -176773 -123391 -278560 -288910 -144724 -90012
44104i0012J2559K50373M66137L56564J40885R3631j896l71544o07780k23411
$$ -90012 -77453 172920 639057 995621 1136506 1230137 1228241 856697 248917 25506
44094B5506L87098L58604l13176p03747l60464R9231J15910L7918K64170L28199
$$ 25506 412604 771208 458032 -245715 -606179 -506948 -391038 -353120 -88950 239249
44084B39249l01416j043025q48522J67531P51590K65851m55436l37594M98966
$$ 239249 -62167 -1105192 -1953714 -1786183 -1034593 -768742 -1224178 -1561772 -1062806
44075a062806J008122N82712k78076o03408l8840P67020R16502L50442j30542
$$ -1062806 -54684 528028 249952 -353456 -392296 374724 1291226 1641668 1511126
44066A511126k3143K20841N5079k40654j80426q2043m84046r12233m57655M95307
$$ 1511126 1487983 1708824 1763903 1523249 1342823 1260780 776734 -135499 -593154 -97847
44056i7847N30540n21844j043306p4796J081991Q48579j90274l35528M81866P46286
$$ -97847 432693 -89151 -1132457 -1207253 -125262 723317 533043 197515 679381 1425667
44046A425667p3658p48659l72450L06701K81935k07155l93150k66412k34121k04367
$$ 1425667 1352009 603350 230900 537601 819536 612381 219231 -47181 -281302 -485669
44036d85669M2401J06194m06419q83318m17187O37766R48073J49615n95372l70458
$$ -485669 -443268 -337074 -743493 -1626811 -2043998 -1406232 -458159 -308544 -903916 -1274374
44026a274374K03991J36974l25606k25864M73924Q57862N29681J15367J42164
$$ -1274374 -1070383 -933409 -1259015 -1484879 -1010955 -153093 376588 491955 634119
44017F34119K89094J12477j88712k29559j42154k51878l83993r8471N00148P38524
$$ 634119 923213 1035690 846978 617419 475265 223387 -160606 -259077 241071 979595
44007I79595K48574n01931p17268j43941O79135R82128N21896k45427p45406q85529
$$ 979595 1228169 726238 8970 -134971 544164 1526292 2048188 1802761 1057355 171826
43997A71826r07402q27990m28347K26917P16870Q11661O69044L89611j08072n96016
$$ 171826 -735576 -1563566 -1991913 -1764996 -1048126 -236465 432579 822190 714118 118102
43987A18102n34098Q6127M68416N4059o63008q66973m70357J13702O90935J069240
$$ 118102 -415996 -329869 138547 192606 -470402 -1337375 -1807732 -1694030 -1003095 66145
43977F6145O82649o02921j663903j192664M74198J609055J227199L3697q40338
$$ 66145 748794 145873 -1518030 -2710694 -2236496 -627441 599758 633455 -206883
43968b06883j045663p17459K5903P91232R04370K68506l24953k18583K65942M32495
$$ -206883 -1252546 -1970005 -1944102 -1152870 -248500 20006 -304947 -523530 -257588 174907
43958A74907J91620k6608J9672K02030L10999K05232j31470m69910m78111j23747
$$ 174907 366527 339919 359591 561621 872620 1077852 946382 476472 -1639 -125386
43948a25386K65687L86868J85940k25682n83719n46848j28643J65227N7180j0819
$$ -125386 140301 527169 713109 487427 -96292 -643140 -771783 -606556 -549376 -560195
43938e60195L08567M75027k1711m70436P7541R85757P54126n00787j037994k43520
$$ -560195 -251628 223399 201688 -268748 -191207 794550 1548676 1047889 9895 -233625
43928b33625M43704m082o25614l49010K21161J61788q1326K10446N12553J57172
$$ -233625 210079 205997 -419617 -768627 -547466 -385678 -467004 -256558 255995 413167
43918D13167j81868K79718P37264P2145j042134j163536n04939l80827p73011
$$ 413167 231299 511017 1248281 1320426 278292 -885244 -1390183 -1771010 -2544021
43909b544021n26577L26935N91086K07825L83907J203280J255326J46504o63737
$$ -2544021 -3070598 -2743663 -2152577 -1944752 -1560845 -357565 897761 1044265 380528
43900C80528k86960K39487k7355l39178J25355O12565J80144n23442l87463K01107
$$ 380528 93568 333055 305700 -33478 91877 704442 884586 361144 -26319 174788
43890A74788R3449n65537n94867J86648O44888J20917o61551p61085j95278M11874
$$ 174788 268237 -297300 -892167 -705519 -60631 60286 -601265 -1362350 -1557628 -1145754
43880a145754P16720P71661O32797K76151j69868l97360k58005l3221j44556n52505
$$ -1145754 -429034 342627 975424 1251575 1081707 684347 426342 393121 248565 -303940
43870c03940p34129m19021J8341J93146K97478N80657P00296K72569k99564l47709
$$ -303940 -1038069 -1457090 -1438749 -1245603 -948125 -367468 332828 605397 305833 -41876
43860d1876l868J12837N673J11591K19834k65965j024770j001383n3170P53369
$$ -41876 -45744 67093 72766 184357 404191 138226 -886544 -1887927 -1941097 -1187728
43850a187728P43904M02713K35444J9343l76810n01368j61772J69025K10059K34104
$$ -1187728 -443824 -41111 194333 213676 -163134 -664502 -826274 -657249 -447190 -213086
43840b13086K73158j7480m21947k45010L50804L70599k67729m57635R8618K21948
$$ -213086 60072 42592 -379355 -624365 -273561 97038 -170691 -628326 -529708 -307760
43830c07760o13262j127544l30124P57812P92457J61684o2772L4931o6228M4281
$$ -307760 -921022 -2048566 -2378690 -1620878 -828421 -666737 -729509 -694578 -760806 -716525
43820g16525P17175R75794J2815j019896o28589M43662L25019q94296j362996
$$ -716525 650 976444 989259 -30637 -659226 -215564 109455 -784841 -2147837
43811b147837m86727M15891N06622M43385P15127P71957K76428k66516n38490
$$ -2147837 -2634564 -2218673 -1712051 -1268666 -553539 218418 494846 228330 -310160
43802c10160p93846r61760n77672K18875P61369R40266J057405Q21561j11101
$$ -310160 -1104006 -2065766 -2643438 -2424563 -1663194 -722928 334477 1156038 1044937
43793A044937q67223l23349P91147O56383p02040j278033k29973R09224P86988
$$ 1044937 177714 -145635 645512 1301895 599855 -678178 -908151 1073 788061
43784G88061M606m80225q19340j154033q22670J78295N85452r8270n41760K00723
$$ 788061 792667 312442 -506898 -1660931 -2483601 -2305306 -1719854 -1818124 -2359884 -2159161
43774b159161J007476O49838r7619J8937M42955o6872j043675j017217L7393Q04683
$$ -2159161 -1151685 -501847 -599466 -580529 -137574 -204446 -1248121 -2265338 -2227945 -1423262
43764a423262P68868N69717N18497L14503M2225M8828K4804m95847r93021o50118
$$ -1423262 -654394 -84677 433820 748323 790548 839376 864180 368333 -624688 -1274806
43754a274806R6238J15131n01954n62218K25209Q30630O20037J27221j16956k63409
$$ -1274806 -1178568 -1063437 -1565391 -2127609 -1902400 -1071770 -451733 -324512 -441468 -704877
43744g04877l63299q1604M58200N93241K21631J0355K07784K32402k13829n80898
$$ -704877 -1068176 -1149780 -691580 -98339 123292 133647 341431 573833 360004 -220894
43734b20894m22404l6228K46599N70706R28447Q37781J48966n18657o31200m36286
$$ -220894 -643298 -679526 -432927 137779 1066226 1904007 2052973 1534316 903116 466830
43724D66830l89520m62821m24785k81935r1010J66956K70355r9974o45888n53021
$$ 466830 77310 -385511 -810296 -1092231 -1183241 -1016285 -745930 -845904 -1491792 -2044813
43714b044813L30940J066877Q15342r4913p14997n96146J3473O01882O89231J88482
$$ -2044813 -1713873 -646996 168346 73433 -641564 -1237710 -1224237 -622355 66876 255358
43704B55358k70463L3815P51902P16202l14842j120629q00441r0023m0088l28146
$$ 255358 -15105 18710 770612 1486814 1171972 51343 -749098 -839121 -879209 -1207355
43694a207355o5427M49649K25304n50134o52576J50408O66832K00847l86985j23920
$$ -1207355 -1272782 -823133 -597829 -1147963 -1800539 -1650131 -983299 -782452 -1169437 -1293357
43684a293357O20748Q62204M16216j51083m42107m30238j68219J25567O8967k91458
$$ -1293357 -672609 189595 605811 454728 12621 -417617 -585836 -460269 -391302 -682760
43674f82760l24998K10894N48327k9471r36316r71618k0692Q62019R93953P32444
$$ -682760 -1007758 -796864 -248537 -278008 -1214324 -2185942 -2206634 -1344615 -350662 381782
43664C81782N17498K38668j23140j46415K07885J98315o08491j457767j347601
$$ 381782 899280 1137948 1014808 868393 1076278 1274593 666102 -791665 -2139266
43655b139266m03247M25645O79286O10880L62311j86160p58846p15545N0512Q49568
$$ -2139266 -2542513 -2116868 -1437582 -826702 -464391 -650551 -1409397 -2124942 -2074430 -1224862
43645a224862J041342O91891K61347O4554J43048K91441J65269k97974o54366
$$ -1224862 -183520 508371 769718 834272 977320 1268761 1434030 1136056 481690
43636D81690n47809k97535l11885k21845N12229J310749R63950m34514j275274
$$ 481690 -66119 -363654 -675539 -897384 -385155 925594 1889544 1455030 179756
43627A79756o38730M17673M76978l36077r34236q95289n31633q101N89578Q17188
$$ 179756 -458974 -41301 435677 99600 -834636 -1729925 -2261558 -2269659 -1680081 -862893
43617h62893M78604K15158N41452P93575J23915q95672r23273J27401R92823R34862
$$ -862893 -384289 -169131 372321 1165896 1289811 394139 -529134 -401733 591090 1525952
43607A525952M39078k7687o34170j253598j170515k69294M99601M32173n167j22510
$$ 1525952 1965030 1937343 1303173 49575 -1120940 -1390234 -890633 -458460 -463627 -586137
43597e86137m6142j60253k38998J06232O16884P32058M11125M4773j67966k73660
$$ -586137 -632279 -792532 -1031530 -925298 -308414 423644 834769 879542 711576 437916
43587D37916k57243r8518P2798J64655K26167K06059k1587k62975j49256J50559
$$ 437916 180673 82155 154953 319608 545775 751834 730247 467272 318016 468575
43577D68575J030o24715q65303k39528N20194N58810J85355K29470N80491L70704
$$ 468575 469605 -155110 -1020413 -1259941 -739747 -180937 4418 233888 814379 1185083
43567A185083n20771j107144o33232L99317Q59095K80301o94239j007427k52440
$$ 1185083 664312 -442832 -1076064 -676747 182348 462649 -231590 -1239017 -1491457
43558a491457Q93951J374215Q90980J01300l33484m31628m70919m60101l98079
$$ -1491457 -597506 776709 1667689 1768989 1435505 1003877 532958 72857 -325222
43549c25222n25862q27899p61579n5930O53403O31648J11486j35554N6713K95835
$$ -325222 -851084 -1678983 -2440562 -2496492 -1843089 -1211441 -1099955 -1235509 -1178796 -882961
43539h82961M96512Q04758Q73745K28008o79594q22904j67062J63345l89225r48334
$$ -882961 -386449 418309 1292054 1520062 840468 17564 -149498 13847 -375378 -1323712
43529a323712o29287R2382K49247q2420j07979K10349Q2309o77184j097717l50272
$$ -1323712 -1952999 -1860617 -1611370 -1693790 -1801769 -1591420 -1509111 -2186295 -3284012 -3634284
43519c634284R90151J519738O41446q06613j547529j149830j93274N55032P90184
$$ -3634284 -2644133 -1124395 -482949 -1289562 -2837091 -3986921 -4180195 -3625163 -2834979
43510b834979N89598J43086k38047j95809K52119N87804M36272J21138J69662
$$ -2834979 -2245381 -2102295 -2340342 -2536151 -2284032 -1696228 -1259956 -1138818 -969156
43501i69156M76323N03372J84168l5655o1013k96066p35723p03049N3525P02626
$$ -969156 -492833 10539 194707 159052 98039 -198027 -933750 -1636799 -1583274 -880648
43491h80648M39098k65836l25914L51629P95501M52977j22449k61139r6779r5795
$$ -880648 -441550 -707386 -1033300 -681671 113830 566807 444358 183219 86440 -9355
43481i355k43743k29689r3004j39022l57957m07409j49861J78461L46783L37390
$$ -9355 -253098 -482787 -575791 -714813 -1072770 -1480179 -1630040 -1451579 -1104796 -767406
43471g67406J65109j27331k25298K43795J007740J123278J44241r88144r05067
$$ -767406 -602297 -729628 -954926 -711131 296609 1419887 1564128 575984 -329083
43462c29083L61222J232448N41289r97388j775610j277396l87541L1871O2855
$$ -329083 32139 1264587 1805876 808488 -967122 -2244518 -2632059 -2600188 -2537333
43453b537333J59502L91453N73751O24753M52489o9839o57589o09650K46915R90420
$$ -2537333 -2377831 -1986378 -1412627 -787874 -335385 -405224 -1062813 -1672463 -1425548 -435128
43443d35128O23123n57967j287277r47016j53099L19199M45173N41111O38198
$$ -435128 187995 -369972 -1657249 -2604265 -2757364 -2438165 -1992992 -1451881 -813683
43434h13683O79715P85712Q64578M76074l91728r20151n13933J76424J20139n17380
$$ -813683 -133968 651744 1516322 1992396 1600668 680517 166584 343008 463147 -54233
43424e4233o61775q4400K69633q4022l54949J46351Q09674P11461N0615l34522
$$ -54233 -716008 -800408 -530775 -614797 -969746 -823395 -13721 697740 748355 413833
43414D13833l48160n16586p98479n85194J42385O27740M57912M3446k24589n10438
$$ 413833 65673 -450913 -1249392 -1834586 -1692201 -1064461 -606549 -563103 -787692 -1298130
43404a298130q96330r17212k35949O78342J043217O87769J32459p4491J49234
$$ -1298130 -2194460 -3111672 -3347621 -2669279 -1626062 -938293 -805834 -880325 -731091
43395g31091M47193L97833j9392l37258j79800J88215K40556k2351j68233j11854
$$ -731091 -283898 113935 94543 -242715 -422515 -234300 6256 -16095 -184328 -296182
43385b96182j49175k20506R0811O72018Q03811K75275k14073j71095k9093k27742
$$ -296182 -445357 -665863 -575052 96966 900777 1176052 961979 790884 761791 534049
43375E34049l79775n2590L48927K99106J02247K22939K89084j62640m97301J37112
$$ 534049 154274 101684 450611 749717 851964 1074903 1363987 1201347 704046 841158
43365H41158J058312P05972q90630j861404j163333l1202O2040l95026l0026J007745
$$ 841158 1899470 2605442 1714812 -146592 -1309925 -1341127 -1279087 -1674113 -1704139 -696394
43355f96394J227268J41668r52506p95474K71017J017002Q67400J90689m53472
$$ -696394 530874 672542 -279964 -1075438 -804421 212581 1079981 1270670 817198
43346H17198p57948o14182j69550J34277K7200j24905K21599Q53556Q81027k8186
$$ 817198 59250 -554932 -724482 -590205 -563005 -687910 -466311 387245 1268272 1240086
43336A240086j018117j060713k08731O46764R30692P19149K13997l86391o30193
$$ 1240086 221969 -838744 -1047475 -400711 529981 1249130 1463127 1076736 446543
43327D46543k12824L74073L69427q8846k13539l177k70650r70851q52494N11645
$$ 446543 233719 607792 977219 888373 674834 671657 401007 -569844 -1422338 -910693
43317i10693J631021J115330k69020q45447m65939k31993m26865l82227q3933
$$ -910693 720328 1835658 1566638 721191 255252 23259 -403606 -785833 -869766
43308h69766k11435n99456l03828O02843Q76649J18670n48178l37163J01229R8628
$$ -869766 -1081201 -1680657 -1984485 -1381642 -504993 -386323 -934501 -1271664 -1170435 -1071807
43298a071807R4078M70635N48134j79672q57966n04722L92721P00002L80043K12689
$$ -1071807 -977729 -507094 41040 -138632 -996598 -1501320 -1108599 -408597 -28554 184135
43288A84135L12196J79024j08676O783M12152M09592o0032l26949j95383k29876
$$ 184135 496331 675355 566679 573462 985614 1395206 1335174 1008225 812842 582966
43278E82966o29539p47887j41124O14965O52234o4291p48251p17473o0198N18240
$$ 582966 -46573 -794460 -935584 -320619 331615 267324 -480927 -1198400 -1258598 -740358
43268g40358M41265q4952k93139J42997O35342N26286N6203m6594K99987M72878
$$ -740358 -299093 -384045 -677184 -534187 101155 627441 683644 637050 937037 1409915
43258A409915J63010k12463k24266J5443J94269K12196N2675l22382p04984o46050
$$ 1409915 1572925 1360462 1136196 1151639 1345908 1558104 1610779 1288397 583413 -62637
43248f2637k4896O54342Q18688M79895O8654k01365m53627o79193n53816M7397
$$ -62637 -87533 566809 1385497 1865392 1934046 1732681 1279054 599861 46045 93442
43238I3442O05890M50947k85813o56535j00607P29866Q07721J00636n21805n91713
$$ 93442 699332 1150279 864466 207931 107324 837190 1644911 1745547 1223742 632029
43228F32029m83658n12777m31041r5473J36640P5567M8690J49101j00713p67508
$$ 632029 148371 -364406 -795447 -890920 -754280 -678713 -630023 -480922 -581635 -1349143
43218a349143r83337j83802Q20721R29471L34067J7257J68285K24922J17502K16906
$$ -1349143 -2332480 -2516282 -1695561 -766090 -432023 -414766 -246481 -21559 95943 312849
43208C12849K48145l94871j247050j091059O0575O82441l8697r56563o89304M79060
$$ 312849 560994 166123 -1080927 -2171986 -2111411 -1428970 -1467667 -2424230 -3113534 -2634474
43198b634474J297819J272154P48118J4579o52680o18622L34685J206754Q47285
$$ -2634474 -1336655 -64501 683617 698196 45516 -573106 -238421 968333 1815618
43189A815618l52178r20307m22387M1883l07272p43536l54549L77093L10823n04426
$$ 1815618 1463440 543133 120746 162629 -144643 -888179 -1242728 -865635 -554812 -1059238
43179a059238q25256p0803Q03691O91385j43263n66767j58839M59761P02367O17255
$$ -1059238 -1884494 -1955297 -1151606 -460221 -603484 -1170251 -1329090 -869329 -166962 450293
43169D50293L41098k39065r26781j020917k51483N90692O10392L7488j97871J29319
$$ 450293 791391 552326 -374455 -1395372 -1646855 -1056163 -445771 -408283 -606154 -476835
43159d76835L43325K9177l76403l12759J81369O69682P95885M39811j82375n07272
$$ -476835 -133510 -104333 -480736 -793495 -612126 57556 853441 1293252 1110877 603605
43149F03605j51699N02150O92071K40271l61316p48464r00802o10075L66143J420951
$$ 603605 451906 954056 1646127 1886398 1525082 776618 -124184 -734259 -368116 1052835
43139A052835J350463J0442j121883p52982N19735J106752N19823l38844o80017
$$ 1052835 2403298 2413740 1291857 538875 1058610 2165362 2685185 2346341 1666324
43130A666324o56569o78671p22440n65799j96007K36823N53766N52910J76756
$$ 1666324 1009755 331084 -391356 -957155 -1153162 -916339 -362573 190337 367093
43121C67093k98575n16343m53551k99055k3057N11247J023799R07829L8149q81498
$$ 367093 68518 -447825 -901376 -1200431 -1223488 -712241 311558 1219387 1257536 376038
43111C76038j051254m41073K99004O08378M39729M5194l18755m22324j11824M36630
$$ 376038 -675216 -1116289 -817285 -208907 230822 276016 -42739 -465063 -576887 -140257
43101a40257O86395K89898l56392m67503J14060O34350M00333l26964p83376p13107
$$ -140257 546138 836036 479644 12141 126201 760551 1160884 833920 50544 -662563
43091f62563m11598k2392N14787Q92362N93568k15437o76529m35131j78176n18037
$$ -662563 -1074161 -1096553 -581766 310596 904164 688727 12198 -422933 -601109 -1119146
43081a119146r30920m81339P17819J490982J048691q2059p43307m57159J78130
$$ -1119146 -2050066 -2531405 -1813586 -322604 726087 644028 -99279 -556438 -378308
43072c78308L39610q73j61726J70476M38755J36716k72499o0272M95812N00479
$$ -378308 -38698 -39571 -201297 -30821 407934 544650 272151 211879 707691 1208170
43062A208170l9247k24029J03297K9520o90774r33994p9210O91503J80764p72684
$$ 1208170 1168923 944894 1048191 1077711 386937 -547057 -626267 65236 246000 -526684
43052e26684n51275O22269J032060J71855o24609m02907J53131J56040j50919
$$ -526684 -1077959 -455690 576370 748225 123616 -279291 -126160 29880 -121039
43043a21039j84637o6365r5365r953M35391P81523N10773p8174l24643j75824
$$ -121039 -305676 -372041 -467406 -477359 -41968 739555 1250328 1172154 847511 671687
43033F71687p4915j64061k02420j14021r4303k33526l98636m14830j35019M68465
$$ 671687 596772 432711 230291 116270 21967 -211559 -610195 -1025025 -1160044 -691579
43023f91579J039121R61548J17030p37338p81870j63925K47298N4809k29246m1580
$$ -691579 347542 1309090 1426120 688782 -93088 -257013 -9715 45094 -184152 -225732
43013b25732M01359M53563j6421m44773l83663j37455k76451o84808o04061K15660
$$ -225732 175627 629190 612769 167996 -215667 -353122 -629573 -1314381 -1918442 -1702782
43003a702782R18554N80094m59592r35802k87556O81654R14413L21995l69489
$$ -1702782 -784228 -204134 -663726 -1599528 -1887084 -1205430 -291017 30978 -338511
42994c38511n57630k13805L07764N90549M50344J10158n5577L160N1980P9769
$$ -338511 -896141 -1109946 -802182 -211633 238711 348869 293292 296452 348432 428201
42984D28201L09138N87852L48655m82170j069984o97601J71087M68202n0091n87946
$$ 428201 737339 1325191 1673846 1191676 121692 -575909 -404822 63380 13289 -574657
42974e74657m73443O3499L96543L14287J06929J16555L77216N78774L68061j91609
$$ -574657 -1048100 -984601 -588058 -273771 -166842 -50287 326929 905703 1273764 1082155
42964A082155n72779m20379p6854j03081l88974k63303M38733R73224O56685j75515
$$ 1082155 509376 88997 12143 -90938 -479912 -743215 -304482 668742 1325427 1149912
42954A149912o03385k91991K01092K22210k45997p02486p13806k75394K67181
$$ 1149912 546527 254536 455628 677838 431841 -270645 -984451 -1259845 -992664
42945i92664N60950N43781M07905K77428N9558k91174n37477m11601r036L16346
$$ -992664 -431714 112067 519972 797400 856958 565784 28307 -383294 -392330 -75984
42935g5984L96022L22822J38139j98155m84452l38708K21333O24693M68943R4225
$$ -75984 320038 642860 780999 582844 98392 -240316 -18983 605710 1074653 1168878
42925A168878O8884L44045L83743K1311l20853l09832j37504j06718j51044l0704
$$ 1168878 1237762 1581807 1965550 1986861 1666008 1356176 1218672 1111954 960910 930206
42915I30206K12473K74012R237l42422m02217q9590K43815K22943l2022l7669
$$ 930206 1142679 1416691 1425928 1083506 681289 591699 835514 1058457 1026435 988766
42905I88766L32978O21276M99057K94920L82948M52472K6345n78483o05196p4081
$$ 988766 1321744 1943020 2442077 2736997 3119945 3572417 3598762 3020279 2415083 2341002
42895B341002K01699j15745m51140l44626r4211o2386j23532j83646m87419r42750
$$ 2341002 2542701 2426956 1975816 1631190 1536979 1474593 1351061 1167415 679996 -262754
42885b62754q75733k5139Q60305R97554N58505J44169r5359k25512q5292K30110
$$ -262754 -1138487 -1163626 -303321 694233 1252738 1396907 1301548 1076036 990744 1220854
42875A220854J05230o04312r67827k52635Q00297R66797K91524k16755k08783
$$ 1220854 1326084 721772 -246055 -498690 301607 1268404 1559928 1343173 1134390
42866A134390j58641k03689k0787K65616J86559j04716k6687L23866L28604O0629
$$ 1134390 975749 772060 751273 1016889 1203448 1098732 1072045 1395911 1724515 1785144
42856A785144J86755O07706M13298n56392j247945q97290k7838M89363N42935
$$ 1785144 1971899 2579605 2992903 2436511 1188566 291276 263438 752801 1295736
42847A295736N06699N34924N35090L75036o2597o17709p32730j41210N52119O57702
$$ 1295736 1802435 2337359 2872449 3247485 3184888 2567179 1834449 1693239 2245358 2903060
42837B903060M22369M23703M03047j77394q26084o16150J94159N72245M91514
$$ 2903060 3325429 3749132 4152179 3974785 3148701 2532551 2726710 3298955 3790469
42828C790469P15973J037323N70620k50315p336J200606J704718J062683P13077
$$ 3790469 4506442 5543765 6114385 5864070 5856734 7057340 8762058 9824741 10537818
42819A0537818J324808J782185J504175J406661J722885J387104N95723J227928
$$ 10537818 11862626 13644811 15148986 16555647 18278532 19665636 20261359 21489287
42811B1489287L420451M736280M460534N442644R347227J3670050J6881621K2967369
$$ 21489287 24909738 29646018 34106552 39549196 48896423 62566473 79448094 102415463
42803A02415463L5656493M9911880N4538445M3200331J9087211j0067087l6405367
$$ 102415463 138071956 187983836 242522281 285722612 304809823 294742736 258337369
42796B58337369n1992799n1399132l7458217k0577382r420225m565156k501224
$$ 258337369 206344570 154945438 117487221 96909839 87489614 82924458 80423234
42789H0423234j977197l676270o721689r050843r908039r564370p895875n249428
$$ 80423234 78446037 74769767 68048078 58997235 49089196 39524826 31628951 26379523
42781B6379523l272416k883959k746185j569040m54122r59570k261706k464981
$$ 26379523 23107107 20223148 17476963 15907923 15453801 14494231 12232525 9767544
42773I767544j614576j164585j304017j006262j60921L54432L23552J92645r5710
$$ 9767544 8152968 6988383 5684366 4678104 4517183 4871615 5195167 5387812 5292102
42764E292102o86449q56143r6859N36231j21949j248642j227673k70997J43353
$$ 5292102 4605653 3749510 3652651 4188882 4066933 2818291 1590618 1319621 1462974
42755A462974j29209k8487L88868P8768o66768m02914P88418J140744J57908n43814
$$ 1462974 1333765 1305278 1694146 1772914 1106146 703232 1491650 2632394 2790302 2246488
42745B246488k7585N26034J34441k96729J24185M91231k26683j155223q52569
$$ 2246488 2218903 2744937 2879378 2582649 2706834 3198065 2971382 1816159 963590
42736I63590L14195Q01954K75210k14751j14141K2491j92076l20697l759L55256
$$ 963590 1277785 2079739 2354949 2140198 2026057 2048548 1856472 1535775 1532016 1887272
42726A887272K11016l09333n76276k61683K55922L41319q2654l84298q5849M07903
$$ 1887272 2098288 1788955 1212679 950996 1206918 1548237 1465583 1081285 995436 1403339
42716A403339M12576N9093O2454M55723M52117k02803o52609k22024M73998M32051
$$ 1403339 1815915 1875008 1937462 2393185 2845302 2642499 1989890 1767866 2241864 2673915
42706B673915k58305o46574l58660K8412N7710P9054N22916R80562O01373o19371
$$ 2673915 2415610 1769036 1410376 1438788 1496498 1575552 2098468 3079030 3680403 3061032
42696C061032j512904j092973Q9572O07743J04906l06315J15304N41356M9974
$$ 3061032 1548128 455155 544727 1152470 1257376 951061 1066365 1607721 1657695
42687A657695o10224q9298J198136J400065O589j298034j119526k62784k00123
$$ 1657695 1047471 958173 2156309 3556374 3562963 2264929 1145403 882619 682496
42678F82496p53087n99195N02273J334145J006373K6948o39861p65463o93243
$$ 682496 -70591 -669786 -167513 1166632 2173005 2199953 1560092 794629 101386
42669A01386n35638j17896M29336N79123J34077l12126r2100M95910M97119k32495
$$ 101386 -434252 -552148 -122812 456311 590388 278262 186162 682072 1179191 946696
42659I46696o36549j7763P56654M58127o26116j098414m85022K92786M80251L51629
$$ 946696 310147 292384 1049038 1507165 881049 -217365 -702387 -409601 70650 422279
42649D22279K79731N9357l84024n53582k01579J70201J49279N8803K51070M08695
$$ 422279 702010 761367 377343 -176239 -377818 -207617 -58338 465 251535 660230
42639F60230J14522m07390o37215m29943K3008M60963N35984P1609m53531l25003
$$ 660230 774752 367362 -269853 -699796 -676788 -215825 320159 391768 -61763 -386766
42629c86766L15987N70171J75888j24754O9801J76925j61365l30629Q9529M66198
$$ -386766 -70779 499392 675280 550526 620327 797252 635887 305258 394787 860985
42619H60985K59027K7266L52658P08603M39691l4287r9853j29179n47841o37307
$$ 860985 1120012 1147278 1499936 2208539 2648230 2613943 2514090 2384911 1837070 1199763
42609A199763K67611J164438O23483q97211j676270j281623p43927m43025K60679
$$ 1199763 1467374 2631812 3255295 2358084 681814 -599809 -1343736 -1786761 -1526082
42600a526082J232824J328737L63706l60262l5169O07825P31957M59582Q883p87368
$$ -1526082 -293258 1035479 1399185 1038923 1003754 1611579 2343536 2803118 2812001 2024633
42590B024633j515762j183590J08119Q80765M15329k34504j74813o8491n18909
$$ 2024633 508871 -674719 -566600 314165 729494 494990 320177 251686 -267223
42581b67223o39934K70396J007736K40839j014100p39056Q56648J559029M76169
$$ -267223 -907157 -636761 370975 611814 -402286 -1141342 -284694 1274335 1750504
42572A750504q55246r59349k40083K49444L46697L17605M8092m37900n38620P497
$$ 1750504 895258 -64091 -304174 -54730 291967 609572 657664 219764 -318856 -311359
42562c11359M40983K3024p67521q80750j74938N42404P46853O74908N69410K18363
$$ -311359 129624 152648 -614873 -1495623 -1670561 -1128157 -381304 293604 863014 1081377
42552A081377m64921r85875q77231m31487k71595l44230j1007P64200J092281
$$ 1081377 616456 -369419 -1246650 -1678137 -1949732 -2293962 -2304969 -1540769 -448488
42543d48488M93866j43465K10759J015350Q08034n29199j433942r12827R3716
$$ -448488 45378 -98087 112672 1128022 1936056 1406857 -27085 -939912 -846196
42534h46196K59210k70545m76660j01676L49372O43440P99958M95296m28107j179895
$$ -846196 -586986 -857531 -1334191 -1435867 -1086495 -443055 356903 852199 424092 -755803
42524g55803q45084J97878P26288L95948l2004o3789N1081J85059M92839O24011
$$ -755803 -1600887 -1403009 -676721 -280773 -312777 -376566 -325485 -140426 352413 976424
42514I76424j385r21481r01078J58495Q52190L59934l65603k63278K01102J07009
$$ 976424 975039 53558 -847520 -689025 163165 523099 157496 -105782 95320 202329
42504B02329k35785L6425O47939N26883m26098j120845q34525l4599M60948M18671
$$ 202329 -33456 2969 650908 1177791 751693 -369152 -1203677 -1238276 -777328 -358657
42494c58657J40682k2347O101j8015k62206l34424K72313J087980Q87434m80364
$$ -358657 -217975 -240322 -234221 -252236 -514442 -848866 -576553 511427 1398861 918497
42484I18497j460262q62810L64546O18593M3872p3299L19169J41343n55531m67183
$$ 918497 -541765 -1404575 -1040029 -421436 -377564 -450863 -131694 9649 -545882 -1013065
42474a013065N44602R08699o9713r17521l53724O65605O23127j46849l00922K03938
$$ -1013065 -468463 440236 370523 -546998 -900722 -235117 388010 241161 -59761 144177
42464A44177L30864o5617j47633K40721L34485r4074l65733j49971N7721o5843
$$ 144177 475041 409424 261791 502512 836997 742923 377190 227219 284940 219097
42454B19097k11584k04238k83965l91217j01306M47070M83122j65229o52827l85619
$$ 219097 7513 -196725 -480690 -871907 -973213 -526143 -43021 -208250 -861077 -1246696
42444a246696J21829K04097Q2620K50486M47577P5685p00060j026773m55997N62768
$$ -1246696 -1124867 -920770 -838150 -587664 -140087 -64402 -764462 -1791235 -2247232 -1684464
42434a684464J238422J153865N23783k3732n6589J52199k2821o39223j043906
$$ -1684464 -446042 707823 1231606 1207874 1151285 1303484 1280663 641440 -402466
42425d02466p78504j14706N06574R72203J153633P59889q981l35200J01350N06693
$$ -402466 -1180970 -1295676 -789102 183101 1336734 2096623 2087642 1752442 1853792 2360485
42415B360485J45957m85309m77320O0935L30100J55138n9867l31394r01482j263786
$$ 2360485 2506442 2021133 1543813 1604748 1934848 2089986 2030119 1698725 797243 -466543
42405d66543o42261N55494J009776L77682k94281k96537j39854k88288k88559
$$ -466543 -1108804 -553310 456466 834148 539867 243330 103476 -184812 -473371
42396d73371J48943L60067j04903n12177j27840M73991L69632j39347r4886M54329
$$ -473371 -324428 35639 -69264 -581441 -709281 -235290 134342 -5005 -99891 354438
42386C54438N82937M5661m47956m58319k86356j81698n949K06424J65814o3595
$$ 354438 937375 983036 535080 76761 -209595 -391293 -397242 -190818 -25004 -88599
42376h8599q3061J20098J42980q3234j90050p0729K728J2459K25482N08871L59183
$$ -88599 -171660 -51562 91418 8184 -181866 -252595 -249867 -237408 -11926 496945 856128
42365H56128k38813o97651p14324n46225k86141K90003R31933Q99761J50573l37784
$$ 856128 617315 -80336 -794660 -1340885 -1627026 -1337023 -405090 494671 645244 307460
42355C07460K1379M87027J40264p02170r96835m32236L50224O81060M03689k32541
$$ 307460 328839 815866 956130 253960 -742875 -1175111 -824887 -143827 259862 27321
42345B7321p06414n27258J67848O32072M57349M7740j91014m74453r20060r36261
$$ 27321 -679093 -1206351 -1038503 -406431 50918 98658 -92356 -566809 -1486869 -2423130
42335b423130j34572P44538P63348K07685P6461M71050N75319J13515k60158j20166
$$ -2423130 -2557702 -1813164 -1049816 -842131 -765670 -294620 280699 394214 134056 13890
42325A3890J39856R1760j33055k68966l08067k84799j79165j04040j36005n3367
$$ 13890 153746 245506 112451 -156515 -464582 -749381 -928546 -1032586 -1168591 -1221958
42315a221958K55472L66761l8608m07915j9281Q16338J203691J048263Q86729
$$ -1221958 -966486 -599725 -638333 -1046248 -1065529 -249191 954500 2002763 2889492
42306B889492N97731l25203j288514j012932L03834R01566O9417q17400o44091
$$ 2889492 3487223 3162020 1873506 860574 1164408 2065974 2135391 1317991 673900
42297F73900k39624n85091r45466l08352O22733O12311P0920K01836P15384L79342
$$ 673900 434276 -150815 -1096281 -1404633 -781900 -169589 -98669 103167 818551 1197893
42287A197893n61082n74667N40038J187155M88472m60950m61093J27303L41559
$$ 1197893 636811 62144 602182 1789337 2277809 1816859 1355766 1483069 1824628
42278A824628P4572k26928m37633n91351n03942j51899R5809K8137j30032k23067
$$ 1824628 1899200 1672272 1234639 643288 139346 -12553 83256 111393 -18639 -241706
42268b41706l58921m53168k77995p8459l08920o25924j44145J036995J661009
$$ -241706 -600627 -1053795 -1331790 -1410249 -1719169 -2345093 -2489238 -1452243 208766
42259B08766J117010K99129N5740o4060o31750r75233k03058J105498J498870
$$ 208766 1325776 1624905 1680645 1616585 984835 9602 -193456 912042 2410912
42250B410912O12398n34456r90990p13256j30439K90338J74465l57243n88965
$$ 2410912 3023310 2488854 1497864 784608 654169 944507 1118972 761729 172764
42241A72764j21190M52257M47406J86722K89411L44720m84258j735430j891889
$$ 172764 51574 503831 951237 1137959 1427370 1772090 1287832 -447598 -2339487
42232b339487n32500R93666J425398J020262O19487L25692j32092n16596m54509
$$ -2339487 -2871987 -1878321 -452923 567339 1186826 1512518 1380426 863830 409321
42223D09321k25528l91835r12037j250062j124119o05537K36570J181607J599496
$$ 409321 183793 -208042 -1120079 -2370141 -3494260 -4099797 -3863227 -2681620 -1082124
42214a082124J056986J03828k41873J49912L47192k68624j086718j117343k89070
$$ -1082124 -25138 78690 -163183 -13271 333921 65297 -1021421 -2138764 -2427834
42205b427834O03054R69297R23778Q20327P89115P81523O76112K52123n79593
$$ -2427834 -1824780 -855483 68295 888622 1677737 2459260 3135372 3387495 2807902
42196B807902j401340j521779q01541O2275L14731o3237n45797p03130l82872
$$ 2807902 1406562 -115217 -916758 -854483 -539752 -602989 -1148786 -1851916 -2234788
42187b234788L35170R64981Q28661p767m47037K55477J213829J004155j90771
$$ -2234788 -1899618 -934637 -105976 -113743 -560780 -305303 908526 1912681 1721910
42178A721910p57342p2933N81024M3848j002516j187932l92432M51677P96076
$$ 1721910 964568 891635 1472659 1516507 513991 -673941 -1066373 -614696 181380
42169A81380O97643J40014p91707j373784r11451J76537Q01925O32479K97730
$$ 181380 879023 1019037 227330 -1146454 -2057905 -1881368 -1079443 -446964 -149234
42160a49234K97797M83568N45846L17583k97933j037457j145581k98477N93990
$$ -149234 148563 632131 1177977 1495560 1197627 160170 -985411 -1283888 -689898
42151f89898M08767n58296r69562l46357M70767P62770P14059O00375K93717j24810
$$ -689898 -281131 -839427 -1808989 -2155346 -1684579 -921809 -207750 392625 686342 561532
42141E61532k36465p1264j21803l78216l52825k16226o64123j346649q89930Q57226
$$ 561532 325067 253803 132000 -246216 -599041 -815267 -1479390 -2826039 -3715969 -2858743
42131b858743K066371J432491J16839r4088N62818N82521k15684o11939j72990
$$ -2858743 -792372 640119 756958 662870 1225688 1808209 1592525 980586 807596
42122H07596J73386j67695o11263n30677j15474K44221N28087P32848O79676L96110
$$ 807596 980982 813287 202024 -328653 -444127 -199906 328181 1061029 1740705 2136815
42112B136815Q0721l53338j021936j418059q83176K22684P66154M32908J05482
$$ 2136815 2217536 1864198 842262 -575797 -1458973 -1236289 -470135 -37227 68255
42103F8255L53196N75044J93396k58300n4028M35884L26825l27405o26216k32087
$$ 68255 421451 996495 1189891 931591 877563 1313447 1640272 1312867 686651 454564
42093D54564J83314J2508m56669n51485j13250M06914N28322K08961j71755k11176
$$ 454564 637878 650386 193717 -357768 -471018 -64104 464218 673179 501424 290248
42083B90248Q5516L12858K01012R303J38678M56503M22560l1168k34511K43039
$$ 290248 375764 688622 889634 898937 1037615 1494118 1916678 1885510 1650999 1894038
42073A894038P37897K59030r94642j657730r92458P2467K60591k98859m93081
$$ 1894038 2631935 2890965 1896323 238593 -753865 -681398 -420807 -719666 -1212747
42064a212747l8656K26523j03119l02253J78066O86790M12670k52549k97023L47166
$$ -1212747 -1251403 -1024880 -1127999 -1430252 -1252186 -565396 -152726 -405275 -702298 -355132
42054c55132P22019K30618o32980j002000n68429K58686P72441N67025m8900l99224
$$ -355132 366887 597505 -35475 -1037475 -1605904 -1347218 -574777 -7752 -56652 -455876
42044d55876l49007m26316p59847n91125M95044J517890J279806J67087l93490
$$ -455876 -804883 -1231199 -1991046 -2582171 -2087127 -569237 710569 877656 484166
42035D84166o8075R2487m31530p81084k41124N84930Q32201O53841O19608N81467
$$ 484166 416091 508578 77048 -704036 -945160 -360230 471971 1125812 1745420 2326887
42025B326887O6118o65669q52929l30454L17209N81682M44825P6344l73404p20618
$$ 2326887 2393005 1727336 874407 543953 861162 1442844 1887669 1964013 1590609 869991
42015H69991q64215q95456q46053n27342R2050N95802N68687J51800j73333j70146
$$ 869991 5776 -889680 -1735733 -2263075 -2171025 -1575223 -1006536 -854736 -1028069 -1198215
42005a198215O4632L51836M59712J62349l75506n63838j45554L10688J61385l53440
$$ -1198215 -1133583 -781747 -322035 -159686 -535192 -1099030 -1244584 -933896 -772511 -1125951
41995a125951m96917j68459N8030j9449Q9584O45366J100577Q48587J18829l22927
$$ -1125951 -1622868 -1791327 -1733297 -1752746 -1663162 -1017796 82781 931368 1050197 727270
41985G27270j58337J88542J85813j78779m94697n08903m29882n55094p15984m14030
$$ 727270 568933 757475 943288 764509 269812 -239091 -668973 -1224067 -1940051 -2354081
41975b354081L89870R96593Q03154J19370k97468k80210k15685j09544M80524
$$ -2354081 -1964211 -967618 -164464 -45094 -342562 -622772 -838457 -948001 -467477
41966d67477J383740J552040M48142r25155j179167l71381J96644j09873n31672
$$ -467477 916263 2468303 2916445 1991290 812123 440742 637386 527513 -4159
41957d159l12405J34794N5833l67442m08267n7179L8422k18180j69813M25543
$$ -4159 -316564 -181770 -125937 -493379 -901646 -958825 -920403 -1138583 -1308396 -882853
41947h82853Q89587O80887K28913J66635L17155J09088m19567p50768p43264o33631
$$ -882853 6734 687621 916534 1083169 1400324 1509412 1089845 339077 -404187 -1037818
41937a037818l72382K47161Q45161O84543j84235p66314m25125K98293N50766
$$ -1037818 -1410200 -1163039 -317878 366665 182430 -583884 -1009009 -710716 -159950
41928a59950K83275K1896k5571p0274k12144l42297m57243o21401o64597l18362
$$ -159950 123325 145221 119650 49376 -162768 -505065 -962308 -1583709 -2248306 -2566668
41918b566668L06383P03363N61565J79963J27049N25717Q30763M58639m02636
$$ -2566668 -2260285 -1556922 -995357 -815394 -688345 -162628 668135 1126774 724138
41909G24138q81322m65444L27736O34171L39662L1308J9175M038k56102n40198
$$ 724138 -157184 -622628 -294892 339279 678941 710249 729424 733462 477360 -62838
41899f2838n97103n01083l86668k44821j26731j25971n8556L36888P70937N92268
$$ -62838 -659941 -1161024 -1547692 -1792513 -1919244 -2045215 -2103771 -1766883 -995946 -403678
41889d03678j68894o01398j35561O24443P56362K12412l33753m18261r4539L25958
$$ -403678 -572572 -1173970 -1309531 -685088 71274 283686 -50067 -468328 -562867 -236909
41879b36909M19922q6819q10749q82956n0862Q32861Q80242K78459j65596j41381
$$ -236909 183013 96194 -714555 -1597511 -1648373 -815512 64730 343189 177593 36212
41869C6212N8851J54483M6482k81269n66659l86173J24810K37060k25287m35137
$$ 36212 95063 249546 296028 14759 -551900 -938073 -813263 -576203 -801490 -1236627
41859a236627J22488P33187O81108M68973O90652O23798n14833j633940j004056
$$ -1236627 -1114139 -380952 300156 769129 1459781 2083579 1568746 -65194 -1069250
41850a069250Q38603J471460Q4982j371192j159767o6594K49407k71987n11312
$$ -1069250 -230647 1240813 1325795 -45397 -1205164 -1271758 -1022351 -1294338 -1805650
41841a805650l1010O88858J202663J292977P61648j41896o01219k51203K38682
$$ -1805650 -1836660 -1147802 54861 1347838 2109486 1967590 1366371 1115168 1353850
41832A353850K31640P9314K68350L63158k24723r99394r99963k99630J69690Q7859
$$ 1353850 1585490 1664804 1933154 2296312 2071589 1072195 72232 -227398 -57708 30151
41822C0151J8265K48144L20070r6954o05226o22098q8048N30282O90926K61477
$$ 30151 48416 296560 616630 519676 -85550 -707648 -795696 -265414 425512 686989
41812F86989k45388j38523N11053P83022J46196o79413o85663j432L84570Q0080
$$ 686989 441601 303078 814131 1597153 1743349 1063936 378273 376841 761411 841491
41802H41491l27126k82555P1446L26168L21767J33765k3601J18941N04078N59171
$$ 841491 514365 231810 303256 629424 951191 1084956 1061355 1180296 1684374 2243545
41792B243545j42946j147742j552509j084649k44971M79151R33904R40614L61561
$$ 2243545 2100599 952857 -599652 -1684301 -1929272 -1450121 -516217 424397 785958
41783G85958l71056m69516K13524R04280Q61279K10748l69904m59745j93260J0414
$$ 785958 414902 -54614 158910 1063190 1924469 2135217 1765313 1305568 1112308 1122722
41773A122722j04060l29246k21258K36412M81998J85332j92783j52848k3476l26526
$$ 1122722 1018662 689416 468158 704570 1186568 1371900 1179117 1026269 1002793 676267
41763F76267o71316l14570L61193J65325r55797j554605p37781N60122J042890
$$ 676267 4951 -309619 51574 216899 -738898 -2293503 -3031284 -2471162 -1428272
41754a428272P56187M46095J43884m52786q27926k05441R72894J380126O61844
$$ -1428272 -672085 -225990 -82106 -534892 -1362818 -1568259 -595365 784761 1446605
41745A446605j51525k82194j77152m14970o23288k30271L68188K83715m90423
$$ 1446605 1295080 1012886 835734 420764 -202524 -432795 -64607 219108 -271315
41736b71315r85101n44032M10301J016239Q94333K64926m30168p62924m95649
$$ -271315 -1256416 -1800448 -1390147 -373908 520425 785351 355183 -407741 -903390
41727i03390J48516N53356L20944k84141o83083n92289p6373P05252J395750J365302
$$ -903390 -754874 -201518 119426 -164715 -847798 -1440087 -1516460 -811208 584542 1949844
41717A949844L82712p20851q02368O7834O08950J25895n49245m32688J41213K57073
$$ 1949844 2332556 1611705 809337 877171 1486121 1612016 1062771 630083 771296 1028369
41707A028369n9860j29609J3035k51014p75046o75812J54532P32444M93135L8859
$$ 1028369 968509 838900 851935 600921 -174125 -849937 -695405 37039 530174 569033
41697E69033n0849j05373m60375o44834k45389K36765K49334J92154O02303R54809
$$ 569033 518184 412811 -47564 -692398 -937787 -701022 -451688 -259534 342769 1297578
41687A297578M01015o68630r78282j96617O48398O59629N2014m94959o31622l02611
$$ 1297578 1698593 1029963 51681 -144936 503462 1163091 1215105 720146 88524 -214087
41677b14087L21719O78249K84834m39294n56558J3490L45956J6077k25746J58868
$$ -214087 107632 785881 1070715 631421 74863 88353 434309 450386 224640 383508
41667C83508M14498k71076j189705r82532K51291R93313N08589k10267j24870
$$ 383508 798006 526930 -662775 -1645307 -1394016 -400703 107886 -102381 -227251
41658b27251K97133K7157p47027q62373N412Q18167P12613K11327L06172Q69310
$$ -227251 69882 97039 -649988 -1512361 -1506949 -688782 23831 235158 541330 1410640
41648A410640Q09802k62873j338916j299119l45174L79251K81784j63948l05434
$$ 1410640 2220442 1957569 618653 -680466 -1025640 -646389 -364605 -528553 -833987
41639h33987r0118J93125M22006N66395M72132J06215k03091j52115M9000m4305
$$ -833987 -924105 -730980 -308974 257421 729553 835768 632677 480562 529562 485257
41629D85257m08054n35572j89556K03242J10770l82060o56353k97806M29880Q87588
$$ 485257 77203 -458369 -647925 -444683 -333913 -715973 -1372326 -1670132 -1240252 -352664
41619c52664P59768L60389J81874K30779O2332m61587q02348m44074L05795O87482
$$ -352664 407104 767493 949367 1180146 1242478 780891 -21457 -465531 -159736 527746
41609E27746N20134K88127K07346r5723p26337j030769m84786M17872P87314N26410
$$ 527746 1047880 1336007 1543353 1447630 721293 -309476 -794262 -376390 410924 937334
41599I37334K52990K52623K12118n8763l18932l86946l66693k96963j09531J1742
$$ 937334 1190324 1442947 1655065 1596302 1277370 890424 523731 226768 117237 128979
41589A28979j82273m00307p8908O04798P77577K18535j90925J31800M77529K6429
$$ 128979 -53294 -453601 -532509 72289 849866 1068401 877476 1009276 1486805 1513234
41579A513234p11148o59809P8837L90186j03095n68770l49021J75523L88694K75617
$$ 1513234 802086 142277 221114 611300 508205 -60565 -409586 -234063 154631 430248
41569D30248Q8122j41803l57923l21882q5401r9438m55796n32012J11365R01251
$$ 430248 518370 376567 18644 -303238 -388639 -488077 -943873 -1475885 -1364520 -463269
41559d63269R15865J48303m82982l44336K06652M50643K58317J16617L26189N17725
$$ -463269 452596 600899 117917 -226419 -19767 430876 689193 805810 1131999 1649724
41549A649724J81492m99368p76774l85780L5018q8667l60266n8781O68790J019646
$$ 1649724 1831216 1331848 555074 169294 204312 115645 -244621 -303402 365388 1385034
41539A385034P50461L44361K3735m72427j006953r30988k14744K19268j72430
$$ 1385034 2135495 2479856 2503591 2031164 1024211 93223 -121521 97747 -74683
41530g4683o76784m13536L61260P46674M77023Q837k76733l09746r7755J68593
$$ -74683 -751467 -1165003 -803743 -57069 419954 428791 152058 -157688 -255443 -86850
41520h6850R4956l30272n18705j52482K11723Q524l78606k54413K54079N19373
$$ -86850 8106 -322166 -840871 -993353 -781630 -773106 -1151712 -1406125 -1152046 -632673
41510f32673M80160N02656M92441R9751l86560l28781J49199K81884j03083l74029
$$ -632673 -152513 350143 842584 942335 555775 226994 376193 658077 554994 180965
41500A80965j86943O8902L4970j83583m41735o69390n34978K03000R78559R16586
$$ 180965 -5978 62924 97894 -85689 -527424 -1196814 -1731792 -1528792 -550233 366353
41490C66353J15573m60197m27181l17867l64248j15931M12948M36059k07317m92743
$$ 366353 481926 21729 -405452 -723319 -1087567 -1203498 -790550 -354491 -561808 -1054551
41480a054551K01466R61271O79427l10431q84118p19219k84371J74238O43012
$$ -1054551 -853085 108186 787613 477182 -406936 -1126155 -1410526 -1236288 -593276
41471e93276P80556L29874j97564j33276K89446L10286j42282m30899k68421k9053
$$ -593276 187280 517154 319590 186314 475760 786046 643764 212865 -55556 -84609
41461h4609o1161l35579o97425r12780o41596P0462N21543K04362l44208k52897
$$ -84609 -145770 -481349 -1178774 -2091554 -2733150 -2662688 -2141145 -1936783 -2280991 -2533888
41451b533888L86822P42214N60913L63735L68397J63809l89170p68485n80156
$$ -2533888 -2147066 -1404852 -843939 -480204 -111807 52002 -337168 -1105653 -1685809
41442a685809q2859L31441O16542P92991O88637K20097l91202q03155p13433K8931
$$ -1685809 -1768668 -1437227 -820685 -27694 660943 881040 489838 -313317 -1026750 -997819
41432i97819J071196J528112Q83665k26204p52127n79796m12899m93654l83114
$$ -997819 73377 1601489 2485154 2258950 1506823 927027 514128 20474 -362640
41423c62640j4582O9313k38472k97524J84154O23268N47652K70615J17375j68242
$$ -362640 -377222 -307909 -546381 -843905 -659751 -36483 511169 781784 899159 730917
41413G30917o59291p15564K0561P72149O25314j12988m17768n5741K83475J86336
$$ 730917 71626 -643938 -623377 148772 774086 661098 243330 187589 471064 657400
41403F57400k338P3856K56577K69430J56021J05448J02329p8429n70858j116217
$$ 657400 655062 728918 985495 1254925 1410946 1516394 1618723 1540294 969436 -146781
41393a46781j145930m01804N69797R23956N38101N7291j25474k94758o12353o13614
$$ -146781 -1292711 -1694515 -1124718 -200762 337339 394630 269156 -25602 -637955 -1251569
41383a251569L6106Q47175J078001N91972k19279q81029r03536p2980R23484R36198
$$ -1251569 -1215463 -368288 709713 1301685 1082406 201377 -702159 -775139 148345 1084543
41373A084543n9662o86236j51585M90765O8287p40048n72213K59866L08843n10148
$$ 1084543 1024881 338645 187060 677825 746112 6064 -566149 -306283 2560 -507588
41363e07588q19034j79752K47862j77816n32959p4982M88908L71489M9170K16921
$$ -507588 -1326622 -1506374 -1258512 -1436328 -1969287 -2044269 -1555361 -1183872 -1134702 -917781
41353i17781M80254J96314k46020j34665K39968J16721l51993l67714J51970N18249
$$ -917781 -437527 -241213 -487233 -621898 -381930 -265209 -617202 -984916 -832946 -314697
41343c14697M27319K35570J39237p5878m39157o63780o55823n72358m07123q6949
$$ -314697 112622 348192 487429 411551 -27606 -691386 -1347209 -1919567 -2326690 -2413639
41333b413639J14169j02900l91423j14851N94497Q64658L43446k63511k21656
$$ -2413639 -2299470 -2402370 -2793793 -2908644 -2314147 -1449489 -1106043 -1369554 -1591210
41324a591210K69656N71259N72951N96598N96983J27634p90734j298490o21420
$$ -1591210 -1321554 -750295 -177344 419254 1016237 1143871 353137 -945353 -1566773
41315a566773Q00076J594053J023736j31359o17163k90504o2297m16821p99991
$$ -1566773 -766697 827356 1851092 1719733 1102570 812066 749769 332948 -467043
41306d67043o58720k80028j35924p2448K18388M49996K07842j89690p6161M95455
$$ -467043 -1125763 -1405791 -1541715 -1614163 -1395775 -945779 -737937 -927627 -1003788 -508333
41296e08333P98937M86555m3667l07554j94722J96621O43915P51106L18628k90427
$$ -508333 290604 777159 733492 425938 231216 427837 1071752 1822858 2141486 1851059
41286A851059n97157o33151o14203l24657M17894R81700O00882k71626m02447
$$ 1851059 1253902 620751 6548 -318109 99785 1081485 1682367 1410741 1008294
41277A008294L46821P69472K36103l69266k13090J68719j9871m09402k28503K54247
$$ 1008294 1355115 2124587 2360690 1991424 1778334 1947053 1927182 1517780 1289277 1543524
41267A543524K37907j47837r5750M05229N11034q8039p46271r10738o89559k87641
$$ 1543524 1781431 1633594 1537844 1943073 2454107 2366068 1619797 709059 19500 -268141
41257b68141K41551N56770K44802l18873k42651M51169O47749j17272p33456j40467
$$ -268141 -26590 530180 774982 456109 213458 664627 1312376 1195104 461648 321181
41247C21181R45165R95147j33312j113703j080980n21400j56807p813R4077j1381
$$ 321181 1266346 2261493 2128181 1014478 -66502 -587902 -744709 -752522 -658445 -669826
41237f69826k82015j61865N52019J098136P28500j10974l60472J40511N43208
$$ -669826 -951841 -1113706 -561687 536449 1264949 1153975 793503 934014 1477222
41228A477222L18317j43753l79184m94701o50279n88126j50062K37551J10912
$$ 1477222 1795539 1651786 1272602 777901 127622 -460504 -610566 -373015 -262103
41219b62103l28388n16186k85916P1032K85447K87858J06595q9205m4378K25045
$$ -262103 -590491 -1106677 -1392593 -1321561 -1036114 -748256 -641661 -730866 -775244 -550199
41209e50199L88415L22186K73710K64498p8563o82806p47809l487M88948j75408
$$ -550199 -161784 160402 434112 698610 620047 -62759 -810568 -814055 -325107 -500515
41199e00515j071699o23293Q63937J436778L72971p94424o48242K21919N65357
$$ -500515 -1572214 -2195507 -1331570 105208 478179 -316245 -964487 -742568 -177211
41190a77211M08436M79046O54886L19318k87176l60969N8301J23852l97904p26257
$$ -177211 231225 710271 1365157 1684475 1397299 1036330 1094631 1218483 820579 94322
41180I4322k43586O55002J101866O98303j74867o99914l58540M36167O87512L6634
$$ 94322 -149264 505738 1607604 2305907 2131040 1431126 1072586 1508753 2196265 2232899
41170B232899p74350r74594p24706n16303k80846J60952L78351P982l35931R7867
$$ 2232899 1458549 483955 -240751 -757054 -1037900 -876948 -498597 -490615 -826546 -728679
41160g28679Q15097P25884n2984l66057M0018J71338l57274n75736R0742O17713
$$ -728679 86418 812302 759318 393261 433279 604617 247343 -328393 -237651 380062
41150C80062p0826j255480j278310J74921J668409J814742P36802l52576n59867
$$ 380062 309236 -946244 -2224554 -2049633 -381224 1433518 2170320 1817744 1257877
41141A257877j18838R1034k69804n51715j25908N04629L14479o37517j127188
$$ 1257877 1139039 1230073 960269 408554 282646 787275 1101754 464237 -662951
41132f62951m83063N24824R10372P14448M45958Q9069n30478r76970p01008J2301
$$ -662951 -1146014 -621190 289182 1003630 1449588 1538657 1008179 31209 -669799 -657498
41122f57498L97794L23564L10674N38159N53153P9280m39313l56066L40188Q79624
$$ -657498 -259704 63860 374534 912693 1465846 1545126 1105813 749747 1089935 1969559
41112A969559M70045p00016j400952p37468N37762Q18151j72832r57916m71196
$$ 1969559 2439604 1739588 338636 -398832 138930 957081 784249 -173667 -644863
41103f44863M27836M45143j03425M587P49666R03557R2046n94081l17659L61771
$$ -644863 -217027 228116 124691 129278 878944 1782501 1874547 1280466 962807 1324578
41093A324578N29105J48219k97797o50591r54988j018886o52440k3295N83859
$$ 1324578 1853683 2001902 1704105 1053514 98526 -920360 -1572800 -1596095 -1012236
41084a012236J020381J056479M24404n66131r91169m11215M08823M55664j91079
$$ -1012236 8145 1064624 1489028 922897 -68272 -479487 -70664 385000 193921
41075A93921o35974n55034m88930o97189n75345L12945J223929J016486j96396
$$ 193921 -442053 -997087 -1486017 -2183206 -2758551 -2445606 -1221677 -205191 -401587
41066d01587r33975j53474J354235J862962P67000p96641j368579o95494L40788
$$ -401587 -1335562 -1489036 -134801 1728161 2495161 1698520 329941 -365553 -24765
41057b4765Q81108P98785M59208J67593q0047m37902q59542r83434n31561K24414
$$ -24765 856343 1655128 2114336 2281929 2201882 1763980 904438 -78996 -610557 -386143
41047c86143O68484N37281J28889j84894k82302j20761K51903M22575m4674p83297
$$ -386143 282341 819622 948511 763617 481315 360554 612457 1035032 990358 207061
41037B07061q31648k4337N73991J80234n21712m93122N0998J72155j59143j65031
$$ 207061 -624587 -648924 -74933 105301 -416411 -909533 -858535 -686380 -845523 -1010554
41027a010554K44358L30425r4683l34650n4953K30700K19750L21642O80300O71387
$$ -1010554 -766196 -435771 -530454 -865104 -920057 -689357 -469607 -147965 532335 1203722
41017A203722p1030r35822j191718q58635k65901M77878J060845Q59002p3325
$$ 1203722 1132692 196870 -994848 -1853483 -2119384 -1641506 -580661 278341 205016
41008B05016o72863k70428M05407M25031Q1578J20943K77455j50474p56740n11410
$$ 205016 -467847 -738275 -332868 92163 173741 294684 572139 421665 -335075 -846485
40998h46485L72555N39763l69635j082358o39439K70757N88199M03563L53611
$$ -846485 -473930 65833 -303802 -1386160 -2025599 -1754842 -1166643 -763080 -409469
40989d09469L79979J17750q3995L51226J009087Q45552k28468j086754r19021
$$ -409469 -29490 88260 4265 355491 1364578 2210130 1981662 894908 -24113
40980b4113k09273J56676O5606l7135j6671q4621k29960k15253o8883n2839j13974
$$ -24113 -233386 -76710 -11104 -48239 -64910 -149531 -379491 -594744 -663627 -716466 -830440
40969h30440J15369O07820P25333O9062q01615r73524l41926L33816N14530M61244
$$ -830440 -715071 -107251 618082 687144 -114471 -1087995 -1429921 -1096105 -581575 -120331
40959a20331N34842M70549j31740r00769r74170k46929L01754j09417r14820q95128
$$ -120331 414511 885060 753320 -147449 -1121619 -1368548 -1066794 -1176211 -2091031 -2986159
40949b986159J84062J259449J351361O58364N102k77014m30948n65251m67638
$$ -2986159 -2802097 -1542648 -191287 467077 472179 195165 -235783 -801034 -1268672
40940a268672q9899K51016K37520j40050n86119n98432J70684J264251J504257
$$ -1268672 -1358571 -1107555 -870035 -1010085 -1596204 -2194636 -2023952 -759701 744556
40931G44556L98802q55994p40790L83933O93916l33937j077007l57975O36006
$$ 744556 1143358 287364 -453426 -69493 624423 290486 -786521 -1144496 -508490
40922e08490K91547p86413p80017L97220J049205M05058m53267n77831l74475
$$ -508490 -216943 -1003356 -1783373 -1386153 -336948 68110 -385157 -962988 -1337463
40913a337463l29831m8736O60690J014804M97590j16990O8418O83057P97723L73315
$$ -1337463 -1667294 -1716030 -1055340 -40536 457054 340064 408482 1091539 1889262 2262577
40903B262577N9620L0231p9787l73359n82870n57010l21074O2711K96866q489
$$ 2262577 2322197 2352428 2272641 1899282 1316412 759402 438328 501039 797905 789416
40893G89416n63531m19330O42155J440271R13667l25564q81077m72215P7232K88431
$$ 789416 225885 -193445 448710 1888981 2802648 2477084 1596007 1123792 1201024 1489455
40883A489455L23215J48271l77041p27612k67989M41029J88089q89825j231057
$$ 1489455 1812670 1960941 1583900 856288 588299 1029328 1217417 327592 -903465
40874i03465k14625P45994K85644q61096j012699j2892P18729L56892l10651k43598
$$ -903465 -1118090 -372096 -86452 -947548 -1960247 -1973139 -1254410 -897518 -1208169 -1451767
40864a451767L92361O61477K64127j22249J34531P48123R21611L85739l43229
$$ -1451767 -1059406 -397929 -133802 -256051 -121520 626603 1548214 1933953 1590724
40855A590724o95888o24198l47336K2737L44288L60703J15133N3183K94866K64542
$$ 1590724 894836 270638 -76698 -53961 290327 651030 766163 819346 1114212 1378754
40845A378754l69218q59572l35052P17710R49592Q2467p19207n99013p0053J04418
$$ 1378754 1009536 149964 -185088 532622 1482214 1564681 845474 246461 176408 280826
40835B80826Q6098K98479L93534j61742r15841q55996Q6010Q29077O04714q3087
$$ 280826 366924 665403 1058937 897195 -18646 -874642 -788632 40445 645159 562072
40825E62072l01398K9072K10007j14271n01202m69236j99557j05005n9013L26234
$$ 562072 260674 289746 499753 385482 -115720 -584956 -784513 -889518 -948531 -622297
40815f22297P66159M45096o53636j326309o42076P05126J267139O85735j18405
$$ -622297 143862 588958 -64678 -1390987 -2033063 -1327937 -60798 624937 506532
40806E06532l50763r2562K63297M83460L44188k25494p30177n33729J72777N04261
$$ 506532 155769 63207 326504 809964 1154152 928658 198481 -335248 -162471 341790
40796C41790J18163l71328l90555j22565J8489j7789j28308k91600l49317q3095
$$ 341790 459953 88625 -301930 -424495 -406006 -423795 -552103 -843703 -1193020 -1276115
40786a276115L22710M46254L36716M05128N69404L26925k19954l69589o5597o8229
$$ -1276115 -953405 -507151 -170435 234693 804097 1131022 911068 541479 475882 407653
40776D07653n22362n29907K47874P51808J66392o65644n53963J93175M43767Q5095
$$ 407653 -114709 -644616 -396742 355066 521458 -144186 -698149 -504974 -61207 23888
40766B3888r4922Q0651P0838j94569j92989J76736M37961L62497J43302j24389
$$ 23888 -71034 9617 80455 -114114 -307103 -130367 307594 670091 813393 689004
40756F89004l81767k93554J97869L75847k51431q66682l96650P00544J032764
$$ 689004 307237 13683 211552 587399 335968 -530714 -927364 -226820 805944
40747H05944M49686J07393L34538J07031r20222j485502o76023N10450O31028
$$ 805944 1255630 1363023 1697561 1804592 884370 -601132 -1277155 -766705 -135677
40738a35677j40179n33336j09911M14392M15791J7048l43255l34793J30185P14898
$$ -135677 -275856 -809192 -919103 -504711 -88920 -71872 -415127 -749920 -619735 95163
40728I5163Q18870K93412k91228m19193k88610l44637n78503o98494n97849k61996
$$ 95163 914033 1207445 916217 497024 208414 -136223 -714726 -1413220 -2011069 -2273065
40718b273065L53938R52969R04816J29099n10279k70764M33242O66577K46470
$$ -2273065 -1919127 -966158 -61342 67757 -442522 -713286 -280044 386533 633003
40709F33003k83647n98485p57576o51270o0743P49870J133244Q09177J04681m81259
$$ 633003 349356 -249129 -1006705 -1657975 -1718718 -968848 164396 973573 1078254 596995
40699E96995o06200k02527L32859L64918j30910l65123P7050L96259k53479j272500
$$ 596995 -9205 -211732 121127 486045 355135 -9988 67062 463321 209842 -1062658
40689a062658j381938n47951J26362K90515O70009J323467J147851k18360j383793
$$ -1062658 -2444596 -2992547 -2866185 -2575670 -1905661 -582194 565657 347297 -1036496
40680a036496j089685l9560K80826k06834l98376J07525O07768N77727K65977
$$ -1036496 -2126181 -2165741 -1884915 -2091749 -2490125 -2382600 -1774832 -1197105 -931128
40671i31128L5700j2323K12014O59992Q49038M13488k03361l50035k20435m25780
$$ -931128 -895428 -907751 -695737 -35745 813293 1226781 1023420 673385 452950 27170
40661B7170p62642n00384K10891M55532J51106J99964P61287Q01784m1590n82115
$$ 27170 -735472 -1235856 -1024965 -569433 -418327 -218363 542924 1344708 1303118 721003
40651G21003j598O49450J22075r11781r06237J04638P06202L88937K6794J28677
$$ 721003 719405 1368855 1490930 579149 -327088 -222450 483752 872689 899483 1028160
40641A028160J56781j74294l06096J1200J58859k06135m58808q4187L96896K54105
$$ 1028160 1184941 1010647 704551 715751 874610 668475 209667 125480 522376 776481
40631G76481l49650p13229n52762p5510M45208P12679M71839n2615k31992P3743
$$ 776481 426831 -286398 -839160 -914670 -469462 243217 715056 662441 430449 504192
40621E04192K05481k80096q09199n71778K70507P41107K50142p54572j231587
$$ 504192 709673 429577 -379622 -951400 -680893 60214 310356 -444216 -1675803
40612a675803n01050R83358J804657J013402n78480j210382l88439N72361M93951
$$ -1675803 -2176853 -1193495 611162 1624564 1046084 -164298 -552737 19624 513575
40603E13575j87328m50535k12971l349P2094J10648j68935q28191j106207m10957
$$ 513575 326247 -124288 -337259 -340608 -268514 -157866 -326801 -1154992 -2261199 -2672156
40593b672156N70275P43245J59338k82251k50008p3141J63648N36228O65450K82127
$$ -2672156 -2101881 -1358636 -1199298 -1481549 -1731557 -1804698 -1641050 -1104822 -439372 -157245
40583a57245R953M25614Q08138J86792q12211p87595O3067K39966m35228n27566
$$ -157245 -147292 278322 1086460 1273252 461041 -326554 -263487 -23521 -458749 -986315
40573i86315L67139P91115l0224q02487l91928L46162K66560j28784N9020L25574
$$ -986315 -619176 171939 141715 -660772 -1052700 -706538 -439978 -568762 -509742 -184168
40563a84168j24902o13036j14898P29195N85923k43961l62120K99411N34549J57200
$$ -184168 -309070 -922106 -1037004 -307809 278114 34153 -327967 -28556 505993 663193
40553F63193K31489Q71919Q06859l29495j083954m19250O62804P82455K21932
$$ 663193 894682 1766601 2573460 2243965 1160011 740761 1403565 2186020 2407952
40544B407952J05838M73955M67078j03693n81878o27599n52088n72041n44743
$$ 2407952 2513790 2987745 3454823 3351130 2769252 2141653 1589565 1017524 472781
40535D72781m25197l28433j83145R9087K34637k9663k87416r151L90462j8706
$$ 472781 47584 -280849 -463994 -364907 -130270 -159933 -447349 -456500 -66038 -84744
40525h4744j049836j283897j08199J147450J004136l7501l50254L35031P28701
$$ -84744 -1134580 -2418477 -2526676 -1379226 -375090 -412591 -762845 -427814 300887
40516C00887K00879l12679l4399M10699K44618j42643j18844o3025m96082p80514
$$ 300887 501766 189087 154688 565387 810005 667362 548518 485493 -10589 -791103
40506g91103j13372P55010M11675q44377j211450r4447J035452R16273J10017
$$ -791103 -904475 -149465 262210 -582167 -1793617 -1888064 -852612 63661 173678
40497A73678l19310l71140m83595m84191j24321K24935K68729L53028N69170K44163
$$ 173678 -145632 -516772 -1000367 -1484558 -1608879 -1383944 -1115215 -762187 -193017 51146
40487E1146p87455j401408p74225J61488J30480m19213j42359Q87625J305056
$$ 51146 -736309 -2137717 -2911942 -2750454 -2619974 -3039187 -3181546 -2293921 -988865
40478i88865O48607j29562l39089k81907j78063K48430Q10068P51786L6909l70746
$$ -988865 -340258 -469820 -808909 -1090816 -1268879 -1020449 -210381 541405 578314 207568
40468B07568J6842M57523K19839l39588n33542l89370k89323j96044J01065M05797
$$ 207568 224410 681933 901772 562184 28642 -360728 -650051 -846095 -745030 -339233
40458c39233L74119P8226j30595j18671k7257r616q1372p0204K74179Q57652J072966
$$ -339233 34886 113112 -17483 -136154 -163411 -173027 -254399 -324603 -50424 807228 1880194
40447A880194N07306l14559m93484m761K92771p7155o48140q30642n87031j29054
$$ 1880194 2387500 2072941 1579457 1574696 1867467 1790312 1142172 311530 -275501 -404555
40437d04555L59430N13742K5826o75386p12746j0060M98201K45741j74545q7515
$$ -404555 -45125 468617 494443 -180943 -893689 -903749 -405548 -159807 -334352 -421867
40427d21867J65223r7304o71840p07786O9089R92259J263369P67246J13156k1877
$$ -421867 -256644 -353948 -1025788 -1733574 -1664485 -672226 591143 1358389 1471545 1449668
40417A449668K98051K50995n94956j397735j049443R9690N84039n288m29170J55786
$$ 1449668 1747719 1998714 1403758 6023 -1043420 -943730 -359691 -364979 -794149 -638363
40407f38363Q30330M57755m76053p19907k03642J23492m4852j10363J87047L70875
$$ -638363 191967 649722 173669 -546238 -749880 -626388 -671240 -781603 -594556 -223681
40397b23681J34115k10249k89217p0936K71609M08995j652o78570o29173N33900
$$ -223681 -89566 -299815 -589032 -659968 -388359 20636 18984 -659586 -1288759 -754859
40387g54859J616034J197504l12266j164319p29425j34245k39368m15017J7628
$$ -754859 861175 2058679 1746413 582094 -147331 -281576 -520944 -935961 -918333
40378i18333M20211p465o18479j86858J037588J472700M34760r26291j266170
$$ -918333 -498122 -505587 -1124066 -1310924 -273336 1199364 1634124 707833 -558337
40369e58337o90862j93810j45880j22779J13543K97120L18439M71295Q08049Q39278
$$ -558337 -1249199 -1443009 -1588889 -1711668 -1598125 -1301005 -982566 -511271 296778 1136056
40359A136056K71709l81325m13332J03769M45022J96069l47825o67240n14879
$$ 1136056 1407765 1026440 613108 716877 1161899 1357968 1010143 342903 -171976
40350a71976r715M14591L09465j71328k38723M19378Q60233N6976j378733j725580
$$ -171976 -181691 232900 542365 371037 132314 551692 1411925 1468901 90168 -1635412
40340a635412m78749R73240J304514P65776K24527j88293o42119p41954j41985
$$ -1635412 -2114161 -1140921 163593 929369 1153896 965603 323484 -418470 -560455
40331e60455N61687N35212q6603n32355n46140m10486k07658J28819L67294L43979
$$ -560455 1232 536444 449841 -82514 -628654 -1039140 -1246798 -1117979 -750685 -406706
40321d06706L95991O99067O96882N3006m41312j2186O21155K66757o80629p85751
$$ -406706 -10715 688352 1385234 1438240 996928 984742 1605897 1872654 1192025 406274
40311D06274J8639L41131k12461l68459M60546R74585J70870q30493n34112N13351
$$ 406274 424913 766044 553583 185124 645670 1620255 1791125 960632 426520 939871
40301I39871O30817l76020j096573p42832l0441K31137J74378J74166Q9936k90906
$$ 939871 1570688 1194668 98095 -644737 -675178 -444041 -269663 -95497 -5561 -296467
40291b96467o66267n69058j3455N22061O19736L01948j5386M2931L34280L16649
$$ -296467 -962734 -1531792 -1545247 -1023186 -403450 -101502 -116888 -73957 260323 576972
40281E76972j79906n66737k43780M84980P57382L50070n4354N8162K55060j39013
$$ 576972 397066 -169671 -413451 71529 828911 1178981 1124627 1182789 1437849 1298836
40271A298836r21556j174771n24735K98185M10984q6853l60046k9196M36138N46988
$$ 1298836 377280 -797491 -1322226 -1024041 -613057 -699910 -1059956 -1089152 -653014 -106026
40261a06026M09930K44282j14869p03742r09877k13243Q33016J203554Q61450
$$ -106026 303904 548186 433317 -270425 -1180302 -1393545 -560529 643025 1504475
40252A504475O85083Q99945O78247l22243j120910q77100k90067n00269j215596
$$ 1504475 2189558 3089503 3767750 3445507 2324597 1447497 1157430 657161 -558435
40243e58435j168836j80980N34670K52599k92852k47798J09092J50846Q1308M00177
$$ -558435 -1727271 -1908251 -1373581 -1120982 -1413834 -1661632 -1552540 -1401694 -1320386 -920209
40233i20209P55991M07408l94783n80927Q7289N64784R4819o66431p17317j92832
$$ -920209 -164218 243190 -151593 -732520 -645231 -80447 14372 -652059 -1369376 -1562208
40223a562208M2745j55960j00836N09642J097514J051442M32125l08108p94140
$$ -1562208 -1519463 -1675423 -1776259 -1266617 -169103 882339 1314464 1006356 212216
40214B12216q19272m49830j05071r9504j81730m9303o8971o30836r99069o8865
$$ 212216 -607056 -1056886 -1161957 -1261461 -1443191 -1492494 -1561465 -2192301 -3191370 -3260235
40204c260235J598523J981686M50499j041454o50753P54961J086783J20908n91976
$$ -3260235 -1661712 319974 770473 -270981 -921734 -166773 920010 1040918 448942
40195D48942l26391Q6019J164j94196j72982k25328m11867k97592J61927M40101
$$ 448942 122551 208570 209734 15538 -157444 -382772 -794639 -1092231 -930304 -490203
40185d90203L63110L04026L32710J15688k47919k76038o3141j69267n11638m72326
$$ -490203 -127093 176933 509643 625331 377412 101374 38233 -131034 -642672 -1114998
40175a114998j30660j44536l53703P8593R61926J086486K85982j66121K31615
$$ -1114998 -1245658 -1390194 -1743897 -1665304 -703378 383108 669090 502969 734584
40166G34584L35623n11742j222695q87534k83807k14949J4575R50404J377824
$$ 734584 1070207 558465 -664230 -1551764 -1835571 -2050520 -2035945 -1085541 292283
40157B92283K17537j240178j047676L86519J073438N29525k3631n1915j44331
$$ 292283 509820 -730358 -1778034 -1391515 -318077 211448 187817 135902 -8429
40148h429k90899J55379Q08328N65504l04583l90978L58198M57125m01656o59196
$$ -8429 -299328 -143949 664379 1229883 925300 534322 892520 1349645 947989 288793
40138B88793L07095Q73418q8654j097033l73696J194411J357693j11254j293037
$$ 288793 595888 1469306 1380652 283619 -90077 1104334 2462027 2350773 1057736
40129A057736j054694l05556j52379l04008O3493Q17896J056695M30984l76897
$$ 1057736 3042 -302514 -454893 -758901 -695408 122488 1179183 1610167 1233270
40120A233270n75402k62928j61468m76610n68243O2O53975O27288J39667l3730
$$ 1233270 657868 394940 233472 -243138 -811381 -811319 -157344 469944 609611 575881
40110E75881J35280J782n07812p57360n49800l66525l01550J45540Q96193J032418
$$ 575881 711161 712943 205131 -552229 -1102029 -1468554 -1770104 -1624564 -728371 304047
40100C04047K39878m97282k95495M08374P08257M77747M9970n52561j232974j350786
$$ 304047 543925 46643 -248852 159522 867779 1345526 1395496 842935 -390039 -1740825
40090a740825n48926M58575P66182M79203K42205R9614k32279m22556K4851O08774
$$ -1740825 -2289751 -1831176 -1064994 -585791 -343586 -243972 -476251 -898807 -873956 -265182
40080b65182K89454q36189j405195o35614O04211J038792N88729J28282J05833
$$ -265182 24272 -811917 -2217112 -2852726 -2248515 -1209723 -620994 -492712 -386879
40071c86879J32423j34041l60015j02086L85885M43174M0868q8388L85418P31687
$$ -386879 -254456 -388497 -748512 -850598 -464713 -21539 19329 -69059 316359 1048046
40061A048046K58486m69551m24120J96708K23644n46320r40986l02881M35651
$$ 1048046 1306532 836981 412861 609569 833213 286893 -654093 -956974 -521323
40052e21323K52461m15290m90626J52483Q03243J015494P80783J54322n20978
$$ -521323 -268862 -684152 -1174778 -1022295 -219052 796442 1577225 1731547 1210569
40043A210569n80281R295K79115l39193r48217n21890L87668N15733q5447k89412
$$ 1210569 630288 639583 918698 579505 -368712 -890602 -502934 12799 -72648 -362060
40033c62060J44967L44075j816j95453N1372J27369k00585k68514K37872O14096
$$ -362060 -217093 126982 125166 -70287 -18915 108454 -92131 -360645 -122773 491323
40023D91323K80322l34031n98937n43670l84406P45N59086P60721L91963Q92P724
$$ 491323 771645 437614 -161323 -704993 -1089399 -1088654 -529568 231153 623116 624008 631732
40012F31732K5121l58106p55809o03481o7403L05992L84842L05980L0064l24674
$$ 631732 656853 298747 -457062 -1060543 -1127946 -821954 -437112 -131132 -101068 -425742
40002d25742k09813N49104J105818N91135n25947r43601k64814O06376P84770
$$ -425742 -635555 -86451 1019367 1610502 1084555 140954 -123860 482516 1267286
39993A267286K99821m20018j121584j471688r65535L44875J464536J405870L78490
$$ 1267286 1567107 1147089 25505 -1446183 -2411718 -2066843 -602307 803563 1182053
39984A182053m65130m40417p575R1988j04799k8693L68860M63771j4663m41871
$$ 1182053 716923 276506 268931 360919 256120 227427 596287 1060058 1045395 603524
39974F03524k20646K56305K28678j77058j62517L64721N80063J04868l54621j84005
$$ 603524 382878 639183 867861 690803 528286 893007 1473070 1577938 1223317 1039312
39964A039312J60160N434l90779l60672J2670J47846N4764K25492N72683M47522
$$ 1039312 1199472 1204906 814127 453455 466125 613971 668735 894227 1466910 1914432
39954A914432j92512n33077r4087N90489Q46599P41464O27705L90257k31747r33797
$$ 1914432 1721920 1188843 1094756 1685245 2531844 3273308 3901013 4291270 4059523 3125726
39944C125726j118976p66414m64037n51117o93781m49415Q9489M23589K42937
$$ 3125726 2006750 1240336 776299 225182 -468599 -918014 -828525 -404936 -161999
$$ [...]
##END NTUPLES=NMR SPECTRUM
##END=
