##TITLE=31Pdec_PR163-1
 D2O, 24 sc
 16.1.2019
##JCAMPDX= 6.0         $$ Bruker NMR JCAMP-DX V2.0
##DATA TYPE= NMR SPECTRUM
##DATA CLASS= NTUPLES
##ORIGIN= UXNMR, Bruker Analytische Messtechnik GmbH
##OWNER= root
$$ XWIN-NMR		Version 3.5
$$ Wed Jan 16 16:14:52 2019 Russian Standard Time (UT+4h)  she@DPX200
##.OBSERVE FREQUENCY= 81.013821
##.OBSERVE NUCLEUS= ^31P
##.ACQUISITION MODE= SIMULTANEOUS
##.ACQUISITION SCHEME= undefined
##.AVERAGES= 24
##.DIGITISER RES= 17
##SPECTROMETER/DATA SYSTEM= spect
##.PULSE SEQUENCE= zgpg30
##.SOLVENT NAME= D2O
##.SHIFT REFERENCE= (INTERNAL, D2O, 0, 182.463)
##AUDIT TRAIL= $$ (NUMBER, WHEN, WHO, WHERE, WHAT)
$$ ##TITLE= Audit trail, XWIN-NMR		Version 3.5
$$ ##JCAMPDX= 5.01
$$ ##ORIGIN= Bruker BioSpin GmbH
$$ ##OWNER= she
$$ F:/spectra/data/she/nmr/P31/1/pdata/1/auditp.txt
$$ ##AUDIT TRAIL=  $$ (NUMBER, WHEN, WHO, WHERE, WHAT)
(   1,<2019-01-16 16:12:56.28 +0400>,<she>,<DPX200>,
      <created by zg, POWCHK disabled, PULCHK disabled
       configuration hash MD5:
       00 E9 B6 7A A2 85 ED C7 34 08 36 98 17 FE 4E 26
       data hash MD5: 32K
       EE 3C DA 66 A7 57 C0 AF 62 A9 0F 36 F4 27 05 2F>)
(   2,<2019-01-16 16:13:48.90 +0400>,<she>,<DPX200>,
      <Start of raw data processing
       efp BC_mod = 2 LB = 1 FT_mod = 6 PKNL = 1 PHC0 = -1533.223 PHC1 = 185.399 SI = 64K 
       data hash MD5: 64K
       09 EA 16 7D 80 5F 85 67 1A 56 0E 74 A7 0A ED D1>)
(   3,<2019-01-16 16:14:12.09 +0400>,<she>,<DPX200>,
      <pk PHC0 = 47.15422 PHC1 = -95.20002 
       data hash MD5: 64K
       14 A1 58 86 DC CE 4E 42 34 FA 62 BE 3A E0 AD 24>)
(   4,<2019-01-16 16:14:15.76 +0400>,<she>,<DPX200>,
      <abs ABSG = 5 
       data hash MD5: 64K
       6B D8 BA 8C 89 DA EA 0A 8F 42 DD DD 5D B7 05 B6>)
$$ ##END=
$$ 
$$ hash MD5
$$ 42 56 DA 29 45 00 17 E3 1D 1E 6E C9 C4 5A 59 D8
##$RELAX= 
##$RELAX= 
##$RELAX= 
##$RELAX= 
##$RELAX= 
##$RELAX= 
##$RELAX= 
##$RELAX= 
$$ Bruker specific parameters
$$ --------------------------
##$DU= <F:/spectra>
##$EXPNO= 1
##$NAME= <P31>
##$PROCNO= 1
##$TYPE= <nmr>
##$USER= <she>
##$AMP= (0..31)
100 100 100 100 100 100 100 100 100 100 100 100 100 100 100 100 100 100 
100 100 100 100 100 100 100 100 100 100 100 100 100 100 
##$AQSEQ= 0
##$AQ_mod= 1
##$AUNM= <au_zg>
##$AUTOPOS= <>
##$BF1= 81.014009
##$BF2= 200.13
##$BF3= 200.13
##$BF4= 200.13
##$BF5= 200.13
##$BF6= 200.13
##$BF7= 200.13
##$BF8= 200.13
##$BYTORDA= 1
##$CFDGTYP= 0
##$CFRGTYP= 5
##$CHEMSTR= <none>
##$CNST= (0..31)
1 1 145 1 1 1 1 1 1 1 1 1 1 1 1 1 1 1 1 1 1 1 1 1 1 1 1 1 1 1 1 1 
##$CPDPRG= <waltz16>
##$CPDPRG1= <>
##$CPDPRG2= <waltz16>
##$CPDPRG3= <>
##$CPDPRG4= <mlev>
##$CPDPRG5= <mlev>
##$CPDPRG6= <mlev>
##$CPDPRG7= <mlev>
##$CPDPRG8= <mlev>
##$CPDPRGB= <>
##$CPDPRGT= <>
##$D= (0..31)
0 1 0 0 0 0 0 0 0 0 0 0.03 2e-05 3e-06 0 0 0 0 0 0 0 0 0 0 0 0 0 0 0 0 
0 0 
##$DATE= 1547640775
##$DBL= (0..7)
120 120 120 11 120 120 24 19 
##$DBP= (0..7)
150 150 150 150 150 150 150 150 
##$DBP07= 0
##$DBPNAM0= <>
##$DBPNAM1= <>
##$DBPNAM2= <>
$$ [...]
##$SUBNAM3= <"">
##$SUBNAM4= <"">
##$SUBNAM5= <"">
##$SUBNAM6= <"">
##$SUBNAM7= <"">
##$SUBNAM8= <"">
##$SUBNAM9= <"">
##$SW= 369.568048894756
##$SWIBOX= (0..15)
0 1 3 0 0 0 0 0 0 0 0 0 0 0 0 0 
##$SW_h= 29940.119760479
##$TD= 32768
##$TD0= 1
##$TE= 0
##$TE2= 300
##$TE3= 300
##$TEG= 300
##$TL= (0..7)
0 120 53 12 22 120 120 120 
##$TP= (0..7)
150 150 150 150 150 150 150 150 
##$TP07= 0
##$TPNAME0= <>
##$TPNAME1= <>
##$TPNAME2= <>
##$TPNAME3= <>
##$TPNAME4= <>
##$TPNAME5= <>
##$TPNAME6= <>
##$TPNAME7= <>
##$TPOAL= (0..7)
0.5 0.5 0.5 0.5 0.5 0.5 0.5 0.5 
##$TPOFFS= (0..7)
0 0 0 0 0 0 0 0 
##$TUNHIN= 0
##$TUNHOUT= 0
##$TUNXOUT= 0
##$USERA1= <user>
##$USERA2= <user>
##$USERA3= <user>
##$USERA4= <user>
##$USERA5= <user>
##$V9= 5
##$VALIST= <valist>
##$VCLIST= <CCCCCCCCCCCCCCC>
##$VD= 0
##$VDLIST= <DDDDDDDDDDDDDDD>
##$VPLIST= <PPPPPPPPPPPPPPP>
##$VTLIST= <TTTTTTTTTTTTTTT>
##$WBST= 1024
##$WBSW= 4
##$XGAIN= (0..3)
0 0 0 0 
##$XL= 0
##$YL= 0
##$YMAX_a= 14790
##$YMIN_a= -17009
##$ZGOPTNS= <>
##$ZL1= 120
##$ZL2= 120
##$ZL3= 120
##$ZL4= 120
##$ABSF1= 182.463
##$ABSF2= -187.1042
##$ABSG= 5
##$ABSL= 3
##$ALPHA= 0
##$AQORDER= 0
##$ASSFAC= 0
##$ASSFACI= 0
##$ASSFACX= 0
##$ASSWID= 0
##$AUNMP= <proc_1d>
##$AZFE= 0.1
##$AZFW= 0.5
##$BCFW= 0
##$BC_mod= 2
##$BYTORDP= 0
##$COROFFS= 0
##$CY= -3
##$DATMOD= 1
##$DC= 0
##$DFILT= <>
##$DTYPP= 0
##$F1P= 0
##$F2P= 0
##$FCOR= 1
##$FTSIZE= 65536
##$FT_mod= 6
##$GAMMA= 0
##$GB= 0
##$INTBC= 1
##$INTSCL= 5.30512e-09
##$ISEN= 30
##$LB= 1
##$LEV0= 0
##$LPBIN= 0
##$MAXI= 10000
##$MC2= 0
##$MEAN= 0
##$ME_mod= 0
##$MI= 50
##$NCOEF= 0
##$NC_proc= -5
##$NLEV= 6
##$NOISF1= 182.463
##$NOISF2= 159.3651
##$NSP= 0
##$NTH_PI= 0
##$NZP= 0
##$OFFSET= 182.463
##$PC= 4
##$PHC0= -1486.069
##$PHC1= 90.19898
##$PH_mod= 1
##$PKNL= yes
##$PPARMOD= 0
##$PSCAL= 0
##$PSIGN= 0
##$REVERSE= no
##$SF= 81.0140089999434
##$SI= 65536
##$SIGF1= 159.3651
##$SIGF2= -187.1042
##$SINO= 113.3802
##$SIOLD= 16384
##$SREGLST= <1H.CDCl3>
##$SSB= 0
##$STSI= 65536
##$STSR= 0
##$SW_p= 29940.119760479
##$SYMM= 0
##$S_DEV= 0
##$TDeff= 32768
##$TDoff= 0
##$TI= <>
##$TILT= no
##$TM1= 0
##$TM2= 0
##$TOPLEV= 0
##$USERP1= <user>
##$USERP2= <user>
##$USERP3= <user>
##$USERP4= <user>
##$USERP5= <user>
##$WDW= 1
##$XDIM= 65536
##$YMAX_p= 424445398
##$YMIN_p= -18678597
$$ End of Bruker specific parameters
$$ ---------------------------------
##NTUPLES= NMR SPECTRUM
##VAR_NAME=  FREQUENCY,     SPECTRUM/REAL,   SPECTRUM/IMAG
##SYMBOL=    X,             R,               I
##VAR_TYPE=  INDEPENDENT,   DEPENDENT,       DEPENDENT
##VAR_FORM=  AFFN,          ASDF,            ASDF
##VAR_DIM=   65536,         65536,           65536
##UNITS=     HZ,            ARBITRARY UNITS, ARBITRARY UNITS
##FACTOR=    0.456856943014862, 1,           1
##FIRST=     14782.0589164792, 0,            0
##LAST=      -15158.0608439998, 0,           0
##MIN=       -15158.0608439998, -18678597,   0
##MAX=       14782.0589164792, 424445398,    0
$$ Real data points
##PAGE= N=1
##DATA TABLE= (X++(R..R)), XYDATA
$$ [...]
$$ plain form
45999 1999997 2394642 1597064 151442 -478203 182814 871599 259827 -1276413 -2261761
45990 -2261761 -2062419 -1394900 -1031714 -822396 -225069 733402 1382178 1108609 -12693
45981 -12693 -1189611 -1532400 -874116 63973 457215 176336 -367160 -861202 -1177522 -1093144
45971 -1093144 -529068 43959 100314 -39045 464677 1597266 2266256 1829074 1068765
45962 1068765 1025942 1501801 1538316 957539 485117 488551 509796 155324 -340212 -686666
45952 -686666 -1014192 -1425830 -1588634 -1197924 -539976 -212039 -437585 -914062 -1225634 -1232794
45942 -1232794 -1123602 -1140079 -1200279 -922494 -222778 359933 386116 351496 1082709 2299193
45932 2299193 2670732 1648294 371014 104694 496648 283627 -724447 -1426560 -1101373
$$ packed form
45999A999997L94645p97578j445622o29645O61017O88785o11772j536240r85348
45990b261761J99342O67519L63186K09318N97327R58471O48776k73569j121302
45981a2693j176918l42789O58284R38089L93242k80879n43496m94042l16320Q4378
45971a093144N64076N73027N6355j39359N03722J132589O68990m37182p60309
45962A068765m2823M75859L6515n80777m72422L434K1245l54472m95536l46454
45952f86666l27526m11638j62804L90710O57948L27937k25546m76477l11572p160
45942a232794J09192j6477o0200K77785O99716N82711K6183l4620P31213J216484
45932B299193L71539j022438j277280k66320L91954k13021j008074p02113L25187
$$ plain form
45923 -1101373 -302925 109359 41763 -60008 85002 465141 924499 1160003 935804 502350
45913 502350 411044 743310 998380 955389 1047414 1477559 1586719 788388 -301407 -532060
45903 -532060 136136 544549 -7484 -880289 -1211214 -1124359 -1187255 -1235889 -640985 413958
45893 413958 835068 47562 -1158366 -1641256 -1296005 -917773 -1007243 -1322896 -1493488 -1436845
45883 -1436845 -1121945 -547650 -161332 -663174 -1972819 -2915924 -2517540 -1242233 -313848
45874 -313848 -94194 91879 659245 1196491 1336025 1325144 1369547 1165393 584765 159228
45864 159228 248748 291798 -355194 -1252403 -1422611 -841026 -475313 -860148 -1498260 -1802618
45854 -1802618 -1795947 -1599269 -1014753 -70746 655751 785542 695539 798656 766603 164169
$$ packed form
45923a101373P98448M12284o7596j01771J45010L80139M59358K35504k24199m33454
45913E02350r1306L32266K55070m2991R2025M30145J09160p98331j089795k30653
45903e32060O68196M08413n52033q72805l30925Q6855o2896m8634N94904J054943
45893D13958M21110p87506j205928m82890L45251L78232q9470l15653j70592N6643
45883a436845L14900N74295L86318n01842j309645r43105L98384J275307R28385
45874c13848K19654J86073N67366N37246J39534j0881M4403k04154n80628m25537
45864A59228Q9520M3050o46992q97209j70208N81585L65713l84835o38112l04358
45854a802618O671J96678N84516R44007P26497J29791r0003J03117l2053o02434
$$ plain form
45844 164169 -506509 -266496 860693 1640663 1167576 24099 -502998 -9510 679652
45835 679652 628904 -169094 -988847 -1317205 -1295661 -1252808 -1159612 -819694 -381202 -209441
45825 -209441 -253832 -31734 579343 1004541 761361 186638 -78427 -20225 -120465 -482145
45815 -482145 -707386 -628596 -563398 -721559 -878623 -830949 -722126 -680517 -536589 -195449
45805 -195449 36822 -163881 -638567 -930377 -852711 -645494 -638792 -893922 -1112499 -902020
45795 -902020 -298324 68825 -294340 -887223 -662831 494204 1395426 1092653 201782
45786 201782 9967 674242 1137759 682141 -285412 -1066905 -1516540 -1797209 -1944766 -2042873
45776 -2042873 -2341686 -2808757 -2933271 -2367613 -1489675 -968243 -977161 -1149703 -1120529 -825266
$$ packed form
45844A64169o70678K40013J127189P79970m73087j143477n27097M93488O89162
45835F79652n0748p97998q19753l28358K1544M2853R3196L39918M38492J71761
45825b09441m4391K22098O11077M25198k43180n74723k65065N8202j00240l61680
45815d82145k25241P8790O5198j58161j57064M7674J08823M1609J43928L41140
45805a95449K32271k00703m74686k91810P7666K07217O702k55130k18577K10479
45795i02020O03696L67149l63165n92883K24392J157035R01222l02773q90871
45786B01782j91815O64275M63517m55618r67553p81493m49635k80669j47557r8107
45776b042873k98813m67071j24514N65658Q77938N21432q918j72542K9174K95263
$$ plain form
45766 -825266 -440716 -286149 -583050 -1063252 -1087027 -484854 17340 -305813 -1088426 -1304586
45756 -1304586 -730546 -270226 -636142 -1368241 -1590379 -1238680 -935318 -899786 -669558 33792
45746 33792 734669 810076 351300 55524 349155 927337 1212177 1030872 683063 474561
45736 474561 426620 466404 664344 1095004 1574885 1772663 1597638 1303674 1159791 1152805
45726 1152805 1047553 601282 -279975 -1365900 -2022795 -1626695 -297861 995675 1362424
45717 1362424 872502 242452 -157140 -523568 -943018 -1087852 -782185 -380489 -261638
45708 -261638 -302967 -193217 55212 294952 631226 1103244 1198641 348600 -1076323 -1916361
45698 -1916361 -1600645 -854063 -694926 -1153254 -1439388 -1119180 -574691 -288400 -128497
$$ packed form
45766h25266L84550J54567k96901m80202k3775O02173N02194l23153p82613k16160
45756a304586N74040M60320l65916p32099k22138L51699L03362L5532K30228P03350
45746C3792P00877P5407m58776k95776K93631N78182K84840j81305l47809k08502
45736D74561m7941L9784J97940M30660M79881J97778j75025k93964j43883o986
45726A152805j05252m46271q81257j085925o56895L96100J328834J293536L66749
45717A362424m89922o30050l99592l66428m19450j44834L05667M01696J18851
45708b61638m1329J09750K48429K39740L36274M72018R5397q50041j424923q40038
45698a916361L15716P46582J59137m58328k86134L20208N44489K86291J59903
$$ plain form
45689 -128497 390177 1297962 1935201 1710272 997972 900420 1850268 2783963 2282416 437502
45679 437502 -1157603 -1462780 -1231354 -1678109 -2637321 -2945052 -2273256 -1547863 -1531711 -1908291
45669 -1908291 -1995305 -1600150 -861816 62391 759355 636677 -276835 -1122896 -1300469 -1254730
45659 -1254730 -1608225 -2028073 -1769463 -1022940 -780172 -1397704 -2181852 -2527231 -2599425 -2579954
45649 -2579954 -2091438 -985188 -70467 -262463 -1287206 -1968667 -1707945 -1003501 -479136
45640 -479136 -96722 377218 680343 353615 -473730 -1063484 -859968 -23679 857060 1333503
45630 1333503 1282186 774818 28140 -581060 -738975 -547908 -462356 -699804 -887768 -585624
45620 -585624 -49924 -25601 -651147 -1051521 -416057 850364 1605224 1441149 1016944 854767
$$ packed form
45689a28497N18674R07785O37239k24929p12300r7552R49848R33695n01547j844914
45679D37502j595105l05177K31426m46755r59212l07731O71796P25393J6152l76580
45669a908291q7014L95155P38334R24207O96964j22678r13512q46061j77573M5739
45659a254730l53495m19848K58610P46523K42768o17532p84148l45379p2194J9471
45649b579954M88516J106250R14721j91996j024743o81461K60722P04444N24365
45640d79136L82414M73940L03125l26728q27345n89754K03516Q36289Q80739M76443
45630A333503n1317n07368p46678o09200j57915J91067Q5552k37448j87964L02144
45620e85624N35700K4323o25546m00374O35464J266421P54860j64075m24205j62177
$$ plain form
45610 854767 560477 -328304 -1319833 -1506643 -857640 -231477 -135827 -200478 -44437 54936
45600 54936 -211156 -449265 -83467 689228 1122213 1000849 845386 951441 879785 235634
45590 235634 -555554 -783428 -509511 -509940 -1172934 -1979601 -2260796 -2031285 -1728923 -1443482
45580 -1443482 -925552 -289875 -116749 -598612 -1039366 -671504 260279 775792 474775
45571 474775 -10942 -43993 118524 -132104 -736527 -1073902 -908443 -640159 -609117 -690230
45561 -690230 -712086 -798479 -1037906 -1168730 -898043 -323241 201425 441038 332096 -128948
45551 -128948 -794374 -1292644 -1282635 -746055 43386 692410 805116 263022 -436258 -482265
45541 -482265 308096 1182755 1429632 1262810 1219215 1082199 238110 -1046170 -1687176 -1320339
$$ packed form
45610H54767k94290q88781r91529j86810O49003O26163R5650o4651J56041R9373
45600E4936k66092k38109L65798P72695M32985j21364j55463J06055p1656o44151
45590B35634p91188k27874K73917m29o62994q06667k81195K29511L02362K85441
45580a443482N17930O35677J73126m81863m40754L67862R31783N15513l01017
45571D74775m85717l3051J62517k50628o04423l37375J65459K68284L1042q1113
45561f90230k1856q6393k39427j30824K70687N74802N24666K39613j08942m61044
45551a28948o65426m98270J0009N36580P89441O49024J12706n42094o99280m6007
45541d82265P90361Q74659K46877j66822m3595j37016q44089j284280o41006L66837
$$ plain form
45531 -1320339 -830222 -883856 -805378 291883 1853806 2375602 1364735 -102627 -849065
45522 -849065 -818428 -612989 -531282 -510156 -548779 -674452 -686069 -332308 312242 887210
45512 887210 1113288 987447 700069 444768 218402 -171885 -705006 -837972 -38377 1297577
45502 1297577 1989068 1423320 299156 -350017 -382152 -259752 -22146 634203 1467977
45493 1467977 1789433 1492013 1159363 978551 383057 -874139 -2071673 -2473573 -2314109
45484 -2314109 -2251061 -2368106 -2363237 -2269554 -2252862 -2028416 -1263213 -347841 29150 -35593
45474 -35593 186409 837993 1250155 1040223 602809 278186 -139222 -686825 -822433 -288985
45464 -288985 244533 49689 -624129 -993277 -795124 -263598 519463 1456242 1914088 1295251
$$ packed form
45531a320339M90117n3634P8478J097261J561923N21796j010867j467362p46438
45522h49065L0637K05439Q1707K1126l8623j25673j1617L53761O44550N74968
45512H87210K26078j25841k87378k55301k26366l90287n33121j32966P99595J335954
45502A297577O91491n65748j124164o49173l2135J22400K37606O56349Q33774
45493A467977L21456k97420l32650j80812n95494j257196j197534m01900J59464
45484b314109O3048j17045M869R3683J6692K24446P65203R15372L76991o4743
45474c5593K22002O51584M12162k09932m37414l24623m17408n47603j35608N33448
45464b88985N33518j94844o73818l69148J98153N31526P83061R36779M57846o18837
$$ plain form
45454 1295251 86752 -522795 -186134 252845 161168 28180 529137 1409969 1970172
45445 1970172 2149306 2359988 2519243 2089432 1094740 310203 167366 111515 -480589 -1185874
45435 -1185874 -974226 356866 1789539 2269595 1840520 1343555 1316593 1550607 1582613
45426 1582613 1255536 777617 487907 592794 928988 986747 401547 -545722 -1149470 -1049780
45416 -1049780 -558245 -178338 -87475 -198492 -419101 -626677 -613728 -306298 103428 415788
45406 415788 635709 755087 569795 -3875 -615879 -807329 -533400 -62518 517322 1307974
45396 1307974 2143499 2532584 2217848 1562010 1213802 1466995 1996449 2172348 1663466
45387 1663466 788857 193540 125802 200144 -35649 -544021 -983577 -1176738 -1125605 -829729
$$ packed form
45454A295251j208499o09547L36661M38979r1677j32988N00957Q80832N60203
45445A970172J79134K10682J59255m29811r94692p84537j42837n5851n92104p05285
45435a185874K11648J331092J432673M80056m29075m96965k6962K34014L2006
45426A582613l27077m77919k89710J04887L36194N7759n85200r47269o03748R9690
45416a049780M91535L79907R0863j11017k20609k07576J2949L07430M09726L12360
45406D15788K19921J19378j85292n73670o12004j91450K73929M70882N79840P90652
45396A307974Q35525L89085l14736o55838l48208K53193N29454J75899n08882
45387A663466q74609n95317o7738P4342k35793n08372m39556j93161N1133K95876
$$ plain form
45377 -829729 -428130 -267765 -423358 -394877 227051 1023327 1273433 1043263 1006914 1222734
45367 1222734 949684 -90458 -1071604 -1111296 -328765 598169 1345944 1867426 1920371 1365429
45357 1365429 639085 278163 141446 -313844 -1102811 -1630652 -1507215 -951302 -395619
45348 -395619 -132938 -320479 -855887 -1227159 -967563 -353833 -206501 -844249 -1623639 -1700171
45338 -1700171 -928661 149962 896417 963949 421405 -246496 -462787 -110942 374202
45329 374202 595851 643626 772854 921817 892884 847842 1189080 1888791 2265186 1623040
45319 1623040 17215 -1708775 -2590089 -2259897 -1150091 -53229 565931 843215 1098853
45310 1098853 1309698 1226496 937705 916222 1331643 1665355 1359646 628044 180316 245598
$$ packed form
45377h29729M01599J60365j55593K8481O21928P96276K50106k30170l6349K15820
45367A222734k73050j040142r81146l9692P82531R26934P47775N21482N2945n54942
45357A365429p26344l60922j36717m55290p88967n27841J23437N55913N55683
45348c95619K62681j87541n35408l71272K59596O13730J47332o37748p79390p6532
45338a700171P71510J078623P46455O7532n42544o67901k16291L51845M85144
45329C74202K21649M7775J29228J48963k8933m5042L41238O99711L76395o42146
45319A623040j605825j725990q81314L30192J109806J096862O19160K77284K55638
45310A098853K10845q3202k88791k1483M15421L33712l05709p31602m47728O5282
$$ plain form
45300 245598 386424 319325 321086 542289 475170 -356547 -1505839 -2015821 -1614186 -928846
45290 -928846 -528246 -328850 -86782 79557 -26403 -268328 -426308 -612884 -1051312 -1534771
45280 -1534771 -1479537 -626760 503974 1058284 770093 281194 340876 796922 814616 178759
45270 178759 -263590 75989 392151 -449539 -2075440 -2957349 -2586417 -2070316 -2220159
45261 -2220159 -2268991 -1258112 292189 1127366 1035904 827349 924455 998169 811219 494209
45251 494209 60306 -536257 -930038 -725668 -292222 -379699 -971606 -1338927 -1238589 -1164211
45241 -1164211 -1289051 -1098444 -388788 196710 51456 -627818 -1304589 -1696314 -1597601 -826550
45231 -826550 242919 791918 671965 720363 1427132 2031938 1696437 915177 789820 1322459
$$ packed form
45300B45598J40826o7099J761K21203o7119q31717j149292n09982M01635O85340
45290i28846M00600J99396K42068J66339j05960k41925j57980j86576m38428m83459
45280a534771N5234Q52777J130734N54310k88191m88899N9682M56046J7694o35857
45270A78759m42349L39579L16162q41690j625901q81909L70932N16101j49843
45261b220159m8832J010879J550301Q35177r1462k08555R7106P3714j86950l17010
45251D94209m33903n96563l93781K04370M33446q7477n91907l67321J00338P4378
45241a164211j24840J90607P09656N85498j45254o79274o76771l91725R8713P71051
45231h26550J069469N48999j19953M8398P06769O04806l35501p81260j25357N32639
$$ plain form
45221 1322459 1511690 1021623 680274 1104595 1709336 1536534 532364 -455719 -676631
45212 -676631 -127948 646848 1149245 1289197 1238617 1041746 597761 88064 62996 787494
45202 787494 1750378 2224128 2149004 2027395 2055036 1874558 1235728 425113 -128289 -330571
45192 -330571 -347312 -341164 -444767 -743205 -1105078 -1218322 -956497 -572120 -400727 -500575
45182 -500575 -702039 -883388 -1020159 -993557 -549116 375754 1288354 1370175 368919 -848565
45172 -848565 -1104076 -380311 42288 -741029 -1973554 -2234130 -1342453 -446859 -342463
45163 -342463 -645241 -823433 -1103763 -1797747 -2442163 -2372877 -1755173 -1285250 -1071825 -560221
45153 -560221 456805 1443913 1859616 1702247 1147670 219024 -863938 -1491075 -1276095
$$ packed form
45221A322459J89231m90067l41349M24321O04741j72802j004170r88083k20912
45212f76631N48683P74796N02397J39952n0580j96871m43985n09697k5068P24498
45202G87494R62884M73750p5124j21609K7641j80478o38830q10615n53402k02282
45192c30571j6741O148j03603k98438l61873j13244K61825L84377J71393r9848
45182e00575k01464j81349j36771K6602M44441R24870R12600Q1821j001256j217484
45172h48565k55511P23765M22599p83317j232525k60576Q91677Q95594J04396
45163c42463l02778j78192k80330o93984o44416O9286O17704M69923K13425N11604
45153e60221J017026R87108M15703j57369n54577r28646j082962o27137K14980
$$ plain form
45144 -1276095 -607431 -205343 -313066 -620978 -743393 -424135 441342 1499973 1883309
45135 1883309 1072588 -250583 -848929 -423901 220176 546904 920821 1536156 1688426
45126 1688426 876284 -107790 -164284 503963 803850 469983 237104 397595 405478 86232
45116 86232 35288 397260 386968 -338654 -868237 -441862 200979 -99088 -1133642 -1729854
45106 -1729854 -1541391 -1304094 -1469932 -1683048 -1695624 -1858063 -2442337 -3158841 -3569675 -3490470
45096 -3490470 -2918219 -2041484 -1289193 -869925 -404563 397754 963285 597912 -176937
45087 -176937 -111204 884112 1473026 816168 -366070 -1130301 -1589385 -2125107 -2340275 -1795998
45077 -1795998 -1070661 -1031659 -1536711 -1843992 -1900868 -2192625 -2594526 -2452875 -1724793 -1042259
$$ packed form
45144a276095O68664M02088j07723l07912j22415L19258Q65477J058631L83336
45135A883309q10721j323171n98346M25028O44077L26728L73917O15335J52270
45126A688426q12142r84074n6494O68247K99887l33867k32879J60491P883l19246
45116H6232n0944L61972j0292p25622n29583M26375O42841l00067j034554n96212
45106a729854J88463K37297j65838k13116j2576j62439n84274p16504m10834P9205
45096c490470N72251Q76735P52291M19268M65362Q02317N65531l65373p74849
45087a76937O5733R95316N88914o56858j182238p64231m59084n35722k15168N44277
45077a795998P25337L9002n05052l07281n6876k91757m01901J41651P28082O82534
$$ plain form
45067 -1042259 -637313 -164136 322192 180842 -754895 -1756957 -2142885 -1919624 -1266566
45058 -1266566 -213508 807761 979738 279651 -94896 770163 2140619 2579012 1818842
45049 1818842 823240 288332 94444 183434 898023 2105237 2857226 2529456 1765055
45040 1765055 1663566 2325132 2790925 2325725 1238775 368229 141285 315879 436815
45031 436815 352765 296167 515582 900473 1089972 942583 656685 315345 -359525 -1452089
45021 -1452089 -2285014 -1956640 -507730 920113 1303318 772819 221461 224145 668999
45012 668999 1186145 1507159 1475487 1075083 504110 19511 -280827 -383197 -198170 289492
45002 289492 813622 1022514 807288 237317 -633339 -1576047 -2039105 -1705483 -1106670 -1096033
$$ packed form
45067a042259M04946M73177M86328j41350r35737j002062l85928K23261O53058
45058a266566J053058J021269J71977p00087l74547Q65059J370456M38393p60170
45049A818842r95602n34908j93888Q8990P14589J207214P51989l27770p64401
45040A765055j01489O61566M65793m65200j086950q70546k26944J74594J20936
45031D36815q4050n6598K19415L84891J89499j47389k85898l41340o74870j092564
45021a452089q32925L28374J448910J427843L83205n30499n51358K684M44854
45012F68999N17146L21014l1672m00404n70973m84599l00338j02370J85027M87662
45002B89492N24130K08892k15226n69971q70656r42708m63058L33622N98813J0637
$$ plain form
44992 -1096033 -1666918 -1898870 -1250752 -306810 86574 -84251 -178257 211629 938193 1532791
44982 1532791 1404782 200665 -1586634 -2727967 -2513661 -1628195 -1231875 -1445914 -1402822
44973 -1402822 -613863 470311 1248690 1569332 1418789 742656 -138270 -556293 -332642
44964 -332642 -124303 -575559 -1527982 -2405389 -2936765 -3069477 -2597702 -1480096 -294277
44955 -294277 239329 129057 -11455 67321 -48539 -653024 -1341245 -1497208 -1048002 -447009
44945 -447009 -101509 -75110 -223383 -351861 -270324 71690 441262 471349 59496 -455221
44935 -455221 -620280 -362137 -57972 -96538 -475681 -924052 -1320730 -1792731 -2370750 -2751481
44925 -2751481 -2555928 -1748717 -692429 143942 437752 109379 -605109 -1195484 -1240429
$$ packed form
44992a096033n70885k31952O48118R43942L93384j70825r4006L89886P26564N94598
44982A532791j28009j204117j787299j141333K14306Q85466L96320k14039M3092
44973a402822P88959J084174P78379L20642j50543o76133q80926m18023K23651
44964c32642K08339m51256r52423q77407n31376j32712M71775J117606J185819
44955b94277N33606j10272j40512P8776j15860o04485o88221j55963M49206O00993
44945d47009L45500K6399j48273j28478Q1537L42014L69572L0087m11853n14717
44935d55221j65059K58143L04165l8566l79143m48371l96678m72001n78019l80731
44925b751481J95553Q07211J056288Q36371K93810l28373p14488n90375m4945
$$ plain form
44916 -1240429 -844395 -552290 -689476 -920306 -675060 39264 534286 257576 -510477
44907 -510477 -1012836 -947055 -718478 -743946 -883410 -817119 -701800 -995332 -1662842 -2045805
44897 -2045805 -1754943 -1334559 -1614640 -2517014 -2973425 -2189396 -663318 348880 222800
44888 222800 -525665 -1076874 -1204911 -1119578 -819496 -138819 659350 939268 537695 54502
44878 54502 -42967 -160638 -887968 -1873905 -2108998 -1313739 -355991 -102702 -457787 -813776
44868 -813776 -857691 -489720 494813 1950521 2935355 2525660 1076409 -14800 57463
44859 57463 677452 796397 180400 -655506 -1261131 -1509809 -1355809 -877646 -459478 -458321
44849 -458321 -698582 -715182 -540666 -810864 -1891391 -3244699 -3963443 -3729765 -2944519
$$ packed form
44916a240429L96034K92105j37186k30830K45246P14324M95022k76710p68053
44907e10477n02359O5781K28577k5468j39464O6291J15319k93532o67510l82963
44897b045805K90862M20384k80081r02374m56411P84029J526078J012198j26080
44888B22800p48465n51209j28037Q5333L00082O80677P98169K79918m01573m83193
44878E4502r7469j17671p27330r85937k35093P95259R57748K53289l55085l55989
44868h13776m3915L67971R84533J455708R84834m09695j449251j091209P2263
44859E7463O19989J18945o15997q35906o05625k48678J54000M78163M18168J157
44849d58321k40261j6600J74516k70198j080527j353308p18744K33678P85246
$$ plain form
44840 -2944519 -2051694 -1127389 -176791 535681 706497 387654 -65767 -375317 -475030 -332676
44830 -332676 100079 698369 1149938 1266238 1163285 1019557 819831 496478 151191 -100508
44820 -100508 -370612 -777278 -1048500 -722300 179438 1009049 1191035 819722 406987 275072
44810 275072 388300 569781 670186 694937 920236 1609587 2396563 2345078 1095579 -350889
44800 -350889 -661308 105476 546580 -184165 -1294415 -1571975 -1000798 -486228 -410900 -310368
44790 -310368 105341 432844 311971 57938 146592 447891 435559 6195 -341203 -183523
44780 -183523 287090 566630 499754 386943 439031 411207 27417 -372630 -30634 1238522
44770 1238522 2599123 3055265 2548786 1838109 1444648 1216766 966165 981100 1560615
$$ packed form
44840b944519Q92825R24305R50598P12472J70816l18843m53421l09550r9713J42354
44830c32676M32755N98290M51569J16300j02953j43728j99726l23353l45287k51699
44820a00508k70104m06666k71222L26200R01738Q29611J81986l71313m12735j31915
44810B75072J13228J81481J00405K4751K25299O89351P86976n1485j249499j446468
44800c50889l10419P66784M41104p30745j110250k77560N71177N14570P5328J00532
44790c10368M15709L27503j20873k54033Q8654L01299j2332m29364l47398J57680
44780a83523M70613K79540o6876j12811N2088k7824l83790m00047L41996J269156
44770A238522J360601M56142n06479p10677l93461k27882k50601J4935N79515
$$ plain form
44761 1560615 2346911 2564731 1926525 1017526 656138 973364 1279949 929078 204910
44752 204910 58367 836260 1632593 1325037 50954 -941735 -926713 -513127 -555427 -885620
44742 -885620 -712218 88631 769224 723345 106909 -630595 -1300072 -1804582 -1807791 -992515
44732 -992515 392708 1510934 1574377 495124 -1068916 -2251899 -2556914 -2012566 -983472
44723 -983472 27152 549585 443818 64136 -118426 -90652 -214121 -543762 -646655 -277879
44713 -277879 196440 368251 388387 574511 750750 515824 -25327 -351766 -263440 -24098
44703 -24098 158287 264074 110893 -543649 -1453149 -1953557 -1725713 -1069682 -377160 172891
44693 172891 374481 111820 -122358 443399 1656671 2274625 1543926 348919 93731
$$ packed form
44761A560615P86296K17820o38206r08999l61388L17226L06585l50871p24168
44752B04910j46543P77893P96333l07556j274083r92689J5022M13586m2300l30193
44742h85620J73402Q00849O80593m5879o16436p37504o69477n04510l209Q15276
44732i92515J385223J118226O3443j079253j564040j182983l05015N44348J029094
44723i83472J010624N22433j05767l79682j82562K7774j23469l29641j02893L68776
44713b77879M74319J71811K0136J86124J76239k34926n41151l26439Q8326K39342
44703b4098J82385J05787j53181o54542r09500n00408K27844O56031O92522N50051
44693A72891K01590k62661k34178N65757J213272O17954p30699j195007k55188
$$ plain form
44684 93731 876741 1549271 1328940 548637 -131522 -484946 -567858 -447905 -323241 -464850
44674 -464850 -824005 -1021853 -852491 -477050 -51238 453221 942471 1125140 938919 692243
44664 692243 551447 222505 -565169 -1525419 -2096802 -2101589 -1842863 -1656662 -1605258 -1522126
44654 -1522126 -1172651 -494543 151541 184668 -458800 -987102 -571464 550936 1234782
44645 1234782 775601 -288377 -898484 -668910 -110068 94017 -255354 -795000 -945409
44636 -945409 -452083 229431 281732 -483912 -1212422 -972573 32923 734341 591415 92373
44626 92373 -221453 -490542 -933340 -1190384 -900386 -453412 -427794 -581707 -226731 530735
44616 530735 820358 382192 38899 458970 1184606 1371710 923787 353868 -28466 -209749
$$ packed form
44684I3731P83010O72530k20331p80303o80159l53424q2912J19953J24664j41609
44674d64850l59155j97848J69362L75441M25812N04459M89250J82669j86221k46676
44664F92243j40796l28942p87674r60250n71383m787K58726J86201N1404Q3132
44654a522126L49475O78108O46084L3127o43468n28302M15638J122400O83846
44645A234782m59181j063978o10107K29574N58842K04085l49371n39646j50409
44636i45409M93326O81514N2301p65644p28510K39849J005496P01418j42926m99042
44626I2373l13826k69089m42798k57044K89998M46974K5618j53913L54976P57466
44616E30735K89623m38166l43293M20071P25636J87104m47923n69919l82334j81283
$$ plain form
44606 -209749 -82257 421426 946795 992954 529989 -20104 -313383 -264990 129163 756614
44596 756614 1290200 1492596 1509334 1539718 1418413 928136 315766 864 -61928 -184591
44586 -184591 -269105 10357 417538 313989 -276729 -530342 -18682 672967 912933 909048
44576 909048 1059165 1026340 266090 -841151 -1247849 -647052 82940 35352 -660932 -1233185
44566 -1233185 -1337389 -1318400 -1513091 -1710830 -1514786 -1050464 -937558 -1421299 -1863382 -1481797
44556 -1481797 -426444 383621 463224 215091 81972 -50925 -253107 -61663 735162
44547 735162 1342587 830463 -499130 -1473904 -1668782 -1738774 -2055548 -2010762 -1125462 -47732
44537 -47732 232703 -319921 -927044 -1105525 -998529 -794097 -475412 -166332 -167718 -478582
$$ packed form
44606b09749J27492N03683N25369M6159m62965n50093k93279M8393L94153O27451
44596G56614N33586K02396J6738L0384j21305m90277o12370l14902o2792j22663
44586a84591q4514K79462M07181j03549n90718k53613N11660O91649K39966l885
44576I09048J50117l2825p60250j107241m06698O00797P29992m7588o96284n72253
44566a233185j04204J8989j94691j97739J96044M64322J12906m83741m42083L81585
44556a481797J055353Q10065P9603k48133j33119j32897k02182J91444P96825
44547G35162O07425n12124j329593r74774j94878o9992l16774M4786Q85300J077730
44537d7732K80435n52624o07123j78481J06996K04432L18685L09080j386l10864
$$ plain form
44527 -478582 -650259 -315539 339559 765272 594847 -45690 -674099 -881388 -687625 -445475
44517 -445475 -394457 -466646 -547021 -619166 -515937 67271 961623 1306019 503856 -792979
44507 -792979 -1274257 -508323 693261 1443021 1648501 1590292 1333547 911054 552742 354912
44497 354912 155931 25747 327161 918664 949980 54166 -851818 -756053 -73300 -16882
44487 -16882 -749246 -1290084 -1252162 -1440686 -2325740 -3011905 -2500092 -1246580 -561842 -814519
44477 -814519 -1106069 -691923 25040 184893 -298680 -623275 -171331 633515 825288 159627
44467 159627 -588948 -789002 -833215 -1274465 -1589744 -808103 779254 1698866 1303104 574233
44457 574233 485926 712241 693587 861637 1689736 2393175 1927851 744826 133578 133849
$$ packed form
44527d78582j71677L34720O55098M25713j70425o40537o28409k07289J93763K42150
44517d45475N1018p2189q0375p2145J03229N83208Q94352L44396q02163j296835
44507g92979m81278P65934J201584P49760K05480n8209k56745m22493l58312j97830
44497C54912j98981j30184L01414N91503L1316q95814r05984R5765O82753N6418
44487a6882p32364n40838L7922j88524q85054o86165N11813J253512O84738k52677
44477h14519k91550M14146P16963J59853m83573l24595M51944Q04846J91773o65661
44467A59627p48575k00054m4213m41250l15279P81641J587357R19612l95762p28871
44457E74233q8307K26315j8654J68050Q28099P03439m65324j183025o11248K71
$$ plain form
44447 133849 -362091 -1439502 -1723569 -570031 736726 771933 -143700 -767755 -785272
44438 -785272 -775026 -876805 -618393 61305 555884 484181 187037 148527 369338 501109
44428 501109 309639 -156465 -685453 -1066802 -1200810 -1109941 -884424 -679607 -710329 -1073202
44418 -1073202 -1556513 -1788867 -1601604 -1125449 -608341 -334903 -581797 -1290546 -1837943
44409 -1837943 -1555631 -548908 342978 444946 -210866 -1173919 -1947538 -2091183 -1515531
44400 -1515531 -803046 -732448 -1339028 -1891931 -1838418 -1218116 -174729 1125938 1958542
44391 1958542 1409038 -267024 -1559287 -1571033 -1122897 -1285873 -1704332 -1386000 -459468
44382 -459468 64611 -100471 -330007 -305872 -293323 -282713 35716 401438 170743 -481687
$$ packed form
44447A33849m95940j077411k84067J153538J306757L5207r15633o24055j7517
44438g85272J0246j01779K58412O79698M94579p1703k97144l8510K20811J31771
44428E01109j91470m66104n28988l81349j34008R0869K25517K04817l0722l62873
44418a073202m83311k32354J87263M76155N17108K73438k46894p08749n47397
44409a837943K82312J006723Q91886J01968o55812r63053p73619j43645N75652
44400a515531P12485P0598o06580n52903N3513O20302J043387J300667Q32604
44391A958542n49504j676062j292263j1746M48136j62976m18459L18332R26532
44382d59468N24079j65082k29536K4135J2549J0610L18429L65722k30695o52430
$$ plain form
44372 -481687 -618563 -68399 159827 -552547 -1411444 -1395103 -692811 -240145 -380804 -712943
44362 -712943 -872620 -771483 -298505 552724 1318004 1345907 517765 -591729 -1262369 -1166049
44352 -1166049 -485865 272873 655066 598327 368476 153569 -78533 -281054 -174538 445535
44342 445535 1427913 2387287 2934532 2797927 2036324 1200201 928644 1243470 1552092 1463398
44332 1463398 1228545 1204649 1302778 1283546 1276661 1614834 2288615 2855721 2844234 2137333
44322 2137333 1091379 316587 123926 171654 -56509 -473480 -559177 -314125 -367168 -895937
44312 -895937 -1179965 -733836 -214268 -451763 -1071239 -1000181 -129083 509692 284666 -220187
44302 -220187 -243461 65498 122089 -55101 59677 562828 900846 677872 235928 161475
$$ packed form
44372d81687j36876N50164K28226p12374q58897J6341P02292M52666j40659l32139
44362g12943j59677J01137M72978Q51229P65280K7903q28142j109494o70640R6320
44352a166049O80184P58738L82193n6739k29851k14907k32102k02521J06516O20073
44342D45535R82378R59374N47245j36605p61603q36123k71557L14826L08622q8694
44332A463398k34853k3896R8129j9232o885L38173O73781N67106j1487p06901
44322B137333j045954p74792j92661M7728k28163m16971q5697K45052n3043n28769
44312h95937k84028M46129N19568k37495o19476P1058Q71098O38775k25026n04853
44302b20187k3274L08959N6591j77190J14778N03151L38018k22974m41944p4453
$$ plain form
44292 161475 459967 599060 360660 229900 660942 1271640 1293570 753907 575141 1270364
44282 1270364 2114302 2080050 1198270 388872 134162 -49799 -774207 -1915450 -2777422
44273 -2777422 -2840263 -2229363 -1589750 -1470857 -1685418 -1435379 -330042 937668 1344076
44264 1344076 797064 113193 -181783 -353322 -640729 -677251 -163178 429679 424588 -76145
44254 -76145 -346438 -38662 503040 889416 1107307 1191815 978928 468070 86767 225887
44244 225887 671025 838838 526727 107777 -51712 -48919 -152764 -301255 -181943 248865
44234 248865 599581 476597 -58494 -542126 -551030 -73973 478433 632918 310735 -84854
44224 -84854 -133131 105699 223304 45493 -194333 -332600 -616240 -1309699 -2122656 -2347970
$$ packed form
44292A61475K98492J39093k38400j30760M31042O10698K1930n39663j78766O95223
44282A270364Q43938l4252q81780q09398k54710j83961p24408j141243q61972
44273b777422o2841O10900O39613J18893k14561K50039J105337J267710M06408
44264A344076n47012o83871k94976j71539k87407l6522N14073N92857n091n00733
44254g6145k70293L07776N41702L86376K17891Q4508k12887n10858l81303J39120
44244B25887M45138J67813l12111m18950j59489K793j03845j48491J19312M30808
44234B48865L50716j22984n35091m83632q904M77057N52406J54485l22183l95589
44224h4854m8277K38830J17605j77811k39826j38267k83640o93459q12957k25314
$$ plain form
44214 -2347970 -1619029 -344447 713004 1206251 1423043 1714754 1882537 1407415 314504
44205 314504 -567214 -504029 233690 744384 588524 52238 -504597 -927489 -927378 -226754
44195 -226754 747514 1061573 545359 178567 701815 1496649 1518583 783926 111627 -192498
44185 -192498 -459277 -700069 -525747 -33988 144424 -131692 -238794 203526 733778 757379
44175 757379 275001 -375875 -962048 -1252348 -999025 -353302 125988 143385 -74365 -378567
44165 -378567 -1009030 -2006176 -2855490 -3100393 -2834197 -2227776 -1118596 454641 1836072
44156 1836072 2469968 2625266 2809627 2873486 2411268 1730327 1572885 1955618 2071429 1419933
44146 1419933 382148 -425238 -758949 -593038 21241 686605 774974 153631 -544075
$$ packed form
44214b347970P28941J274582J057451M93247K16792K91711J67783m75122j092911
44205C14504q81718O3185P37719N10694j55860n36286n56835m22892J11P00624
44195b26754R74268L14059n16214l66792N23248P94834K1934p34657o72299l04125
44185a92498k66779k40792J74322M91759J78412k76116j07102M42320N30252K3601
44175G57379m82378o50876n86173k90300K53323O45723M79290J7397k17750l04202
44165c78567o30463r97146q49314k44903K66196O06421J109180J573237J381431
44156A836072O33896J55298J84361O3859m62218o80941j57442L82733J15811o51496
44146A419933j037785q07386l33711J65911O14279O65364Q8369o21343o97706
$$ plain form
44137 -544075 -641782 -135196 509746 952259 1109782 954835 498160 -100682 -594252 -807636
44127 -807636 -726147 -518078 -411816 -379418 -62608 690955 1349588 1223365 459392 -29220
44117 -29220 256689 867613 1259102 1504281 1701082 1339215 67277 -1279530 -1372804 -115563
44107 -115563 1169121 1457268 1148491 1108998 1335376 1243140 807760 575746 662112 559041
44097 559041 106748 -89270 346193 716557 108450 -1152772 -1691423 -842278 472822
44088 472822 991966 658511 333391 378466 361034 99616 88991 546579 796842 227456
44078 227456 -638441 -766315 -58729 575561 541145 193894 53209 119072 281415 748415
44068 748415 1576670 2266292 2383877 2236295 2350475 2577013 2371765 1780498 1386661 1298840
$$ packed form
44137e44075r7707N06586O44942M42513J57523j54947m56675n98842m93570k13384
44127h07636Q1489K08069J06262L2398L16810P53563O58633j26223p63973m88612
44117b9220K85909O10924L91489K45179J96801l61867j271938j346807r3274J257241
44107a15563J284684K88147l08777l9493K26378r2236m35380k32014Q6366j03071
44097E59041m52293j96018M35463L70364o08107j261222n38651Q49145J315100
44088D72822N19144l33455l25120M5075j7432k61418j0625M57588K50263n69386
44078B27456q65897j27874P07586O34290l4416l47251j40685O5863J62343M67000
44068G48415Q28255O89622J17585j47582J14180K26538k05248n91267l93837q7821
$$ plain form
44058 1298840 1006972 441264 335636 1037855 1657528 1174010 841 -430333 422719
44049 422719 1549074 1793257 1164181 340800 -450788 -1355132 -2062686 -1956003 -1126067
44040 -1126067 -461134 -436883 -498678 -107393 255921 -102052 -743957 -623039 163161 327775
44030 327775 -608409 -1455942 -1164011 -407933 -318098 -493396 279411 1762330 2337122 1400409
44020 1400409 167972 -287421 -365202 -652399 -671124 62253 784732 523769 -309997 -589319
44010 -589319 -258990 -249264 -866078 -1419186 -1375877 -883494 -193254 507995 763459 290743
44000 290743 -297258 -195932 226713 -113123 -1139379 -1462906 -448518 780716 999328
43991 999328 490164 266821 559243 901835 1079985 1172221 1093364 774877 439975 192074
$$ packed form
44058A298840k91868n65708j05628P02219O19673m83518j173169m31174Q53052
44049D22719J126355K44183o29076q23381p91588r04344p07554J06683Q29936
44040a126067O64933K4251o1795L91285L63314l57973o41905J20918P86200J64614
44030C27775r36184q47533K91931P56078Q9835j75298P72807J482919N74792r36713
44020A400409j232437m55393p7781k87197j8725P33377P22479k60963q33766k79322
44010e89319L30329R726o16814n53108M3309M92383O90240P01249K55464m72716
44000B90743n88001J01326M22645l39836j026256l23527J014388J229234K18612
43991I99328n09164k23343K92422L42592J78150R2236p8857l18487l34902k47901
$$ plain form
43981 192074 -230319 -832450 -1046630 -557856 125561 494707 826676 1488893 2065872 1980403
43971 1980403 1499758 1301490 1437686 1519042 1517259 1553926 1293502 448585 -447844 -683524
43961 -683524 -444584 -315322 -109537 654517 1435404 1184050 115870 -422334 -5260
43952 -5260 319642 -158647 -829535 -1108062 -1445089 -2218182 -2744298 -2314541 -1317706 -437777
43942 -437777 441732 1558117 2228344 1627548 194918 -776162 -722139 -128142 474536
43933 474536 949822 1152631 927910 499710 203615 -95073 -710084 -1400218 -1587171 -1235447
43923 -1235447 -901541 -955861 -1293628 -1696997 -1924785 -1610880 -705291 126841 204694 -201309
43913 -201309 -269377 186953 699256 1122121 1691922 2178592 2029372 1457706 1308207 1615321
$$ packed form
43981A92074m22393o02131k14180M88774O83417L69146L31969O62217N76979q5469
43971A980403m80645j98268J36196Q1356j783L6667k60424q44917q96429k35680
43961f83524K38940J29262K05785P64054P80887k51354j068180n38204M17074
43952e260L24902m78289o70888k78527l37027p73093n26116M29757R96835Q79929
43942d37777Q79509J116385O70227o00796j432630r71080N4023N93997O02678
43933D74536M75286K02809k24721m28200k96095k98688o15011o90134j86953L51724
43923a235447L33906n4320l37767m03369k27788L13905R05589Q32132P7853m06003
43913b01309o8068M56330N12303M22865N69801M86670j49220n71666j49499L07114
$$ plain form
43903 1615321 1440077 526857 -90081 228092 621848 223625 -329375 -49260 618177
43894 618177 576115 54572 235817 1124371 1390081 495891 -498956 -694801 -561234 -702665
43884 -702665 -604143 388368 1649107 1944693 1128848 205503 -96439 47436 288028 647296
43874 647296 1139813 1416833 1092433 207563 -752614 -1213293 -964212 -392410 -103395 -189567
43864 -189567 -173202 144407 261660 -167302 -561407 -236952 303963 -150165 -1713286 -2968170
43854 -2968170 -2667662 -1191413 89154 352271 -187219 -843801 -990392 -343928 728980
43845 728980 1311512 781484 -450582 -1325905 -1228528 -487772 137052 245447 44870 -65694
43835 -65694 -59331 -280491 -800926 -1072537 -624588 79968 87256 -735229 -1481002 -1456651 -971522
$$ packed form
43903A615321j75244r13220o16938L18173L93756l98223n53000K80115O67437
43894F18177m2062n21543J81245Q88554K65710q94190r94847j95845J33567j41431
43884g02665R8522R92511J260739K95586q15845r23345l01942J43875K40592L59268
43874F47296M92517K77020l24400q84870r60177m60679K49081N71802K89015q6172
43864a89567J6365L17609J17253m28962l94105L24455N40915m54128j563121j254884
43854b968170L00508J476249J280567K63117n39490o56582j46591O46464J072908
43845G28980N82532n30028j232066q75323R7377P40756O24824J08395k00577j10564
43835f5694O363k21160n20435k71611M47949P04556P288q22485p45773K4351M85129
$$ plain form
43824 -971522 -588864 -311347 -8683 2164 -504022 -1006305 -849229 -195187 309426 532633
43814 532633 820382 1207266 1427362 1584398 2052881 2723329 3018721 2677514 1928926 953092
43804 953092 -170020 -1011442 -1030878 -370147 217793 322253 184089 45890 -161272 -453033
43794 -453033 -766442 -1294731 -2145967 -2737303 -2407624 -1627887 -1559646 -2268491 -2539331 -1807456
43784 -1807456 -1027079 -1004257 -1088286 -439404 447590 617212 270273 315075 846416 1233828
43774 1233828 1333677 1479521 1540000 1102498 443703 254693 473044 411789 27037 16374
43764 16374 564232 1005383 956686 849589 1038408 1249331 1307868 1626620 2456651 3254127
43754 3254127 3326371 2716727 2028687 1675643 1619072 1573974 1229584 520836 -151301 -243089
$$ packed form
43824i71522L82658K77517L02664J0847n06186n02283J57076O54042N04613K23207
43814E32633K87749L86884K20096J57036M68483O70448K95392l41207p48588r75834
43804I53092j123112q41422j9436O60731N87940J04460j38164j38199k07162k91761
43794d53033l13409n28289q51236n91336L29679P79737O8241p08845k70840P31875
43784a807456P80377K2822q4029O48882Q86994J69622l46939M4802N31341L87412
43774A233828R9849J45844O0479m37502o58795j89010K18351o1255l84752j0663
43764A6374N47858M41151m8697j07097J88819K10923N8537L18752Q30031P97476
43754C254127P2244o09644o88040l53044n6571m5098l44390p08748o72137r1788
$$ plain form
43744 -243089 252744 721382 622150 12932 -661903 -1013238 -901968 -478491 -49315 305686
43734 305686 841937 1591592 1966871 1406061 216612 -741907 -998561 -563050 525698
43725 525698 1910537 2508617 1520880 -178071 -794478 105309 1189975 1418875 1226563
43716 1226563 1236299 1132883 582768 107504 99721 -30160 -704090 -1104934 -450824 430573
43706 430573 176319 -946653 -1372483 -554767 390756 440569 -127295 -553931 -669668 -752918
43696 -752918 -970367 -1270144 -1417870 -1057251 -132746 819913 1253680 1320516 1496447 1736945
43686 1736945 1632680 1183167 720187 268562 -274220 -554446 -220877 223051 2386
43677 2386 -592268 -519915 329930 905897 640334 194101 210881 430703 538496 845301
$$ packed form
43744b43089M95833M68638r9232o09218o74835l51335J11270M23477M29176L55001
43734C05686N36251P49655L75279n60810j189449r58519k56654M35511J088748
43725E25698J384839N98080r87737j698951o16407Q99787J084666K28900j92312
43716A226563R736j03416n50115m75264p783j29881o73930m00844O54110Q81397
43706D30573k54254j122972m25830Q17716R45523M9813n67864m26636j15737q3250
43696g52918k17449k99777j47726L60619R24505R52659M33767O6836J75931K40498
43686A736945j04265m49513m62980m51625n42782k80226L33569M43928k20665
43677B386n94654P2353Q49845N75967k65563m46233J6780K19822J07793L06805
$$ plain form
43667 845301 1467296 1745747 1249593 613767 605931 966849 930291 400010 -82758 -126294
43657 -126294 334813 1193417 1968233 1971545 1233816 695942 894382 1102930 493363 -532099
43647 -532099 -1066433 -1150366 -1440764 -1882628 -1882350 -1543009 -1498602 -1559133 -755460 1023986
43637 1023986 2513069 2616430 1680630 792869 442357 307166 -50430 -606085 -789696
43628 -789696 -9383 1423773 2174775 1339367 -207339 -796698 -211551 122870 -649705
43619 -649705 -1585369 -1448640 -423631 482569 978854 1478935 1981255 1914673 1064950 -2549
43609 -2549 -534313 -270983 416560 845020 606250 11871 -241218 53955 401102 373691
43599 373691 148450 48872 37144 -26503 -60554 -26845 -77648 -115625 282146 1095344 1557427
$$ packed form
43667H45301O21995K78451m96154o35826p836L60918l6558n30281m82768m3536
43657a26294M61107Q58604P74816L312p37729n37874J98440K08548o09567j025462
43647e32099n34334q3933k90398m41864K78L39341M4407o0531Q03673J779446
43637A023986J489083J03361r35800q87761l50512j35191l57596n55655j83611
43628g89696P80313J433156P51002q35408j546706n89359N85147L34421p72575
43619f49705r35664J36729J025009R06200M96285N00081N02320o6582q49723j067499
43609b549n31764K63330O87543M28460k38770n94379k53089K95173L47147k7411
43599C73691k25241r9578j1728o3647l4051L3709n0803l7977L97771Q13198M62083
$$ plain form
43588 1557427 1153874 445319 300162 723379 1072550 1050050 806674 411025 -50279 -137645
43578 -137645 394191 938441 738960 81931 -89883 320456 398541 -322431 -1146172 -1267413
43568 -1267413 -793927 -337241 -177379 -216111 -305268 -303183 -162726 -136983 -491416 -925609
43558 -925609 -838013 -325695 -264671 -1053065 -1886427 -1789308 -907150 -192621 -93400 -153158
43548 -153158 145954 655328 830280 474766 180 -90480 141590 165434 -231549 -636560
43538 -636560 -742784 -902812 -1409477 -1680736 -1017100 77798 368849 -318182 -874193
43529 -874193 -690149 -512935 -1032476 -1705364 -1736099 -1332818 -1118833 -1013149 -598702 -13267
43519 -13267 426940 958613 1796912 2326295 1872467 866652 185659 -268388 -1101572 -1827770
$$ packed form
43588A557427m03553p08555j45157M23217L49171k2500k43376l95649m61304q7366
43578a37645N31836N44250j99481o57029j71814M10339P8085p20972q23741j21241
43568a267413M73486M56686J59862l8732q9157K085J40457K5743l54433m34193
43558i25609Q7596N12318O1024p88394q33362R7119Q82158P14529R9221n9758
43548a53158K99112N09374J74952l55514m74586r0660K32070K3844l96983m05011
43538f36560j06224j60028n06665k71259O63636J094898K91051o87031n56011
43529h74193J84044J77214n19541o72888l0735M03281K13985J05684M14447N85435
43519a3267M40207N31673Q38299N29383m53828j005815o80993m54047q33184p26198
$$ plain form
43509 -1827770 -1214991 646408 2056534 1943741 1157065 927103 1192947 1301728 1379610
43500 1379610 1873410 2339798 1930729 913461 570027 1387723 2252298 1890461 519352
43491 519352 -510699 -435069 155547 294523 -120770 -403509 -135922 318895 400146 31030
43481 31030 -477753 -875834 -1046118 -884456 -431172 33261 283574 367867 330039 32478
43471 32478 -430951 -527878 23856 690044 815280 574485 533264 535431 -58536 -1085827
43461 -1085827 -1543497 -1056212 -458536 -520658 -917144 -985530 -787363 -756171 -839864 -710265
43451 -710265 -457235 -367647 -232537 448146 1627113 2646782 3057547 3058248 3044904 3078113
43441 3078113 2937771 2485743 1817003 1108415 426994 -205491 -547667 -207436 731173
$$ packed form
43509a827770O12779J861399J410126j12793p86676k29962K65844J08781P7882
43500A379610M93800M66388m09069j017268l43434Q17696Q64575l61837j371109
43491E19352j030051P5630N90616J38976m15293k82739K67587M54817Q1251l69116
43481C1030n08783l98081j70284J61662M53284M64433K50313Q4293l7828k97561
43471C2478m63429r6927N51734O66188J25236k40795m1221K167n93967j027291
43461a085827m57670M87285N97676o2122l96486o8386J98167L1192q3693J29599
43451g10265K53030Q9588J35110O80683J178967J019669M10765P01j3344L3209
43441C078113j40342m52028o68740p08588o81421o32485l42176L40231R38609
$$ plain form
43432 731173 1369001 806697 -705462 -1963827 -2223799 -1838668 -1376544 -839826 -131497
43423 -131497 415009 569286 713117 1132888 1256716 403378 -989202 -1760314 -1589554
43414 -1589554 -1316260 -1570004 -1874345 -1473550 -458241 417839 715252 656274 640526 784517
43404 784517 955707 1033816 1037280 1028683 947174 628926 90065 -283482 -38191 771398 1455812
43393 1455812 1326993 480255 -219205 -78971 580276 791008 169345 -603467 -770927
43384 -770927 -565667 -764941 -1436003 -1835950 -1571826 -1128776 -1017536 -1066525 -935228 -733978
43374 -733978 -632456 -353970 322633 914003 773023 108159 -209346 151951 587747 499760
43364 499760 113444 71321 541596 1078560 1265900 1200882 1248461 1480832 1582739 1338688
$$ packed form
43432G31173O37828n62304j512159j258365k59972L85131M62124N36718P08329
43423a31497N46506J54277J43831M19771J23828q53338j392580p71112J70760
43414a589554K73294k53744l04341M00795J015309Q76080K97413n8978j5748J43991
43404G84517J71190P8109L464q597q1509l18248n38861l73547K45291Q09589O84414
43393A455812j28819q46738o99460J40234O59247K10732o21663p72812j67460
43384g70927K05260j99274o71062l99947K64124M43050J11240m8989J31297K01250
43374g33978J01522K78486O76603N91370j40980o64864l17505L61297M35796q7987
43364D99760l86316m2123M70275N36964J87340o5018M7579K32371J01907k44051
$$ plain form
43354 1338688 983742 901885 1150370 1487264 1683763 1578853 1103067 590134 697876 1481049
43344 1481049 1940544 1289697 337125 535415 1792060 2526136 2052199 1474143 1722493
43335 1722493 2183341 2144099 2190829 2896329 3271485 2096896 61839 -1027651 -740124
43326 -740124 -183872 15496 291415 730625 705472 216418 196702 973697 1582421 1199356
43316 1199356 342562 55631 595377 1437060 2037533 2182714 1973599 1713041 1548719
43307 1548719 1326513 1149828 1627682 2804322 3367121 2153856 172461 -392101 759709
43298 759709 1626419 974759 105270 621821 1944259 2411702 1837662 1462636 1910890
43289 1910890 2615103 3099162 3597623 4269122 4711450 4528707 3830225 2986296 2237944
$$ packed form
43354A338688l54946q1857K48485L36894J96499j04910m75786n12933J07742P83173
43344A481049M59495o50847r52572J98290J256645P34076m73937n78056K48350
43335A722493M60848l9242M6730P05500L75156j174589k035057j089490K87527
43326g40124N56252J99368K75919M39210k5153m89054j9716P76995O08724l83065
43316A199356q56794k86931N39746Q41683O00473J45181k09115k60558j64322
43307A548719k22206j76685M77854J176640N62799j213265j981395n64562J151810
43298G59709Q66710o51660q69489N16551J322438M67443n74040l75026M48254
43289A910890P04213M84059M98461O71499M42328j82743o98482q43929p48352
$$ plain form
43280 2237944 1627444 1089217 593825 264279 206509 248667 176604 187013 584001 1006054
43270 1006054 670024 -403411 -1164263 -897945 -83561 552261 1049988 1656056 2001344
43261 2001344 1707460 1284164 1476025 2006052 1877359 824856 -327102 -757069 -413481
43252 -413481 365166 1373442 2491242 3538869 4390324 5024686 5391780 5384183 4970312
43243 4970312 4281897 3605309 3253887 3263257 3250771 2869762 2367410 2282624 2587668 2659999
43233 2659999 2231914 1815185 1946902 2503536 3010267 3177260 2927647 2401028 2154314
43224 2154314 2816190 4247141 5509957 5901098 5533214 4775401 3771739 2734734 2030019
43215 2030019 1682783 1428443 1409898 2005372 2771148 2610878 1454617 695626 1267831
$$ packed form
43280B237944o10500n38227m95392l29546n7770M2158p2063J0409L96988M22053
43270A006054l36030j073435p60852K66318Q14384O35822M97727O06068L45288
43261B001344k93884m23296J91861N30027j28693j052503j151958m29967L43588
43252d13481P78647J008276J117800J047627Q51455O34362L67094p597m13871
43243D970312o88415o76588l51422R370j2486l81009n02352q4786L05044P2331
43233B659999m28085m16729J31717N56634N06731J66993k49613n26619k46714
43224B154314O61876J430951J262816L91141l67884p57813j003662j037005p04715
43215B030019l47236k54340j8545N95474P65776j60270j156261p58991N72205
$$ plain form
43206 1267831 2277336 2396724 1740482 1344362 1458473 1458526 1085276 787059 942296 1424328
43196 1424328 1877917 2061196 2089775 2452748 3375344 4213092 4200061 3718790 3790473 4331654
43186 4331654 4297821 3730700 3992561 5435927 6578302 6405645 5776935 5567310 5212525
43177 5212525 4323054 3940153 4684099 5327369 4841791 4271846 4868101 5952962 6450448
43168 6450448 6921057 8147106 9344308 9831768 10777430 13114978 15530899 16795948 18064627
43159 18064627 20418137 22581451 23981105 27225734 34033054 41998374 49844095 62103783
43151 62103783 83006170 110662133 145973656 201655844 286251849 376829690 424445398
43144 424445398 398648967 318912152 232769931 170080353 128720868 96922687 72133366
$$ packed form
43206A267831J009505J19388o56242l96120J14111N3l73250k98217J55237M82032
43196A424328M53589J83279K8579L62973R22596Q37748j3031m81271P1683N41181
43186D331654l3833n67121K61861J443366J142375j72657o28710k09625l54785
43177E212525q89471l82901P43946O43270m85578n69945N96255J084861M97486
43168F450448M70609J226049J197202M87460R45662K337548K415921J265049J268679
43159A8064627K353510K163314J399654L244629O807320P965320P845721J2259688
43151F2103783K0902387K7655963L5311523N5682188Q4596005R0577841M7615708
43144D24445398k5796431p9736815q6142221o2689578m1359485l1798181k4789321
$$ plain form
43137 72133366 56164545 46021946 37260757 29942213 25794292 23621662 21393806 19446781
43129 19446781 18455769 17136216 14580111 12250673 11360283 10696297 9117853 7831093
43121 7831093 8073011 8687855 8133240 7035290 6691719 6664144 5890619 4856146 4708447
43112 4708447 5210440 5265434 4679941 3994632 3309287 2496637 1897677 1791856 1853754 1911641
43102 1911641 2415048 3436525 4154366 4067735 3777167 3862558 3996797 3875572 3951007 4449122
43092 4449122 4685561 4183365 3538402 3423524 3644303 3825677 4032051 4096642 3475007 2448325
43082 2448325 2246085 3169912 3850798 3296827 2413587 2400630 2843197 2661165 1928103 1423090
43072 1423090 1204985 892032 628713 603069 325968 -480868 -1047585 -765286 -412486 -882672
$$ packed form
43137G2133366j5968821j0142599q761189p318544m147921k172630k227856j947025
43129A9446781r91012j319553k556105k329438q90390o63986j578444j286760
43121G831093K41918O14844n54615j097950l43571k7575p73525j034473j47699
43112D708447N01993N4994n85493o85309o85345q12650n98960j05821O1898N7887
43102A911641N03407J021477P17841q6631k90568Q5391J34239j21225P5435M98115
43092D449122K36439n02196o44963j14878K20779J81374K06374O4591o21635j026682
43082B448325k02240R23827O80886n53971q83240j2957M42567j82032p33062n05013
43072A423090k18105l12953k63319k5644k77101q06836n66717K82299L52800m70186
$$ plain form
43062 -882672 -1474395 -930950 410124 1076811 728806 436135 807863 1241839 1113736
43053 1113736 553475 -62553 -439140 -172841 904782 2255378 3265783 4114973 5190987
43044 5190987 6026684 5882318 5121470 4816658 5058624 4842823 3727050 2471997 1790195
43035 1790195 1467263 1080192 742144 718552 931799 1188427 1411552 1438712 1063253 455400
43025 455400 128545 344646 857075 1242107 1191558 623500 -104079 -258731 538534 1782739
43015 1782739 2662799 2944639 2896916 2698188 2430790 2289811 2204702 1647684 505177 -276861
43005 -276861 226961 1496801 2147981 1761937 1211712 1252508 1726850 2188911 2411733 2161206
42995 2161206 1302972 318082 -4331 434411 942943 996963 708708 380417 249223 609686
$$ packed form
43062h82672n91723N43445J341074O66687l48005k92671L71728M33976j28103
43053A113736n60261o16028l76587K66299J077623J350596J010405Q49190J076014
43044E190987Q35697j44366p60848l04812K41966k15801j115773j255053o81802
43035A790195l22932l87071l38048k3592K13247K56628K23125K7160l75459o07853
43025D55400l26855K16101N12429L85032n0549n68058p27579j54652P97265J244205
43015A782739Q80060K81840m7723j98728k67398j40979q5109n57018j142507p82038
43005b76861N03822J269840O51180l86044n50225M0796M74342M62061K22822k50527
42995B161206q58234r84890l22413M38742N08532N4020k88255l28291j31194L60463
$$ plain form
42985 609686 1454809 2048316 1646439 615005 -8727 -30399 -219359 -876710 -1363123 -1297244
42975 -1297244 -1144220 -1170994 -816253 278830 1431206 1807405 1554076 1392450 1559939
42966 1559939 1750015 1736949 1536911 1222827 977114 1061565 1426910 1638958 1438805 1060804
42956 1060804 797864 629461 498839 567827 932711 1386823 1645858 1542679 976342 69319
42946 69319 -623581 -585539 -81813 113130 -195317 -414844 -160770 219201 343047 375188
42936 375188 601574 959831 1274728 1506516 1581880 1418995 1171342 953041 457275 -424187
42926 -424187 -816541 200354 1874370 2314395 1025721 -438749 -828847 -741613 -1056603
42917 -1056603 -1312983 -809283 -70101 146294 280877 972706 1532152 1023573 163073
$$ packed form
42985F09686Q45123N93507m01877j031434o23732k1672j88960o57351m86413O5879
42975a297244J53024k6774L54741J095083J152376L76199k53329j61626J67489
42966A559939J90076j3066k00038l14084k45713Q4451L65345K12048k00153l78001
42956A060804k62940j68403j30622O8988L64884M54112K59035j03179n66337r07023
42946F9319o92900L8042N03726J94943l08447k19527K54074L79971J23846L2141
42936C75188K26386L58257L14897K31788P5364j62885k47653k18301m95766q81462
42926d24187l92354J016895J674016M40025j288674j464470l90098Q7234l14990
42917a056603k56380N03700P39182K16395J34583O91829N59446n08579q60500
$$ plain form
42908 163073 375985 1390409 1582682 574829 -297883 -208750 192220 345129 670572
42899 670572 1327015 1534999 887496 139105 -63302 -173670 -692764 -1092870 -677334 235160
42889 235160 818086 824856 456771 -229008 -1024259 -1249515 -533437 505544 1060870 1192499
42879 1192499 1381978 1503008 1083924 290259 -217512 -266392 -245742 -288411 -86647 513327
42869 513327 1360429 2356047 3309864 3559013 2550653 883811 -39584 338977 1132175
42860 1132175 1350249 1135474 1169866 1480221 1564110 1373013 1369237 1605371 1457790 568816
42850 568816 -416189 -507723 375027 1210923 1018009 -63414 -980409 -889466 139159 1411382
42840 1411382 2262857 2371224 1774355 853248 143290 -87504 -29313 4754 -60894 -187893
$$ packed form
42908A63073K12912J014424J92273j007853q72712Q9133M00970J52909L25443
42899F70572O56443K07984o47503p48391k02407j10368n19094m00106M15536R12494
42889B35160N82926O770l68085o85779p95251k25256P16078J038981N55326J31629
42879A192499J89479J21030m19084p93665n07771m8880K0650m2669K01764N99974
42869E13327Q47102R95618R53817K49149j008360j666842r23395L78561P93198
42860A132175K18074k14775L4392L10355Q3889j91097l776K36134j47581q88974
42850E68816r85005r1534Q82750Q35896j92914j081423r16995R0943J028625J272223
42840A411382Q51475J08367n96869r21107p09958k30794N8191L4067o5648j26999
$$ plain form
42830 -187893 -458754 -895214 -1235468 -1245066 -1095058 -1037519 -872302 -266476 480127 645950
42820 645950 153085 -268409 -224802 -243464 -751685 -1152384 -651162 448350 1128927 1132341
42810 1132341 1181985 1721491 2249165 2132673 1425076 564321 -208508 -801639 -1091105 -1151468
42800 -1151468 -1340649 -1826293 -2277062 -2279780 -1822840 -1178115 -609729 -397157 -768068 -1506469
42790 -1506469 -1964999 -1805195 -1421332 -1284107 -1200235 -681176 210904 914455 1156722 1213768
42780 1213768 1400843 1696271 1906384 1929177 1831949 1797125 1870198 1686819 795119 -544464
42770 -544464 -1346673 -1087263 -432506 -237435 -299627 109898 847627 1030690 470696 -52237
42760 -52237 -72499 -14350 -207224 -285554 -48894 -56163 -683740 -1246754 -835279 377196
$$ packed form
42830a87893k70861m36460l40254r598J50008N7539J65217O05826P46603J65823
42820F45950m92865m21494M3607j8662n08221m00699N01222J099512O80577L414
42810A132341M9644N39506N27674j16492p07597q60755p72829n93131k89466o0363
42800a151468j89181m85644m50769k718M56940O44725N68386K12572l70911p38401
42790a506469m58530J59804L83863J37225Q3872N19059Q92080P03551K42267N7046
42780A213768J87075K95428K10113K2793r7228l4824P3073j83379q91700j339583
42770e44464q02209K59410O54757J95071o2192M09525P37729J83063n59994n22933
42760e2237k0262N8149j92874p8330K36660p269o27577n63014M11475J212475
$$ plain form
42750 377196 1386345 1667567 1565149 1494437 1375420 927585 118576 -777955 -1367041 -1396753
42740 -1396753 -997612 -588933 -450323 -530355 -726567 -1064879 -1459733 -1611429 -1366568 -932030
42730 -932030 -545639 -201915 131237 349828 464031 651633 825504 544723 -310263 -1121796
42720 -1121796 -1172225 -435719 572291 1407432 1791472 1448274 375761 -851940 -1492519
42711 -1492519 -1333626 -776111 -378103 -497130 -1115270 -1767622 -1901402 -1526843 -1202709
42702 -1202709 -1188542 -1068955 -515221 112002 370310 438401 649540 780118 472137 11868
42692 11868 -31194 289377 431809 219281 -99910 -470894 -1029327 -1588232 -1773333 -1594841
42682 -1594841 -1310351 -869226 -111373 662080 1015292 1126631 1472047 1894318 1808694 1268609
$$ packed form
42750C77196J009149K81222j02418p0712j19017m47835q09009q96531n89086k9712
42740a396753L99141M08679J38610q0032j96212l38312l94854j51696K44861M34538
42730i32030L86391L43724L33152K18591J14203J87602J73871k80781q54986q11533
42720a121796n0429P36506J008010Q35141L84040l43198j072513j227701o40579
42711a492519J58893N57515L98008j19027o18140o52352j33780L74559L24134
42702a202709J4167J19587N53734O27223K58308O8091K11139J30578l07981m60269
42692A1868m3062L20571J42432k12528l19191l70984n58433n58905j85101J78492
42682a594841K84490M41125P57853P73453L53212J11339L45416M22271q5624n40085
$$ plain form
42672 1268609 936853 956855 777310 267255 78661 557284 1097527 1014989 430602 -101085
42662 -101085 -295498 -139715 291649 723123 845275 798548 993249 1316445 1129512 244745
42652 244745 -713145 -1109284 -844659 -14421 1165596 1927880 1445528 155480 -412371
42643 -412371 293921 937355 219883 -1218849 -1837313 -1363891 -751102 -468056 -115671
42634 -115671 437460 750909 747069 937079 1466765 1748176 1352562 644574 209588 118205
42624 118205 56197 -137881 -313430 -221746 212579 741271 977336 843711 652871 582408
42614 582408 382436 -104492 -479890 -290489 264416 608851 580882 476041 490212 627889
42604 627889 1002832 1663597 2186218 1998103 1158048 392673 322686 943002 1740359 1991991
$$ packed form
42672A268609l31756K0002j79545n10055j88594M78623N40243q2538n84387n31687
42662a01085j94413J55783M31364M31474J22152m6727J94701L23196j86933q84767
42652B44745r57890l96139K64625Q30238J180017P62284m82352j290048n67851
42643d12371P06292O43434p17472j438732o18464M73422O12789K83046L52385
42634a15671N53131L13449l840J90010N29686K81411l95614p07988m34986r1383
42624A18205o2008j94078j75549R1684M34325N28692K36065j33625j90840p0463
42614E82408j99972m86928l75398J89401N54905L44435k7969j04841J4171J37677
42604F27889L74943O60765N22621j88115q40055p65375o9987O20316P97357K51632
$$ plain form
42594 1991991 1198093 -292316 -1306153 -1062439 -171781 200954 -47580 5189 735443
42585 735443 1394960 1324323 872268 680522 743214 685568 468304 310471 265559 291101
42575 291101 450358 718072 880010 894707 1006837 1226653 1111655 439330 -295085 -512408
42565 -512408 -361601 -388776 -640157 -676864 -400210 -299138 -778289 -1635107 -2327323 -2500533
42555 -2500533 -2193653 -1740747 -1479190 -1359304 -918521 92306 1175308 1589484 1353750
42546 1353750 1220455 1523243 1659251 1112397 437412 523753 1174977 1287079 472892 -376152
42536 -376152 -477291 -263833 -462035 -752239 -317682 616825 903162 179371 -567232 -468074
42526 -468074 95671 336862 261241 338056 556018 592948 561264 799242 1119941 1021149
$$ packed form
42594A991991p93898j490409j013837K43714Q90658L72735k48534N2769P30254
42585G35443O59517p0637m52055j91746O2692n7646k17264j57833m4912K5542
42575B91101J59257K67714J61938J4697J12130K19816j14998o72325p34415k17323
42565e12408J50807k7175k51381l6707K76654J01072m79151q56818o92216j73210
42555b500533L06880M52906K61557J19886M40783J010827J083002M14176k35734
42546A353750j33295L02788J36008n46854o74985Q6341O51224J12102q14187q49044
42536c76152j01139K13458j98202k90204M34557R34507K86337p23791p46603R9158
42526d68074N63745K41191p5621P6815K17962L6930l1684K37978L20699r8792
$$ plain form
42516 1021149 573318 388429 655328 854122 601330 240373 312852 780452 1044956 629353
42506 629353 -250157 -754010 -192077 1141481 2136928 2099942 1522807 1297638 1516633 1591007
42496 1591007 1304212 1064541 1146653 1304508 1222732 855838 251919 -496683 -1047990 -974541
42486 -974541 -234694 795404 1700396 2154273 1914803 1157189 568460 529867 456760 -333572
42476 -333572 -1341702 -1410910 -480132 217243 -110141 -852491 -1101893 -805324 -376458 24091
42466 24091 289851 125836 -468481 -1007416 -1185518 -1155205 -864209 101112 1587997 2615486
42456 2615486 2616957 2207479 2129350 2211808 2056191 1946274 2223249 2463913 2220776 1958507
42446 1958507 2253572 2626360 2272243 1502709 1291366 1731200 2181116 2711601 4027376
$$ packed form
42516A021149m47831j84889K66899J98794k52792l60957P2479M67600K64504m15603
42506F29353q79510n03853N61933J333558R95447l6986n77135k25169K18995P4374
42496A591007k86795k39671Q2112J57855q1776l66894o03919p48602n51307P3449
42486i74541P39847J030098R04992M53877k39470p57614n88729l8593p3107p90332
42476c33572j008130o9208R30778O97375l27384p42350k49402K96569M28866M00549
42466B4091K65760j64015n94317n38935j78102L0313K90996R65321J486885J027489
42456B615486J471m09478p8129Q2458j55617j09917K76975K40664k43137k62269
42446A958507K95065L72788l54117p69534k11343M39834M49916N30485J315775
$$ plain form
42437 4027376 5908816 7108608 7194612 7401676 9170132 12663790 17045193 21284224 24268579
42428 24268579 25122780 24265608 23607535 24870940 27794762 30354840 30565942 27894297 23334394
42419 23334394 18516833 14546682 11403209 8499074 5773792 3904632 3384951 3776805
42411 3776805 4062805 3536643 2316514 1217653 1088108 2012043 3246940 4162323 4961205
42402 4961205 6136819 7677808 9422706 11677401 14492240 16697471 16997356 16060844
42394 16060844 16097393 17892731 19543634 18858522 15930966 12481976 9639087 7462782
42386 7462782 5952314 5243363 5014417 4672892 4079365 3457122 2848398 2309691 2271611
42377 2271611 2895464 3373573 2780581 1463406 656804 764407 995177 830108 835913 1565606
$$ packed form
42437D027376J881440J199792Q6004K07064J768456L493658M381403M239031K984355
42428B4268579Q54201q57172o58073J263405K923822K560078K11102k671645m559903
42419B3334394m817561l970151l143473k904135k725282j869160n19681L91854
42411C776805K86000n26162j220129j098861j29545R23935J234897R15383P98882
42402D961205J175614J540989J744898K254695K814839K205231K99885r36512
42394A6060844L6549J795338J650903o85112k927556l448990k842889k176305
42386G462782j510468p08951k28946l41525n93527o22243o08724n38707l8080
42377B271611O23853M78109n92992j317175q06602J07603K30770j65069N805P29693
$$ plain form
42367 1565606 2437800 2368314 1111920 -578224 -1891507 -2571915 -2693544 -2301617 -1456169
42358 -1456169 -423104 433803 1015583 1588386 2339091 2928243 2799571 1960378 1096966
42349 1096966 800354 1048165 1583610 2294657 2897119 2776937 1719907 475005 -42
42340 -42 321342 650465 460066 -50173 -392658 -196820 659581 1826461 2573589 2614468
42330 2614468 2583734 3089419 3609928 3185762 2023948 1361309 1614248 1731085 811466
42321 811466 -542224 -1126582 -723529 -82141 244141 330263 349791 233812 -102674 -533497
42311 -533497 -767434 -531415 151835 798187 821207 184748 -528143 -779388 -551753 -137703
42301 -137703 179067 163259 -223568 -573128 -340138 444119 1164047 1421695 1362633 1118255
$$ packed form
42367A565606Q72194o9486j256394j690144j313283o80408j21629L91927Q45448
42358a456169J033065Q56907N81780N72803P50705N89152j28672q39193q63412
42349A096966k96612K47811N35445P11047O02462j20182j057030j244902m75047
42340d2L21384L29123j90399n10239l42485J95838Q56401J166880P47128M0879
42330B614468l0734N05685N20509m24166j161814o62639K52939J16837r19619
42321H11466j353690n84358M03053O41388L26282Q6122J9528j15979l36486m30823
42311e33497k33937K36019O83250O46352K3020o36459p12891k51245K27635M14050
42301a37703L16770j5808l86827l49560K32990P84257P19928K57648n9062k44378
$$ plain form
42291 1118255 581820 -20371 -65923 506283 837951 329135 -396839 -372463 338352 862484
42281 862484 759211 326518 -38459 -73534 480764 1483641 2073676 1554774 482525
42272 482525 45264 418660 609945 623 -861722 -1243415 -1147063 -873904 -401350 298845
42262 298845 862145 949315 697393 406519 169964 114090 526459 1346843 1969038 1989207
42252 1989207 1749550 1683321 1562997 1003091 341363 260203 690114 867696 506797 161972
42242 161972 245682 395785 189405 -116839 -88694 86491 -51493 -341928 -197470 315876
42232 315876 357790 -436196 -1225133 -1005158 45097 878715 980723 759939 633156 492356
42222 492356 243582 147779 254480 84498 -655480 -1497273 -1819809 -1623861 -1227567 -649932
$$ packed form
42291A118255n36435o02191m5552N72206L31668n08816p25974K4376P10815N24132
42281H62484j03273m32693l64977l5075N54298J002877N90035n18902j072249
42272D82525m37261L73396J91285o09322q62345l81693R6352K73159M72554P00195
42262B98845N63300Q7170k51922k90874k36555n5874M12369Q20384O22195K0169
42252A989207k39657o6229j20324n59906o61728q1160M29911J77582l60899l44825
42242A61972Q3710J50103k06380l06244K8145J75185j37984k90435J44458N13346
42232C15876M1914p93986p88937K19975J050255Q33618J02008k20784j26783j40800
42222D92356k48774r5803J06701j69982p39978q41793l22536J95948L96294N77635
$$ plain form
42212 -649932 87970 466399 51818 -668374 -833959 -436132 -162923 -135342 221008 946800
42202 946800 1234144 739851 315999 827027 1890081 2436284 2082124 1348941 820218
42193 820218 609427 514358 335697 111360 116206 400237 416980 -349665 -1405364 -1661290
42183 -1661290 -1009209 -611814 -1237317 -2204102 -2570457 -2487452 -2547495 -2553432 -1951944 -973946
42173 -973946 -330233 -135224 -70551 -244762 -871744 -1388455 -991290 71208 768772 767186
42163 767186 629489 635387 504901 317259 551869 1038818 978522 282638 -153456 165270
42153 165270 698494 956072 1156082 1375316 1140855 447901 141920 596164 975758 571331
42143 571331 -65215 -141681 129482 228925 366021 720691 504070 -858303 -2204257 -1819813
$$ packed form
42212f49932P37902L78429m14581p20192j65585L97827K73209K7581L56350P25792
42202I46800K87344m94293m23852N11028J063054N46203l54160p33183n28723
42193H20218k10791r5069j78661k24337M846K84031J6743p66645j055699k55926
42183a661290O52081L97395o25503r66785l66355Q3005o0043n937O01488R77998
42173i73946O43713J95009O4673j74211o26982n16711L97165J062498O97564j586
42163G67186j37697N898j30486j87642K34610M86949o0296o95884m36094L18726
42153A65270N33224K57578K00010K19234k34461o92954l05981M54244L79594m04427
42143E71331o36546p6466K71163R9443J37096L54670k16621j362373j345954L84444
$$ plain form
42133 -1819813 82352 1519062 1378215 541409 170376 181092 -73371 -632095 -1080023
42124 -1080023 -1203187 -987300 -479017 -6409 -29900 -456389 -591963 -76006 613043 873199
42114 873199 715824 455048 129564 -322022 -628920 -403644 305779 982172 1138139 737497
42104 737497 204878 52326 369890 707833 617839 201774 -122985 -251707 -412178 -657971
42094 -657971 -785648 -743851 -697321 -666606 -505676 -240167 -30348 164313 453138 632661
42084 632661 453272 181274 289083 642473 677682 340843 48121 -267618 -1042044 -1840180
42074 -1840180 -1440108 297378 1785985 1783305 1123088 1332159 2330798 2786679 2251028
42065 2251028 1572805 1347441 1235536 901339 498135 34957 -714503 -1433805 -1389664 -662723
$$ packed form
42133a819813J902165J436710j40847q36806l71033J0716k54463n58724m47928
42124a080023j23164K15887N08283M72608k3491m26489j35574N15957O89049K60156
42114H73199j57375k60776l25484m51586l06898K25276P09423O76393J55967m00642
42104G37497n32619j52552L17564L37943q9994m16065l24759j28722j60471k45793
42094f57971j27677M1797M6530L0715J60930K65509K09819J94661K88825J79523
42084F32661j79389k71998J07809L53390L5209l36839k92722l15739p74426p98136
42074a840180M00072J737486J488607k680o60217K09071R98639M55881n35651
42065B251028o78223k25364j11905l34197m03204m63178p49460p19302M4141P26941
$$ plain form
42055 -662723 -283698 -703837 -1083325 -701914 -163999 -361192 -965290 -968124 -262911 372982
42045 372982 643721 1000293 1520574 1579233 946072 333145 363775 681829 639055 303696
42035 303696 140672 124443 -76077 -273795 65077 838593 1253486 916520 346695 178219
42025 178219 434268 833268 1185598 1143321 258553 -1133379 -1733016 -781533 724095
42016 724095 1242485 767628 602154 1197941 1522972 863091 9255 -25079 504134 712629
42006 712629 510118 463556 706984 884877 911548 992347 1072015 950946 745223 568597
41996 568597 41790 -1086036 -2072012 -1890726 -749334 90902 81839 -51027 237950 384120
41986 384120 -192675 -975052 -1129622 -782628 -674668 -923849 -945096 -420792 364670 1098216
$$ packed form
42055f62723L79025m20139l79488L81411N37915j97193o04098k834P05213O35893
42045C72982K70739L56572N20281N8659o33161o12927L0630L18054m2774l35359
42035C03696j63024j6229k00520j97718L38872P73516M14893l36966n69825j68476
42025A78219K56049L99000L52330m2277q84768j391932n99637R51483J505628
42016G24095N18390m74857j65474N95787L25031o59881q53836l4334N29213K08495
42006G12629k02511m6562K43428J77893K6671Q0799P9668j21069k05723j76626
41996E68597n26807j127826r85976J81286J141392Q40236r063j32866K88977J46170
41986C84120n76795p82377j54570L46994J07960k49181k1247N24304P85462P33546
$$ plain form
41976 1098216 1726450 2157734 2216329 1985670 1780063 1678163 1409966 770749 -132579 -1071315
41966 -1071315 -1855650 -2301983 -2329044 -2101357 -1799285 -1273640 -301685 774427 1129463
41957 1129463 431801 -598084 -951002 -468852 103259 92936 -409601 -819241 -684882
41948 -684882 28987 996476 1686595 1675141 1041179 360316 102659 124003 -16253 -322429
41938 -322429 -304377 289485 1059472 1504516 1684260 1981399 2380837 2420462 1885117 1177152
41928 1177152 826291 852643 816102 417649 -108304 -247565 179985 755285 936290 738176
41918 738176 655269 854275 867646 377109 -112175 97020 842865 1296031 1077697 535436
41908 535436 -37279 -679747 -1148046 -874919 64814 687867 343766 -373389 -539915 -178824
$$ packed form
41976A098216O28234M31284N8595k30659k05607j01900k68197o39217r03328r38736
41966a071315p84335m46333k7061K27687L02072N25645R71955J076112L55036
41957A129463o97662j029885l52918M82150N72111j0323n02537m09640J34359
41948f84882P13869R67489O90119j1454o33962o80863k57657K1344j40256l06176
41938c22429J8052N93862P69987M45044J79744K97139L99438L9625n35345p07965
41928A177152l50861K6352l6541l98453n25953j39261M27550N75300J81005j98114
41918G38176q2907J99006J3371m90537m89284K09195P45845M53166k18334n42261
41908E35436n72715o42468m68299K73127R39733O23053l44101p17155j66526L61091
$$ plain form
41898 -178824 77504 146191 492660 1225186 2003046 2745184 3687553 4761649 5579694 6003155
41888 6003155 6093294 5618887 4394823 3046029 2500929 2605938 2217007 946828 -191755
41879 -191755 -363897 -119949 -281480 -515974 -23584 987520 1622928 1724427 1849807
41870 1849807 2007906 1562712 491625 -302621 -221895 332705 776812 1021925 985971 303099
41860 303099 -865450 -1448535 -702157 587203 943359 60071 -917741 -955564 -296751
41851 -296751 121007 -88937 -455443 -396190 38445 253388 -135146 -797132 -1096114 -891284
41841 -891284 -636523 -701430 -993927 -1348752 -1814050 -2295534 -2373446 -1861731 -1171055 -690267
41831 -690267 -188098 638591 1369557 1297927 487535 -287319 -581005 -592465 -493249 -182495
$$ packed form
41898a78824K56328O8687L46469P32526P77860P42138R42369J074096Q18045M23461
41888F003155R0139m74407j224064j348794n45100J05009l88931j270179j138583
41879a91755j72142K43948j61531k34494M92390J011104O35408J01499J25380
41870A849807J58099m45194j071087p94246Q0726N54600M44107K45113l5954o82872
41860C03099j168549n83085P46378J289360L56156q83288r77812l7823O58813
41851b96751M17758k09944l66506N9253M34635K14943l88534o61986k98982K04830
41841h91284K54761o4907k92497l54825m65298m81484p7912N11715O90676M80788
41831f90267N02169Q26689P30966p1630q10392p74854k93686j1460R9216L10754
$$ plain form
41821 -182495 190921 178772 -279204 -730329 -958710 -1219144 -1510084 -1344568 -626390 -67472
41811 -67472 -228064 -728793 -945911 -906329 -873305 -626342 33900 496327 -5607 -1143744
41801 -1143744 -1811893 -1651652 -1378011 -1489830 -1546574 -1067799 -426196 -340007 -919614 -1677478
41791 -1677478 -2212758 -2505738 -2692881 -2850659 -2958154 -2932674 -2726123 -2366855 -1825248 -997700
41781 -997700 -52301 424922 49703 -718225 -1048403 -789361 -472336 -287744 193007 1051172
41771 1051172 1543541 1105176 266758 -50640 208879 323823 -69641 -562179 -662344
41762 -662344 -374937 -10321 191328 137561 -141358 -502523 -826954 -1121874 -1340395 -1235973
41752 -1235973 -663783 77782 544780 754421 1121813 1729756 2054936 1655009 856581
$$ packed form
41821a82495L73416j2149m57976m51125k28381k60434k90940J65516P18178N58918
41811f7472j60592n00729k17118L9582L3024K46963O60242M62427n01934j138137
41801a143744o68149J60241K73641j11819n6744M78775O41603Q6189n79607p57864
41791a677478n35280k92980j87143j57778j07495K5480K06551L59268N41607Q27548
41781i97700R45399M77223l75219p67928l30178K59042L17025J84592M80751Q58165
41771A051172M92369m38365q38418l17398K59519J14944l93464m92538j00165
41762f62344K87407L64616K01649n3767k78919l61165l24431k94920k18521J04422
41752a235973N72190P41565M66998K09641L67392O07943L25180l99927p98428
$$ plain form
41743 856581 426551 636222 950378 707930 -111023 -955559 -1408242 -1563828 -1660343 -1587225
41733 -1587225 -1026987 -53858 667186 443490 -715319 -2002782 -2487122 -1926742 -940911
41724 -940911 -332901 -283243 -354267 -234057 -124591 -255609 -411136 -277653 55948 369006
41714 369006 774972 1360700 1620980 1007365 -17915 -305505 434892 1178556 969667
41705 969667 52848 -743183 -1040414 -834377 -72305 994742 1546211 1053352 112361
41696 112361 -271714 10239 254761 114747 -61000 3243 101348 -9932 -286405 -582592
41686 -582592 -749432 -591565 -158208 33285 -431650 -1175710 -1467232 -1245995 -1071130 -1103203
41676 -1103203 -910959 -418174 -243087 -716637 -1187285 -800915 403131 1596893 2113670
$$ packed form
41743H56581m30030K09671L14156k42448q18953q44536m52683j55586r6515P3118
41733a587225N60238R73129P21044k23696j158809j287463m84340N60380R85831
41724i40911O08010M9658p1024J20210J09466j31018j55527J33483L33601L13058
41714C69006M05966N85728K60280o13615j025280k87590P40397P43664k08889
41705I69667r16819p96031k97231K06037P62072J067047N51469m92859r40991
41696A12361l84075K81953K44522j40014j75747O4243R8105j11280k76473k96187
41686e82592j66840J57867M33357J91493m64935p44060k91522K21237J74865l2073
41676a103203J92244M92785J75087m73550m70648L86370J204046J193762N16777
$$ plain form
41667 2113670 1962221 1568860 1263252 968069 388243 -360795 -531432 394178 1743082
41658 1743082 2191859 1340211 114555 -520529 -539515 -320273 32417 322571 -25592
41649 -25592 -1157140 -2201622 -2247544 -1518181 -864671 -507110 -156195 -43310 -683852 -1595657
41639 -1595657 -1440591 117745 1660146 1772694 829400 219111 335022 347131 -184385
41630 -184385 -550269 -81775 722598 904979 444631 224847 709041 1330464 1381958 974844
41620 974844 727222 824837 877290 623607 310954 228785 200964 -162039 -805852 -1126675
41610 -1126675 -659402 267928 808709 565470 22939 -165620 -23224 30383 49354 435556
41600 435556 921319 569670 -781166 -1886828 -1650540 -693808 -462568 -1200024 -1867597
$$ packed form
41667B113670j51449l93361l05608k95183n79826p49038j70637R25610J348904
41658A743082M48777q51648j225656o35084j8986K19242L52690K90154l48163
41649b5592j131548j044482m5922P29363O53510L57561L50915J12885o40542r11805
41639a595657J55066J558336J542401J12548r43294o10289J15911J2109n31516
41630a84385l65884M68494Q04373J82381m60348k19784M84194O21423N1494m07114
41620I74844k47622R7615N2453k53683l12653q2169k7821l63003o43813l20823
41610a126675M67273R27330N40781k43239n42531j88559J42396N3607J8971L86202
41600D35556M85763l51649j350836j105662K36288R56732K31240p37456o67573
$$ plain form
41591 -1867597 -1856196 -1606322 -1496115 -1303909 -1058050 -1290722 -1964581 -2176533 -1543179 -918735
41581 -918735 -985173 -1051490 -236309 914225 1172678 517802 28991 97494 7489 -579265
41571 -579265 -886797 -237615 814932 1136639 357878 -837611 -1487340 -1154413 -186883
41562 -186883 635836 822283 533447 142913 -291422 -787452 -998120 -607011 -16966 8949
41552 8949 -613474 -1221977 -1395017 -1356442 -1312202 -1074328 -564056 -77147 198256 366211
41542 366211 335816 -170526 -828268 -701521 434734 1429464 1130489 -46580 -691292
41533 -691292 -221378 662051 1167385 1228122 1078342 769329 372933 145582 201159 338437
41523 338437 349017 191603 -214613 -967028 -1798032 -2138252 -1832054 -1444050 -1522434 -1831956
$$ packed form
41591a867597J1401K49874J10207J92206K45859k32672o73859k11952O33354O24444
41581i18735o6438o6317Q15181J150534K58453o54876m88811O8503r0005n86754
41571e79265l07532O49182J052547L21707p78761j195489o49729L32927R67530
41562a86883Q22719J86447k88836l90534m34335m96030k10668L91109N90045K5915
41552H949o22423o08503j73040L8575M4240K37874N10272M86909K75403J67955
41542C66211l0395n06342o57742J26747J136255R94730k98975j177069o44712
41533f91292M69914Q83429N05334O0737j49780l09013l96396k27351N5577J37278
41523C38437J0580j57414m06216p52415q31004l40220L06198L88004p8384l09522
$$ plain form
41513 -1831956 -1702023 -947652 -24094 637442 996729 1098187 883682 505666 414374 781228
41503 781228 1088153 696381 -280705 -1062632 -1142767 -763655 -401605 -188388 -36721 27088
41493 27088 -15014 49063 399527 821312 955208 866939 1012706 1582956 2187986 2337974
41483 2337974 2021429 1630347 1432361 1315729 1071303 770597 692437 866668 940885 742846
41473 742846 759550 1538294 2598672 2631135 1177966 -459258 -640368 637990 1893404
41464 1893404 2022187 1173311 -108712 -1546945 -2659412 -2623918 -1284645 315278 1038437
41455 1038437 838976 323428 -284890 -969774 -1192930 -394361 866874 1290345 542954
41446 542954 -304910 -390191 -224951 -627878 -1219294 -950844 159688 872236 474101 -191751
$$ packed form
41513a831956J29933P54371R23558O61536L59287J01458k14505l78016r1292L66854
41503G81228L06925l91772r77086p81927q0135L79112L62050K13217J51667O3809
41493B7088m2102O4077L50464M21785J33896q8269J45767N70250O05030J49988
41483B337974l16545l91082j97986j16632k44426l00706p8160J74231P4217j98039
41473G42846J6704P78744J060378L2463j453169j637224j81110J278358J255414
41464A893404J28783q48876j282023j438233j112467L5494J339273J599923P23159
41455A038437j99461n15548o08318o84884k23156P98569J261235M23471p47391
41446E42954q47864q5281J65240m02927n91416K68450J110532P12548l98135o65852
$$ plain form
41436 -191751 42790 998648 1414667 664541 -501270 -1019955 -737106 -271104 -78184
41427 -78184 -78427 -20783 182778 450455 577646 352357 -111703 -275244 217445 897780
41417 897780 935458 316274 -9520 542382 1242161 994983 -75001 -717452 -253340 508606
41407 508606 376893 -680867 -1575648 -1432573 -385537 898554 1962916 2663010 2958450
41398 2958450 2951925 2915373 2950907 2785495 2236395 1705215 1731086 2109239 2025638 1187682
41388 1187682 247592 -150945 -169116 -224368 -233344 -18862 -1807 -681181 -1663714 -2048438
41378 -2048438 -1705885 -1350628 -1321623 -1173247 -662873 -240535 -157264 87202 829844 1467761
41368 1467761 1298515 621107 240633 238541 41407 -469702 -737781 -467035 -84139 -45237
$$ packed form
41436a91751K34541R55858M16019p50126j165811n18685K82849M66002J92920
41427g8184k43N7644K03561K67677J27191k25289m64060j63541M92689O80335
41417H97780L7678o19184l25794N51902O99779k47178j069984o42451M64112P61946
41407E08606j31713j057760q94781J43075J047036J284091J064362P00094K95440
41398B958450o525l6552L5534j65412n49100n31180K5871L78153q3601q37956
41388A187682r40090l98537j8171n5252q976K14482J7055o79374r82533l84724
41378b048438L42553L55257K9005J48376N10374M22338Q3271K44466P42642O37917
41368A467761j69246o77408l80474k092j97134n11109k68079K70746L82896L8902
$$ plain form
41358 -45237 -185736 -45488 466170 1008950 1293924 1425183 1718156 2230208 2613666 2572437
41348 2572437 2294076 2085242 1720249 750445 -494152 -978560 -362750 437475 611561
41339 611561 585491 1003423 1333585 665490 -533239 -813058 144996 1122211 1275435 1179895
41329 1179895 1489753 1757611 1369881 715883 496518 545694 295250 -76829 54517 608745
41319 608745 905363 805132 852060 1267395 1643915 1768351 1943032 2201696 1913686 635925
41309 635925 -1098143 -2289097 -2490117 -1982161 -1209421 -413381 315036 919235 1276785
41300 1276785 1145124 426739 -442907 -773511 -526826 -508826 -1241284 -2056340 -1935234 -964096
41290 -964096 -186747 -129127 -361554 -600568 -1193019 -2054010 -2158352 -975998 329310
$$ packed form
41358d5237j40499J40248N11658N42780K84974J31259K92973N12052L83458m1229
41348B572437k78361k08834l64993r69804j244597m84408O15810Q00225J74086
41339F11561k6070M17932L30162o68095j198729k79819R58054R77215J53224r5540
41329A179895L09858K67858l87730o53998k19365M9176k50444l72079J31346N54228
41319F08745K96618j00231M6928M15335L76520J24436J74681K58664k88010j277761
41309F35925j734068j190954k01020N07956P72740P96040P28417O04199L57550
41300A276785j31661p18385q69646l30604K46685J8000p32458q15056J21106R71138
41290i64096P77349N7620k32427k39014n92451q60991j04342J182354J305308
$$ plain form
41281 329310 243798 -976092 -1699137 -1237970 -509949 -316105 -303765 -88378 -150735 -808768
41271 -808768 -1283012 -786860 131544 357543 -144071 -442427 -87025 504048 881560 878034
41261 878034 257872 -997063 -2115974 -2189330 -1435526 -959709 -1201581 -1495182 -1255048
41252 -1255048 -691617 -183959 168061 182446 -290964 -692126 -202386 839871 1108486
41243 1108486 330853 -71579 873259 2103312 2127032 1187585 563052 518787 392188 173232
41233 173232 455183 1024288 1005693 467857 481461 1342631 2039294 1885679 1485655 1501817
41223 1501817 1528261 920164 -75474 -770366 -987900 -873229 -307668 750014 1730868
41214 1730868 1971454 1546781 1054023 792736 636732 478680 312779 50186 -323113
$$ packed form
41281C29310q5512j219890p23045M61167P28021J93844J2340K15387o2357o58033
41271h08768m74244M96152R18404K25999n01614k98356L55402N91073L77512l526
41261H78034o20162j254935j118911p3356P53804M75817k41872k93601K40134
41252a255048N63431N07658L52020J4385m73410m01162M89740J042257K68615
41243A108486p77633m02432R44838J230053K3720r39447o24533m4265j26599k18956
41233A73232K81951N69105j8595n37836J3604Q61170O96663j53615m00024J6162
41223A501817K6444o08097r95638o94892k17534J14671N65561J057682R80854
41214A730868K40586m24673m92758k61287j56004j58052j65901k62593l73299
$$ plain form
41205 -323113 -557205 -446263 -132030 174172 462260 607289 215151 -729157 -1450711 -1237857
41195 -1237857 -433760 55061 3436 -76845 58203 140918 141988 429860 1015922 1410694
41185 1410694 1498156 1811018 2544282 3000777 2590334 1813114 1541080 1694669 1428729 522148
41175 522148 -189981 57406 963501 1584282 1411729 738948 133910 -159588 -277538 -349494
41165 -349494 -213417 360555 1189004 1672105 1472697 1038100 1141282 1916418 2640393 2571553
41155 2571553 1789423 1037620 850244 1027959 1002432 578801 155373 165793 461147 468535
41145 468535 -44516 -620391 -644131 -25643 790983 1288321 1157959 378277 -638250 -1117439
41135 -1117439 -579296 522969 1151208 774965 -121115 -676710 -530575 43193 595553
$$ packed form
41205c23113k34092J10942L14233L06202K88088J45029l92138r44308p21554K12854
41195a237857Q04097M88821n1625q0281J35048Q2715J070K87872N86062L94772
41185A410694Q7462L12862P33264M56495m10443p77220k72034J53589k65940r06581
41175E22148p12129K47387R06095O20781j72553o72781o05038k93498j17950p1956
41165c49494J36077N73972Q28449M83101j99408m34597J03182P75136P23975o8840
41155B571553p82130p51803j87376J77715k5527m23631m23428J0420K95354P388
41145D68535n13051n75875k3740O18488Q16626M97338j30362p79682j016527m79189
41135a117439N38143J102265O28239l76243q96080n55595J46135N73768N52360
$$ plain form
41126 595553 886131 927197 803263 457510 -267087 -1245737 -1894589 -1728265 -1050318 -642408
41116 -642408 -690260 -543942 183074 802594 381893 -903678 -1880322 -1820797 -1232789 -1054054
41106 -1054054 -1496419 -1980074 -1957589 -1445391 -780377 -178883 284009 439415 109504 -492044
41096 -492044 -768191 -446411 -80442 -432894 -1420213 -2126781 -1912151 -1040088 -111859 589127
41086 589127 975610 965716 802423 1034084 1670726 1834100 872846 -559486 -1253499 -979063
41076 -979063 -489738 -223932 44200 268576 -90318 -987156 -1393986 -603187 673995
41067 673995 1182006 725528 242555 431262 904626 803612 -116126 -1184199 -1499103
41058 -1499103 -844980 91569 455962 90053 -479610 -791011 -886028 -1022309 -1264280 -1438779
$$ packed form
41126E95553K90578M1066j23934l45753p24597r78650o48852J66324O77947M07910
41116f42408m7852J46318P27016O19520m20701j285571r76644N9525N88008J78735
41106a054054m42365m83655K2485N12198O65014O01494M62892J55406l29911o01548
41096d92044k76147L21780L65969l52452r87319p06568K14630Q72063R28229P00986
41086E89127L86483r894j63293K31661O36642J63374r61254j432332o94013K74436
41076i79063M89325K65806K68132K24376l58894q96838m06830P90799J277182
41067F73995N08011m56478m82973J88707M73364j01014r19738j068073l14904
41058a499103O54123R36549L64393l65909n69663l11401r5017j36281k41971j74499
$$ plain form
41048 -1438779 -1302391 -770126 -148592 40843 -230591 -255782 424162 1072026 580017 -841681
41038 -841681 -1730152 -1278653 -241082 392323 633782 832836 709310 -57750 -914065
41029 -914065 -1059548 -612272 -286939 -235874 -82291 136690 -12958 -480608 -732816 -650360
41019 -650360 -609152 -604220 -135387 821489 1520790 1499281 1282942 1579725 2228393 2449009
41009 2449009 1889227 994531 417059 334268 372005 115882 -328824 -419086 61546 553075
40999 553075 367679 -376521 -913883 -850343 -526908 -351194 -312255 -314418 -470033 -759967
40989 -759967 -808778 -370150 218625 418401 175550 -71838 16515 362785 722267 1007753
40979 1007753 1260646 1422822 1306572 857309 353848 180307 377982 590657 521898 276359
$$ packed form
41048a438779J36388N32265O21534J89435k71434k5191O79944O47864m92009j421698
41038h41681q88471M51499J037571O33405K41459J99054j23526p67060q56315
41029i14065j45483M47276L25333N1065J53583K18981j49648m67650k52208Q2456
41019f50360M1208M932M68833R56876O99301k1509k16339K96783O48668K20616
41009B449009n59782q94696n77472q2791L7737k56123m44706r0262M80632M91529
40999E53075j85396p44200n37362O3540L23435J75714L8939k163j55615k89934
40989g59967m8811M38628N88775J99776k42851k47388Q8353L46270L59482K85486
40979A007753K52893J62176j16250m49263n03461j73541J97675K12675o8759k45539
$$ plain form
40969 276359 151109 258261 464579 543586 307014 -213647 -653879 -647477 -334074 -210211
40959 -210211 -428522 -685831 -856519 -1099335 -1169077 -465756 789070 1336938 597835 -240349
40949 -240349 133978 1143818 1242395 348831 -150750 292069 662912 241697 -256654 6355
40939 6355 690648 1003890 878971 760459 865649 1187370 1658300 1924766 1562867 821119
40929 821119 468296 653370 726867 465392 493575 1052556 1393876 1041789 676386 986763
40919 986763 1538631 1615031 1330161 1020754 409141 -582350 -1025944 -255279 728311 495874
40909 495874 -632811 -1102856 -523156 8185 -22467 246021 1321544 2221964 1873778
40900 1873778 743791 222734 853361 1858402 2228516 1792413 1197559 1033510 1101793
$$ packed form
40969B76359j25250J07152K06318P9007k36572n20661m40232O402L13403J23863
40959b10211k18311k57309j70688k42816o9742P03321J254826N47868p39103q38184
40949b40349L74327J009840R8577q93564m99581M42819L70843m21215m98351K63009
40939F355O84293L13242j24919j18512J05190L21721M70930K66466l61899p41748
40929H21119l52823J85074P3497k61475K8183N58981L41320l52087l65403L10377
40919I86763N51868P6400k84870l09407o11613r91491m43594P70665R83590k32437
40909D95874j128685m70045N79700N31341l0652K68488J075523R00420l48186
40900A873778j129987n21057O30627J005041L70114m36103n94854j64049O8283
$$ plain form
40891 1101793 746536 -72999 -505085 77227 1149570 1728584 1571470 1104038 588046
40882 588046 75395 -196368 -174269 -421126 -1298543 -2031552 -1598129 -351780 327605 -66574
40872 -66574 -717127 -953840 -1027610 -1225163 -1307645 -1172369 -1144630 -1288190 -1255178 -1040823
40862 -1040823 -1024732 -1106532 -761116 -100339 207399 251648 836937 1792882 1775441 423915
40852 423915 -687560 -212534 1061303 1537697 965148 108796 -721212 -1477092 -1524772
40843 -1524772 -438441 884518 1246055 846938 691387 781820 347180 -464452 -671689
40834 -671689 -153366 232394 263398 596569 1206723 1112018 127187 -519227 -13589 794233
40824 794233 772222 132033 -186403 74405 582577 1236461 1957053 2153518 1331479 -17937
$$ packed form
40891A101793l55257q19535m32086N82312J072343N79014j57114m67432n15992
40882E88046n12651k71763K2099k46857q77417p33009M33423J246349O79385l94179
40872f6574o50553k36713p3770j97553q2482J35276K7739j43560L3012K14355
40862a040823J6091q1800L45416O60777L07738M4249N85289R55945j7441j351526
40852D23915j111475M75026J273837M76394n72549q56352q30008p55880m7680
40843a524772J086331J322959L61537l99117j55551R0433m34640q11632k07237
40834f71689N18323L85760L1004L33171O10154r4705r84831o46414N05638Q07822
40824G94233k2011o40189l18436K60808N08172O53884P20592J96465q22039j349416
$$ plain form
40814 -17937 -913621 -1093322 -1068485 -1158889 -1169958 -991904 -880913 -1003400 -1118885 -883149
40804 -883149 -274388 331436 438979 -91906 -770826 -906902 -431846 19896 26493 -34602
40794 -34602 355724 1002840 1282147 1029638 637338 384042 152654 -209473 -636491 -942265
40784 -942265 -883911 -239383 831343 1630748 1554652 819211 149767 -160916 -370457 -517781
40774 -517781 -229399 488288 922154 595310 81462 282378 1130684 1650918 1304852 668739
40764 668739 538801 827692 771604 19266 -940613 -1434376 -1276063 -654331 241416 1120917
40754 1120917 1405794 721496 -406504 -917402 -511063 -84274 -496325 -1363337 -1679549
40745 -1679549 -1320395 -1116517 -1435591 -1535886 -681570 739023 1718970 1844112 1483043
$$ packed form
40814a7937q95684j79701K4837r0404j1069J78054J10991j22487j15485K35736
40804h83149O08761O05824J07543n30885o78920j36076M75056M51742O597o1095
40794c4602L90326O47116K79307k52509l92300k53296k31388l62127m27018l05774
40784i42265N8354O44528J070726P99405p6096p35441o69444l10683k09541j47324
40774e17781K88382P17687M33866l26844n13848K00916Q48306N20234l46066o36113
40764F68739j29938K88891n6088p52338r59879m93763J58313O21732Q95747Q79501
40754A120917K84877o84298j128000n10898M06339M26789m12051q67012l16212
40745a679549L59154K03878l19074j00295Q54316J420593R79947J25142l61069
$$ plain form
40736 1483043 1061319 715675 559647 748679 1186070 1510248 1486596 1228453 1021461 1081635
40726 1081635 1417515 1756076 1703650 1162427 458579 -104661 -572130 -957358 -875727 -40169
40716 -40169 1083067 1663741 1465805 919490 387294 -12939 32120 827497 1909047 2291574
40706 2291574 1738666 1046562 800864 711066 594404 1024313 2210039 3081871 2565683
40697 2565683 1220017 466265 540814 434339 -254967 -703753 -314359 385275 750331
40688 750331 948685 1279266 1367708 800153 39405 -52496 644909 1460420 1873941 1977971
40678 1977971 2030754 1982161 1564261 690002 -289158 -754592 -415514 265554 504361 109806
40668 109806 -319029 -184826 441718 1047614 1213042 788070 -61329 -760508 -672649 139225
$$ packed form
40736A483043m21724l45644j56028J89032M37391L24178k3652k58143k06992O0174
40726A081635L35880L38561n2426n41223p03848n63240m67469l85228Q1631Q35558
40716d0169J123236N80674j97936n46315n32196m00233M5059P95377J081550L82527
40706B291574n52908o92104k45698q9798j16662M29909J185726Q71832n16188
40697B565683j345666p53752P4549j06475o89306m48786L89394O99634L65056
40688G50331J98354L30581Q8442n67555p60748r1901O97405Q15511M13521J04030
40678A977971N2783m8593m17900q74259r79160m65434L39078O81068K38807l94555
40668A09806m28835J34203O26544O05896J65428m24972q49399o99179Q7859Q11874
$$ plain form
40658 139225 787884 515428 -460107 -1319639 -1601909 -1473644 -1280991 -1212298 -1284977 -1321409
40648 -1321409 -982546 -109412 963891 1645852 1673046 1356834 1233290 1499206 1784879
40639 1784879 1533660 664814 -261999 -667868 -550710 -247885 124597 598364 956548
40630 956548 962928 863706 1067141 1402333 1358782 1020838 985300 1279094 1209636 508016 -224052
40619 -224052 -510890 -596264 -672782 -423707 145104 289129 -415074 -1367497 -1926161 -2262134
40609 -2262134 -2548871 -2245503 -1122622 -114962 -20578 -123524 607655 1624054 1593639
40600 1593639 662798 307030 1031620 1783730 1781596 1456966 1268580 944974 389182 152165
40590 152165 452602 722556 622025 550994 675725 439264 -360628 -933375 -640883 10700
$$ packed form
40658A39225O48659k72456r75535q59532k82270J28265J92653O8693p2679l6432
40648a321409L38863Q73134J073303O81961K7194l16212j23544K65916K85673
40639A784879k51219q68846r26813m05869J17158L02825L72482M73767L58184
40630I56548O380r9222K03435L35192m3551l37944l5538K93794o9458p01620p32068
40619b24052k86838q5374p6518K49075N68811J44025p04203r52423n58664l35973
40609b262134k86737L03368J122881J007660R4384j02946P31179J016399l0415
40600A593639r30841l55768P24590P52110k134l24630j88386l23606n55792k37017
40590A52165L00437K69954j00531p1031J24731k36461p99892n72747K92492O51583
$$ plain form
40580 10700 263162 294880 707494 1353870 1523643 1021760 355118 -27140 -148565 -219524
40570 -219524 -290014 -184189 293202 948190 1123886 442475 -505335 -809521 -500239 -403642
40560 -403642 -750100 -870808 -471863 -188106 -445078 -741748 -646323 -599862 -1000513 -1276488
40550 -1276488 -720739 327059 935178 761659 90386 -824677 -1720805 -2067083 -1597208
40541 -1597208 -801803 -295971 -78695 28402 -241325 -1021755 -1580938 -1057695 298438
40532 298438 1386486 1579673 1155720 641419 368442 466967 723479 681129 349247 384674
40522 384674 1022994 1411984 773674 -327493 -796166 -587285 -426435 -377075 81450 762033
40512 762033 857797 347132 75721 269486 159471 -595284 -1245328 -1192872 -896656 -934158
$$ packed form
40580A0700K52462L1718M12614O46376J69773n01883o66642l82258j21425p0959
40570b19524p0490J05825M77391O54988J75696o81411r47810l04186L09282R6597
40560d03642l46458j20708L98945K83757k56972k96670R5425M6461m00651k75975
40550a276488N55749J047798O08119j73519o71273r15063q96128l46278M69875
40541a597208P95405N05832K17276J07097k69727p80430n59183N23243J356133
40532B98438J088048J93187m23953n14301k72977R8525K56512m2350l31882L5427
40522C84674O38320L88990o38310j101167m68673K08881J60850M9360M58525O80583
40512G62033R5764n10665k71411J93765j10015p54755o50044N2456K96216l7502
$$ plain form
40502 -934158 -1004299 -579115 58628 163509 -410930 -1070423 -1228008 -816065 -180901 294663
40492 294663 535416 767765 1052192 1024727 453405 -192842 -301330 -95198 -365593 -1226659
40482 -1226659 -1859309 -1657090 -995617 -614094 -706230 -839767 -457397 583146 1679760
40473 1679760 1881522 1029670 170223 225420 696345 577333 112199 359923 1202498 1326490
40463 1326490 423299 -135071 579569 1632956 1774298 1216516 869760 767455 385490
40454 385490 -139244 -209379 203196 615132 822751 959015 1101990 1368938 1949866 2563615
40444 2563615 2484147 1643981 993922 1121601 1305662 743261 -91632 -295641 -4568 91821
40434 91821 59072 333009 572869 210661 -270241 13699 706114 668092 -67970 -309035
$$ packed form
40502i34158p0141M25184O37743J04881n74439o59493j57585M11943O35164M75564
40492B94663K40753K32349K84427k7465n71322o46247j08488K06132k70395q61066
40482a226659o32650K02219O61473L81523r2136j33537L82370J040543J096614
40473A679760K01762q51852q59447N5197M70925j19012m65134K47724Q42575J23992
40463A326490r03191n58370P14640J053387J41342n57782l46756j02305l81965
40454C85490n24734p0135M12575M11936K07619J36264J42975K66948N80928O13749
40444B563615p9468q40166o50059J27679J84061n62401q34893k04009K91073R6389
40434I1821l2749K73937K39860l62208m80902K83940O92415l8022p36062k41065
$$ plain form
40424 -309035 287678 728693 444902 54602 -41156 -365774 -1037299 -1095654 -40686 1074318
40414 1074318 1072225 303809 -105397 70116 253068 287648 519266 929701 1100482 927967
40404 927967 674197 404921 -39627 -609023 -1055090 -1263182 -1212055 -845333 -351334 -228992
40394 -228992 -608501 -855290 -406218 317969 477358 34253 -330399 -399229 -692612 -1426504
40384 -1426504 -1942864 -1578066 -649495 -145421 -604037 -1593102 -2255397 -2194991 -1765497 -1494316
40374 -1494316 -1342826 -785994 337516 1408459 1685154 1082937 37607 -1058759 -1905944
40365 -1905944 -2155040 -1806968 -1525133 -1889316 -2443430 -2206390 -1153227 -399438 -675980
40356 -675980 -1369584 -1513456 -1095723 -778757 -760153 -612729 -86003 535900 851406 673007
$$ packed form
40424c09035N96713M41015k83791l90300r5758l24618o71525n8355J054968J115004
40414A074318k093p68416m09206J75513J82952L4580K31618M10435J70781j72515
40404I27967k53770k69276m44548n69396m46067k08092N1127L66722M93999J22342
40394b28992l79509k46789M49072P24187J59389m43105l64652o8830k93383p33892
40384a426504n16360L64798R28571N04074m58616r89065o62295O0406M29494K71181
40374a494316J51490N56832J123510J070943K76695o02217j045330j096366q47185
40365a905944k49096L48072K81835l64183n54114K37040J053163P53789k76542
40356f75980o93604j43872M17733L16966J8604J47424N26726O21903L15506j78399
$$ plain form
40346 673007 -5101 -947056 -1626396 -1665533 -1317031 -1102545 -1024403 -663359 -89903 -3207
40336 -3207 -652536 -1227506 -878693 39545 391857 -235915 -1084990 -1267452 -676402 245016
40326 245016 1059595 1401456 1007588 122387 -452972 -170323 591477 1053942 1039625 972968
40316 972968 1037992 965255 722041 754505 1219506 1526441 1172287 673215 992554 2114403
40306 2114403 2850021 2270892 847373 -168197 -172481 351997 659402 602237 637546 1212953
40296 1212953 2216960 2961104 2777535 1746614 697611 315191 430996 471252 354242
40287 354242 416589 557146 186602 -753116 -1408501 -1094621 -186211 595069 1182265 1686591
40277 1686591 1485023 -33356 -1959710 -2425813 -1003650 608893 867149 284899 253412
$$ packed form
40346F73007o78108r41955o79340l9137L48502K14486P8142L61044N73456Q6696
40336c207o49329n74970L48813R18238L52312o27772q49075j82462N91050R21418
40326B45016Q14579L41861l93868q85201n75359K82649P61800M62465j4317o6657
40316I72968O5024p2737k43214L2464M65001L06935l54154m99072L19339J121849
40306B114403P35618n79129j423519j015570m284N24478L07405n7165L5309N75407
40296A212953J004007P44144j83569j030921j049003l82420J15805M0256j17010
40287C54242O2347J40557l70544r39718o55385L13880R08410P81280N87196N04326
40277A686591k01568j518379j926354m66103J422163J612543K58256n82250l1487
$$ [...]
##END NTUPLES=NMR SPECTRUM
##END=
