##TITLE=31Pdec_PR162_KP
 CDCl3, 24 sc
 29.5.2019
##JCAMPDX= 6.0         $$ Bruker NMR JCAMP-DX V2.0
##DATA TYPE= NMR SPECTRUM
##DATA CLASS= NTUPLES
##ORIGIN= UXNMR, Bruker Analytische Messtechnik GmbH
##OWNER= root
$$ XWIN-NMR		Version 3.5
$$ Wed May 29 13:44:19 2019 Russian Standard Time (UT+4h)  she@DPX200
##.OBSERVE FREQUENCY= 81.013821
##.OBSERVE NUCLEUS= ^31P
##.ACQUISITION MODE= SIMULTANEOUS
##.ACQUISITION SCHEME= undefined
##.AVERAGES= 24
##.DIGITISER RES= 17
##SPECTROMETER/DATA SYSTEM= spect
##.PULSE SEQUENCE= zgpg30
##.SOLVENT NAME= DMSO
##.SHIFT REFERENCE= (INTERNAL, DMSO, 0, 182.463)
##AUDIT TRAIL= $$ (NUMBER, WHEN, WHO, WHERE, WHAT)
$$ ##TITLE= Audit trail, XWIN-NMR		Version 3.5
$$ ##JCAMPDX= 5.01
$$ ##ORIGIN= Bruker BioSpin GmbH
$$ ##OWNER= she
$$ F:/spectra/data/she/nmr/P31/1/pdata/1/auditp.txt
$$ ##AUDIT TRAIL=  $$ (NUMBER, WHEN, WHO, WHERE, WHAT)
(   1,<2019-05-29 13:43:00.98 +0400>,<she>,<DPX200>,
      <created by zg, POWCHK disabled, PULCHK disabled
       configuration hash MD5:
       00 E9 B6 7A A2 85 ED C7 34 08 36 98 17 FE 4E 26
       data hash MD5: 32K
       BE F9 A0 06 9D 6E 77 6D 30 58 C5 AD EF 09 A4 93>)
(   2,<2019-05-29 13:43:36.71 +0400>,<she>,<DPX200>,
      <Start of raw data processing
       efp BC_mod = 2 LB = 1 FT_mod = 6 PKNL = 1 PHC0 = -2145.918 PHC1 = -3.800903 SI = 64K 
       data hash MD5: 64K
       36 AD D1 DE 66 53 49 73 03 7E 0C 76 F0 FB AD 4B>)
(   3,<2019-05-29 13:43:53.35 +0400>,<she>,<DPX200>,
      <pk PHC0 = 0.5663407 PHC1 = 0 
       data hash MD5: 64K
       B3 89 3B 79 59 44 AF 0B C3 91 74 CC 27 68 09 6A>)
(   4,<2019-05-29 13:43:56.46 +0400>,<she>,<DPX200>,
      <abs ABSG = 5 
       data hash MD5: 64K
       EE 90 4F B3 28 AC A3 34 39 2D E7 19 02 8F 55 64>)
$$ ##END=
$$ 
$$ hash MD5
$$ 40 00 6D 5E BE CF 51 CB 4E 73 78 C2 18 B5 4E 3B
##$RELAX= 
##$RELAX= 
##$RELAX= 
##$RELAX= 
##$RELAX= 
##$RELAX= 
##$RELAX= 
##$RELAX= 
$$ Bruker specific parameters
$$ --------------------------
##$DU= <F:/spectra>
##$EXPNO= 1
##$NAME= <P31>
##$PROCNO= 1
##$TYPE= <nmr>
##$USER= <she>
##$AMP= (0..31)
100 100 100 100 100 100 100 100 100 100 100 100 100 100 100 100 100 100 
100 100 100 100 100 100 100 100 100 100 100 100 100 100 
##$AQSEQ= 0
##$AQ_mod= 1
##$AUNM= <au_zg>
##$AUTOPOS= <>
##$BF1= 81.014009
##$BF2= 200.13
##$BF3= 200.13
##$BF4= 200.13
##$BF5= 200.13
##$BF6= 200.13
##$BF7= 200.13
##$BF8= 200.13
##$BYTORDA= 1
##$CFDGTYP= 0
##$CFRGTYP= 5
##$CHEMSTR= <none>
##$CNST= (0..31)
1 1 145 1 1 1 1 1 1 1 1 1 1 1 1 1 1 1 1 1 1 1 1 1 1 1 1 1 1 1 1 1 
##$CPDPRG= <waltz16>
##$CPDPRG1= <>
##$CPDPRG2= <waltz16>
##$CPDPRG3= <>
##$CPDPRG4= <mlev>
##$CPDPRG5= <mlev>
##$CPDPRG6= <mlev>
##$CPDPRG7= <mlev>
##$CPDPRG8= <mlev>
##$CPDPRGB= <>
##$CPDPRGT= <>
##$D= (0..31)
0 1 0 0 0 0 0 0 0 0 0 0.03 2e-05 3e-06 0 0 0 0 0 0 0 0 0 0 0 0 0 0 0 0 
0 0 
##$DATE= 1559122980
##$DBL= (0..7)
120 120 120 11 120 120 24 19 
##$DBP= (0..7)
150 150 150 150 150 150 150 150 
##$DBP07= 0
##$DBPNAM0= <>
##$DBPNAM1= <>
##$DBPNAM2= <>
$$ [...]
##$SUBNAM3= <"">
##$SUBNAM4= <"">
##$SUBNAM5= <"">
##$SUBNAM6= <"">
##$SUBNAM7= <"">
##$SUBNAM8= <"">
##$SUBNAM9= <"">
##$SW= 369.568048894756
##$SWIBOX= (0..15)
0 1 3 0 0 0 0 0 0 0 0 0 0 0 0 0 
##$SW_h= 29940.119760479
##$TD= 32768
##$TD0= 1
##$TE= 0
##$TE2= 300
##$TE3= 300
##$TEG= 300
##$TL= (0..7)
0 120 53 12 22 120 120 120 
##$TP= (0..7)
150 150 150 150 150 150 150 150 
##$TP07= 0
##$TPNAME0= <>
##$TPNAME1= <>
##$TPNAME2= <>
##$TPNAME3= <>
##$TPNAME4= <>
##$TPNAME5= <>
##$TPNAME6= <>
##$TPNAME7= <>
##$TPOAL= (0..7)
0.5 0.5 0.5 0.5 0.5 0.5 0.5 0.5 
##$TPOFFS= (0..7)
0 0 0 0 0 0 0 0 
##$TUNHIN= 0
##$TUNHOUT= 0
##$TUNXOUT= 0
##$USERA1= <user>
##$USERA2= <user>
##$USERA3= <user>
##$USERA4= <user>
##$USERA5= <user>
##$V9= 5
##$VALIST= <valist>
##$VCLIST= <CCCCCCCCCCCCCCC>
##$VD= 0
##$VDLIST= <DDDDDDDDDDDDDDD>
##$VPLIST= <PPPPPPPPPPPPPPP>
##$VTLIST= <TTTTTTTTTTTTTTT>
##$WBST= 1024
##$WBSW= 4
##$XGAIN= (0..3)
0 0 0 0 
##$XL= 0
##$YL= 0
##$YMAX_a= 8135
##$YMIN_a= -20951
##$ZGOPTNS= <>
##$ZL1= 120
##$ZL2= 120
##$ZL3= 120
##$ZL4= 120
##$ABSF1= 182.463
##$ABSF2= -187.1042
##$ABSG= 5
##$ABSL= 3
##$ALPHA= 0
##$AQORDER= 0
##$ASSFAC= 0
##$ASSFACI= 0
##$ASSFACX= 0
##$ASSWID= 0
##$AUNMP= <proc_1d>
##$AZFE= 0.1
##$AZFW= 0.5
##$BCFW= 0
##$BC_mod= 2
##$BYTORDP= 0
##$COROFFS= 0
##$CY= -3
##$DATMOD= 1
##$DC= 0
##$DFILT= <>
##$DTYPP= 0
##$F1P= 0
##$F2P= 0
##$FCOR= 1
##$FTSIZE= 65536
##$FT_mod= 6
##$GAMMA= 0
##$GB= 0
##$INTBC= 1
##$INTSCL= 5.30512e-09
##$ISEN= 30
##$LB= 1
##$LEV0= 0
##$LPBIN= 0
##$MAXI= 10000
##$MC2= 0
##$MEAN= 0
##$ME_mod= 0
##$MI= 50
##$NCOEF= 0
##$NC_proc= -8
##$NLEV= 6
##$NOISF1= 182.463
##$NOISF2= 159.3651
##$NSP= 0
##$NTH_PI= 0
##$NZP= 0
##$OFFSET= 182.463
##$PC= 4
##$PHC0= -2145.352
##$PHC1= -3.800903
##$PH_mod= 1
##$PKNL= yes
##$PPARMOD= 0
##$PSCAL= 0
##$PSIGN= 0
##$REVERSE= no
##$SF= 81.0140089999434
##$SI= 65536
##$SIGF1= 159.3651
##$SIGF2= -187.1042
##$SINO= 113.3802
##$SIOLD= 16384
##$SREGLST= <1H.CDCl3>
##$SSB= 0
##$STSI= 65536
##$STSR= 0
##$SW_p= 29940.119760479
##$SYMM= 0
##$S_DEV= 0
##$TDeff= 32768
##$TDoff= 0
##$TI= <>
##$TILT= no
##$TM1= 0
##$TM2= 0
##$TOPLEV= 0
##$USERP1= <user>
##$USERP2= <user>
##$USERP3= <user>
##$USERP4= <user>
##$USERP5= <user>
##$WDW= 1
##$XDIM= 65536
##$YMAX_p= 421097844
##$YMIN_p= -97266597
$$ End of Bruker specific parameters
$$ ---------------------------------
##NTUPLES= NMR SPECTRUM
##VAR_NAME=  FREQUENCY,     SPECTRUM/REAL,   SPECTRUM/IMAG
##SYMBOL=    X,             R,               I
##VAR_TYPE=  INDEPENDENT,   DEPENDENT,       DEPENDENT
##VAR_FORM=  AFFN,          ASDF,            ASDF
##VAR_DIM=   65536,         65536,           65536
##UNITS=     HZ,            ARBITRARY UNITS, ARBITRARY UNITS
##FACTOR=    0.456856943014862, 1,           1
##FIRST=     14782.0589164792, 0,            0
##LAST=      -15158.0608439998, 0,           0
##MIN=       -15158.0608439998, -97266597,   0
##MAX=       14782.0589164792, 421097844,    0
$$ Real data points
##PAGE= N=1
##DATA TABLE= (X++(R..R)), XYDATA
$$ [...]
44993A8277609J616931m943197n623044l95508L093668n51888o803611p110207
$$ 18277609 19894540 14951343 9328299 8932791 12026459 11474571 4670960 -2439247
44985b439247K08703Q527662J0639232N157002l194280p463651m299127K390224
$$ -2439247 -2230544 6297118 16936350 22093352 18899072 11435421 7136294 9526518
44977I526518N432239K908223m55347j273462j890195m209348m916079j762978
$$ 9526518 14958757 17866980 17411633 16138171 14247976 10038628 5122549 3359571
44969C359571O14954k020415m638294K9835Q125005Q557212L40823m898945q10849
$$ 3359571 3974525 1954110 -2684184 -2654349 5470656 14027868 14368691 9469746 8658897
44960H658897M022099N36485o122566n614094O24164K516059j949766m683240
$$ 8658897 12680996 13217481 7094915 1480821 2104985 4621044 2671278 -2011962
44952b011962j789097J074320k84059k050889o94144Q06349p2970K02193L980171
$$ -2011962 -3801059 -2726739 -3010798 -5061687 -5755831 -4949482 -5022452 -4820259 -840088
44943h40088O280620K724967k100911j809089J107786K13655l160737k675678
$$ -840088 5440532 8165499 6064588 4255499 5363285 5576940 2416203 -259475
44935b59475J035219J470151j477143j187769K811884K873386k744630m968456
$$ -259475 775744 2245895 768752 -419017 2392867 5266253 2521623 -2446833
44927b446833J295374P457679M269255l514167m909515O29036M471708L250528
$$ -2446833 -1151459 6306220 10575475 7061308 2151793 2780829 7252537 10503065
44919A0503065J677895K002455M72010m346529p826442o479801k817235l82655
$$ 10503065 12180960 14183415 14655425 10308896 2482454 -3997347 -6814582 -7197237
44911g197237J121129L026371M017226K274140j077977k985404j777326J392306
$$ -7197237 -6076108 -3049737 967489 3241629 2163652 -821752 -2599078 -1206772
44903a206772L376250J623892k571924m425940j321360L299899M399567K008141
$$ -1206772 2169478 3793370 1221446 -3204494 -4525854 -1225955 3173612 5181753
44895E181753j01048p71929j916518l370299k360024J378932M394101M410034
$$ 5181753 5080705 4308776 2392258 -978041 -3338065 -1959133 2434968 6845002
44887F845002K769402J277197P3807q15288j118179j669319k834615k221064J840226
$$ 6845002 9614404 10891601 10965408 10150120 9031941 7362622 4528007 2306943 4147169
44878D147169N408599L134471k752693m232260N23969L938477N50828m996683
$$ 4147169 9555768 12690239 9937546 5705286 6229255 10167732 10718560 5721877
44870E721877n786371k653584j033864k162692l118471k645630j535401O90674
$$ 5721877 -64494 -2718078 -3751942 -5914634 -9033105 -11678735 -13214136 -12523462
44862a2523462M478082P129729N639162J710560j48745J043188J932703J4948
$$ -12523462 -8045380 -915651 4723511 6434071 6285326 7328514 9261217 9276165
44854I276165l455993n642058m901293j656154J874985L404329K957334K198869
$$ 9276165 5820172 178114 -4723179 -6379333 -4504348 -1100019 1857315 4056184
44846D056184J057251k141087o287840p141156l434043N74748J268360K92542
$$ 4056184 5113435 2972348 -3315492 -10456648 -13890691 -13315943 -12047583 -11755041
44838a1755041L1861o74920k127212l63088N795399R048509K857159o811792p937227
$$ -11755041 -11723180 -12398100 -14525312 -14888400 -9093001 -44492 2812667 -3999125 -11936352
44829a1936352O24489P861599O658104J837852j20572m43883k499333m118901
$$ -11936352 -11311863 -3450264 3207840 5045692 4925120 4481237 1981904 -2136997
44821b136997j679778K749905M334357K774539J540790J709785J315729j31299
$$ -2136997 -3816775 -1066870 3267487 6042026 7582816 9292601 10608330 10477031
44813A0477031p76167j28877k68166k510507m975957m529947m61984M233851N371464
$$ 10477031 9700864 9571987 9303821 6793314 1817357 -2712590 -3174574 1059277 6430741
44804F430741J729306l530876o229492n306828k518218P41345L872904N059422
$$ 6430741 8160047 4629171 -1600321 -6907149 -9425367 -8684022 -4811118 248304
44796B48304K308739k600151m252547K60869O927771Q538009K555473n816579
$$ 248304 2557043 -43108 -4295655 -4034786 2892985 11430994 13986467 8169888
44788H169888q903956m996204o15268k525721q084901p619164K170432J2271463
$$ 8169888 -734068 -5730272 -6345540 -8871261 -16956162 -24575326 -22404894 -10133431
44780a0133431J2831332N888701N60624o79727k681683o353900o289179r35459
$$ -10133431 2697901 8586602 9147226 8467499 5785816 -568084 -6857263 -7792722
44772g792722L589558K938150M15811j80272q10357l908725o802946o274218l800087
$$ -7792722 -4203164 -1265014 -849203 -1029475 -1839832 -5748557 -12551503 -18825721 -22625808
44763b2625808j660767J552076O821620J0400451Q602125L502602l82280j736779
$$ -22625808 -24286575 -22734499 -15912879 -5512428 3089697 6592299 6210019 4473240
44755D473240j314807N16312J581502j464617o207042m556336M704311J0531689
$$ 4473240 3158433 3674745 5256247 3791630 -2415412 -6971748 -2267437 8264252
44747H264252M615128m818625m363904M307152P507929O13910o489077n816390
$$ 8264252 12879380 8060755 3696851 8004003 15511932 16125842 9636765 3820375
44739C820375j463668j19554j076122l26634K410476M979963N931008L688841
$$ 3820375 2356707 2237153 1161031 834397 3244873 8224836 14155844 17844685
44731A7844685k438710q629711r144998m010801J079741L108203L853111L453816
$$ 17844685 15405975 6776264 -2368734 -6379535 -5299794 -2191591 1661520 5115336
44723E115336m11526n557443n794567q70894K335794J416776K170719O676096
$$ 5115336 4703810 -853633 -6648200 -7519094 -5183300 -3766524 -1595805 5080291
44715E080291P424550j26532q011410p011971k61962L185851K201538J548001
$$ 5080291 12504841 12378309 4366899 -2645072 -2907034 278817 2480355 4028356
44707D028356J291208j315064l065750J065027O908208N227263l282759p815290
$$ 4028356 5319564 4004500 938750 2003777 8911985 14139248 10856489 3041199
44699C041199l751248J091184k10838l472817j923345K433506K902115q47853
$$ 3041199 -710049 381135 170297 -3302520 -5225865 -2792359 109756 -738097
44691g38097k793714j03532L185314K668964l73761j616717m01279o62819m292071
$$ -738097 -3531811 -3635343 -450029 2218935 1845174 228457 -172822 -835641 -5127712
44682e127712o470257j454940P872464J1692323O143315j098550j846442J374680
$$ -5127712 -11597969 -13052909 -5180445 6511878 12655193 11556643 9710201 11084881
44674A1084881Q71206l831811o605446n259838l482236k913384j029739K428866
$$ 11084881 11956087 8124276 1518830 -3741008 -7223244 -10136628 -11166367 -8737501
44666h737501M021680K933604K290333K738034J206642k095794k165329K577913
$$ -8737501 -4715821 -1782217 508116 3246150 4452792 2356998 191669 2769582
44658B769582O859757O561875M058989K009785j534465o735308p177442J066025
$$ 2769582 9629339 16191214 20250203 22259988 20725523 13990215 6812773 7878798
44650G878798R963040P803926m481546j3442859j0305944r49673L810749J997601
$$ 7878798 17841838 25645764 21164218 7721359 -2584585 -3534258 276491 2274092
44642B274092p8827J146976J813244k251859p869414p545947N23198R061270J0048592
$$ 2274092 2195265 3342241 5155485 2903626 -4965788 -12511735 -11988537 -2927267 7121325
44633G121325M010859j780873k698169o12320J058778J808087K359723K075126
$$ 7121325 11132184 9351311 6653142 6040822 7099600 8907687 11267410 13342536
44625A3342536J73898k472549m344785m740390l627790j609732k05874l78307
$$ 13342536 13516434 11043885 6699100 1958710 -1669080 -3278812 -3484686 -3862993
44617c862993r57960m82253K39185j11550n53106k90111j923245o790510q859812
$$ -3862993 -4820953 -5303206 -5064021 -5175571 -5728677 -6018788 -7942033 -14732543 -23592355
44608b3592355j044425J1899366J5533830M204410j0303215j3509916n271066
$$ -23592355 -24636780 -12737414 2796416 7000826 -3302389 -16812305 -22083371
44601b2083371L627472O391179M941346L339399L258443M494922N127533K617797
$$ -22083371 -18455899 -12064720 -7123374 -3783975 -525532 3969390 9096923 11714720
44593A1714720j941576l525207n00231J666061j594635o280605n473616P90317
$$ 11714720 9773144 6247937 5747706 7413767 5819132 -461473 -5935089 -5144772
44585e144772O807126R098953P374554J133156p972512j3083440q663022J216404
$$ -5144772 1662354 10761307 18135861 19269017 11296505 -1786935 -10449957 -9233553
44577i233553P250001O089312J607387k473215m700097l158255J994843N078689
$$ -9233553 -1983552 4105760 5713147 3239932 -1460165 -4618420 -2623577 2455112
44569B455112J355071m827087n845054k414976p69201p31592K750286P385824
$$ 2455112 3810183 -1016904 -6861958 -9276934 -10046135 -10777727 -8027441 -641617
44561f41617N110033k918698n374984J583231P381425L107421n755545q983192
$$ -641617 4468416 1549718 -3825266 -2242035 5139390 8246811 2491266 -6491926
44553f491926n160385Q56930O026775Q160047M311856l242538o266042k044779
$$ -6491926 -11652311 -10795381 -4768606 3391441 7703297 4460759 -1805283 -3850062
44545c850062J500432j459709m821491j312416M713339M872613P02003m47480
$$ -3850062 -2349630 -3809339 -8630830 -9943246 -5229907 -357294 344709 -102771
44537a02771J578374J577417n2276R08025K616359m654m514333l974079M40670
$$ -102771 1475603 3053020 3000744 3908769 6525128 6520474 2006141 -1967938 -1527268
44528a527268R46448l048152m066543l29225J323128j278699j148142M439630
$$ -1527268 -580820 -3628972 -7695515 -8024740 -6701612 -7980311 -9128453 -4688823
44520d688823O938725q7278r191278q901816L33417Q001705P851155L277903J01469
$$ -4688823 2249902 2162624 -7028654 -15930470 -15597053 -7595348 255807 3533710 3635179
44511C635179j45521K56446j192478m334272n908034l172722J780021M005946
$$ 3635179 3489658 3746104 2553626 -1780646 -7688680 -10861402 -9081381 -5075435
44503e075435K295448J16130n72422j714780l807511l301295J601661O761985
$$ -5075435 -2779987 -2663857 -3236279 -4951059 -8758570 -12059865 -10458204 -3696219
44495c696219P185270L176489j369840l729611k981336O31916M311621M074506
$$ -3696219 3489051 6665540 5295700 1566089 -1415247 -783331 3528290 7602796
44487G602796O5711l013500k961469k990233m768452m115661J672320P303975
$$ 7602796 7668507 4655007 1693538 -1296695 -6065147 -10180808 -8508488 -1204513
44479a204513O457985J413398r91315o1439n16881k810001k180373K317116N200812
$$ -1204513 5253472 6666870 5675555 5614116 5097235 2287234 106861 2423977 7624789
44470G624789K868360j374360k962812k074725j630363l049035n922769q540813
$$ 7624789 10493149 9118789 6155977 4081252 2450889 -598146 -6520915 -15061728
44462a5061728p383717o8457R311807J1975636M659346n158960p638488j856332
$$ -15061728 -22445445 -22513902 -13202095 -1226459 3432887 -1726073 -9364561 -11220893
44454a1220893M652383N780876K481099p98479j600630n58166O36837J082810
$$ -11220893 -6568510 -787634 1693465 894986 -705644 -1263810 -626973 455837
44446D55837J278348K272919L825693L975657J473462j939197l254924k085930
$$ 455837 1734185 4007104 7832797 11808454 13281916 11342719 8087795 6001865
44438F001865j000413j516306j824365p8577J743375J47056l994681n232780o96796
$$ 6001865 5001452 3485146 1660781 1582204 3325579 3472635 -522046 -5754826 -6451622
44429f451622N327029O595954K756186j240583k237777j423506k43458J583243
$$ -6451622 -1124593 5471361 8227547 6986964 4749187 3325681 3082223 4665466
44421D665466L058893J593553k142255l265463M30013M366516L548006l69980
$$ 4665466 7724359 9317912 7175657 3910194 4340207 8706723 12254729 11884749
44413A1884749k624964k886449m032764n567891m155362O3133L215741L538022
$$ 11884749 9259785 6373336 2340572 -3227319 -7382681 -7319548 -4103807 -565785
44405e65785K336934k69459m560140o461478j057531P788086R439006J571368
$$ -565785 1771149 1501690 -3058450 -9519928 -10577459 -2789373 6649633 8221001
44397H221001m753628p50067O642549N067969m760869j0688089o797127O94828
$$ 8221001 3467373 2717306 9359855 14427824 9666955 -1021134 -7818261 -7123433
44389g123433N300312P885711R611122O590267k490140j0071771q380205p48253
$$ -7123433 -1823121 6062590 15673712 22263979 19773839 9702068 1321863 573610
44381E73610K784496o13470m056631k414475N70692o68313m524816m863360l75483
$$ 573610 3358106 2744636 -1311995 -3726470 -3155778 -3824091 -8348907 -13212267 -13587750
44372a3587750L428110J953317k163792k522605K567916P365919N212235l245365
$$ -13587750 -10159640 -8206323 -10370115 -12892720 -10324804 -2958885 2253350 -992015
44364i92015r901858p855482Q09731P309623N966682j12801l850739k647896J53064
$$ -992015 -10893873 -18749355 -17939624 -10630001 -4663319 -4776120 -8626859 -11274755 -11121691
44355a1121691J128899Q43845J322115K349783K367225J223600k84548k250280
$$ -11121691 -9992792 -9148947 -7826832 -5477049 -3109824 -1886224 -2170772 -4421052
44347d421052m366694l957455J094094P490290Q581435K709989l849816m400753
$$ -4421052 -8787746 -12745201 -11651107 -4160817 4420618 7130607 3280791 -1119962
44339a119962M70115N027626N606102K742415j614050n268033n448434j238034
$$ -1119962 -649847 4377779 9983881 12726296 11112246 5844213 395779 -842255
44331h42255L877729N127302K095585j406321k535280j510279O41382K759185
$$ -842255 3035474 8162776 10258361 8852040 6316760 4806481 5447863 8207048
44323H207048K571519p74090l576730j807527J646290m4254o491768q944453l183697
$$ 8207048 10778567 10004477 6427747 4620220 6266510 6222256 -269512 -9213965 -12397662
44314a2397662L573306L572923k07493m38879K313402K195683n06099K6040M099590
$$ -12397662 -8824356 -5251433 -5458926 -5897805 -3584403 -1388720 -1894819 -1868779 2230811
44305B230811N253384R87483l471794m064328k985707k269692L26291N116918
$$ 2230811 7484195 8471678 4999884 935556 -2050151 -4319843 -3993552 1123366
44297A123366O774908J921728m606340o284140l685121j683664j377607k39201
$$ 1123366 7898274 9820002 5213662 -1070478 -4755599 -6439263 -7816870 -8056071
44289h056071K092696L439614L135185K079317j5438l497313o117845n252714
$$ -8056071 -5963375 -2523761 611424 2690741 2675303 -822010 -6939855 -12192569
44281a2192569j788725J400360L455954M824253M388899J184748k348872k714219
$$ -12192569 -13981294 -12580934 -9124980 -4300727 88172 1272920 -1075952 -3790171
44273c790171j29599K318677L118894K715884J021361j854261l778143l000543
$$ -3790171 -3919770 -1601093 1517801 4233685 5255046 3400785 -377358 -3377901
44265c377901r24088N54598J961637L164396J322496l113368l081468M906831
$$ -3377901 -4301989 -3747391 -1785754 1378642 2701138 -412230 -3493698 1413133
44257A413133J1471122N460053p851322j1809645k393890N805262J812816o171442
$$ 1413133 12884255 18344308 10492986 -1316659 -3710549 2094713 3907529 -2263913
44249b263913n383531J854456L999406j029861m917286l605612j657930k055255
$$ -2263913 -7647444 -5792988 -1793582 -2823443 -7740729 -11346341 -13004271 -15059526
44241a5059526j327753K874955O636774N581504J229586j555117p82420J438893
$$ -15059526 -16387279 -13512324 -6875550 -1294046 -64460 -1619577 -2401997 -963104
44233i63104K604377K928130M298668O307352N030623j672502q850160r216303
$$ -963104 1641273 4569403 8868071 15175423 20206046 18533544 9683384 467081
44225D67081l554878l62098l162498n192280q65716M722132M413941P45886L63108
$$ 467081 -3087797 -3449895 -6612393 -11804673 -12670389 -7948257 -3534316 -2788430 -2425322
44216b425322J563791k085804q329051p946058r4060N325110L164007M49826L737387
$$ -2425322 -861531 -2947335 -11276386 -19222444 -19316504 -13991394 -10827387 -10377561 -6640174
44207f640174Q325024O773475J145959j102275Q95750J396880j861004m540697
$$ -6640174 1684850 8458325 9604284 8502009 9397759 10794639 8933635 4392938
44199D392938k969428O74563J906407l63456l109475k849987O70861M051448L594384
$$ 4392938 1423510 2098073 4004480 3641024 531549 -2318438 -1647577 2403871 5998255
44190E998255p43873n175603n682980j346151M934930Q033113M568785k810291
$$ 5998255 5254382 78779 -5604201 -6950352 -2015422 6017691 10586476 7776185
44182G776185o995901m693721o10184j0425p15465J561473L247378k533814j2075094
$$ 7776185 780284 -3913437 -4523621 -4534046 -5249511 -3688038 -440660 -2974474 -15049568
44173a5049568j2712981j545541Q069804N286859k077106K76000J1082437J5360627
$$ -15049568 -27762549 -29308090 -21238286 -15951427 -18028533 -17752533 -6670096 8690531
44165H690531O351849n764018r054119m512281j069720k272299l862762k041427
$$ 8690531 15042380 9278362 224243 -4288038 -5357758 -7630057 -11492819 -13534246
44157a3534246J201968J680562q70595k317361J11905L251291J680304l970958
$$ -13534246 -12332278 -10651716 -11522311 -13839672 -13727767 -10476476 -8796172 -12767130
44149a2767130o119718j59205P923067Q418090R66102m701340j923636M234195
$$ -12767130 -18886848 -19046053 -11122986 -2704896 -1738794 -6440134 -8363770 -4129575
44141d129575M718319q44436m343508j177648L466467K619503k423964m752833
$$ -4129575 588744 -255692 -4599200 -5776848 -2310381 309122 -2114842 -6867675
44133f867675k493772o87191j934710j883976K407382N662576K118785m182312
$$ -6867675 -9361447 -10048638 -11983348 -13867324 -11459942 -5797366 -3678581 -7860893
44125g860893m497727J503938N901159M897858K418407J031799j368112l814606
$$ -7860893 -12358620 -10854682 -4953523 -55665 2362742 3394541 2026429 -1788177
44117a788177r18609O624918R340227K561871n439963n667065j147671L87701
$$ -1788177 -2706786 3918132 13258359 15820230 10380267 4713202 3565531 3953232
44109C953232m42745J462385M172730J838515l681454m798485n75135K463575
$$ 3953232 3510487 4972872 9145602 10984117 7302663 2504178 1929043 4392618
44101D392618J503129M14034J271693J358957m56714j925323k762522m615070
$$ 4392618 5895747 6309781 7581474 8940431 8483717 6558394 3795872 -819198
44093h19198n360924j152032N187133N887274k23057n712651n639856k697956
$$ -819198 -6180122 -7332154 -2145021 3742253 3519196 -2193455 -7833311 -10531267
44085a0531267L25556M333986P446655M176042m350824q143155k203207N187288
$$ -10531267 -10205711 -5871725 1574930 5750972 1400148 -6743007 -8946214 -3758926
44077c758926M713404n54635j738260J837904M003486K977205K197792K135062
$$ -3758926 954478 399843 -1338417 499487 4502973 7480178 9677970 11813032
44069A1813032j79444m091354n384154l714010l347092n550206o165454k430818
$$ 11813032 11633588 7542234 2158080 -1555930 -4903022 -10453228 -16618682 -19049500
44061a9049500K708429N221555N100142M604203M255101K903801J65206k991869
$$ -19049500 -16341071 -11119516 -6019374 -1415171 2839930 5743731 5908937 2917068
44053B917068n211027n327713k934701O02193K355826M47446l198949l887458
$$ 2917068 -2293959 -7621672 -10556373 -9954180 -7598354 -7150908 -10349857 -14237315
44045a4237315O28194O477225P543884L293518m70642n5031J088679r45043l272736
$$ -14237315 -13609121 -7131896 411988 3705506 3234864 3179833 4268512 3323469 50733
44036E0733j358310K197103J636370j230513O65117O659305P508264p5349p485074
$$ 50733 -1307577 889526 2525896 1295383 1960500 8619805 16128069 16052720 8567646
44027H567646p092682k516485n51637o72479N85294J381095j377927m437324k492728
$$ 8567646 1474964 -1041521 -1593158 -2265637 -1680343 -299248 -1677175 -6114499 -8607227
44018h607227K990531O162698N505429L965055K692271N62727j849624k950963
$$ -8607227 -5616696 546002 6051431 10016486 12708757 13271484 11421860 8470897
44010H470897l161739l423681l200638l012979m725917o045243j008373Q998477
$$ 8470897 5309158 1885477 -1315161 -4328140 -9054057 -15099300 -16107673 -7109196
44002g109196J2149530J927778j0707908j0762319K08321P684646M818645j674140
$$ -7109196 5040334 6968112 -3739796 -14502115 -14293794 -6609148 -1790503 -3464643
43994c464643m179392j792472L722309R313749Q886552J79351p903392n393496
$$ -3464643 -7644035 -9436507 -5714198 3599551 12486103 12665454 4762062 -631434
43986f31434L037410M530070j343949k878302K478092L596598l574892p307633
$$ -631434 2405976 6936046 5592097 2713795 5191887 8788485 5213593 -2094040
43978b094040N0227Q250891N611144k786967n014035p71539K187218K579603M153571
$$ -2094040 -2043813 6207078 11818222 9031255 4017220 3245681 5432899 8012502 12166073
43969A2166073N041111N65888o455855q815163o119890l631409k176510J520478
$$ 12166073 17207184 17773072 11317217 2502054 -3617836 -7249245 -9425755 -7905277
43961g905277O007887N848790J087311k041796m44199K415936K933570J487664
$$ -7905277 -1897390 3951400 5038711 2996915 2552716 4968652 7902222 9389886
43953I389886k78561j484519j158126P04106J675425j72703l136173m655126m944809
$$ 9389886 9111325 7626806 6468680 7172786 8848211 8675508 5539335 884209 -4060600
43944d060600m696800k372730K282910N444421M303816J606481Q78857J161670
$$ -4060600 -8757400 -11130130 -8847220 -3402799 901017 2507498 3386355 4548025
43936D548025Q86575J825676L728706J083636p456538j2398575n421093O757906
$$ 4548025 5434600 7260276 10988982 12072618 4616080 -7782495 -13203588 -6445682
43928f445682J0798947N285426k6995m30755K01350K67850K105487L055827k297978
$$ -6445682 4353265 9638691 9611696 9180941 9382291 9650141 11755628 14811455 12513477
43919A2513477j0036927r995526k706275L75805l450643l185114N454169J0098623
$$ 12513477 2476550 -7518976 -10225251 -9849446 -13300089 -16485203 -11031034 -932411
43911i32411J880499q149550n609999M744609P758995J864366j262600K413858
$$ -932411 948088 -7201462 -12811461 -8066852 -307857 1556509 293909 2707767
43903B707767M172869j072170o627930n777074j457446L95959k66869j22193J229936
$$ 2707767 6880636 5808466 -819464 -6596538 -8053984 -7658025 -7924894 -8047087 -6817151
43894f817151J806735J155737O96556J687411M031749N739680L961809j254548
$$ -6817151 -5010416 -3854679 -3158123 -1470712 2561037 8300717 12262526 11007978
43886A1007978n260283l992503N8403R23370k265295m217475j622984K025407
$$ 11007978 5747695 1755192 1813595 2736965 471670 -3745805 -5368789 -3343382
43878c343382J672930k436137n541934m217403N62751N278800P255810O263993
$$ -3343382 -1670452 -4106589 -9648523 -13865926 -13303175 -8024375 -768565 5495428
43870E495428L506960j47010l939398n691765l039013K631496N987344L757373
$$ 5495428 9002388 8855378 4915980 -775785 -3814798 -1183302 4804042 8561415
43862H561415r71264k919822j219481J074657K257496K964497K940727J095054
$$ 8561415 7590151 4670329 3450848 4525505 6783001 9747498 12688225 13783279
43854A3783279j182754q56616J789310K766355L21932k262885j930611q24125
$$ 13783279 12600525 11743909 13533219 16299574 16621506 14358621 12428010 11603885
43846A1603885k898987p384457r114440n181872J485937N720703N197230J183259
$$ 11603885 8704898 1320441 -7793999 -12975871 -11489934 -5769231 -572001 611258
43838F11258l682745o614815n148996Q46932P447230R255791M701952k646038
$$ 611258 -3071487 -9686302 -14835298 -13988366 -6541136 2714655 7416607 4770569
43830D770569q264901r931443o681704J289425R419242J0034763J594409o596321
$$ 4770569 -3494332 -13425775 -20107479 -18818054 -9398812 635951 2230360 -4365961
43822d365961m863255L838529Q203540M335757j062373l181636m892664p339321
$$ -4365961 -9229216 -5390687 2812853 7148610 6086237 2904601 -1988063 -9327384
43814i327384n045656L530991R411946N355030k113185k332360L065261M023684
$$ -9327384 -14373040 -10842049 -1430103 3924927 1811742 -520618 2544643 6568327
43806F568327q70868k957282J097394L964935M07369m550253m720709j986408
$$ 6568327 5697459 2740177 3837571 7802506 8209875 3659622 -1061087 -3047495
43798c047495q67007k30402L035190O333648M358916j836733m978778j316934
$$ -3047495 -3914502 -4144904 -1109714 5223934 9582850 7746117 2767339 1450405
43790A450405M331881N058879M89524l625501l313746p82186J54969J49287K305636
$$ 1450405 5782286 10841165 11330689 7705188 4391442 3609256 3764225 3913512 6219148
43781F219148N575091N358260J211430j919738k161372l675084p347447o310108
$$ 6219148 11794239 17152499 18363929 16444191 14282819 10607735 3260288 -3049820
43773c049820K230434Q157625J975163q275888o940424M793672R529492L03856
$$ -3049820 -819386 7338239 9313402 1037514 -5902910 -1109238 8420254 8724110
43765H724110r101034o440826R28047L94197n066263l599969M962622R138355
$$ 8724110 -376924 -6817750 -5889703 -5495506 -10561769 -14161738 -9199116 -60761
43757f0761L966882l007356m333563j415518J107638K039049K141250J388395
$$ -60761 3906121 898765 -3434798 -4850316 -3742678 -1703629 437621 1826016
43749A826016J7399j010717j519160j632269m37581K183768L910133L147891J588654
$$ 1826016 1843415 832698 -686462 -2318731 -2756312 -572544 3337589 6485480 8074134
43740H074134K53893l605775j0787076j4947802r957433l3251N071561L654876
$$ 8074134 8328027 4722252 -6064824 -21012626 -30970059 -31003310 -25931749 -22276873
43732b2276873K676451N231911O580359M232044K782642M903053N651435J131508
$$ -22276873 -19600422 -14368511 -7788152 -3556108 -773466 4129587 9781022 10912530
43724A0912530l843360l157173M73902k04188n407755p880618l375494L841487
$$ 10912530 7069170 3911997 4385899 4181711 -1226044 -9106662 -12482156 -8640669
43716h640669O551152K301900m686516p284821j842192P378163J1585187P236187
$$ -8640669 -2089517 212383 -4474133 -11758954 -13601146 -6222983 5362204 12598391
43708A2598391M03312j153810K158874L674222M74241l458991m158021k873185
$$ 12598391 13001703 11847893 14006767 17680989 18155230 14696239 10538218 7665033
43700G665033k469993k330598l7675L621144M730748J555938k709405l889763
$$ 7665033 5195040 2864442 2826767 6447911 11178659 12734597 10025192 6135429
43692F135429k116741j067703k252351k797633j98453L287742L694272J064014
$$ 6135429 4018688 2950985 698634 -2098999 -2297452 990290 4684562 5748576
43684E748576j305533k181348k720845j981955K415537P927799P365588r62814
$$ 5748576 4443043 2261695 -459150 -2441105 -25568 7902231 15267819 14305005
43676A4305005q485390o833482O66823L995074N21850k796129q46223L007947
$$ 14305005 5819615 -1013867 -347044 3648030 4169880 1373751 527528 3535475
43668C535475L487468Q04233j525227k038339j220323P53006K829679K115222
$$ 3535475 7022943 7827176 6301949 4263610 3043287 3796293 6625972 8741194
43660H741194k448895p102682p252702l315564M92516K157159L058449L518403
$$ 8741194 6292299 -810383 -8063085 -11378649 -10886133 -8728974 -5670525 -2152122
43652b152122J438074l092749n422221j764400M693567O651053J799907l901759
$$ -2152122 -714048 -3806797 -9229018 -10993418 -6299851 351202 2151109 -1750650
43644a750650l504070K394392O642751M271823k253151o770921n995448j137507
$$ -1750650 -5254720 -2860328 3782423 8054246 5801095 -969826 -6965274 -8102781
43636h102781M806541Q901236Q525909K884513n135400j0653072j1131600p751107
$$ -8102781 -3296240 5604996 14130905 17015418 11880018 1226946 -9904654 -17655761
43628a7655761k615921K932818O614337N121815j533021p533714o651280M8230
$$ -17655761 -20271682 -17338864 -10724527 -5602712 -7135733 -14669447 -21320727 -21272497
43620b1272497M851475K474111l802907o332497j878298N410505R205159P639392
$$ -21272497 -16421022 -13946911 -17749818 -24082315 -25960613 -20550108 -11344949 -3705557
43612c705557M200126K685641K669926J075666k536342m707321k966480M41539
$$ -3705557 494569 3180210 5850136 6925802 4389460 -317861 -3284341 -2842802
43604b842802J771147Q11059m811O0537O9191P03708L260011N523930L473601
$$ -2842802 -1071655 -260596 -265407 -204870 -135679 568029 3828040 9351970 12825571
43595A2825571j997730n046980l349781j333335k125030k080263J818128M574967
$$ 12825571 10827841 5780861 2431080 1097745 -1027285 -3107548 -1289420 3285547
43587C285547M75631n833896m377979M943002J1102104P377415j43205k783914
$$ 3285547 3761178 -2072718 -6450697 -1507695 9594409 16971824 16828619 14044705
43579A4044705r33260o03266l546025o308015o100304k952266J950274O420188
$$ 14044705 13111445 12508179 8962154 2654139 -3446165 -6398431 -4448157 1972031
43571A972031P568008M809190P42905k699161n828390p304447l742463L375852
$$ 1972031 9540039 14349229 15092134 12392973 6564583 -739864 -4482327 -1106475
43563a106475O042513M97640n394990k725600M625263N544526j362782o408110
$$ -1106475 4936038 5433678 38688 -2686912 1938351 7482877 6120095 -288015
43555b88015m317475p69248r93295j524595J781905N375037L927605q99002l768722
$$ -288015 -4605490 -5374738 -6368033 -7892628 -6110723 -735686 3191919 2292917 -1475805
43546a475805l628360k598750m42173L838004P288950N789727L32297m363618
$$ -1475805 -5104165 -7702915 -8145088 -4307084 2981866 8771593 9103890 4740272
43538D740272o332611o871140n912895k113139K791711M703738K789112K74349
$$ 4740272 -1592339 -8463479 -14376374 -16489513 -13697802 -8994064 -6204952 -5930603
43530e930603q15835j677566k856859k578535m29774R90380J66679n63186J314915
$$ -5930603 -6746438 -8424004 -11280863 -13859398 -14289172 -13298792 -13132113 -13695299 -12380384
43521a2380384M282337M769824K035892j171661k223534j118553M65452J336677
$$ -12380384 -8098047 -3328223 -1292331 -2463992 -4687526 -5806079 -5340627 -4003950
43513d003950J641910J969892K051711J047969n52995n54480J985798M371604
$$ -4003950 -2362040 -392148 1659563 2707532 2154537 1600057 3585855 7957459
43505G957459L209850l93524j453967J917978M825529J494878o429741j0815401
$$ 7957459 11167309 10773785 9319818 11237796 16063325 17558203 11128462 313061
43497C13061o896416O06696L495269O66965q95029L618900R401649Q321133N85192
$$ 313061 -6583355 -5976659 -2481390 -1814425 -2709454 909446 10311095 18632228 19217420
43488A9217420n015498l122291J106491J3749n424848p444240k787189L204087
$$ 19217420 14201922 11079631 12186122 12199871 6775023 -669217 -3456406 -252319
43480b52319M435546J561770n23324K20692J268635r3883l032484m229927j778938
$$ -252319 4183227 5744997 5221673 5442365 6711000 6617117 3584633 -645294 -2424232
43471b424232K569335N194584M417620J788101n67161k565118n138246p701909
$$ -2424232 145103 5339687 9757307 11545408 10978247 8413129 3274883 -4427026
43463d427026q189723n284327K31426N633553P293855L440732k676897m547294
$$ -4427026 -12616749 -17901076 -17669650 -12036097 -4742242 -1301510 -3978407 -8525701
43455h525701J53925N631971M737803j544157n236117j713034N088970Q471623
$$ -8525701 -8371776 -2739805 1997998 453841 -4782276 -6495310 -1406340 7065283
43447G065283O291745J120168l691321o052904n414151l029168r64629K3803O33082
$$ 7065283 13357028 14477196 10785875 4732971 -681180 -3710348 -4674977 -4651174 -4018092
43438d018092J130873J132214J089361J716778K054604P74622p35789J04625K295642
$$ -4018092 -2887219 -1755005 -665644 1051134 3105738 3880360 3144571 3249196 5544838
43429E544838J838404k111989n641537n792352l710317o80539M030312Q842408
$$ 5544838 7383242 5271253 -370284 -6162636 -9872953 -10553492 -6523180 2319228
43421B319228Q595794J771467n275667o087601k593567p39667r50431P76378M281811
$$ 2319228 10915022 12686489 7410822 1323221 -1270346 -2010013 -2960444 -2184066 2097745
43412B097745M673664L86547m053713m297239p43785L673858O149039M323940
$$ 2097745 6771409 7157956 3104243 -1192996 -1936781 1737077 7886116 12210056
43404A2210056j584643o677180o010142j812943j061223m913515o205137Q9557
$$ 12210056 10625413 3948233 -2061909 -3874852 -4936075 -9849590 -16054727 -15965170
43396a5965170Q969825J1649369O194521j621745n632790m356964n78976J622294
$$ -15965170 -6995345 4654024 10848545 9226800 3594010 -762954 -1341930 280364
43388B80364N85047j070479O870K553353K465572K02084J010062N617407O740364
$$ 280364 865411 -205068 -198198 2355155 4820727 5022811 6032873 11650280 18390644
43379A8390644n01958r670215j0757323l737327K315529K072227q53549j567199
$$ 18390644 17888686 8218471 -2538852 -6276179 -3960650 -1888423 -2741972 -4309171
43371d309171m03411o2126j003394j956563j973025m47718K504651M903619M464311
$$ -4309171 -4712582 -4774708 -5778102 -7734665 -9707690 -10155408 -7650757 -2747138 1717173
43362A717173J671897r56857k373071l026488k227269O56078K845329Q71243k936074
$$ 1717173 3389070 2432213 59142 -2967346 -5194615 -4538537 -1693208 -821965 -3758039
43353c758039k276766L030008M824554j660626r192827p667710J412606O674793
$$ -3758039 -6034805 -3004797 1819757 159131 -9033696 -16701406 -15288800 -8614007
43345h614007K471813m261966m818795m98494J074239j856964k852634K317103
$$ -8614007 -6142194 -10404160 -15222955 -15721449 -14647210 -16504174 -19356808 -17039705
43337a7039705Q401886P660854J168696k369569R99451N160252L606239q47347
$$ -17039705 -8637819 -976965 191731 -2177838 -1178387 3981865 7588104 6740757
43329F740757j112371K980013N064904K337019j554226l730653n347683o374312
$$ 6740757 5628386 8608399 13673303 16010322 14456096 10725443 5377760 -996552
43321i96552m037027Q71889K693017l65680k378148P15794L690263M75596n047158
$$ -996552 -5033579 -4161690 -1468673 -1834353 -4212501 -3496707 193556 669152 -4378006
43312d378006m492807J912547N901401L627302l32191j641698j573006k255173
$$ -4378006 -8870813 -6958266 -1056865 2570437 2238246 596548 -976458 -3231631
43304c231631k868795k814370l563323m950458l833640J100939O437109Q018941
$$ -3231631 -6100426 -8914796 -12478119 -17428577 -21262217 -20161278 -13724169 -5705228
43296e705228N455131J439374j208786j301198k20777q15829l143564k985366
$$ -5705228 -250097 1189277 -19509 -1320707 -1541484 -2357313 -5500877 -8486243
43288h486243J877028O260868L958434k202341l643530J112832M679486K655920
$$ -8486243 -6609215 -348347 3610087 1407746 -2235784 -1122952 3556534 6212454
43280F212454j078098k982676m995250p283348m607465M220200J0730039P684009
$$ 6212454 5134356 2151680 -2843570 -10126918 -14734383 -10514183 215856 7899865
43272G899865l27590m239012l169179k291888k848037k532677k230160l930851
$$ 7899865 7572275 3333263 164084 -2127804 -4975841 -7508518 -9738678 -13669529
43264a3669529m560741k10853N513618N757648J552521J43290L047546M637097
$$ -13669529 -18230270 -18441123 -12927505 -7169857 -5617336 -5474046 -2426500 2210597
43256B210597K721402J578586L142060L657004J267289q37320j241522k782071
$$ 2210597 4931999 6510585 9652645 13309649 14576938 13739618 12498096 9716025
43248I716025n567889n070818n31152K066771n11136l206052j278127K069350
$$ 9716025 4148136 -922682 -1453834 612937 101801 -3104251 -4382378 -2313028
43240b313028J981558j30436q00438j108507k629993j903077L559470P861566
$$ -2313028 -331470 -461906 -1262344 -2370851 -5000844 -6903921 -3344451 4517115
43232D517115L874876m603282o793866n52552M799126K780459j413606k81551
$$ 4517115 8391991 3788709 -3005157 -3557709 1241417 4021876 2608270 2326719
43224B326719M399336N261044R02711k763257k075037n66303k180493m009451
$$ 2326719 6726055 11987099 12889810 10126553 8051516 7485213 5304720 1295269
43216A295269n11362O658436Q932600K650927m809820n042996m76429K82234l599482
$$ 1295269 783907 7442343 16374943 19025870 14216050 9173054 8696625 8978859 5379377
43207E379377m312694J200784N874572L783870j051265k295723j290711k893927
$$ 5379377 1066683 2267467 8142039 11925909 10874644 8578921 7288210 4394283
43199D394283n966084n159870K15096N334326O521198L976002m39875l885219
$$ 4394283 -1571801 -6731671 -6516575 -1182249 5338949 9314951 8875076 4989857
43191D989857l339096O07J78635m837466p852609k303197O312033P288534P33136
$$ 4989857 1650761 1651368 1830003 -3007463 -10860072 -13163269 -6851236 437298 1170434
43182A170434k934589P11354M389754J933717k547704k730913J80918J168987
$$ 1170434 -1764155 -1052801 3336953 5270670 2722966 -7947 172971 1341958
43174A341958m61841j762954j251215O82130L290277M394061J261802m774036
$$ 1341958 880117 -882837 -2134052 -1451922 1838355 6232416 7494218 2720182
43166B720182q296987o770908l307112l45496L812322Q789751Q828417J339523
$$ 2720182 -5576805 -12347713 -15654825 -16000321 -12187999 -3398248 5430169 6769692
43158F769692o473544o360801n61396K531166J162618P59174L426231N346020
$$ 6769692 296148 -6064653 -6626049 -4094883 -2932265 -2173091 1253140 6599160
43150F599160M755299M450841M799569J723431n448085j0477563q276287j478088
$$ 6599160 11354459 15805300 20604869 22328300 16880215 6402652 -1873635 -3351723
43142c351723M458249P846046Q667600N017182k775223q264713n801333N25965
$$ -3351723 1106526 8952572 17620172 22637354 19862131 11597418 5796085 6322050
43134F322050J528971l968444p512008l737873K058368K527632j182662k814628
$$ 6322050 7851021 3882577 -3629431 -7367304 -5308936 -2781304 -3963966 -6778594
43126f778594j201175m75314j367831N95392O483121R641394M236831n565755
$$ -6778594 -7979769 -8455083 -9822914 -9227522 -2744401 6896993 11133824 5568069
43118E568069j0102681o455140j132999k66791k055461j349896K002053L486930
$$ 5568069 -4534612 -10989752 -12122751 -12389542 -14445003 -15794899 -13792846 -10305916
43110a0305916J206994j384844p41167K037210L589974L249977L004229L472176
$$ -10305916 -9098922 -10483766 -11224933 -9187723 -5597749 -2347772 656457 4128633
43102D128633K809625R706l052377l918900k226739P79353L538070L958327M23868
$$ 4128633 6938258 6947964 3895587 -23313 -2250052 -1470699 2067371 6025698 6449566
43093F449566m980868o858615l210468O66856p50034m380931k753000L845152
$$ 6449566 1468698 -5389917 -8600385 -7933529 -8683563 -13064494 -15817494 -11972342
43085a1972342O969721L193084n38818J156591K774653k236467q488872n306332
$$ -11972342 -5002621 -1809537 -2348355 -1191764 1582889 -653578 -9142450 -14448782
43077a4448782O332127J3633247R203625m46201n618322m792948k031491J42711
$$ -14448782 -8116655 5516592 14720217 14274016 8655694 3862746 1831255 1973966
43069A973966P60201j603708o058892q007943m567013J225120M655896M839761
$$ 1973966 2734167 1130459 -4928433 -12936376 -17503389 -16278269 -11622373 -6782612
43061f782612L155376j11464l716529l512782K414867Q772704Q400917J765593
$$ -6782612 -3627236 -3738700 -7455229 -10968011 -8553144 219560 8620477 10386070
43053A0386070l589303k946217O56952K115666Q50127k68306J2072p8593k115132
$$ 10386070 6796767 3850550 4507502 6623168 7473295 7204989 7217061 7138468 5023336
43044E023336m617903m585393j961032q44987l974860p025024k706654Q262901
$$ 5023336 405433 -4179960 -6140992 -6985979 -10960839 -17985863 -20692517 -12429616
43036a2429616J5103892R603423k797962r610294o739735j349218k6765j093775
$$ -12429616 2674276 12277699 9479737 -130557 -6870292 -8219510 -8246275 -9340050
43028i340050p60243m16038k675314m160950J009214J1039207J6069541J0349278
$$ -9340050 -10100293 -10516331 -13191645 -17352595 -16343381 -5304174 10765367 21114645
43020B1114645J91230m223118k013067j187677n870379j0241997p604614k18959
$$ 21114645 21305875 17082757 15069690 13882013 8011634 -2230363 -9834977 -10053936
43012a0053936M510494M352397L227315L405794K608514o18090l631252l466608
$$ -10053936 -5543442 -1191045 2036270 5442064 8050578 7432488 3801236 334628
43004C34628n24974K689089L864980J768707k171722l686844q09469J919473m80021
$$ 334628 -190346 2498743 6363723 8132430 5960708 2273864 1464395 3383868 2903847
42995B903847m442588k293338M412679N399469j888641o531389o03672P973351
$$ 2903847 -1538741 -3832079 580600 5980069 4091428 -2439961 -3043633 4929718
42987D929718P491702k37575m784363l625692k397458k184699J161265N868222
$$ 4929718 12421420 12183845 7399482 3773790 1376332 -808367 352898 6221120
42979F221120M514180k905560p134603m056245r57822l800356p218610l681151
$$ 6221120 10735300 7829740 695137 -3361108 -4318930 -8119286 -15337896 -19019047
42971a9019047M140489P461204L828862j019316j569852K290214P072987Q698743
$$ -19019047 -14878558 -7417354 -3588492 -4607808 -6177660 -3887446 3185541 11884284
42963A1884284M839712k605322q210267q258772m202254K33216L251986M830066
$$ 11884284 16723996 14118674 5908407 -2350365 -6552619 -6319403 -3067417 1762649
42955A762649M743023K848681n8776k898787m580338l722042m47290J942244N38281
$$ 1762649 6505672 9354353 9295577 6396790 1816452 -1905590 -2352880 -410636 127645
42946A27645k161966j257791K379513K623123j748106l777805J326695Q292601
$$ 127645 -2034321 -3292112 -912599 1710524 -37582 -3815387 -2488692 5803909
42938E803909R060903L587214j820152l504437k504001l96350J409563K65690
$$ 5803909 14864812 18452026 16631874 13127437 10623436 10227086 11636649 11902339
42930A1902339m375375p644583m666366J678164L898966M70882k460085o70450
$$ 11902339 7526964 -117619 -4783985 -3105821 793145 1264027 -1196058 -1866508
42922a866508K515515K512006P21583J731679N679691P300961K725555m943208
$$ -1866508 649007 3161013 3882596 5614275 11293966 18594927 21320482 16377274
42914A6377274q164450l257573M628273O586454M18068o471251o506224j604011
$$ 16377274 8212824 4955251 9583524 16169978 16588046 10116795 3610571 2006560
42906B006560L29638l041902n688352k810883J908467K074933j705767k789587
$$ 2006560 2336198 -705704 -6394056 -9204939 -7296472 -5221539 -6927306 -9716893
42898i716893J424441N317049L150957k129827k424614M144090J0124947Q540373
$$ -9716893 -8292452 -2975403 175554 -1954273 -4378887 -234797 9890150 18430523
42890A8430523J657778l350298m296534m648007o015898n931466l574035j951075
$$ 18430523 20088301 16738003 12441469 7793462 1777564 -4153902 -7727937 -9679012
42882i679012k240098r74894L876592Q130167O761756J269326k487291k012600
$$ -9679012 -11919110 -12894004 -9017412 -887245 5874511 7143837 4656546 2643946
42874B643946J74141J499467K123712K795524K864994J166234k319809n652716
$$ 2643946 2818087 4317554 6441266 9236790 12101784 13268018 10948209 5295493
42866E295493n635296r56952M804980N840954J182006l453062k756136J755789
$$ 5295493 -339803 -1296755 3508225 9349179 10531185 7078123 4321987 6077776
42858F077776M581785K976075j568958o067756p483785l691293L867844R874966
$$ 6077776 10659561 13635636 12066678 5998922 -1484863 -5176156 -1308312 8566654
42850H566654R867902M191810l586749r557592j0195673m707692J692930K088918
$$ 8566654 18434556 22626366 19039617 9482025 -713648 -5421340 -3728410 -1639492
42842a639492k297590k906222K478894N192764L95503l298211J629555O497459
$$ -1639492 -3937082 -6843304 -4364410 828354 1223857 -2074354 -444799 6052660
42834F052660m06599j2013550j0942007K447993R279351J980791m186628K849734
$$ 6052660 5646061 -6367489 -17309496 -14861503 -5582152 -3601361 -7787989 -4938255
42826d938255J1964071P684275m501480p813069p76803K937086k075431o057361
$$ -4938255 7025816 14710091 10208611 2395542 1618739 4555825 2480394 -3576967
42818c576967j836632M369824M335678k04160k546050j040378J276162K585983
$$ -3576967 -5413599 -1043775 3291903 3087743 541693 -498685 777477 3363460
42810C363460L191328L119102K150328O72331j265180l994105o248226n341885
$$ 3363460 6554788 9673890 11824218 12496549 11231369 7237264 989038 -4352847
42802d352847p54447M148065N376911K450245j442273k842829j414356r1051j267640
$$ -4352847 -5107294 -959229 4417682 6867927 5425654 2582825 1168469 1077418 -190222
42793a90222l095141j610839L169614O530249N787137L779987L020425R67862
$$ -190222 -3285363 -4896202 -1726588 4803661 10590798 14370785 17391210 18359072
42785A8359072m199368p400656l153321M291118N370194p66943n038943k479114
$$ 18359072 14159704 6759048 3605727 7896845 13267039 12500096 7461153 4982039
42777D982039J033933m94571l676598k657560P48437J064228p84237O34546M942399
$$ 4982039 6015972 5521401 1844803 -812757 -64320 999908 215671 850217 5792616
42768E792616N412753l96238o148556n539887p15542J708835n3836j680105L37622
$$ 5792616 11205369 10809131 4660575 -879312 -1594854 113981 60145 -1619960 -1282338
42759a282338M149940N681079L883825J097824q65233k759632n355577o730490
$$ -1282338 2867602 8548681 12432506 13530330 12665097 9905465 4549888 -2180602
42751b180602m274559J102113N184282N400240L407838J763610K48151k568866
$$ -2180602 -6455161 -5353048 -168766 5231474 8639312 10402922 10651073 8082207
42743H082207n681735o044483k314062L414291P395423O881028K014326l663799
$$ 8082207 2400472 -3644011 -5958073 -2543782 4851641 11732669 13746995 10083196
42735A0083196n836167m039951k174360k633547k366847J766338N983987L674082
$$ 10083196 4247029 207078 -1967282 -4600829 -6967676 -5201338 782649 4456731
42727D456731l585733n824461J604328R991375Q322650j497365p251841k951001
$$ 4456731 870998 -4953463 -3349135 6642240 14964890 13467525 6215684 3264683
42719C264683M292534N249660J89687m036514m047025k160562p81811L09189J095270
$$ 3264683 7557217 12806877 12996564 8960050 4913025 2752463 1970652 2279841 3375111
42710C375111J37710k275981k962741k2056L784192M158499O31939l406234n145690
$$ 3375111 3512821 1236840 -1725901 -1747957 2036235 6194734 6826673 3420439 -1725251
42701a725251m238469q37412M634701Q911753P100534o17453o600989m352953
$$ -1725251 -5963720 -6801132 -2166431 6745322 13845856 13228403 6627414 2274461
42693B274461K352796M158926o74295m043133n10750M494931L190004l071082
$$ 2274461 4627257 8786183 8111888 4068755 3558005 8052936 11242940 8171858
42685H171858o713014n012366j717935O01030K939893M818136L622790K26231
$$ 8171858 1458844 -3553522 -5271457 -4670427 -1730534 3087602 6710392 6936623
42677F936623p64083J724201L237341J270994r16496q93359j569054m779344n864148
$$ 6936623 6172540 7896741 11134082 12405076 11488580 10595221 9026167 4246823 -1617325
42668a617325o80417O058357O467582J176600j941059Q3262J889818l54375k742170
$$ -1617325 -2297742 3760615 10228197 11404797 9463738 9547000 11436818 11082443 8340273
42659H340273p29220K829415J748484l988076p900937o030480j960337r59626
$$ 8340273 7611053 10440468 12188952 8200876 299939 -5730541 -7690878 -8650504
42651h650504k179672n82022M145674N887828J885782r12115M497826J2319827
$$ -8650504 -10830176 -11412198 -7266524 -1378696 507086 -405029 4092797 16412624
42643A6412624R863291l282494j2143515o687286M250738O726037J188461k043654
$$ 16412624 26275915 22993421 10849906 4162620 8413358 15139395 16327856 14284202
42635A4284202r87966k893875q647051r299912p15513Q883723J0385071M916787
$$ 14284202 13296236 10402361 1755310 -7544602 -8260115 623608 11008679 15925466
42627A5925466p73518l467128l663757k054972o838M28577k29601M62776J631553
$$ 15925466 15151948 11684820 8021063 5966091 5959253 6387830 6158229 6621005 8252558
42618H252558j98182l845420l624873J029935L535670J038850p06580J933255
$$ 8252558 8054376 4208956 584083 1614018 5149688 6188538 5481958 7415213
42610G415213L283705j231194n309779j524155N108908L888960m581344q907007
$$ 7415213 10698918 9467724 4157945 2633790 7742698 11631658 7050314 -1856693
42602a856693l565444M656188P685819N305236J644842m80027J49857K834062
$$ -1856693 -5422137 -765949 6919870 12225106 13869948 13389921 13539778 16373840
42594A6373840L605227n12217n355644l803920L021985N682163q5162o642121
$$ 16373840 19979067 19466850 14111206 10307286 13329271 19011434 18926272 12284151
42586A2284151n379316J302646M396594R14724l763885m465318j701505J480210
$$ 12284151 6904835 8207481 12604075 13518799 9754914 5289596 3588091 5068301
42578E068301L722601N047435N192810M145020K869033J815977m21363m941114
$$ 5068301 8790902 13838337 19031147 23176167 26045200 27861177 27439814 22498700
42570B2498700r130100q072658r35577O221284O776828J361148l840158n347182
$$ 22498700 13368600 5295942 4360365 10581649 17358477 18719625 14879467 9532285
42562I532285m676542l126646K6559L310957L124291J28654m45196K380139K826191
$$ 9532285 4855743 1729097 1755656 5066613 8190904 8319558 7874362 10254501 13080692
42553A3080692j489786m254312j085810J841982k306684q903502r081831l760993
$$ 13080692 11590906 7336594 6250784 8092766 5786082 -3117420 -12199251 -15960244
42545a5960244K32599L404207J0219262J5582872R763201k925421o261822L234136
$$ -15960244 -15727645 -12323438 -2104176 13478696 23241897 20316476 14054654 17288790
42537A7288790R375474J285446r320887o963217L456070N733528j931699o060921
$$ 17288790 26664264 27949710 18628823 11665606 15121676 20855204 18923505 12862584
42529A2862584k66179O289536M795904p30329j660112K615391N847182M362208
$$ 12862584 12596405 18885941 23681845 22951516 21291404 23906795 29753977 34116185
42521C4116185P07431n16114K046040M972473L734345j314721m116338j38222
$$ 34116185 34823616 34307502 36353542 41326015 45060360 43745639 39629301 39491079
42513C9491079P399930J1596384J0569879Q358474Q272992R732514J1757224J5662948
$$ 39491079 46891009 58487393 69057272 77415746 85688738 95421252 107178476 122841424
42505A22841424K3468005L6154811N2816420O7725396O8937741M6082450L071597
$$ 122841424 146309429 182464240 235280660 303006056 371943797 418026247 421097844
42498D21097844m0266239o3377237o1747847m7617666l6074984l2534827l2078355
$$ 421097844 380831605 317454368 255706521 208088855 172013871 139479044 107400689
42491A07400689k7398916j6483794m415267J286964k018496q972170j1565504
$$ 107400689 80001773 63517979 59102712 60389676 58371180 49399010 37833506
42484C7833506q038028m417617n687730q108396m480096M121812Q067335K654466
$$ 37833506 29795478 25377861 19690131 11581735 7101639 11223451 19290786 21945252
42476B1945252m277320l256118K998388L972529k667156p932311n107813J361081
$$ 21945252 17667932 14411814 17410202 21382731 18715575 10783264 5675451 7036532
42468G036532L635419Q91882k133858k397128j28519L392377N776602M023010
$$ 7036532 10671951 11563833 9429975 7032847 6904328 10296705 16073307 20096317
42460B0096317j464711n791964n397014k297138N3829J612358L081052K241455
$$ 20096317 18631606 12839642 7442628 5145490 5199319 6811677 9892729 12134184
42452A2134184k274776o399604n134949K8185L252129K742175J904429K659573
$$ 12134184 9859408 3459804 -1675145 -1646960 1605169 4347344 6251773 8911346
42444H911346K805310P26772j647186j975076n36252Q89475R35155p34216k461277
$$ 8911346 11716656 12443428 10796242 8821166 8284914 9174389 10109544 9375328 6914051
42435F914051q23366N085237J0046252P443943j689195q503451p202714k384261
$$ 6914051 6090685 11175922 21222174 28666117 26976922 18473471 11270757 8886496
42427H886496k133753o423560p418758j359053N279625M944858M86060J011709
$$ 8886496 6752743 329183 -7089575 -8448628 -3169003 1775855 2261915 3273624
42419C273624O867981P147946l462819j3074134p199867Q958412J4978000L042694
$$ 3273624 10141605 17289551 13826732 752598 -6447269 2511143 17489143 20531837
42411B0531837j0910872r494359L138495R856238M909064j747149j704498J657977
$$ 20531837 9620965 126606 3265101 13121339 18030403 16283254 14578756 16236733
42403A6236733J691031j461183l181220j811386N033l73386j928042p32274M862680
$$ 16236733 17927764 16466581 13285361 11473975 11479008 11105622 9177580 8445306 13307986
42394A3307986J0034140P912915n75785o197591l768570O24709j69063k854240
$$ 13307986 23342126 31255041 30679256 24481665 20713095 21337804 21168741 18314501
42386A8314501j90207N523754N386946j481926o413662m670982r02229P20030
$$ 18314501 18124294 23648048 29034994 27553068 21139406 16468424 15566195 16286225
42378A6286225K737550P237560J0124796P222675O52178m816968p281634o558359
$$ 16286225 19023775 26261335 36386131 43608806 44260984 39444016 32162382 25604023
42370B5604023k235283L891931P591478P412292O505626P086729P302277N894282
$$ 25604023 23368740 27260671 34852149 42264441 48770067 55856796 63159073 69053355
42362F9053355N445871Q167094J2532785J6597706K0189104K1164948J4754577
$$ 69053355 74499226 82666320 95199105 111796811 131985915 153150863 167905440
42355A67905440Q97482j1999467j5642964j1648631q550201j1032969j5910086
$$ 167905440 168802922 156803455 141160491 129511860 120961659 109928690 94018604
42348I4018604j7376532j3085752n795538q72297j240094m262045n479959m910848
$$ 94018604 76642072 63556320 57760782 56888485 55648391 51386346 45906387 40995539
42340D0995539n873742p928776o679035j800926J089673o51111k180654M63969
$$ 40995539 35121797 27193021 20513986 18713060 19802733 19151622 16970968 17434937
42332A7434937L401483J434341l491786o014976n309217l565231n62548L861355
$$ 17434937 20836420 22270761 18778975 12763999 7454782 3889551 3327003 7188358
42324G188358N417067N53120o284198p620026l543559l88938k73646K99345J767644
$$ 7188358 12605425 13158545 6874347 -745679 -4289238 -4678176 -4951822 -4652477 -2884833
42315b884833l9055m947626n901925O77026Q176033Q460817L010926m5685K356641
$$ -2884833 -2923888 -7871514 -13773439 -13096413 -4920380 3540437 6551363 6505678 8862319
42306H862319N022342K876126k156620m597791k975771r48853j418998k569231
$$ 8862319 13884661 16760787 14604167 10006376 7030605 6081752 4662754 2093523
42298B093523j356832J182500J242259j666272l450853j192339K896721M874807
$$ 2093523 736691 1919191 3161450 1495178 -1955675 -3148014 -251293 4623514
42290D623514L858509J546233p58978k502529k922097j633211Q67906L919646
$$ 4623514 8482023 10028256 9269278 6766749 3844652 2211441 3079347 6998993
42282F998993O223611N087660k61887m666005j778829N632460O614402k964017
$$ 6998993 13222604 18310264 18048377 13382372 11603543 17236003 23850405 20886388
42274B0886388j2694266j0887459l26471O740781N618292K398651J742466Q35998
$$ 20886388 8192122 -2695337 -3021808 3718973 9337265 11735916 13478382 14314380
42266A4314380k815941n483221k969813K670128O010415N097344K551556J337524
$$ 14314380 11498439 6015218 3045405 5715533 11725948 16823292 19374848 20712372
42258B0712372J409113L77359k740388m855763k082872L623891M916930j121058
$$ 20712372 22121485 22498844 19758456 14902693 12819821 16443712 21360642 20239584
42250B0239584p598780o687763l49543L499176K771002K303364M478460N927343
$$ 20239584 12640804 5953041 5603498 9102674 11873676 14177040 18655500 24582843
42242B4582843M018816N22543k073909k858246r15356L454780O132843L225562
$$ 24582843 28601659 29124202 27050293 24192047 23276691 26731471 32864314 36089876
42234C6089876k612322n587887n582852o670001p792250l858556L096810L857127
$$ 36089876 33477554 27889667 22306815 15636814 7844564 3986008 7082818 10939945
42226A0939945l558698q796677l634758O480793J1299084R166367N121499J782879
$$ 10939945 7381247 -1415430 -5050188 1430605 12729689 21896056 27017555 28800434
42218B8800434p50733p97172K001376L437368P43984j957285l94052J980563N9120
$$ 28800434 28049701 27252529 29253905 32691273 33435257 31477972 31083920 33064483 33123603
42209C3123603k906032J60587Q007538J2225589R811161O398399O780834R800415
$$ 33123603 30217571 30378158 38385696 50611285 60422446 66820845 73601679 83402094
42201H3402094J3508982J8285879K3226943K5629298K5702537K6176148K5934929
$$ 83402094 96911076 115196955 138423898 164053196 189755733 215931881 241866810
42194B41866810J9965886P393246o224584j6634634k5039877l2048261l3810820
$$ 241866810 261832696 269225942 263001358 246366724 221326847 189278586 155467766
42187A55467766k8346804k0521545j5843548j3195364q537317k565621M99389
$$ 155467766 127120962 106599417 90755869 77560505 69023188 66457567 66956956
42180F6956956l26822k108673k924083l415446m276286n612984p802398r898003
$$ 66956956 66630134 64521461 61597378 58181932 53905646 48292662 40490264 30592261
42172C0592261q704489k980819K966401L964063J018740q08619n45323j809079
$$ 30592261 21887772 18906953 21873354 25837417 26856157 26047538 25502215 23693136
42164B3693136n003303n122338L94109O624149P196022J799935n084474r454970
$$ 23693136 18689833 13567495 13961604 20585753 27781775 29581710 24497236 15042266
42156A5042266q944812k717798N676467Q741297L389213l558901l691930J095985
$$ 15042266 6097454 3379656 9056123 17797420 21186633 17627732 13935802 15031787
42148A5031787J599649m356221q116583k837206O743547J1176332Q020304K077075
$$ 15031787 16631436 12275215 4158632 1321426 8064973 19241305 27261609 29338684
42140B9338684k395027m465222l680108J24328M256937M621788O55455l710488
$$ 29338684 26943657 22478435 18798327 18922655 23179592 27801380 28456835 24746347
42132B4746347m666947k498954p24663k239952o025202p386861k945770M182307
$$ 24746347 20079400 17580446 16855783 14615831 8590629 1203768 -1742002 2440305
42124B440305O807981K616189k426534j989202K503063N114855L905787J695725
$$ 2440305 9248286 11864475 9437941 7448739 9951802 15066657 18972444 20668169
42116B0668169J79737j790978m531441o277888n613422k278145L259684Q115321
$$ 20668169 20847906 19056928 14525487 8247599 2634177 356032 3615716 11731037
42108A1731037P406947P35195m544356k370162K359502Q15127n003692m619315
$$ 11731037 19137984 19873179 15328823 12958661 15318163 16133290 11129598 6510283
42100F510283L129481O125620k462552j2050955r234900K936212J0009484O192469
$$ 6510283 9639764 15765384 13302832 1251877 -7983023 -5046811 4962673 11155142
42092A1155142n48015k110181J74297J017519p17189k291253j548786J175486
$$ 11155142 10607127 8496946 8671243 9688762 8971573 6680320 5131534 6307020
42084F307020L682151L802789K026485J334945K676190K665042j243767n599641
$$ 6307020 9989171 13791960 15818445 17153390 19829580 22494622 21250855 15651214
42076A5651214n361912j914595j275304m411337n111776O23142P915839R035790
$$ 15651214 10289302 8374707 7099403 2688066 -2423710 -1800568 6115271 15151061
42068A5151061L087465l791902o348066n041809l272644k670842k369287j471631
$$ 15151061 18238526 14446624 8098558 3056749 -215895 -2886737 -5256024 -6727655
42060f727655m05247L02380J154399K560671L450684K452561O6799j800367k131226
$$ -6727655 -7132902 -6830522 -5676123 -3115452 335232 2787793 2854592 1054225 -1077001
42051a077001j121244J005925L279605K975915j345053o041169n552014J51265
$$ -1077001 -2198245 -1192320 2087285 5063200 3718147 -2323022 -7875036 -7723771
42043g723771N394595O827458O770163P047673N174493p9403m558776m469773
$$ -7723771 -2329176 4498282 11268445 18316118 23490611 23411208 18852432 14382659
42035A4382659j867056n7719J828819M607004M390307j102199n950245l789846
$$ 14382659 12515603 12457884 14286703 18893707 23284014 22181815 16231570 12441724
42027A2441724J239597N82165l993916k719625M995225P715592L5693p648451
$$ 12441724 13681321 14263486 10269570 7549945 12545170 20260762 20296455 12648004
42019A2648004m470106M433403N977044j609464p488029m523992K147184M267657
$$ 12648004 8177898 12611301 18588345 16978881 9490852 4966860 7114044 11381701
42011A1381701J215241j836817k339841k548444m147765m431917n3178O616988
$$ 11381701 12596942 10760125 8420284 5871840 1724075 -2707842 -2761020 3855968
42003C855968Q424695K538957m426523m355182J210902L398071q09331m454352
$$ 3855968 12280663 14819620 10393097 6037915 7248817 10646888 9837557 5383205
41995E383205j822681K940368L044390m73473j680396L50358J377390l133r25817
$$ 5383205 3560524 6500892 9545282 9071809 7391413 7741771 9119161 9116028 8190211
41986H190211m18322n26864p90745J850104N904133M686932l572876j0617317
$$ 8190211 7771889 7245025 6454280 8304384 14208517 18895449 15322573 4705256
41978D705256q259740L67424N367986L316588j52041J01148K704437L879575K422765
$$ 4705256 -3554484 -3187060 2180926 5497514 5345473 5446621 8151058 12030633 14453398
41969A4453398n33131k566145m27762N728093Q650244J390744j0294689j1665435
$$ 14453398 13920267 11354122 10926360 16654453 25304697 26695441 16400752 4735317
41961D735317O10123J0988877N748141p137845r920728p08480O760676N946980
$$ 4735317 5345440 16334317 22082458 14944613 5023885 4315405 11076081 17023061
41953A7023061M161090N347147K791928n462886r197259k801959L693825R95705
$$ 17023061 21184151 26531298 29323226 23860340 14663081 11861122 15554947 16550652
41945A6550652l963242j427413L225633K43949m741764J19172R654019P816662
$$ 16550652 12587410 11159997 14385630 14629579 9887815 10006987 19661006 27477668
41937B7477668m370824q062344L053397J2021732N817907n177099o179402q33756
$$ 27477668 23106844 15044500 18097897 30119629 35937536 30760437 24581035 23747279
41929B3747279p40724m164481j629076M695485M078629l285992n535761J506976
$$ 23747279 23006555 18842074 17212998 21908483 25987112 22701120 17165359 18672335
41921A8672335P731789M663352k883773n775618k993281L45676J868672L390193
$$ 18672335 26404124 31067476 28183703 22408085 19414804 19760480 21629152 25019345
41913B5019345O314743R871738J2845758J4458462J4120834J1978772R620607
$$ 25019345 31334088 41205826 54051584 68510046 82630880 94609652 104230259
41906A04230259R436475J2901393J9323014K6790423L5001477M5440173N5766075
$$ 104230259 113666734 126568127 145891141 172681564 207683041 253123214 308889289
41899C08889289N5468680L3463132o984073m5583152o2155736n4892045l8720315
$$ 308889289 364357969 397821101 390837028 345253876 283098140 228206095 189485780
41892A89485780k8155684k5680362k5188560k1720704j6145476j2144326j0487150
$$ 189485780 161330096 135649734 110461174 88740470 72594994 60450668 49963518
41885D9963518q099572l857522k210985o435331j0656963o373790L143442M761098
$$ 49963518 41863946 38006424 35795439 29360108 18703145 12329355 15472797 20233895
41877B0233895n063212j3077334p942616L446125P594140M195323K575305M296112
$$ 20233895 15170683 2093349 -5849267 -2403142 5190998 9386321 11961626 16257738
41869A6257738K966668j356127j785603J169574j135766r196542j1509619k550569
$$ 16257738 19224406 17868279 16082676 17252250 16116484 6919942 -4589677 -7140246
41861g140246O920790N337040k894484n214444O02178N340560K851357k845192
$$ -7140246 -219456 5117584 2223100 -2991344 -2389166 2951394 5802751 2957559
41853B957559m803068j390880L733828O297988N039674K071520j65961j852430
$$ 2957559 -1845509 -3236389 497439 6795427 11835101 13906621 13740660 11888230
41845A1888230m013544m917485k103850K228924K801226r79682m055743l809739
$$ 11888230 7874686 2957201 853351 3082275 5883501 4903819 848076 -2961663
41837b961663l269793m120218k964675J843475N707013M663191J395309k58366
$$ -2961663 -6231456 -10351674 -13316349 -11472874 -5765861 -1102670 292639 34273
41829C4273j212048k324150J04757O953958J0108463K694528q497946j0844417
$$ 34273 -1177775 -3501925 -3397168 3556790 13665253 16359781 7861835 -2982582
41821b982582l931259P71461k155085n483500k707377K402276L970278L085309
$$ -2982582 -6913841 -6142380 -8297465 -13780965 -16488342 -14086066 -10115788 -7030479
41813g030479L108435K759413o6803k821184k542394j379507k255331k770663
$$ -7030479 -3922044 -1162631 -1229434 -4050618 -6593012 -7972519 -10227850 -12998513
41805a2998513O51763N561209O636760M106297K905331M393936M724747J526810
$$ -12998513 -12346750 -6785541 -148781 3957516 6862847 11256783 15981530 17508340
41797A7508340k784395m970364m326858j800658Q47032J201512j187694l075581
$$ 17508340 14723945 9753581 5426723 3626065 4473097 5674609 4486915 1411334
41789A411334j837560L5467p99793j773721J783504P172359O565448m72402n114916
$$ 1411334 -426226 -390759 -1190552 -2964273 -1180769 5991590 12557038 12084636 6969720
41780F969720k627416P66891j129863m588062l412847M89498J757199J440409
$$ 6969720 4342304 5109195 3979332 -608730 -4021577 -3532079 -1774880 -334471
41772c34471L656761O271709L923492k036297n358992m975038m662129m245808
$$ -334471 3322290 9593999 13517491 11481194 6122202 1147164 -3514965 -7760773
41764g760773n84907L504086J719137l780845l717836L150499P368996M472554
$$ -7760773 -8345680 -4841594 -3122457 -6903302 -10621138 -7470639 -101643 4370911
41756D370911J650665L666309M147563j341247m902907N80963P479231M910390
$$ 4370911 6021576 9687885 13835448 12494201 7591294 8172257 15651488 20561878
41748B0561878l115007m667291J15254P34784m422727n852979o73788K161628
$$ 20561878 17446871 12779580 12894834 13629618 9206891 3353912 2680124 4841752
41740D841752j892446m801915j58648N581862L888380k317952m316117p29737
$$ 4841752 2949306 -1852609 -2011257 3570605 7458985 5141033 824916 95179
41732I5179L058286M347735M306599K534836k257834p215906p148009j627144
$$ 95179 3153465 7501200 11807799 14342635 12084801 4868895 -2279114 -3906258
41724c906258M014112N049950J708025k556137m448351k791205O73628K606743
$$ -3906258 107854 5157804 6865829 4309692 -138659 -2929864 -2256236 350507
41716C50507J589231l58977p65269J83992P80373M80574p5376l91971m4730J453544
$$ 350507 1939738 1580761 815492 999484 1779857 2260431 2185055 1793084 1748354 3201898
41706C201898L450813M095273K624207M89208o83248q65688o47658j57566J85574
$$ 3201898 6652711 10747984 13372191 13861399 13178151 12312463 11664805 11507239 11692813
41697A1692813m51963j770778k254568j414874n49496o90269j471606k390147
$$ 11692813 11240850 9470072 7215504 5800630 5251134 4560865 3089259 699112
41689F99112l234454l013948q08979J892720K269636K17561j258481m12953J196834
$$ 699112 -2535342 -5549290 -6358269 -4465549 -2195913 -1978352 -3236833 -3649786 -2452952
41680b452952J903619K299416L089486L086462Q92534l020146o537325o808075
$$ -2452952 -549333 1750083 4839569 7926031 8818565 5798419 -738906 -7546981
41672g546981j859119N915952R404362M638357j868802p4360Q646649J1183550
$$ -7546981 -9406100 -3490148 5914214 10552571 8683769 8609409 17256058 28439608
41664B8439608O68227j2537873j3801271k885383P453679Q418775L229985r81233
$$ 28439608 29107835 16569962 2768691 -116692 7336987 15755762 18985747 18004514
41656A8004514k299019l132569m760884n718554m281682j037957J258185Q06012
$$ 18004514 15705495 12572926 7812042 2093488 -2188194 -3226151 -1967966 -1161954
41648a161954o51872j29499J878816J936706n21893j689724O41822L464117L477783
$$ -1161954 -1813826 -1943325 -64509 1872197 1350304 -339420 302402 3766519 7244302
41639G244302K057078K041297K654305J362450j455981l299735l366114k579167
$$ 7244302 9301380 11342677 13996982 15359432 13903451 10603716 7237602 4658435
41631D658435j433874m52704r83162l050416m312100l341349j682468o27164J090300
$$ 4658435 3224561 2771857 1788695 -1261721 -5573821 -8915170 -10597638 -11224802 -10134502
41622a0134502L954185N303882L262654l6763j982973k887264l124012j080677
$$ -10134502 -6180317 -876435 2386219 2349456 366483 -2520781 -5644793 -6725470
41614f725470K619272L546183M00606j455991J342005L247921j568610q336545
$$ -6725470 -4106198 -560015 -159409 -1615400 -273395 2974526 1405916 -6930629
41606f930629p842139l81991N269592M990055K541503P68847j175812j773036
$$ -6930629 -14772768 -15154759 -9885167 -4895112 -2353609 -1584762 -2760574 -4533610
41598d533610K250015P798170O951543p99369o286733l943357O97834R82413j089150
$$ -4533610 -2283595 5514575 12466118 11666749 5380016 1436659 2134493 3116906 2027756
41589B027756o69159R28791j59824k406195j624938J219066J637794m84796r40816
$$ 2027756 1358597 2287388 2127564 -278631 -1903569 -684503 953291 468495 -472321
41580d72321J085703J225968k708734o257026m122619K182822N916667L712016
$$ -472321 613382 1839350 -869384 -7126410 -11249029 -9066207 -3149540 562476
41572E62476n85763j761965o2763P73251L85865J775086M329574K926615l327596
$$ 562476 -23287 -1785252 -1848015 -1074764 -688899 1086187 5415761 8342376 5014780
41563E014780p414685m403263O9521j748040o706572n035925L883613R701542
$$ 5014780 -2399905 -6803168 -6733647 -8481687 -15188259 -20224184 -16340571 -6639029
41555f639029O423467N57003J72177L227779K401678l194732p135322m736448
$$ -6639029 -215562 341441 513618 3741397 6143075 2948343 -4186979 -8923427
41547h923427J457282N198969L390178q48199j889525J289420L523107R13852
$$ -8923427 -7466145 -2267176 1123002 274803 -1614722 -325302 3197805 4111657
41539D111657k967570k503630Q97391J260733j691514k030517K065691M906181
$$ 4111657 1144087 -1359543 -462152 798581 -892933 -2923450 -857759 4048422
41531D048422K456592j707961k834783j754465j616425k503726k785203k045127
$$ 4048422 6505014 4797053 1962270 207805 -1408620 -3912346 -6697549 -8742676
41523h742676M8852L946558P079978N053852j389791n242341k241633L296668
$$ -8742676 -8693824 -4747266 2332712 7386564 5996773 754432 -1487201 1809467
41515A809467N025600K823292P60834L87611P315j833320n226365r057197j0298533
$$ 1809467 6835067 9658359 10419193 10806804 10814119 8980799 3754434 -5302763 -15601296
41506a5601296o187201R86489M847207K914988m2168R89746M648524O281188M289821
$$ -15601296 -21788497 -20802008 -15954801 -13039813 -13081981 -12092235 -7443711 -1162523 3127298
41497C127298O81980j949089j894766P00120L149165L098838J960618J957919
$$ 3127298 3809278 1860189 -34577 665543 3814708 6913546 8874164 10832083
41489A0832083J135128l086810o800172l810305L344074N517169R00329k887082
$$ 10832083 11967211 8880401 2080229 -1730076 1613998 7131167 8031496 5144414
41481E144414k094460j182677j389138K236370P681638L981664r623912j6478675
$$ 5144414 3049954 1867277 478139 2714509 10396147 14377811 4753899 -11724776
41473a1724776n728650R651703J1607828L018786o98789K657245K474678l587331
$$ -11724776 -17453426 -7801723 3806105 6824891 6126102 8783347 11258025 7670694
41465G670694o888110m573561k747248k968861n59444L087156J003927n131284
$$ 7670694 782584 -3790977 -6538225 -9507086 -10066530 -6979374 -5975447 -11106731
41457a1106731n226748K495935Q166230O331156K681673J797763Q24718j017353
$$ -11106731 -16333479 -13837544 -5671314 659842 3341515 5139278 5963996 4946643
41449D946643R00631N987163O319272j0346m774439l583249k346379m614148m695657
$$ 4946643 5847274 11834437 18153709 18143363 13368924 9785675 7439296 2825148 -1870509
41440a870509J44368K850529l05527j735555L248007N935553j022929r005017
$$ -1870509 -1726141 1124388 818861 -916694 2331313 8266866 7243937 -1761080
41432a761080o562660J461341K334201l257235l582039L527725P551942L086122
$$ -1761080 -8323740 -6862399 -4528198 -7785433 -11367472 -7839747 -287805 2798317
41424B798317k508311j960864K022824L457708J651899o48656j937679j824526
$$ 2798317 290006 -1670858 351966 3809674 5461573 4812917 2875238 1050712
41416A050712l39857R75120N43777m15140K74508J899563K477284K777020M421842
$$ 1050712 710855 1685975 2229752 1814612 2089120 3988683 6465967 9242987 13664829
41407A3664829N468957K736156k481930n666500n053173k156450J842009N437498
$$ 13664829 19133786 21869942 19388012 13721512 8668339 6511889 8353898 13791396
41399A3791396M827507j500527q009853q260051m117206j917036j434160K399674
$$ 13791396 18618903 17118376 9108523 848472 -3268734 -5185770 -6619930 -4220256
41391d220256P509089N329739m093799q623281j405307P622212N836913l404943
$$ -4220256 3288833 8618572 4524773 -4098508 -5503815 2118397 7955310 4550367
41383D550367o176264J677549R983062R669545L401500j501816l201343m177016
$$ 4550367 -1625897 51652 10034714 19704259 23105759 21603943 18402600 14225584
41375A4225584n030941m396409k538949r57366K83087J579700J413886j531031
$$ 14225584 9194643 4798234 2259285 1301919 1585006 3164706 4578592 3047561
41367C047561m551358l285104J436160L076152k022339q510650p750032J695476
$$ 3047561 -1503797 -4788901 -3352741 -276589 -2298928 -10809578 -18559610 -16864134
41359a6864134J2303818J5894985J1172778L143877k504152l817456l002494l243709
$$ -16864134 -4560316 11334669 22507447 25651324 23147172 19329716 16327222 13083513
41351A3083513m826771n076650k608749J59509K95300j694621l301428l495834
$$ 13083513 8256742 3180092 571343 730852 1026152 -668469 -3969897 -7465731
41343g465731k331960M94360L364635J894555m715290r005590l543406P294627
$$ -7465731 -9797691 -9303331 -5938696 -4044141 -8759431 -17765021 -21308427 -14013800
41335a4013800J1397215N160663k324795l168246m15127n1213j144508O6793K275444
$$ -14013800 -2616585 2544078 219283 -2948963 -3364090 -3415303 -4559811 -4493018 -2217574
41326b217574K040848M81251O82324J573586K72597k135985k726078k178178k709260
$$ -2217574 -176726 304525 986849 2560435 2833032 697047 -2029031 -4207209 -6916469
41317f916469k974237n92022K448371K688636J596554L015888N696092M732552
$$ -6916469 -9890706 -10482728 -8034357 -5345721 -3749167 -733279 4962813 9695365
41309I695365j81468m141971m640275l918101l404915j554244J794196M056622
$$ 9695365 9513897 5371926 731651 -3186450 -6591365 -8145609 -6351413 -2294791
41301b294791M165577L773148L335451J404556j361297k017596k87966N52584
$$ -2294791 1870786 5643934 8979385 10383941 9022644 7005048 6717082 7269666
41293G269666j171394l650124n655353p750430q220100l180979O587142J3667032
$$ 7269666 6098272 2448148 -3207205 -10957635 -19177735 -22358714 -15771572 -2104540
41285b104540J2399698N668978l9789k823803m599487n344741l527338j011373
$$ -2104540 10295158 15964136 15924347 13100544 8501057 3156316 -371022 -1382395
41277a382395j823091n123034m457436L100263J0730238R386450J43550o424335
$$ -1382395 -3205486 -8328520 -12785956 -9685693 1044545 10430995 10574545 4150210
41269D150210m373799k19251k395227p702509o028052L025260P866173K006121
$$ 4150210 -223589 -442840 -2838067 -10540576 -16568628 -13543368 -5677195 -3671074
41261c671074n550122l380623N537899Q705498K245661n116319n821161k618590
$$ -3671074 -9221196 -12601819 -7063920 1641578 3887239 -1229080 -7050241 -9668831
41253i668831j553218k393347m11194N418052J0067622Q408507J815579k765799
$$ -9668831 -11222049 -13615396 -14026590 -8608538 1459084 9867591 11683170 8917371
41245H917371j447480Q22770k734975q895913o967027M580091J2685522P007072
$$ 8917371 7469891 8292661 5557686 -3338227 -10305254 -5725163 6960359 13967431
41237A3967431n080546r437795m701709k51517M15135J608531L249871N28704
$$ 13967431 8886885 -550910 -5252619 -5504136 -5089001 -3480470 -230599 298105
41229B98105l901719j118734P937932J0706390K199040o290066m307787K874349
$$ 298105 -3603614 -4722348 3215584 13921974 16121014 9830948 5523161 8397510
41221H397510M572829N24011k711059l647048m573984l936130N91946N238726
$$ 8397510 12970339 13494350 10783291 7136243 2562259 -1373871 -781925 4456801
41213D456801M761202J004707n10531L54107k40589k381172l020516k072388j425724
$$ 4456801 9218003 10222710 9712179 10066286 9825697 7444525 4424009 2351621 925897
41204I25897j13256L245472N472212K759591k409404m612596l844938m066459
$$ 925897 812641 4058113 9530325 12289916 9880512 5267916 1422978 -2643481
41196b643481n188311l431834J220184M519947M550585L033940P65631k490309
$$ -2643481 -7831792 -11263626 -10043442 -5523495 -972910 2061030 2826661 336352
41188C36352m460953k740247J08084q8626j691776O5412L880846L670525p65092
$$ 336352 -4124601 -6864848 -6756764 -6845390 -8537166 -8471754 -4590908 -920383 -1685475
41179a685475k644077O58270L519064J927004l16833P06747K190753P17960o48178
$$ -1685475 -4329552 -3671282 -152218 1774786 1457953 2164700 4355453 5073413 4425235
41170D425235K320406O677143N837716o04192o313843o594072k724533J490533
$$ 4425235 6745641 13422784 19260500 18656308 12342465 5748393 3023860 4514393
41162D514393L395146J915529j880312m288469k238084K288236L842336L22084
$$ 4514393 7909539 9825068 7944756 3656287 1418203 3706439 7548775 7870859
41154G870859m424097o038143n064089m614719m697846k530278J878717M594000
$$ 7870859 3446762 -2591381 -7655470 -12270189 -16968035 -19498313 -17619596 -13025596
41146a3025596L649340K217058K967713K855238j665850o785277n326784J856491
$$ -13025596 -9376256 -7159198 -4191485 -1336247 -3002097 -9787374 -15114158 -13257667
41138a3257667N761939K120892k795237k466817P98712J931339J710163K855568
$$ -13257667 -7495728 -5374836 -8170073 -10636890 -9838178 -7906839 -6196676 -3341108
41130c341108L080254k14050k696671O96705N527130L550332l017921l647052
$$ -3341108 -260854 -474904 -3171575 -2474870 3052260 6602592 3584671 -62381
41122f2381L455475P383651J162706p342382p097299O30244N426853K236514l669965
$$ -62381 3393094 10776745 11939451 4597069 -2500230 -1869986 3556867 5793381 2123416
41113B123416m669266N96684O242077N281501k078841o924084j980643P392541
$$ 2123416 -2545850 -1949166 4292911 9574412 7495571 571487 -1409156 5983385
41105E983385Q638337r32341r926135q520008q06694L303832J664934j117121
$$ 5983385 14621722 13689381 3763246 -4756762 -5563456 -2259624 -594690 -1711811
41097a711811k714132l444179j479607M228596Q490904N334695k044872m499159
$$ -1711811 -4425943 -7870122 -9349729 -5121133 3369771 8704466 6659594 2160435
41089B160435r6228L579628J488590k092038j769392P38515J101955q2101K13399
$$ 2160435 2064207 5643835 7132425 5040387 3270995 4009510 5111465 5029364 5242763
41080E242763Q02813j771816o044308o412531j737749K244163J423513l15720
$$ 5242763 6045576 4273760 -1770548 -8183079 -9920828 -7676665 -6253152 -6568872
41072f568872K655076Q090902Q214665J286860n099640m334812P89386L658985
$$ -6568872 -3913796 4177106 12391771 13678631 8578991 4244179 5033565 8692550
41064H692550L303735K844788J925297k005295o151656m423689J706213K681208
$$ 8692550 11996285 14841073 16766370 14761075 8609419 4185730 5891943 8573151
41056H573151n022131j1654979p140459M288579R904152N662821n53616j970194
$$ 8573151 3551020 -8103959 -15244418 -10955839 -1051687 4611134 4057518 2087324
41048B087324r87981k188159l986539j815072L773183O899804L860025k264430
$$ 2087324 1099343 -1088816 -5075355 -6890427 -3117244 3782560 7642585 5378155
41040E378155n433173l546907O0186J803981K316750L966270N707259M084182
$$ 5378155 -55018 -3601925 -3541739 -1737758 578992 4545262 10252521 14336703
41032A4336703p50717m230044l828209k179006j721577p25452K045213L140545
$$ 14336703 13585986 9355942 5527733 3348727 1627150 901698 2946911 6087456
41024F087456k74416m474764m264454j331894j032194k707389q96932L984016
$$ 6087456 5813040 1338276 -2926178 -4258072 -5290266 -7997655 -8894587 -4910571
41016d910571M630037j134548n212307q85796O518601O936421k84243o369787
$$ -4910571 -280534 -1415082 -6627389 -7513185 -994584 5941837 5657594 -712193
41008g12193n729103j955123n55601j383236j042681Q50666J574608K17159o90232
$$ -712193 -6441296 -8396419 -8952020 -10335256 -11377937 -10527271 -8952663 -8735504 -9425736
40999i425736R04120L235203K955303j52220k506548j003009L419570P046767
$$ -9425736 -8521616 -5286413 -2331110 -2483330 -4989878 -5992887 -2573317 4473450
40991D473450P103385L645496r43765l530026k741956r65023k102173n890412
$$ 4473450 11576835 15222331 14278566 10748540 8006584 7041561 4939388 -951024
40983i51024o728244r52400O594886P382483J78776p157666p889540m213169k328453
$$ -951024 -7679268 -8631668 -2036782 5345701 5524477 -1633189 -9522729 -13735898 -16064351
40974a6064351l061867j665435L909192Q885466P693268J666731k502520j766429
$$ -16064351 -19126218 -20791653 -16882461 -7996995 -303727 1363004 -1139516 -2905945
40966b905945m74233k892977n399531j455901O806950R318871K612297l915816
$$ -2905945 -3380178 -6273155 -11672686 -13128587 -6321637 2997234 5609531 1693715
40958A693715j694907L893515K641576l242292k585888N475793Q657227Q86224
$$ 1693715 -1192 3892323 6533899 3291607 705719 6181512 14838739 15724963
40950A5724963p655481o260796P77185L081314M65127k55853R51109j460149o271717
$$ 15724963 8069482 1808686 2585871 5667185 6132312 5876459 6827568 5367419 -904298
40941i04298o194291r70435J228879k426933m326426J040578Q032465Q458353
$$ -904298 -7098589 -8069024 -6840145 -9267078 -13593504 -12552926 -4520461 3937892
40933C937892K491520m135552p959787p618487j652853P131308R928799K053944
$$ 3937892 6429412 2293860 -5665927 -13284414 -14937267 -7805959 2122840 4176784
40925D176784q288065r036240l46618O275609M579650Q89820K573407O754968
$$ 4176784 -4111281 -13147521 -13494139 -7218530 -2638880 -1749060 824347 7579315
40917G579315N603832j646676p658128o488699J99840O298967P484508L801535
$$ 7579315 13183147 11536471 3878343 -2610356 -2410516 3888451 11372959 15174494
40909A5174494j607742n021522m433764q56556K368376K423409q7219j659090
$$ 15174494 13566752 8545230 4111466 3254910 5623286 8046695 7959476 6300386
40901F300386k36260J823060R37968k351957m202816l373333k255706j396136
$$ 6300386 6064126 7887186 8825154 6473197 2270381 -1102952 -3358658 -4754794
40893d754794J708576O108642N861537m85195m968385j487205L622293J364687
$$ -4754794 -3046218 3062424 8923961 8438766 3470381 1983176 5605469 6970156
40885F970156m296338k604940M635063M555652m428672p698219J844367J0345693
$$ 6970156 2673818 68878 4703941 9259593 4830921 -2867298 -1022931 9322762
40877I322762M236896p798592q598679P73513M837399n85346m035260M59387M551234
$$ 9322762 13559658 5761066 -2837613 -2064100 2773299 2187953 -1847307 -1387920 3163314
40868C163314J495495l226486l016863m95428j98819k68828J915959L556702K232203
$$ 3163314 4658809 1432323 -1584540 -2079968 -2278787 -2547615 -631656 2925046 5157249
40859E157249J050154K075158J378129l034004m981977P48737Q447251Q562756
$$ 5157249 6207403 8282561 9660690 6626686 1644709 2393446 10840697 19403453
40851A9403453Q67609o795503r562639q186049l713645K761799O816559M489897
$$ 19403453 20271062 13475559 3912920 -4273129 -7986774 -5224975 1591584 6081481
40843F081481j263910l967494k592187j416102k025298j636244Q55697K952928
$$ 6081481 4817571 850077 -1742110 -3158212 -5183510 -6819754 -5964057 -3011129
40835c011129L148523K700622K447226J745121M64912j183291l662217n809587
$$ -3011129 137394 2838016 5285242 7030363 7495275 6311984 2649767 -3159820
40827c159820m085281J659740M868992N14380o174144o085065P70379O167470
$$ -3159820 -7245101 -5585361 -716369 -201989 -6376133 -12461198 -11690819 -5523349
40819e523349O097455M054199K581127M21866j453351j17673J701095k122067
$$ -5523349 574106 4628305 7209432 7631298 6177947 6060274 7761369 5639302
40811E639302q858337p424198M116882J1892802M816957q442937j0836651n9032
$$ 5639302 -3219035 -10643233 -6526351 5366451 10183408 1740471 -9096180 -9155212
40803i155212R911383Q329691o09944o238900m332572Q27380L140651J129647
$$ -9155212 756171 9085862 8475918 2237018 -2095554 -1268174 1872477 3002124
40795C002124j132411O01473M420414L945544k418335p855171n904946O41285
$$ 3002124 1869713 2471186 6891600 10837144 8418809 563638 -5341308 -4700023
40787d700023L869356J262260k512795k910364k42850K476856L070633J584419
$$ -4700023 -830667 431593 -2081202 -4991566 -5234416 -2757560 313073 1897492
40779A897492M7103J39244L39709k145378n691260m732832J632785O371558L937830
$$ 1897492 1944595 2083839 2423548 278170 -5413090 -10145922 -8513137 -2141579 1796251
40770A796251j567641k923267l40279R32246J92914R65928L078304K902807P47790
$$ 1796251 228610 -2694657 -3034936 -2102690 -1909776 -943848 2134456 5037263 5785053
40761E785053K69477O70505k328017o904309n367961L236379R190490N447913
$$ 5785053 6054530 6725035 4397018 -2507291 -7875252 -4638873 4551617 9999530
40753I999530k223643m237947m57549K244659J296939j11984m36946j370297k757921
$$ 9999530 7775887 3537940 3080391 5325050 6621989 6510005 6073059 4702762 1944841
40744A944841k359966q71285j392837l273899k304395J449678K074609k664979
$$ 1944841 -415125 -1286410 -2679247 -5953146 -8257541 -6807863 -4733254 -7398233
40736g398233n813087p16778P774103Q789552J093225m521137o19036O201203
$$ -7398233 -13211320 -13928098 -6153995 2635557 3728782 -792355 -1411391 4789812
40728D789812N221919k875522p766959m605666P87861K610160K871934M842762
$$ 4789812 10011731 7136209 -630750 -5236416 -4448555 -1838395 1033539 5876301
40720E876301N555141J044619n191745n979103r24209L306976K653281k50282
$$ 5876301 11431442 12476061 7284316 1305213 381004 3687980 6341261 6090979
40712F090979j845228j900708j053831O07367J055907k375717p170376o401566
$$ 6090979 4245751 2345043 1291212 1898579 2954486 578769 -6591607 -12993173
40704a2993173J537745Q872779Q210596K132196j779902j671978j132355j008944
$$ -12993173 -11455428 -2582649 5627947 7760143 5980241 4308263 3175908 2166964
40696B166964J041847L554868J659046m001274o155122k040943J234284k224398
$$ 2166964 3208811 6763679 8422725 4421451 -1733671 -3774614 -2540330 -4764728
40688d764728o704859l387477M625607N665640k399305p733813j798950P933602
$$ -4764728 -11469587 -14857064 -10231457 -4565817 -6965122 -14698935 -16497885 -8564283
40680h564283R212383K438284j721698J383261N662120N146198J053107l233422
$$ -8564283 648100 3086384 1364686 2747947 8410067 13556265 14609372 11375950
40672A1375950o701587p898348m368320J880031M332284J007620k085071n08234
$$ 11375950 4674363 -3223985 -7592305 -5712274 -1379990 -372370 -2457441 -2965675
40664b965675J499779j148163m894499k887062L876479Q134318O842687L042798
$$ -2965675 -1465896 -2614059 -7508558 -10395620 -6519141 1615177 8457864 11500662
40656A1500662r80384n024323o418737k008827M770149O180264J021521l579431
$$ 11500662 10520278 5495955 -922782 -2931609 1838540 8018804 9040325 5460894
40648E460894l066161j312554k725587n014974m113307j148771L12134L32730
$$ 5460894 2394733 1082179 -1643408 -6658382 -10771689 -11920460 -11608326 -11275596
40640a1275596J375908L566203N050530N100652L751361M00938m315365p160143
$$ -11275596 -9899688 -6333485 -1282955 3817697 7569058 7969996 3654631 -3505512
40632c505512n552436p50397M075017P025754P275468M442420J79584k293033
$$ -3505512 -9057948 -9808345 -5733328 1292426 8567894 13010314 13189898 10896865
40624A0896865k302687k669419m743968n830691l703351o252L258548O330788
$$ 10896865 8594178 5924759 1180791 -4649900 -8353251 -8359503 -5100955 1229833
40616A229833P786338L310949o729832j3363902r214184Q12240N983541M089760
$$ 1229833 9016171 12327120 5597288 -7766614 -16980798 -16168558 -10185017 -6095257
40608f095257J597474J541551M76817k289743j880105K968870N998524K892559
$$ -6095257 -4497783 -2956232 -2479415 -4769158 -6649263 -3680393 2318131 5210690
40600E210690j824667j957709J612400M116708M372772M154978L650993K259240
$$ 5210690 3386023 1428314 3040714 7157422 11530194 15685172 19336165 21595405
40592B1595405J027155K03749k483344p075339q719168m658832O7993m5471j769879
$$ 21595405 22622560 22826309 20342965 13267626 4548458 -110374 -42381 -87852 -1857731
40583a857731J220360O623136O669113J534089q20302J292973O57696m580728
$$ -1857731 -637371 5985765 12654878 14188967 13368665 14661638 15319334 10738606
40575A0738606n851741P37911N518056L63430p118646n851266L00503J05323m705018
$$ 10738606 4886865 5624776 11142832 11506262 4387616 -1463650 -1163147 -1057824 -5762842
40566e762842k685558N823476P571347j199790p831744m124353J334381j63256
$$ -5762842 -8448400 -2624924 4946423 3746633 -4085111 -8209464 -6875083 -7038339
40558g038339k703415J369132O083574K682214l638528k364449L771083L836739
$$ -7038339 -9741754 -8372622 -2289048 393166 -3245362 -5609811 -1838728 1998011
40550A998011k258521m832307j838940l27793j760379o56063K242125M48927l708188
$$ 1998011 -260510 -5092817 -6931757 -7259550 -9019929 -9675992 -7433867 -6984940 -10693128
40541a0693128o68704P794513Q050506k556150q964538j944455P576073P525991
$$ -10693128 -11361832 -3567319 4483187 1927037 -7037501 -8981956 -1405883 6120108
40533F120108K911079K742863K601780m610657j1669051p754223J640541K794477
$$ 6120108 9031187 11774050 14375830 9765173 -1903878 -9658101 -8017560 -5223083
40525e223083l509734m560212K123957O470831M804863M112752N961039K584100
$$ -5223083 -8732817 -13293029 -11169072 -4698241 106622 4219374 10180413 12764513
40517A2764513p015897j1962237o387665J246126K250797N934J078470L868274
$$ 12764513 5748616 -6213621 -12601286 -11355160 -9104363 -9098429 -8019959 -4151685
40509d151685L904844K468243K209339P83316l749721o818261l900846J322115
$$ -4151685 -246841 2221402 4430741 5214057 1464336 -5353925 -9254771 -7932656
40501g932656K162974j362212m143657m091607k838830j011965J625898L121199
$$ -7932656 -5769682 -7131894 -11275551 -15367158 -18205988 -19217953 -17592055 -14470856
40493a4470856J320046k052610k847045P92268P080155J2169769J2034506N977935
$$ -14470856 -13150810 -15203420 -18050465 -17258197 -10178042 1991727 14026233 20004168
40485B0004168o02422j167225K873358L309260k615143p645801n956238k194309
$$ 20004168 19401746 18234521 21107879 24417139 21801996 14156195 8199957 6005648
40477F005648l071988n857374l195222M214039Q076746M384399k362562o595001
$$ 6005648 2933660 -2923714 -6118936 -1904897 6171849 10556248 8193686 1598685
40469A598685p093334m575528M39803N786343P731391M803850m59615m251302
$$ 1598685 -5494649 -10070177 -9630374 -3844031 3887360 8691210 8231595 3980293
40461C980293m708493k820786j249041j335049r39304K482924O532872N795995
$$ 3980293 -728200 -3548986 -4798027 -6133076 -7072380 -4589456 1943416 7739411
40453G739411L49227l073295j216924M14667k971972o789340m634923N04602J096122
$$ 7739411 8088638 5015343 3798419 4213086 1241114 -5548226 -10183149 -9678547 -8582425
40444h582425k125553j620513L734423O422482K537656k253926j931321J534305
$$ -8582425 -10707978 -12328491 -8594068 -2171586 366070 -1887856 -3819177 -2284872
40436b284872K712849M80408k396007l771360l101842n74029K319224L243989
$$ -2284872 427977 908385 -1487622 -5258982 -8360824 -8934853 -6615629 -3371640
40428c371640J606517p46191j767152o68439K082190M176234K571057j828529
$$ -3371640 -1765123 -2511314 -4278466 -4946905 -2864715 1311519 3882576 2054047
40420B054047k973645K388627Q001602N528067k780981o433393k014180J942808
$$ 2054047 -919598 1469029 9470631 14998698 12217717 5784324 3770144 5712952
40412E712952k083653r979933j2366184o166013M131097J2294665J3874822Q123656
$$ 5712952 3629299 -6350634 -18716818 -24882831 -20751734 -8457069 5417753 13541409
40404A3541409L3931l144123m58583J448060j802496o040454n777379k652500
$$ 13541409 13575340 10431217 9972634 11420694 9618198 3577744 -2199635 -4852135
40396d852135j568031k536298k216991n98876j61876l82267J089424L095022K544978
$$ -4852135 -6420166 -8956464 -11173455 -11772331 -11934207 -12316474 -11227050 -8132028 -5587050
40387e587050N63655J218895M011101L551845j738627n897506l371108K953504
$$ -5587050 -5023395 -3804500 206601 3758446 2019819 -3877687 -7248795 -4295291
40379d295291N333242J143059m099515l869895J458444N320698K990267l007425
$$ -4295291 1037951 2181010 -1918505 -5788400 -4329956 990742 3981009 973584
40371I73584o612302n683149l112642j358680L03829K471201L648767L411268
$$ 973584 -5638718 -11321867 -14434509 -15793189 -15489360 -13018159 -9369392 -5958124
40363e958124L692862M550988K714232k302791m885905j054212M030580K646662
$$ -5958124 -2265262 2285726 4999958 2697167 -2188738 -3242950 787630 3434292
40355C434292l548580n543583p42092L051691k83526n993002n896835l40650K976754
$$ 3434292 -114288 -5657871 -6399963 -3348272 -3631798 -9624800 -15521635 -15862285 -12885531
40346a2885531J90354m005364l323072K035348O125742M763814M53541q93621
$$ -12885531 -12695177 -16700541 -20023613 -17988265 -11862523 -7098709 -6645168 -7538789
40338g538789K488254N856986M317663l91627k411791k08429J603352r5113j714832
$$ -7538789 -5050535 806451 5124114 4732487 2320696 2112267 3715619 3620506 1905674
40329A905674J265697O134094N538532j811491p856768n138857L149896P105566
$$ 1905674 3171371 9305465 14843997 13032506 5175738 36881 3186777 10292343
40321A0292343K904299l155941m363923k211885j620516j865046J223604N851133
$$ 10292343 13196642 10040701 5676778 3464893 1844377 -20669 1202935 7054068
40313G054068N165117j117717m188064N50220N076912N21577q415116r855658
$$ 7054068 12219185 11101468 6913404 7463624 12540536 13062113 4646997 -5208661
40305e208661k457033L347044J567809j940383p92073K327491K208879J26663
$$ -5208661 -7665694 -4318650 -2750841 -4691224 -5483297 -3155806 -946927 -820264
40297h20264K71482K146446K523423J451561P72338l41133k780374l116862J926425
$$ -820264 -548782 1597664 4121087 5572648 6344986 6003853 3223479 106617 2033042
40288B033042Q230439Q142119J431777l974008l268967p78758k252129o248227
$$ 2033042 10263481 18405600 19837377 15863369 12594402 11815644 9563515 3315288
40280C315288p080884l222595J258365K383478K59678k257774k686188n78543
$$ 3315288 -3765596 -6988191 -5729826 -3346348 -3086670 -5344444 -8030632 -8609175
40272h609175K580192M763634M994085L569278J219880j062718j898007q07506
$$ -8609175 -6028983 -1265349 3728736 7298014 8517894 7455176 5557169 4749663
40264D749663N24949N8846j627659k307629k001799k897255m601494l151399K785661
$$ 4749663 5274612 5333458 3705799 1398170 -603629 -3500884 -8102378 -11253777 -8468116
40255h468116P881507O216368l39200m184880k062675J388837J115546j597542
$$ -8468116 -586609 5629759 5290559 1105679 -956996 431841 1547387 -50155
40247e0155k437844q89719Q7452l08050L19669K536673K860508j099028n635785
$$ -50155 -2487999 -3377718 -3290266 -3598316 -3278647 -741974 2118534 1019506 -4616279
40238d616279m545971K416705P884914N391374k400787o634712k994083L295361
$$ -4616279 -9162250 -6745545 1139369 6530743 4129956 -2504756 -5498839 -2203478
40230b203478M163869j853160q708320r898662m245253M341116J0180031R260862
$$ -2203478 1960391 107231 -8601089 -18499751 -22745004 -18403888 -8223857 1037005
40222A037005K472308l854623l393550K873920P218317M471551j940146n434456
$$ 1037005 3509313 -345310 -3738860 -864940 6353377 10824928 8884782 3450326
40214C450326m770328l433942k703568l62878L860556O499269N340750K258337
$$ 3450326 -1320002 -4753944 -7457512 -7820390 -3959834 2539435 7880185 10138522
40206A0138522o40569l870385p155454o904853j027217N977662P113675J513915
$$ 10138522 9497953 5627568 -1527886 -8432739 -9459956 -3482294 3631381 5145296
40198E145296m650520n944525l155205m22626J90526k99817m76849l11598l91872
$$ 5145296 494776 -5449749 -8604954 -9027580 -8837054 -9136871 -9613720 -9925318 -10317190
40189a0317190l37913J144635M004256N379354K477985k779663m752303j182011
$$ -10317190 -10655103 -9510468 -5506212 -126858 2351127 -428536 -5180839 -6362850
40181f362850L552998M687190L530224L909821M805600J935938m283099q138999
$$ -6362850 -2809852 1877338 5407562 9317383 14122983 16058921 11775822 3636823
40173C636823o546386k429334P24282K483508K390556q99778m952884l991446
$$ 3636823 -2909563 -5338897 -4614615 -2131107 259449 -640329 -5593213 -9584659
40165i584659K245685N797958J662069l672206j515852N479058P305934J840070
$$ -9584659 -7338974 -1541016 121053 -3551153 -5067005 412053 7717987 9558057
40157I558057k901550j811882P58750j77849k479284j880331R11509K436019J722110
$$ 9558057 6656507 4844625 5603375 5425526 2946242 1065911 1977420 4413439 6135549
40148F135549l92384l581864o253709n000305M80941N072921M554700J232493
$$ 6135549 5743165 2161301 -4092408 -9092713 -8611772 -3538851 1015849 2248342
40140B248342n48698j271863l806758o682071n514481k64353M091344M170480
$$ 2248342 1699644 427781 -3378977 -10061048 -15575529 -15839882 -11748538 -7578058
40132g578058J364602j416779k326680k31062M267073P559313O460276K580468
$$ -7578058 -6213456 -7630235 -9956915 -10187977 -5920904 1638409 8098685 10679153
40124A0679153k37464j630480l326591l607618M33605N467048M357189k409668
$$ 10679153 10441689 8811209 5484618 1877000 2310605 7777653 12134842 9725174
40116I725174n428435J97433P344104P407086J783038k909757n121222o826300
$$ 9725174 4296739 4494172 11838276 19245362 21028400 18118643 12997421 6171121
40108F171121o522338j947895L240647L763905J784055L285726O458524L010938
$$ 6171121 -351217 -2299112 941535 4705440 6489495 9775221 16233745 19244683
40100A9244683p699117j4818007r961451J779391R103216P726730K173098j758086
$$ 19244683 11545566 -3272441 -13233892 -11454501 -2351285 5375445 7548543 5790457
40092E790457k078919l60219N08504o88096j905545r41965O80586L89425k08001
$$ 5790457 3711538 3351319 3859823 3171727 1266182 324217 1004803 1394228 1186227
40083A186227J799655L558214p9546n597766l010269P658787J2390617K537566
$$ 1186227 2985882 6544096 6464550 866784 -2143485 5515302 17905919 20443485
40075B0443485j0851281j1690037j149354N965408L042840k313266l053366j464791
$$ 20443485 9592204 -2097833 -3247187 2718221 5761061 3447795 394429 -1070362
40067a070362j085458j26783K809527M122694R87354l642028n603917m749231
$$ -1070362 -2155820 -2282603 526924 4649618 5636972 1994944 -3608973 -8358204
40059h358204k703676K46505L198691L597470R97920j560715k186500k543483
$$ -8358204 -11061880 -10815375 -7616684 -4019214 -3021294 -4582009 -6768509 -9311992
40051i311992l512295k427883K431415P763553Q600429L746815l692907q903968
$$ -9311992 -12824287 -15252170 -12820755 -5057202 3543227 7290042 3597135 -5306833
40043e306833p940952j246905M771088L980413r01617j243822M767119Q970532
$$ -5306833 -13247785 -14494690 -9723602 -5743189 -6644806 -7888628 -3121509 5849023
40035E849023N694732J98488m37604J704452N94726k575313k007701J562726J260550
$$ 5849023 11543755 11742243 11304639 13009091 13603817 11028504 9020803 10583529 11844079
40026A1844079m455540q659574o154121n25987J861423M30820m20315J760381
$$ 11844079 7388539 -1271035 -7425156 -7951143 -6089720 -5658900 -6079215 -4318834
40018d318834M452697L789874k43560l170016j340342K879419L787333K38346
$$ -4318834 133863 3923737 3680177 510161 -830181 2049238 5836571 6074917
$$ [...]
##END NTUPLES=NMR SPECTRUM
##END=
