##TITLE=31Pdec_PR162_K
 CDCl3, 124 sc
 27.5.2019
##JCAMPDX= 6.0         $$ Bruker NMR JCAMP-DX V2.0
##DATA TYPE= NMR SPECTRUM
##DATA CLASS= NTUPLES
##ORIGIN= UXNMR, Bruker Analytische Messtechnik GmbH
##OWNER= root
$$ XWIN-NMR		Version 3.5
$$ Mon May 27 14:22:31 2019 Russian Standard Time (UT+4h)  she@DPX200
##.OBSERVE FREQUENCY= 81.013821
##.OBSERVE NUCLEUS= ^31P
##.ACQUISITION MODE= SIMULTANEOUS
##.ACQUISITION SCHEME= undefined
##.AVERAGES= 124
##.DIGITISER RES= 17
##SPECTROMETER/DATA SYSTEM= spect
##.PULSE SEQUENCE= zgpg30
##.SOLVENT NAME= DMSO
##.SHIFT REFERENCE= (INTERNAL, DMSO, 0, 182.463)
##AUDIT TRAIL= $$ (NUMBER, WHEN, WHO, WHERE, WHAT)
$$ ##TITLE= Audit trail, XWIN-NMR		Version 3.5
$$ ##JCAMPDX= 5.01
$$ ##ORIGIN= Bruker BioSpin GmbH
$$ ##OWNER= she
$$ F:/spectra/data/she/nmr/P31/1/pdata/1/auditp.txt
$$ ##AUDIT TRAIL=  $$ (NUMBER, WHEN, WHO, WHERE, WHAT)
(   1,<2019-05-27 14:21:25.82 +0400>,<she>,<DPX200>,
      <continue with go, POWCHK disabled, PULCHK disabled
       configuration hash MD5:
       00 E9 B6 7A A2 85 ED C7 34 08 36 98 17 FE 4E 26
       data hash MD5: 32K
       7E 00 41 30 11 C1 CA 52 F7 D5 73 A4 13 23 3F 31>)
(   2,<2019-05-27 14:21:44.96 +0400>,<she>,<DPX200>,
      <Start of raw data processing
       efp BC_mod = 2 LB = 1 FT_mod = 6 PKNL = 1 PHC0 = -1814.578 PHC1 = 74.39899 SI = 64K 
       data hash MD5: 64K
       33 16 78 78 2F E8 21 4F DA DB B2 57 C3 AB 4F 17>)
(   3,<2019-05-27 14:22:02.14 +0400>,<she>,<DPX200>,
      <pk PHC0 = 4.117612 PHC1 = 0 
       data hash MD5: 64K
       F6 91 D5 6C 94 CA 27 66 3B 0D 96 AB DD 11 40 E2>)
(   4,<2019-05-27 14:22:05.70 +0400>,<she>,<DPX200>,
      <abs ABSG = 5 
       data hash MD5: 64K
       D9 F5 8E 43 79 A2 E8 6E 37 BE EE 7B C2 54 62 3D>)
$$ ##END=
$$ 
$$ hash MD5
$$ 0A 0F 67 79 08 0D B4 C3 57 6A 2D 63 B9 EE 2D 64
##$RELAX= 
##$RELAX= 
##$RELAX= 
##$RELAX= 
##$RELAX= 
##$RELAX= 
##$RELAX= 
##$RELAX= 
$$ Bruker specific parameters
$$ --------------------------
##$DU= <F:/spectra>
##$EXPNO= 1
##$NAME= <P31>
##$PROCNO= 1
##$TYPE= <nmr>
##$USER= <she>
##$AMP= (0..31)
100 100 100 100 100 100 100 100 100 100 100 100 100 100 100 100 100 100 
100 100 100 100 100 100 100 100 100 100 100 100 100 100 
##$AQSEQ= 0
##$AQ_mod= 1
##$AUNM= <au_zg>
##$AUTOPOS= <>
##$BF1= 81.014009
##$BF2= 200.13
##$BF3= 200.13
##$BF4= 200.13
##$BF5= 200.13
##$BF6= 200.13
##$BF7= 200.13
##$BF8= 200.13
##$BYTORDA= 1
##$CFDGTYP= 0
##$CFRGTYP= 5
##$CHEMSTR= <none>
##$CNST= (0..31)
1 1 145 1 1 1 1 1 1 1 1 1 1 1 1 1 1 1 1 1 1 1 1 1 1 1 1 1 1 1 1 1 
##$CPDPRG= <waltz16>
##$CPDPRG1= <>
##$CPDPRG2= <waltz16>
##$CPDPRG3= <>
##$CPDPRG4= <mlev>
##$CPDPRG5= <mlev>
##$CPDPRG6= <mlev>
##$CPDPRG7= <mlev>
##$CPDPRG8= <mlev>
##$CPDPRGB= <>
##$CPDPRGT= <>
##$D= (0..31)
0 1 0 0 0 0 0 0 0 0 0 0.03 2e-05 3e-06 0 0 0 0 0 0 0 0 0 0 0 0 0 0 0 0 
0 0 
##$DATE= 1558952291
##$DBL= (0..7)
120 120 120 11 120 120 24 19 
##$DBP= (0..7)
150 150 150 150 150 150 150 150 
##$DBP07= 0
##$DBPNAM0= <>
##$DBPNAM1= <>
##$DBPNAM2= <>
$$ [...]
##$SUBNAM3= <"">
##$SUBNAM4= <"">
##$SUBNAM5= <"">
##$SUBNAM6= <"">
##$SUBNAM7= <"">
##$SUBNAM8= <"">
##$SUBNAM9= <"">
##$SW= 369.568048894756
##$SWIBOX= (0..15)
0 1 3 0 0 0 0 0 0 0 0 0 0 0 0 0 
##$SW_h= 29940.119760479
##$TD= 32768
##$TD0= 1
##$TE= 0
##$TE2= 300
##$TE3= 300
##$TEG= 300
##$TL= (0..7)
0 120 53 12 22 120 120 120 
##$TP= (0..7)
150 150 150 150 150 150 150 150 
##$TP07= 0
##$TPNAME0= <>
##$TPNAME1= <>
##$TPNAME2= <>
##$TPNAME3= <>
##$TPNAME4= <>
##$TPNAME5= <>
##$TPNAME6= <>
##$TPNAME7= <>
##$TPOAL= (0..7)
0.5 0.5 0.5 0.5 0.5 0.5 0.5 0.5 
##$TPOFFS= (0..7)
0 0 0 0 0 0 0 0 
##$TUNHIN= 0
##$TUNHOUT= 0
##$TUNXOUT= 0
##$USERA1= <user>
##$USERA2= <user>
##$USERA3= <user>
##$USERA4= <user>
##$USERA5= <user>
##$V9= 5
##$VALIST= <valist>
##$VCLIST= <CCCCCCCCCCCCCCC>
##$VD= 0
##$VDLIST= <DDDDDDDDDDDDDDD>
##$VPLIST= <PPPPPPPPPPPPPPP>
##$VTLIST= <TTTTTTTTTTTTTTT>
##$WBST= 1024
##$WBSW= 4
##$XGAIN= (0..3)
0 0 0 0 
##$XL= 0
##$YL= 0
##$YMAX_a= 40038
##$YMIN_a= -47514
##$ZGOPTNS= <>
##$ZL1= 120
##$ZL2= 120
##$ZL3= 120
##$ZL4= 120
##$ABSF1= 182.463
##$ABSF2= -187.1042
##$ABSG= 5
##$ABSL= 3
##$ALPHA= 0
##$AQORDER= 0
##$ASSFAC= 0
##$ASSFACI= 0
##$ASSFACX= 0
##$ASSWID= 0
##$AUNMP= <proc_1d>
##$AZFE= 0.1
##$AZFW= 0.5
##$BCFW= 0
##$BC_mod= 2
##$BYTORDP= 0
##$COROFFS= 0
##$CY= -3
##$DATMOD= 1
##$DC= 0
##$DFILT= <>
##$DTYPP= 0
##$F1P= 0
##$F2P= 0
##$FCOR= 1
##$FTSIZE= 65536
##$FT_mod= 6
##$GAMMA= 0
##$GB= 0
##$INTBC= 1
##$INTSCL= 5.30512e-09
##$ISEN= 30
##$LB= 1
##$LEV0= 0
##$LPBIN= 0
##$MAXI= 10000
##$MC2= 0
##$MEAN= 0
##$ME_mod= 0
##$MI= 50
##$NCOEF= 0
##$NC_proc= -5
##$NLEV= 6
##$NOISF1= 182.463
##$NOISF2= 159.3651
##$NSP= 0
##$NTH_PI= 0
##$NZP= 0
##$OFFSET= 182.463
##$PC= 4
##$PHC0= -1810.46
##$PHC1= 74.39899
##$PH_mod= 1
##$PKNL= yes
##$PPARMOD= 0
##$PSCAL= 0
##$PSIGN= 0
##$REVERSE= no
##$SF= 81.0140089999434
##$SI= 65536
##$SIGF1= 159.3651
##$SIGF2= -187.1042
##$SINO= 113.3802
##$SIOLD= 16384
##$SREGLST= <1H.CDCl3>
##$SSB= 0
##$STSI= 65536
##$STSR= 0
##$SW_p= 29940.119760479
##$SYMM= 0
##$S_DEV= 0
##$TDeff= 32768
##$TDoff= 0
##$TI= <>
##$TILT= no
##$TM1= 0
##$TM2= 0
##$TOPLEV= 0
##$USERP1= <user>
##$USERP2= <user>
##$USERP3= <user>
##$USERP4= <user>
##$USERP5= <user>
##$WDW= 1
##$XDIM= 65536
##$YMAX_p= 278345520
##$YMIN_p= -16848751
$$ End of Bruker specific parameters
$$ ---------------------------------
##NTUPLES= NMR SPECTRUM
##VAR_NAME=  FREQUENCY,     SPECTRUM/REAL,   SPECTRUM/IMAG
##SYMBOL=    X,             R,               I
##VAR_TYPE=  INDEPENDENT,   DEPENDENT,       DEPENDENT
##VAR_FORM=  AFFN,          ASDF,            ASDF
##VAR_DIM=   65536,         65536,           65536
##UNITS=     HZ,            ARBITRARY UNITS, ARBITRARY UNITS
##FACTOR=    0.456856943014862, 1,           1
##FIRST=     14782.0589164792, 0,            0
##LAST=      -15158.0608439998, 0,           0
##MIN=       -15158.0608439998, -16848751,   0
##MAX=       14782.0589164792, 278345520,    0
$$ Real data points
##PAGE= N=1
##DATA TABLE= (X++(R..R)), XYDATA
$$ [...]
44553B873179j193478k443743j396742K19683P9811j129181r12379Q73817J825852
$$ 2873179 1679701 -764042 -2160784 -1941101 -1861290 -2990471 -3902850 -3029033 -1203181
44544a203181R55764j1403J08418K20178m44344o85850J49433N31921m69974j130968
$$ -1203181 -247417 -258820 -150402 69776 -374568 -1060418 -910985 -379064 -849038 -1980006
44534a980006n1536J023875O5750j546692j319294J7872Q544r16310k88466J533254
$$ -1980006 -2031542 -1007667 -941917 -2488609 -3807903 -3790031 -3781487 -4697797 -4986263 -3453009
44524c453009J595310l64677j107040O88217K198960J236994l96297l93616M15224
$$ -3453009 -1857699 -2222376 -3329416 -2641199 -442239 794755 398458 4842 420066
44515D20066K91323k94058l42404p22667k096645k508834j34295L028599L357443
$$ 420066 711389 417331 74927 -647740 -2744385 -5253219 -5387514 -2358915 998528
44506I98528O78947j730484j747652l40550R10315J690520K059693J731207P73285
$$ 998528 1677475 -53009 -1800661 -2141211 -1230896 459624 2519317 4250524 5023809
44497E023809l04757j328028k235306k348219j125731O33797J598989J552277
$$ 5023809 4719052 3391024 1155718 -1192501 -2318232 -1684435 -85446 1466831
44489A466831J001566k09271k245577l705906k699457L71164K821943K828916
$$ 1466831 2468397 2259126 13549 -3692357 -6391814 -6020650 -3198707 -369791
44481c69791J173876l81440j038619q76751j68365N26307N11315j40326m32436
$$ -369791 804085 422645 -615974 -1492725 -1661090 -1134783 -623468 -763794 -1196230
44472a196230L17059J493623J796731O50849j110051j936002j120573L30125Q11314
$$ -1196230 -879171 614452 2411183 3062032 1951981 15979 -1104594 -774469 36845
44463C6845N4282p91159r66452q35899o32307K0800P85379M88481p53581j032163
$$ 36845 91127 -700032 -1666484 -2502383 -3134690 -3113890 -2328511 -1840030 -2593611 -3625774
44453c625774M86457J956658J651642N41233J96366L9196q87863j238644M63723
$$ -3625774 -3139317 -1182659 468983 1010216 1206582 1245778 357915 -880729 -417006
44444d17006K366805J558505j016810j718755k8316Q16442n87338j693192p23233
$$ -417006 1949799 3508304 2491494 772739 744423 1560865 973527 -719665 -1442898
44435a442898L88709k06631r16492K09519J689402R49034j255244j788092K53195
$$ -1442898 -1054189 -1260820 -2177312 -1967793 -278391 670643 -584601 -2372693 -2119498
44426b119498K427604K313943J68183j832137j875816j31937J357268Q52125q23151
$$ -2119498 308106 2622049 2790232 958095 -917721 -1049658 307610 1159735 336584
44417C36584j273616p995Q11067j50853j153403j29748J958040K464310P49662
$$ 336584 -937032 -945027 -133960 -284813 -1438216 -1567964 390076 2854386 3604048
44408C604048j345761k115338j457702j65829Q67765J036335O27287N90799R96853
$$ 3604048 2258287 142949 -1314753 -1480582 -612817 423518 1050805 1641604 2638457
44399B638457P07290n18462j012585J89824J132354m54535l217044l502414n59236
$$ 2638457 3345747 2827285 1814700 2004524 3136878 2682343 -534701 -4037115 -4596351
44390d596351K209900J945180L0704l55941J158969J988654N93384j309802j304605
$$ -4596351 -2386451 -441271 -410567 -766508 392461 2381115 2974499 1664697 360092
44381C60092K10355O37801q63576j911502m13015K048790K371308N59693m79750
$$ 360092 570447 1208248 344672 -1566830 -1979845 68945 2440253 2999946 2520196
44372B520196L22014P34951o11316j715661p51970N88653j2924j385036q91595
$$ 2520196 2842210 3577161 2965845 1250184 498214 1086867 1073943 -311093 -1202688
44363a202688P96902O14199j644489k664198p67907J551923J553818N0207m44246
$$ -1202688 -405786 208413 -1436076 -4100274 -4868181 -3316258 -1762440 -1712233 -2156479
44354b156479N49888J469212J259424K61405p89122j352037j128094m64443k33799
$$ -2156479 -1606591 -137379 1122045 1383450 594328 -757709 -1885803 -2350246 -2584045
44345b584045n51361l02651J110775K274723J370564r99385k136744p68992J120948
$$ -2584045 -3135406 -3438057 -2327282 -52559 1318005 318620 -1818124 -2587116 -1466168
44336a466168R50385r32809j823425m51570J479534J959977J216219N08030j09560
$$ -1466168 -515783 -1448592 -3272017 -3723587 -2244053 -284076 932143 1440173 1330613
44327A330613j051771j355731N5502J747403J117156j464989k685209j205562
$$ 1330613 278842 -1076889 -1021387 726016 1843172 378183 -2307026 -3512588
44319c512588L69278j70109j266461p16609M99905L84658k07275P65655K417252
$$ -3512588 -3143310 -3313419 -4579880 -5296489 -4796584 -4411926 -4619201 -3853546 -1436294
44310a436294K085105j26069j476290j019325m96326p45041o20096Q7325L2802
$$ -1436294 648811 522742 -953548 -1972873 -2469199 -3214240 -3834336 -3747011 -3714209
44301c714209o16645J37190K238712K737651M92630j514490p96078O70701l7727
$$ -3714209 -4330854 -4193664 -1954952 782699 1275329 -239161 -1035239 -364538 -402265
44292d02265j737053j118256J644278K961164J211836j207161j702435o92899
$$ -402265 -2139318 -3257574 -1613296 1347868 2559704 1352543 -349892 -1042791
44284a042791j0272r1005j21638J57718J62304l15430n66662L7778Q92571O41513
$$ -1042791 -1053063 -1144068 -1265706 -1107988 -945684 -1261114 -1827776 -1789998 -897427 -255914
44274b55914q74832j841282o50318J554328K103432O57996j55789J200104K583973
$$ -255914 -1130746 -2972028 -3622346 -2068018 35414 693410 537621 1737725 4321698
44265D321698J398700j240062k036197m17750Q19820r1459j441224j003387N96570
$$ 4321698 5720398 4480336 2444139 2026389 2846209 2754750 1313526 310139 906709
44256I06709J140899K25936n06316j82431J13620n68576j256338n12954J116330
$$ 906709 2047608 2273544 1767228 1584797 1698417 1129841 -126497 -639451 476879
44247D76879J583127J80089j509489j917586j420892j124322r00182N6399J473552
$$ 476879 2060006 2240095 730606 -1186980 -2607872 -3732194 -4632376 -4575977 -3102425
44238c102425K217009J854382Q08716n21949j536961j095610Q82983K183824Q17911
$$ -3102425 -885416 968966 1777682 1255733 -281228 -1376838 -493855 1689969 2507880
44229B507880j659627j868947M55876K087487J232694k36046m45825k98926r64894
$$ 2507880 848253 -1020694 -564818 1522669 2755363 2519317 2073492 1774566 809672
44220H09672j506993j123377j130117k236528k261942M80819L537023L383179
$$ 809672 -697321 -1820698 -2950815 -5187343 -7449285 -6968466 -3431443 -48264
44212d8264P27798p19732J37687R47519L37298l14783J21069P79770P49129L66311
$$ -48264 679534 -40198 97489 1045008 1382306 1067523 1188592 1968362 2717491 3083802
44202C083802j1130m94260o48046R345M70742n79685k087932j670151M99332J584891
$$ 3083802 3072672 2578412 1930366 1939711 2410453 1830768 -257164 -1927315 -1427983 156908
44192A56908L70740j157810j327601j040693j279743j024350O26308K386736K595066
$$ 156908 527648 -630162 -1957763 -2998456 -4278199 -5302549 -4676241 -2289505 305561
44183C05561J441996J7267j190373j654995o08419J197789J558972J40285m34888
$$ 305561 1747557 1764824 574451 -1080544 -1688963 -491174 1067798 1208083 773195
44174G73195J358370L032619J631767j659265l187041j830855L41404J447645
$$ 773195 2131565 5164184 6795951 5136686 1949645 118790 460194 1907839
44166A907839J226295j09934j835291k078419J84450K829625K759361J49324j919973
$$ 1907839 3134134 3024200 1188909 -889510 -705060 2124565 4883926 5033250 3113277
44157C113277j867380j005674n07031J56646J121440J152926j26390j167795q04161
$$ 3113277 1245897 240223 -266808 -110162 1011278 2164204 2037814 870019 65858
44148F5858J38491N13947M27734J90242n57878j575393j512418R6334J739163
$$ 65858 204349 718296 1146030 1336272 778394 -796999 -2309417 -2213083 -473920
44139d73920J984171J283527O66805J44226l60382q0368J039358J326288k72901
$$ -473920 1510251 2793778 3460583 3604809 3244427 3164059 4203417 5529705 5256804
44130E256804k070319j825318k5374J108448J032682R75147J151932M21023j220453
$$ 5256804 3186485 1361167 1335793 2444241 3476923 4452070 5604002 6025025 4804572
44121D804572k124174j461479l24674J19902o0528m32276p35026l47684J012232
$$ 4804572 2680398 1218919 894245 1014147 953619 521343 -213683 -561367 450865
44112D50865J947805Q69708j001389p86787J318111J697045q66092k548166l45899
$$ 450865 2398670 3268378 2266989 1480202 2798313 4495358 3629266 1081100 735201
44103G35201K644941J723270j921263k934104k2883K476590J467436j158665k670754
$$ 735201 3380142 5103412 3182149 248045 225162 2701752 4169188 3010523 339769
44094C39769k996074k398286J06741L566632M179088O96722k571639j724446P87272
$$ 339769 -2656305 -5054591 -4947850 -1381218 2797870 3494592 922953 -801493 -14221
44085a4221M13892j899196j637391J212122J920912r38280k894319o99612K772869
$$ -14221 399671 -1499525 -3136916 -1924794 -3882 -942162 -3836481 -4536093 -1763224
44076a763224L303198J166500p16444j447100j820094j549098j1681J592833J585343
$$ -1763224 1539974 2706474 1990030 542930 -1277164 -2826262 -2837943 -1245110 340233
44067C40233L71091n56931j110414j905168k150798o72690J636921K700432K166917
$$ 340233 711324 154393 -956021 -2861189 -5011987 -5684677 -4047756 -1347324 819593
44058H19593J362822P58272l67021j892478k558884j888209p95272j67568j10320
$$ 819593 2182415 2940687 2573666 681188 -1877696 -3765905 -4561177 -4728745 -4839065
44049d839065m17250n59509L20911K030240K627321Q20289j612233j828018J22755
$$ -4839065 -5256315 -5815824 -5494913 -3464673 -837352 -17063 -1629296 -3457314 -3334559
44040c334559J575876J241360M99784N72059P95701K97878o52645j582999k339913
$$ -3334559 -1758683 -517323 -17539 554520 1350221 1648099 995454 -587545 -2927458
44031b927458k277196p56854J202036J740630R54850P10304J302306Q90052r07824
$$ -2927458 -5204654 -5961508 -4759472 -3018842 -2063992 -1353688 -51382 838670 -69154
44022f9154j651059J20821K189041J808846l46379j575221j053134j89931o5524
$$ -69154 -1720213 -1599392 589649 2398495 2052116 476895 -576239 -766170 -831694
44013h31694m59402q07583o02386N36275K000786K256001Q50506o77921r81201
$$ -831694 -1291096 -2098679 -2701065 -2164790 -164004 2091997 2942503 2264582 1283381
44004A283381o99987q76481j052812m68851K84851M98550Q04955J594697J498437
$$ 1283381 583394 -293087 -1345899 -1814750 -1529899 -1031349 -226394 1368303 2866740
43995B866740l71117k089120j369828P82138J560252N49318m53817j003713k064597
$$ 2866740 2495623 406503 -963325 -181187 1379065 1928383 1474566 470853 -1593744
43986a593744k821507j116522K339304L674216J151973k102141k387754j43250
$$ -1593744 -4415251 -5531773 -3192469 481747 1633720 -468421 -2856175 -2999425
43978b999425J514901J186891R9465k92625K09474R86262J234584M34878j004842
$$ -2999425 -1484524 -297633 -198168 -490793 -281319 704943 1939527 2374405 1369563
43969A369563j857911j340002L9607J116739J198835N45794J17975N97038J282303
$$ 1369563 -488348 -1828350 -1788743 -672004 526831 1072625 1190600 1787638 3069941
43960C069941O99633j056511j838530n41066Q30308J87492j057143l14885J424927
$$ 3069941 3769574 2713063 874533 333467 1163775 1351267 294124 -20761 1404166
43951A404166R00284j676998k394423P7613K133252Q65823j680794k216905r32772
$$ 1404166 2304450 627452 -1766971 -1689358 443894 1309717 -371077 -2587982 -3520754
43942c520754J77227R39066J938965K083116L66356j588492j705912p11060m07425
$$ -3520754 -3343527 -2404461 -465496 1617620 1983976 395484 -1310428 -2021488 -2428913
43933b428913k75303J065779K367690J314150j166524j800478o4716J104273Q4756
$$ -2428913 -2704216 -1638437 729253 2043403 876879 -923599 -988315 115958 200714
43924B00714j209652p84365N90188J255621J136176R39831N82459k31938r80767
$$ 200714 -1008938 -1793303 -1203115 52506 1188682 2128513 2710972 2479034 1498267
43915A498267r52465k26523N37813P16342M5382r28275r39610M60859J810830
$$ 1498267 545802 319279 857092 1573434 1618816 690541 -249069 211790 2022620
43906B022620J424639j76148j015727n79260k24109o58269q62661n855J121397
$$ 2022620 3447259 3271111 2255384 1676124 1452015 793746 -68915 -74770 1046627
43897A046627J275915K95733j027694j794746j510581m89238K92442L77538L88846
$$ 1046627 2322542 2618275 1590581 -204165 -1714746 -2203984 -1911542 -1534004 -1145158
43888a145158O38897J85688j343665k115345l89856K276133K646213M22407j350571
$$ -1145158 -506261 -320573 -1664238 -3779583 -4169439 -1893306 752907 1175314 -175257
43879a75257p47384P27380R81569J59570m37045l99333p3836K44736J59655o21323
$$ -175257 -922641 -195261 786308 945878 508833 109500 35664 280400 440055 -181268
43869a81268j469398j425783p45980m35185l15720O29666J981137K063746O72554
$$ -181268 -1650666 -3076449 -3822429 -4257614 -4573334 -3943668 -1962531 101215 773769
43860G73769n31426p21990p98657j131419p36702O54521J922916K498803K685639
$$ 773769 242343 -479647 -1278304 -2409723 -3146425 -2491904 -568988 1929815 4615454
43851D615454J769393j284380m654111m584209p98524K333858J788668k27551
$$ 4615454 6384847 5100467 446356 -4137853 -4936377 -2602519 -813851 -1041402
43843a041402n08916L43270J90446m32862K52281J668444J965297J217791O91763
$$ -1041402 -1550318 -1207048 -1016602 -1449464 -1197183 471261 2436558 3654349 4346112
43834D346112L12960n16472j040377o08390m19326j288848j519225J98889J709354
$$ 4346112 4659072 4142600 3102223 2493833 2074507 785659 -733566 -534677 1174677
43825A174677M76628j997742k412636q52253L0067k00651K39652J415857J750684
$$ 1174677 1651305 -346437 -2759073 -3611326 -3581259 -3781910 -3542258 -2126401 -375717
43816c75717J473844J984393K211445j38441l769858m616940j916546P42643J121955
$$ -375717 1098127 3082520 5293965 5155524 1385666 -3231274 -5147820 -4405177 -3283222
43807c283222Q77830J403217J375172O3239p76355k19924M7095q22113r38840
$$ -3283222 -2405392 -1002175 372997 436236 -340119 -560043 -512948 -1335061 -2273901
43798b273901O75627J739405M26865j387152j205268J60366L82611n95406j114484
$$ -2273901 -1598274 141131 567996 -819156 -2024424 -1864058 -1481447 -2076853 -3191337
43789c191337o39220J54750Q55558J126017M09878p28153n97220R56695J824843
$$ -3191337 -3830557 -3675807 -2820249 -1694232 -1284354 -2012507 -2609727 -1653032 171811
43780A71811R49047O8707N11005Q24484k05295q20239N86779J953485N89300j967792
$$ 171811 1120858 1189565 1700570 2525054 2319759 1499520 2086299 4039784 4629084 2661292
43770B661292j888477J029437L035823J886313o05420j806711j354091m08729
$$ 2661292 772815 1802252 4838075 6724388 6118968 4312257 2958166 2549437
43762B549437Q7476j70654p20613m85277P22193J288006r0873k031236k136353
$$ 2549437 2636913 2466259 1745646 1260369 1982562 3270568 3179695 1148459 -987894
43753i87894n54451L62521j98589n16888N15625J531099R94968l29635n82209
$$ -987894 -1542345 -1179824 -1378413 -1895301 -1379676 151423 1146391 816756 234547
43744B34547M57479J124461J84256j505174k045742r25836L45953M56796K41093
$$ 234547 692026 1816487 2000743 495569 -1550173 -2476009 -2130056 -1673260 -1432167
43735a432167J118903K268184J514820r39896k248036j122408L06318J25252n30111
$$ -1432167 -313264 1954920 3469740 2529844 281808 -840600 -534282 -409030 -939141
43726i39141j14098M61478j3056l83779N63804J250798p8739j709925r21691J356931
$$ -939141 -1053239 -591761 -604817 -988596 -424792 826006 747267 -962658 -1884349 -527418
43716e27418K050306R42725K97795L75901m74730j739674j198706N10699L72870
$$ -527418 1522888 2465613 2763408 3139309 2664579 924905 -273801 236898 609768
43707F09768j422663j127794K053644L810822J271092k475373l187189j323020
$$ 609768 -812895 -1940689 112955 3923777 5194869 2719496 -467693 -1790713
43699a790713J873N1538J56238M31109n185q34230j132605j057409r36365q8900
$$ -1790713 -1788840 -1737302 -1581064 -1149955 -1155140 -1989370 -3121975 -4179384 -5115749 -5204649
43689e204649J480838J853080q2369k145794j552482J081228K820633K554248
$$ -5204649 -3723811 -1870731 -1953100 -4098894 -5651376 -4570148 -1749515 804733
43681H04733J653935J155929O23247l62974j409619j966532j662257n12002M03059
$$ 804733 2458668 3614597 4237844 3874870 2465251 498719 -1163538 -1675540 -1272481
43672a272481l16232j957784j779137R65522L116104J945912n33686n26733J779418
$$ -1272481 -1588713 -3546497 -5325634 -4360112 -1244008 701904 168218 -358515 1420903
43663A420903K823982J290563m44121n02876J38400Q5057m58790r28864j416476
$$ 1420903 4244885 5535448 5091327 4588451 4726851 4811908 4353118 3424254 2007778
43654B007778j715035j239430l63411n4874l1382P25710J619953J028606n36538
$$ 2007778 292743 -946687 -1310098 -1364972 -1396354 -670644 949309 1977915 1441377
43645A441377o14060J150138J958378J47944k102540k106680m81658M46756L07633
$$ 1441377 827317 1977455 3935833 4083777 1981237 -125443 -607101 -160345 147288
43636A47288M71071J245854J454806M19749j175488k192184j906161m95382P00184
$$ 147288 618359 1864213 3319019 3738768 2563280 371096 -1535065 -2030447 -1330263
43627a330263K88944j176019j497549J18127J765643J637740N44365J92393M30415
$$ -1330263 -1041319 -2217338 -3714887 -3596760 -1831117 -193377 350988 543381 973796
43618I73796L1238r28222j407824j271875r82914k79625R28232J253164l21965
$$ 973796 1005034 76812 -1331012 -2602887 -3585801 -3865426 -2937194 -1684030 -2005995
43609b005995j998288j162343J465163K482539Q13382q31228l19034Q61901M55607
$$ -2005995 -4004283 -5166626 -3701463 -1218924 -405542 -1236770 -1555804 -693903 -238296
43600b38296r87850j430932o31443P4829L16636Q88951J770014J808561N57090
$$ -238296 -1226146 -2657078 -3288521 -3213692 -2897056 -2008105 -238091 1570470 2127560
43591B127560r21803j397102p68309J49562N03960j828q79097j187394m51209
$$ 2127560 1205757 -191345 -959654 -810092 -306132 -307960 -1187057 -2374451 -2825660
43582b825660Q22674J735567J817751J097603r4467j039296r97401k35859p8160
$$ -2825660 -2002986 -267419 1550332 2647935 2553468 1514172 516771 280912 202752
43573B02752j192259k350230j811454L21937K037539J700333k48492j892560j678200
$$ 202752 -989507 -3339737 -5151191 -4829254 -2791715 -1091382 -1339874 -3232434 -4910634
43564d910634K39997K093718K155451O43147m32126K67432J713785J984090P95886
$$ -4910634 -4670637 -2576919 -421468 221679 -210447 56985 1770770 3754860 4550746
43555D550746m40617o96174k81282J51262M03137L59993j94026j034797j435748
$$ 4550746 4110129 3413955 3132673 3283935 3687072 4047065 3853039 2818242 1382494
43546A382494r59560O6251R11316R54818M7453j188369j702685j131887j85534
$$ 1382494 422934 489185 1400501 2355319 2402772 1214403 -488282 -1620169 -1805703
43537a805703M68201R49487J226932N85870q67952j438110k22854R20656j3010
$$ -1805703 -1337502 -388015 838917 1424787 556835 -881275 -1104129 -183473 -196483
43528a96483j636789j103524R76528J043403j621860l282936j312563J940670
$$ -196483 -1833272 -2936796 -1960268 -916865 -2538725 -5821661 -7134224 -5193554
43520e193554K939110J823176R76028R65933P14356J26198j43806l85472q93639
$$ -5193554 -2254444 -431268 544760 1510693 2225049 2351247 2207441 1821969 928330
43511I28330n33178J321575K647096J299595j313233k009513n72853L53608k71958
$$ 928330 395152 1716727 4363823 5663418 4350185 2340672 1767819 2121427 1849469
43502A849469p63574j64738L32721M9309J6553N72477L16144j364873k873746
$$ 1849469 1085895 921157 1253878 1303187 1319740 1892217 2208361 843488 -2030258
43493b030258k711411j424236k26635O53972J294771J291001N98610r1143m03123
$$ -2030258 -4741669 -6165905 -6392540 -5738568 -4443797 -3152796 -2554186 -2645329 -3048452
43484c048452m60363R0969J519842K452499J145177j371477k017962k14969J139423
$$ -3048452 -3508815 -3417846 -1898004 554495 1699672 328195 -1689767 -1904736 -765313
43475g65313L82435k91842J160310K874528K016045o87286k287316j971640j174283
$$ -765313 -382878 -674720 485590 3360118 5376163 4688877 2401561 429921 -744362
43466g44362m43010Q38538K126247J867866l362j846005k542313k212762j070642
$$ -744362 -1187372 -348834 1777413 3645279 3641917 1795912 -746401 -2959163 -4029805
43457d029805N66589J500748Q78737o4228M89880J904133J798163j03236j232172
$$ -4029805 -3463216 -1962468 -1083731 -1147959 -658079 1246054 3044217 2940981 1708809
43448A708809L184J801009J596470m57809k094838k074356j236139o69757j44301
$$ 1708809 1711993 3513002 5109472 4651663 2556825 482469 -753670 -1423427 -1567728
43439a567728J057913K328880J858636q34202l314625k682092M42320K241768
$$ -1567728 -509815 1819065 3677701 2843499 -471126 -3153218 -2710898 -469130
43431d69130O93365j730243j749092J69254J091311J37468r11742r49627p48220
$$ -469130 224235 -1506008 -3255100 -3085846 -1994535 -1857067 -2768809 -3718436 -4466656
43422d466656o91689J40483J842129K698304J509786m80210j134427n7656J243755
$$ -4466656 -5158345 -5017862 -3175733 -477429 1032357 552147 -582280 -639936 603819
43413F03819J351657L74845m92798n21406l12213p46118j294630n56122J210639
$$ 603819 1955476 2330321 1837523 1316117 1003904 257786 -1036844 -1592966 -382327
43404c82327J718580j33744k318776k534072j409737p79997l00638J377279L125930
$$ -382327 1336253 1202509 -1116267 -3650339 -5060076 -5840073 -6140711 -4763432 -1637502
43395a637502K435600k31785j587780m06546R55803O62786j70470k88925m22210
$$ -1637502 798098 566313 -1021467 -1428013 -472210 190576 20106 -268819 -691029
43386f91029r61801l94623J841417L373926K116415m75150j676626j298024q62817
$$ -691029 -1652830 -2047453 -206036 3167890 5284305 4809155 3132529 1834505 971688
43377I71688o21595k5409J18258j161823k440107j416653J295119K654499J549048
$$ 971688 350093 324684 442942 -718881 -3158988 -4575641 -3280522 -626023 923025
43368I23025N3811j06375J37631n94809j694593j731323p23749J19316J78332
$$ 923025 976836 870461 1008092 413283 -1281310 -3012633 -3736382 -3617066 -3438734
43359c438734j16712j54560K92415J061544J651029J556040Q72170K67084J78420
$$ -3438734 -3555446 -3710006 -3417591 -2356047 -705018 851022 1723192 1990276 2168696
43350B168696M11744O23583O96583N00005j26297q76366j036406m24143K21505
$$ 2168696 2580440 3204023 3900606 4400611 4274314 3397948 2361542 1937399 2158904
43341B158904K40066j9813J36232N14328K64325p22706j501717j390229q05314
$$ 2158904 2398970 2379157 2515389 3029717 3294042 2571336 1069619 -320610 -1125924
43332a125924l30675K70661J324621K160052J854266P28160j18559n66659j310776
$$ -1125924 -1456599 -1185938 138683 2298735 4153001 4881161 4762602 4195943 2885167
43323B885167j942683j074396J062500K128064R46974n76842m11307M79949O7225
$$ 2885167 942484 -131912 930588 3058652 4005626 3428784 3017477 3497426 3564651
43314C564651j170208j197843J5228O93886M64212M61444N04353o94465k343399
$$ 3564651 2394443 1196600 1211828 1905714 2369926 2831370 3335723 2641258 297859
43305B97859j944191M15176J471022k34026j976278j224694O10564J057055N35934
$$ 297859 -1646332 -1231156 239866 5840 -1970438 -3195132 -2584568 -1527513 -991579
43296i91579P53244J306025Q00596k63523n56421n28699j219771j719806o91301
$$ -991579 -238335 1067690 1868286 1604763 1048342 519643 -700128 -2419934 -3111235
43287c111235P05826M97649m20291L28714K080429J711331j108456k954479j807010
$$ -3111235 -2405409 -1907760 -2328051 -1999337 81092 1792423 683967 -2270512 -4077522
43278d077522K19758O65056K02934N42689J380976J506299J026802N53971k29406
$$ -4077522 -3857764 -3192708 -2989774 -2447085 -1066109 440190 1466992 2020963 1791557
43269A791557j380628j614774k85227R60513M59013q39860j088693n81687o43792
$$ 1791557 410929 -1203845 -1489072 -528559 -69546 -909406 -1998099 -2579786 -3223578
43260c223578o31343R54231K931442K414646m06884j877693k90783J600057J206435
$$ -3223578 -3854921 -2900690 30752 2445398 2038514 160821 -129962 1470095 2676530
43251B676530L4437L19132N74687j681960m573264l780698N70387L508870K431206
$$ 2676530 2710967 3030099 3604786 1922826 -2650438 -6431136 -5860749 -2351879 79327
43242G9327L46581K59261N55497j121202k970800j937811Q51918J759953L68034
$$ 79327 425908 685169 1240666 119464 -2851336 -4789147 -3937229 -2177276 -1809242
43233a809242n98519l08991n55566j522337j051053J149427K413792J438941K54928
$$ -1809242 -2407761 -2716752 -3272318 -4794655 -5845708 -4696281 -2282489 -843548 -588620
43224e88620M81969Q57588J45791n47018k66096j69737r11532p73672J235046
$$ -588620 -106651 750937 896728 349710 83614 -86123 -997655 -1771327 -536281
43215e36281K921448K142426K62742l57659k58484j220790k450607j769908M36133
$$ -536281 2385167 4527593 4790335 4432676 4174192 2953402 502795 -1267113 -830980
43206h30980J648376J017307l8828n68266q82860j032769p73380n86879p11800
$$ -830980 817396 1834703 1795875 1227609 344749 -688020 -1461400 -2048279 -2760079
43197b760079k0451J930654K902218Q13098k348982k651503J40875K274585J438134
$$ -2760079 -2780530 -849876 2052342 2865440 516458 -2135045 -1994170 280415 1718549
43188A718549n90152j221933k60118R40504J323796M76448j129257j936209r18741
$$ 1718549 1128397 -93536 -353654 586850 1910646 2387094 1257837 -678372 -1597113
43179a597113P40177J224334P58196P20642R24225L01544m60085O3665R27211
$$ -1597113 -856936 367398 1125594 1846236 2770461 3072005 2611920 2675585 3602796
43170C602796J7792j904652j945101N4326J150133L02504j92001O95831O79586
$$ 3602796 3620588 1715936 -229165 -174839 975294 1277798 1085797 1781628 2461214
43161B461214j503561l269974k019432R98920K875361K789806J634864N9154j273622
$$ 2461214 957653 -2312321 -4331753 -3332833 -457472 2332334 3967198 4026352 2752730
43152B752730j395342n33628p7676r2916P78165K136009J652247o79938j667509
$$ 2752730 1357388 823760 746084 653168 1431333 3567342 5219589 4539651 2872142
43143B872142j49538O72435j243808k761023p03712K341124J919701r93950j664804
$$ 2872142 2722604 3395039 2151231 -609792 -1313504 1027620 2947321 1953371 288567
43134B88567O62473J836659k94715k686859k035130O04363J879600O07419j411528
$$ 288567 951040 2787699 2492984 -193875 -2229005 -1624642 254958 862377 -549151
43125e49151j878232l19089J572584J778543M41533k09227R79542K269702J562117
$$ -549151 -2427383 -2746472 -1173888 604655 1046188 836961 1816503 4086205 5648322
43116E648322n74387j990905j944497j281124o17940q3161l2071m26145l46648
$$ 5648322 5073935 3083030 1138533 -142591 -760531 -843692 -875763 -1301908 -1648556
43107a648556M99802R42825L77613P6806Q21377J044832n15306k113963j513200
$$ -1648556 -1148754 -205929 171684 248490 1069867 2114699 1599393 -514570 -2027770
43098b027770L82115J165586P31916M72881J27595j182143j984246l14684K189283
$$ -2027770 -1645655 -480069 251847 724728 852323 -329820 -2314066 -2628750 -439467
43089d39467K015686o57640k115884r53961K99436K9080p5789J211353K214077
$$ -439467 1576219 918579 -1197305 -2151266 -1851830 -1822750 -1898539 -687186 1526891
43080A526891J510839M17743L37616K87198q73132j984549j467178Q0699J045377
$$ 1526891 3037730 3455473 3793089 4080287 3207155 1222606 -244572 -163873 881504
43071H81504J138467R49615M48974n55583j516903j935563k091310k083028j271273
$$ 881504 2019971 2969586 3418560 2862977 1346074 -589489 -2680799 -4763827 -6035100
43062f035100M18700J762699J722206P37588j17858l44291L1170O31494N91070
$$ -6035100 -5616400 -3853701 -2131495 -1393907 -1511765 -1856056 -1824886 -1193392 -602322
43053f02322n48196j683009j342088p6483J47930q71323j125892L14407J744985
$$ -602322 -1150518 -2833527 -4175615 -4252098 -4104168 -4975491 -6101383 -5786976 -4041991
43044d041991J505926K41961o28322r11775r11414l24283Q42727J578092J222199
$$ -4041991 -2536065 -2294104 -2922426 -3834201 -4745615 -5069898 -4227171 -2649079 -1426880
43035a426880L90510k41339p70348j036488l39703J027559J617033J062413P48832
$$ -1426880 -1036370 -1277709 -2048057 -3084545 -3424248 -2396689 -779656 282757 1031589
43026A031589J286596J217679m52266k247077k376386j412290j076492j490062
$$ 1031589 2318185 3535864 3083598 836521 -1539865 -2952155 -4028647 -5518709
43018e518709j338106l9590J657693K736453K614253J412139J74168J4901O10666
$$ -5518709 -6856815 -6896405 -5238712 -2502259 111994 1524133 1698301 1713202 2323868
43009B323868N86143l33534r82188q44632p07450p64028j15364J124026J412982
$$ 2323868 2910011 2576477 1594289 749657 42207 -721821 -837185 286841 1699823
43000A699823M42832m3006P49966J202550K50736n85795P1149R73218N08743o06664
$$ 1699823 2142655 2099649 2849615 4052165 4302901 3717106 3788255 4761473 5270216 4663552
42990D663552r85802r61906j224512j029515M6165N62563k93252p89084L20951
$$ 4663552 3677750 2715844 1491332 461817 507982 1070545 777293 -11791 309160
42981C09160J150259o0618j400733m44292J230761O63918j159472j049501O22208
$$ 309160 1459419 1398801 -1932 -446224 784537 1448455 288983 -760518 -138310
42972a38310P04902q64475r95905P52078J379606J24301j23722J503150J668111
$$ -138310 566592 -297883 -1293788 -541710 837896 962197 838475 2341625 4009736
42963D009736j377778m155198l059013L94556K533758K809175K808645K393065
$$ 4009736 2631958 -1523240 -4582253 -4187697 -1653939 1155236 3963881 6356946
42955F356946M21612k095967k903747j854294o75681N378R44702K023872K078978
$$ 6356946 6778558 4682591 1778844 -75450 -751131 -745753 198949 2222821 4301799
42946D301799R64926j34169n64008q43369j388219j870691j897582j345998j76162
$$ 4301799 5266725 5132556 4568548 3725179 2336960 466269 -1431313 -2777311 -2953473
42937b953473J203984J733492Q42668n05874q72403j28621P05320J002855Q92406
$$ -2953473 -1749489 -15997 826671 320797 -551606 -680227 25093 1027948 1920354
42928A920354M45344l36501q72067m69757N20700J018786P46865M81245O33785
$$ 1920354 2365698 2029197 1157130 687373 1208073 2226859 2973724 3454969 4088754
42919D088754O48414K45399K61888J407055K811950K883005J445795j2324m53465
$$ 4088754 4737168 4982567 5244455 6651510 9463460 12346465 13792260 13779936 13326471
42910A3326471o01513j479825k545665k476209j356438o26086q22939r12599l09180
$$ 13326471 12724958 11245133 8699468 6223259 4866821 4240735 3417796 2505197 2196017
42901B196017j7976q51227j827736j560269k54401Q65166J256638J062164L48095
$$ 2196017 2178041 1326814 -500922 -2061191 -2315592 -1450426 -193788 868376 1216471
42892A216471m65485m40905L52539L92837p53971j055475P36190K180803N02629
$$ 1216471 750986 310081 662620 1055457 301486 -753989 -17799 2163004 2665633
42883B665633k451244k376732Q39895K799704J359062n31516j57426Q42714O4915
$$ 2665633 214389 -2162343 -1322448 1477256 2836318 2304802 2147376 2990090 3055005
42874C055005j355979j065565L65751P81949J91716J41844N77638K36322o26134
$$ 3055005 1699026 633461 999212 1781161 1972877 2114721 2692359 2928681 2302547
42865B302547o08505J89930L29624m02652p63627k94372J42290P7038K6965L17548
$$ 2302547 1694042 1883972 2213596 1810944 1047317 752945 895235 972273 999238 1316786
42855A316786O23237N89501r1597j699495l504317l635050j327704J559357K790482
$$ 1316786 1940023 2529524 2437927 738432 -2765885 -6400935 -7728639 -6169282 -3378800
42846c378800K536929K231048J852058O13622o59086n57671J01786n89938j974407
$$ -3378800 -841871 1389177 3241235 3854857 3195771 2638100 2739886 2149948 175541
42837A75541j479489Q57459J901436L46037j181092n04220O58778j12648j811897
$$ 175541 -1303948 -446489 1454947 1800984 619892 115672 774450 661802 -1150095
42828a150095j839838k84321N46990j9618l99743K60415R17725P44556M59394
$$ -1150095 -2989933 -3274254 -2727264 -2746882 -3146625 -2886210 -1968485 -1223929 -764535
42819g64535R47460J882606K275368J556622p8529j654347j837484l40777J164590
$$ -764535 182925 2065531 4340899 5897521 5818992 4164645 2327161 1986384 3150974
42810C150974O62860j561746l042754k209610k15283Q69936O24837J42332J31440
$$ 3150974 3813834 2252088 -790666 -3000276 -3215559 -2345623 -1720786 -1578454 -1447014
42801a447014L47809O09319J135377J663790J295157j42224j296056p81648Q10606
$$ -1447014 -1099205 -489886 645491 2309281 3604438 3462214 2166158 1384510 2195116
42792B195116J426013K41428j130847p89144Q23805J479968J66827j585776j730771
$$ 2195116 3621129 3862557 2731710 1942566 2766371 4246339 4413166 2827390 1096619
42783A096619k10983J220903J231276K14431n45827l88732K80379P11067O14432
$$ 1096619 885636 2106539 3337815 3552246 3006419 2617687 2898066 3609133 4223565
42774D223565K42755j00104l85285o62957p85146n72848j69786N3770j8294q8729
$$ 4223565 4466320 4366216 3980931 3317974 2532828 1959980 1790194 1843964 1825670 1736941
42764A736941J57688O48135R60358O81620k17444j237846j686857j355327p46236
$$ 1736941 1894629 2542764 3503122 4184742 3967298 2729452 1042595 -312732 -1058968
42755a058968l93658j39247N13459J451361J922290J537315P56027J49955k96462
$$ -1058968 -1452626 -1591873 -1078414 372947 2295237 3832552 4588579 4738534 4442072
42746D442072p83048j062703p86385k39968j05982m79892o82925k41659M05412
$$ 4442072 3659024 2596321 1809936 1569968 1463986 984094 301169 59510 464922
42737D64922N19494O3427l73666n23319p25626j098930j009404N5112J393412
$$ 464922 984416 1047843 674177 150858 -574768 -1673698 -2683102 -2627990 -1234578
42728a234578J688639P88123N1371M73838J233451R47109j58409n32622K95323
$$ -1234578 454061 1242184 1293555 1767393 3000844 3947953 3789544 3256922 3552245
42719C552245R18627J64645j145660j498185r06510n53075o38444j26138J174515
$$ 3552245 4470872 4635517 3489857 1991672 1085162 532087 -106357 -232495 942020
42710I42020J768875N52124j345686j925438r09156K38631N49728M86606N80409
$$ 942020 2710895 3263019 1917333 -8105 -917261 -678630 -128902 357704 938113
42701I38113M82982p6780m58419l4316P62309J092901Q56424M33863j32273q17116
$$ 938113 1421095 1344315 885896 851580 1613889 2706790 3563214 3997077 3864804 3047688
42691C047688r87126j85688P58650N95994m69097j000292m98397P167j07832J2875
$$ 3047688 2060562 1874874 2633524 3229518 2760421 1760129 1261732 1268899 1161067 1173942
42681A173942J002486J759007R51668p38807j391180o16345q0890r65312k155681
$$ 1173942 2176428 3935435 4887103 4148296 2757116 2140771 2059881 1094569 -1061112
42672a061112j790924R7225J558582J319594M35841P00801J947369K125027L27792
$$ -1061112 -2852036 -2754811 -1196229 123365 559206 1260007 3207376 5332403 5660195
42663E660195j527755j183235O44131J145350n34655k084156j432873M74634J490489
$$ 5660195 4132440 2949205 3593336 4738686 4204031 2119875 687002 1161636 2652125
42654B652125J274281Q42147L16212p92067j674753q76340J108588K008356J021253
$$ 2652125 3926406 4768553 5084765 4292698 2617945 1741605 2850193 4858549 5879802
42645E879802p1205J40609N25230m03400j659655j109273J094964K421652J390512
$$ 5879802 5808597 5949206 6474436 6071036 4411381 3302108 4397072 6818724 8209236
42636H209236n38926j043717K43035J685756J705733K19402j579506k322756j545268
$$ 8209236 7670310 6626593 6869628 8555384 10261117 10480519 8901013 6578257 5032989
42627E032989m8384Q75984O99035n2313p05587j105849j186383n82624O95578
$$ 5032989 4984605 5860589 6559624 6507311 5801724 4695875 3509492 2926868 3622446
42618C622446J662262J262437k05337j292761j073826n560Q97611J069385M79994
$$ 3622446 5284708 6547145 6341808 5049047 3975221 3969661 4867272 5936657 6416651
42609F416651n27168j226622j022380k73177M2306k67093l45790K02891N37803
$$ 6416651 5889483 4662861 3640481 3367304 3409610 3142517 2796727 2999618 3537421
42600C537421l1833q10817p55935J7553O86083R44126Q34060J47613r21870j347494
$$ 3537421 3505588 2694771 1938836 1956389 2642472 3586598 4420658 4568271 3646401 2298907
42590B298907o80675J469j21051k5523J205539K118297R99724p71244n28630J092127
$$ 2298907 1618232 1619701 1498650 1473127 2678666 4796963 5796687 5025443 4496813 5588940
42580E588940R33099j240713k039650j49791J345509K67439r24730M04232K219163
$$ 5588940 6522039 5281326 3241676 3091885 4437394 4704833 3780103 4184335 6403498
42571F403498J192084j433377j535850J463269L762738K543644r36993l616458
$$ 6403498 7595582 6162205 4626355 6089624 9852362 12396006 11459013 7842555
42563G842555l550501p92727K494965L295605J087171r90500m07726Q93106j87871
$$ 7842555 4292054 3499327 5994292 9289897 10377068 9386568 8978842 9871948 9684077
42554I684077k435288k174112M17518J516488J15260n88677Q68769J689410L9171
$$ 9684077 7248789 5074677 5492195 7008683 7123943 6535266 7404035 9093445 9132616
42545I132616j537463m49266J818156K651754K263758J878708Q49033j315512
$$ 9132616 7595153 7145887 8964043 11615797 13879555 15758263 16607296 15291784
42537A5291784k530445j081983J014660R42185l71412j33099J325685J284171
$$ 15291784 12761339 11679356 12694016 13636201 13264789 13131690 14457375 15741546
42529A5741546m07660j014445M28372J753979J510498R11111R79886P05267m94999
$$ 15741546 15333886 14319441 14747813 16501792 18012290 18923401 19903287 20608554 20113555
42520B0113555r42261P31770K887686K860135P62522o63843J58240J728522J923078
$$ 20113555 19171294 19903064 22790750 25650885 26413407 25749564 25907804 27636326 29559404
42511B9559404J131504J652342M225471O713856P103115O657097Q463930J3388320
$$ 29559404 30690908 32343250 36568721 43282577 50385692 57042789 65506719 78895039
42503G8895039J9488711K5389920L1601250L7332984L8351292L0319123J3573255
$$ 78895039 98383750 123773670 155374920 192707904 231059196 261378319 274951574
42496B74951574o699754k4137341l4223242l5620079l0789619k4556384k0171252
$$ 274951574 268251820 244114479 209891237 174271158 143481539 118925155 98753903
42489I8753903j7086956j3556464j0017301q112115p635988o844016n213408l731832
$$ 98753903 81666947 68110483 58093182 49981067 42345079 35501063 30287655 26555823
42481B6555823k836181k110103j707243k076346k522039j971456r16257o64115
$$ 26555823 23719642 21609539 19902296 17825950 15303911 13332455 12416198 11752083
42473A1752083r70667n03671N46492N61240p25736j682752j292622l30468K02990
$$ 11752083 10781416 10277745 10824237 11385477 10659741 8976989 7684367 7353899 7556889
42464G556889J34424m27952j060145p27329O84947J190136o47355k657124j713211
$$ 7556889 7691313 7263361 6203216 5475887 6160834 7350970 6703615 4046491 2333280
42455B333280J028882J302225j597302l439774j577634J247067J705752P58405
$$ 2333280 3362162 4664387 3067085 -372689 -1950323 -703256 1002496 1760901
42447A760901Q65900J457852O25023r03899j021807J275L54487K02311J094981
$$ 1760901 2626801 4084653 4709676 3805777 2783970 2785245 3139732 3342043 4437024
42438D437024K505250K171593j36412k011310j861382o15188L76607R97337J370269
$$ 4437024 6942274 9113867 8977455 6966145 5104763 4489575 4866182 5863519 7233788
42429G233788J037515j00901j256725j700484j378519m70202P53484J630891J584710
$$ 7233788 8271303 8170402 6913677 5213193 3834674 3364472 4117956 5748847 7333557
42420G333557Q85775K24906k14725n50616n81428k30921j5123j58943j197P09282
$$ 7333557 8219332 8444238 8229513 7678897 7097469 6866548 6851425 6692482 6691285 7400567
42410G400567R33065J10761l06260J023388K577110J671292j432512l541771k801258
$$ 7400567 8333632 8444393 8138133 9161521 11738631 13409923 11977411 8435640 5634382
42401E634382o86359O98760J116799J168549P49535j99288p73009k00426R80774
$$ 5634382 4948023 5646783 6763582 7932131 8681666 8482378 7709369 7508943 8489717
42392H489717J755362J909868J780721J457755R19849L67522j41600q65381j740057
$$ 8489717 10245079 12154947 13935668 15393423 16313272 16680794 16539194 15673813 13933756
42383A3933756k069476j276806L40454J811321K239042J487975M64243L56538
$$ 13933756 11864280 10587474 10927928 12739249 14978291 16466266 16930509 17287047
42375A7287047J115257J274750L0865j272730q98745P24307J673521J269030M93182
$$ 17287047 18402304 19677054 19707919 18435189 17536444 18260751 19934272 21203302 21696484
42366B1696484M7059j40225L77395K276711M705020N824004N482607N402171O341080
$$ 21696484 21743543 21603318 21980713 24257424 28962444 34786448 40269055 45671226 52012306
42357E2012306P224728P613122Q572680J0051548R835560O719889K662895N278
$$ 52012306 59237034 66850156 75422836 85474384 95309944 102029833 104692728 104698006
42349A04698006j641964l837633o324290p771804q191653q384359p993706o337435
$$ 104698006 103056042 99218409 92894119 85122315 76930662 68546303 60552597 54215162
42341E4215162m415616l876390m447594m453727l566313l079645l588023m148395
$$ 54215162 49799546 45923156 41475562 37021835 33455522 30375877 26787854 22639459
42333B2639459l742241k203613J2878J726950J386440r47695k800209k247888
$$ 22639459 18897218 16693605 16706483 18433433 19819873 18872178 16071969 13824081
42325A3824081p29628p22860j658193j048931R18706J401305k82949j429104n45041
$$ 13824081 13094453 12371593 10713400 9664469 10583175 11984480 11701531 10272427 9727386
42316I727386K43608q73180k093204j051860J156462J738469M48868o05708m88087
$$ 9727386 9970994 9097814 7004610 5952750 7109212 8847681 9296549 8690841 8202754
42307H202754k46853o00118r75597q73163n23740j09581M15058P53219N45703
$$ 8202754 7955901 7355783 6380186 5507023 4983283 4873702 5288760 6041979 6587682
42298F587682Q4686j03655q2405j43428j33248N0338m8146n21005m48350O69571
$$ 6587682 6672368 6568713 6486308 6342880 6209632 6259970 6211824 5690819 5242469 5912040
42288E912040J585993Q45056q70346j476663l75417Q79143Q67727l0042n46719
$$ 5912040 7498033 8343089 7472743 5996080 5620663 6499806 7367533 7337491 6790772
42279F790772j57079N45620O27714r8044o36488M4324J295807J301286j89152
$$ 6790772 6633693 7179313 7807027 7708983 7072495 7116819 8412626 9713912 9524760
42270I524760j094038k1179J505746J428316K83947j05999K25393Q7890n2400
$$ 9524760 8430722 8409543 9915289 11343605 11627552 11521553 11746946 11834836 11782436
42261A1782436J039921K185461Q50755k388107l793152j756871R36618J422943
$$ 11782436 12822357 15007818 15858573 13470466 9677314 7920443 8857061 10280004
42253A0280004M40076L911M6298m25168q69319k86611O83383Q91338P36237J114376
$$ 10280004 10720080 10723991 10770289 10345121 9475802 9189191 9872574 10763912 11500149 12614525
42243A2614525J398906N02256q71217j025923J60398J164820R54525j37392j199387
$$ 12614525 14013431 14515687 13644470 12618547 12778945 13943765 14898290 14760898 13561511
42234A3561511j319370r5505J444107J467775p3056q83236L20935J585097P23684
$$ 13561511 12242141 12146636 13590743 15058518 14985462 14102226 14423161 16008258 16731942
42225A6731942j111698j315317N5344Q53188O31962Q67189J812090K118252J574971
$$ 16731942 15620244 14304927 14360271 15213459 15845421 16712610 18524700 20642952 22217923
42216B2217923J391709J542394N77528j473247k613181j908435o37385J58758
$$ 22217923 23609632 25152026 25729554 24256307 21643126 19734691 19097306 19256064
42208A9256064R30929J847144K146615J950417K385438L267625L136872K272092
$$ 19256064 20186993 22034137 24180752 26131169 28516607 31784232 34921104 37193196
42200C7193196K918811N570484P948663Q961987J0592700J4058680J7170513J7856277
$$ 37193196 40112007 45682491 53631154 62593141 73185841 87244521 104415034 122271311
42192A22271311J7453212J7600643J6334359J0708008J670834o946434j3071304
$$ 122271311 139724523 157325166 173659525 184367533 186038367 179091933 166020629
42185A66020629j6934282j8260338j6479339j3226531j1274972j0930099j0223697
$$ 166020629 149086347 130826009 114346670 101120139 89845167 78915068 68691371
42178F8691371q523350p156908o530232n502276l858579k745962k366681j774057
$$ 68691371 60168021 53011113 46480881 40978605 37120026 34374064 32007383 30233326
42170C0233326j144679j590923k509625k037851n62167n89432k320975k774769
$$ 30233326 29088647 27497724 24988099 22950248 22388081 21798649 19477674 16702905
42162A6702905p65459O64983r46858l245515k554878N91751K595724K019692N43557
$$ 16702905 15937446 16602429 15655571 12410056 9855178 10446929 13042653 15062345 15605902
42153A5605902m39659j151488j621392j268166m53184k42525m53151M5377R52200
$$ 15605902 15166243 14014755 12393363 11125197 10672013 10429488 9976337 10021714 10973914
42144A0973914N98378j173333k279039j377999K27098P39905L30631J13880r431
$$ 10973914 11572292 10398959 8119920 6741921 6969019 7708924 8039555 8153435 8144004
42135H144004p97458j745635j555018l39164L55854r005j32550Q09913J535808
$$ 8144004 7346546 5600911 4045893 3706729 4062583 4053578 3921028 4730941 6266749
42126F266749O60144q27811r66974j00851m08519j995221k134382L20855K326646
$$ 6266749 6926893 6099082 5132108 5031257 4622738 2627517 493135 813990 3140636
42117C140636Q54928k187158k491984J61293J739607M31627p04454R42487L171733
$$ 3140636 3995564 1808406 -683578 -522285 1217322 1648949 944495 1886982 5058715
42108E058715K588263l3655j231666j29398J041098R09601L21520j13072r03124
$$ 5058715 7646978 7613323 6381657 6252259 7293357 8202958 8524478 8411406 7508282
42099G508282j761992j384368K01788J264829J057219P65694R57435L11156j739769
$$ 7508282 5746290 4361922 4563710 5828539 6885758 7651452 8608887 8920043 7180274
42090G180274l102950j731342J056689K070219M77353j391202j413864j74727
$$ 7180274 4077324 2345982 3402671 5472890 5950243 4559041 3145177 2970450
42082B970450L68370m45683j392318j024611O16050K050503K057034J064599M57512
$$ 2970450 3338820 2893137 1500819 476208 1092258 3142761 5199795 6264394 6721906
42073F721906O59129P12058n9644r51249j063112p40417q78159j334881j155136
$$ 6721906 7381035 8093093 8033449 7082200 6019088 5278671 4400512 3065631 1910495
42064A910495k07544M91175K94099j29008J15225O30660O0224j941982l600942
$$ 1910495 1702951 2194126 2488225 2359217 2474442 3105102 3165326 1223344 -2377598
42055b377598k640252P76764L553975L053158M76794n89281J011718K528874J406428
$$ -2377598 -5017850 -4241086 -687111 2366047 2842841 2253560 3265278 5794152 7200580
42046G200580j053565j811681m68234P09646M24871l95168q76690j301860j479283
$$ 7200580 6147015 4335334 3867100 4576746 5001617 4606449 3729759 2427899 948616
42037I48616l43394J835911K915456J904216P04774J149361J919186O33052k067567
$$ 948616 605222 2441133 5356589 7260805 7965579 9114940 11034126 11667178 9599611
42028I599611l103139j395289P17535R21312l01360j166472j139415q27171n15075
$$ 9599611 6496472 5101183 5818718 6740030 6438670 5272198 4132783 3305612 2790537
42019B790537n4530M57572Q64290J303914J629097J115785l50866j410355p22844
$$ 2790537 2736007 3193579 4057869 5361783 6990880 8106665 7755799 6345444 5622600
42010E622600R44526J392609j23773j864222j938789o61474K87512L50265N17574
$$ 5622600 6567126 7959735 7835962 5971740 4032951 3371477 3658989 4009254 4526828
42001D526828J364423J951134J291681N177m71629J53386R13799J195189J231081
$$ 4526828 5891251 7842385 9134066 9139243 8667614 8821000 9734799 10929988 12161069
41992A2161069R60611j36671j543327j567536K07849J661371Q45406j066179j430657
$$ 12161069 13121680 12985009 11441682 9874146 10081995 11743366 12588772 11522593 10091936
41983A0091936o1225P37201q6691r83625p37589l99789j074574j696834p01502
$$ 10091936 10030711 10767912 10681221 9697596 8960007 8560218 7485644 5788810 5087308
41974E087308J338372K428000J782302L53544o94230q21766L6702J284005J716693
$$ 5087308 6425680 8853680 10635982 10989526 10295296 9473530 9510232 10794237 12510930
41965A2510930P84383n63506j069756o56093J2271O41883J073561Q06935j44901
$$ 12510930 13295313 12731807 11662051 11005958 11018229 11660112 12733673 13540608 13395707
41956A3395707p70809n63465n34054j419125j987622q40846J086436J810262J277654
$$ 13395707 12624898 12061433 11527379 10108254 8120632 7279786 8366222 10176484 11454138
41947A1454138Q91898P73165J3961p66053J5687J714052J790954r9422j300145
$$ 11454138 12346036 13119201 13133162 12367109 12382796 14096848 15887802 15788380 14488235
41938A4488235m34674L96832p21767k293177j951614j88390P84307M19637j78334
$$ 14488235 14053561 14450393 13728626 11435449 9483835 9295445 10079752 10499389 10321055
41929A0321055n85270j184467j614777j039457L30553J424044J671741J149395
$$ 10321055 9735785 8551318 6936541 5897084 6227637 7651681 9323422 10472817
41921A0472817R2862o98777JK063179L466893K882090J623061J517399K248660
$$ 10472817 10565679 9866902 9866903 11930082 15396975 18279065 19902126 21419525 23668185
41912B3668185K704363L446172N333757O983789O698159O158654Q723524J4208392
$$ 23668185 26372548 29818720 35152477 42136266 48834425 54993079 63716603 77924995
41904G7924995J9156306K2840689K8669777L7342978M2161319L4928568J5320888
$$ 77924995 97081301 119921990 148591767 185934745 228096064 263024632 278345520
41897B78345520q334135k6720064l5676391l6007720l0837345k3989544j8474530
$$ 278345520 270011385 243291321 207614930 171607210 140769865 116780321 98305791
41890I8305791j4861718j1850482q903167p160359p213072p465815o107954l859546
$$ 98305791 83444073 71593591 62690424 55530065 48316993 40851178 34743224 30883678
41882C0883678l052541m122288m763075l185502p25836M1375j165346k289093
$$ 30883678 27831137 23708849 18945774 15760272 15034436 15075811 13910465 11621372
41874A1621372k028031j225080r78629j046973q29126n38195m58507j67392M92981
$$ 11621372 9593341 8368261 7389632 6342659 5513533 4975338 4516831 4349439 4842420
41865D842420O82609r6873q52247m99718L85547N10593j12082l92522J23687R72181
$$ 4842420 5525029 5428156 4575909 4076191 4461738 4972331 4860249 4467727 4591414 5563595
41855E563595J614304J458886p6120k185671k465731Q7719K858112K617216k996
$$ 5563595 7177899 8636785 8560665 6374994 3909263 3996982 6855094 9472310 9469314
41846I469314j588107r71058k32096o75649j007079k66089M07188J70932K4970
$$ 9469314 7881207 6910149 6678053 6002404 4995325 4729236 5136424 5307356 5332326
41837E332326N48945N34827n40845j023937O4411Q34050o12165k876624l171762
$$ 5332326 5881271 6416098 5875253 4851316 4915727 5749777 5137612 2260988 -910774
41828i10774j226840R19382J943747J945792J115958j68316o71990K82285J393461
$$ -910774 -2137614 -1218232 725515 2671307 3787265 3618949 2946959 3229244 4622705
41819D622705J166923K67296J91983N77237Q4602q18880n23308O45405O10314
$$ 4622705 5789628 6056924 6248907 6826144 6910746 6091866 5568558 6213963 6824277
41810F824277j074491k375821j738227L8901J284669J204703m2429j499190j665189
$$ 6824277 5749786 3373965 1635738 1674639 2959308 4164011 4121582 2622392 957203
41801I57203j40455J234791N77073j168982j598854n37666J77655J87703P64970
$$ 957203 816748 2051539 2628612 1459630 -139224 -676890 -499235 -311532 453438
41792D53438J441873Q7661k795590l540767p67747K027943J624446k46837k03999
$$ 453438 1895311 1982972 -812618 -4353385 -5121132 -3093189 -1468743 -1715580 -1919579
41783a919579J420039J882994Q05391M6443k3681n84872j299217o01714J054714
$$ -1919579 -499540 1383454 2188845 2235288 2211607 1626735 327518 -274196 780518
41774G80518J461567L86380l9876P99991Q20970r89146k459167j604354J85677
$$ 780518 2242085 2628465 2588589 3388580 4209550 3220404 761237 -843117 -657440
41765f57440M25291o11233o12127R83857K126379J182105p74823j352065K04627
$$ -657440 -232149 -843382 -1455509 -471652 1654727 2836832 2062009 709944 914571
41756I14571K130580K267469O74234n34313q0214P96797M17166o77594q12595
$$ 914571 3045151 5312620 5986854 5452541 5372327 6169124 6586290 5908696 5096101
41747E096101k00206n88585j971111k232245p23943M09996k15793q44105L00644
$$ 5096101 4895895 4307310 2336199 103954 -619989 -209993 -425786 -1269891 -969247
41738i69247J714365J072673o60774p24191P55221J012767m46966p25704J643987
$$ -969247 745118 1817791 1157017 432826 1188047 2200814 1753848 1028144 2672131
41729B672131L845508K705358o99416k652034j735350P7919O88454J85723j45847
$$ 2672131 6517639 9222997 8523581 5871547 4136197 4214116 4902570 5088293 4942446
41720D942446L97563J491944K163428J453900n29404k220954k060396m12826P89820
$$ 4942446 5340009 6831953 8995381 10449281 9919877 7698923 5638527 5225701 6015521
41711F015521N01941j91433K42190J540423J935548N78692j154672j305882Q2387
$$ 6015521 6517462 6326029 6568219 8108642 10044190 10622882 9468210 8162328 8244715
41702H244715Q75482l39776k104655j714606J177699L714503L049075l82875l475199
$$ 8244715 9120197 8780421 6675766 4961160 6138859 9853362 12902437 12519562 9044363
41693I044363l831235j820084M31849J274335O37332m97266j244148j394897j113567
$$ 9044363 5213128 3393044 3824893 5099228 5736560 5239294 3995146 2600249 1486682
41684A486682n14597J93714N56093M16737L21419O85410Q92251J87569q11538
$$ 1486682 972085 1165799 1721892 2138629 2460048 3145458 4037709 4225278 3413740
41675C413740q13013J5518J95722n77960r33547l23668N0225k09870M62514K529735
$$ 3413740 2600727 2616245 2811967 2234007 1300460 976792 1027017 817147 1279661 3809396
41665C809396L397774J014422k384448l086864j164458L17887M02975Q40436J879014
$$ 3809396 7207170 8221592 5837144 2750280 1585822 1903709 2306684 3147120 5026134
41656E026134J490526n55230j648532o36878L10562k92468p73381J45920O05095
$$ 5026134 6516660 5961430 4312898 3676020 3986582 3694114 2920733 3066653 3671748
41647C671748r36465k373937j213834J144057J693369N49194k5153J80607k99298
$$ 3671748 2735283 361346 -852488 291569 1984938 2534132 2508979 2689586 2390288
41638B390288j085999n30294P47009N44909q66750r74143N71385J338943L87994
$$ 2390288 1304289 773995 1521004 2065913 1199163 225020 796405 2135348 2523342
41629B523342l71419P9867K31013o27236p69440O09860J505666N89019k41743
$$ 2523342 2151923 2231790 2462803 1835567 1066127 1675987 3181653 3770672 3528929
41620C528929Q00479J953820O17770k270946l445540j830862O42150J979430J721337
$$ 3528929 4329408 6283228 6900998 4630052 1184512 -646350 -4200 1975230 3696567
41611C696567L11810j121553j001878Q43689K269051J498754k00489n44149R1307
$$ 3696567 4008377 2886824 1884946 2728635 4997686 6496440 6295951 5751802 5843109
41602E843109m25874k000666k199304l49282J068090J10216j799939k139524p89986
$$ 5843109 5417235 3416569 1217265 867983 1936073 2046289 246350 -1893174 -2683160
41593b683160K90303O1585l74278M71957K308444L105424J475519j253562k263425
$$ -2683160 -2392857 -2331272 -2705550 -2233593 74851 3180275 4655794 3402232 1138807
41584A138807q27355O57041J59752r74663l08219J638298K141769N71811q30070
$$ 1138807 311452 968493 1128245 153582 -154637 1483661 3625430 4197241 3367171
41575C367171o34206J0191l0934p8275M05145L38719r40920j978182j214644O20491
$$ 3367171 2732965 2743156 2712222 2633947 3039092 3377811 2436891 458709 -755935 -135444
41565a35444J639439J221882Q4167r19190r73064L49659J792902J133081j427286
$$ -135444 1503995 2725877 2810044 1890854 917790 1267449 3060351 4193432 2766146
41556B766146k534889l05904K339786J671686j220475k221056n73820N21127l67469
$$ 2766146 231257 -74647 2265139 3936825 2716350 495294 -78526 442601 75132
41547G5132p96997P96545K116778R47510r93873q73360P94104J421107O03312
$$ 75132 -721865 74680 2191458 3138968 2145095 1271735 2065839 3486946 4090258
41538D090258Q7252K76495k31810j640887k178719r50468N56886P44130P3402
$$ 4090258 4177510 4454005 4222195 2581308 402589 -547879 9007 753137 826539
41529H26539p2819M51185O66212J04824o42232q20952l43372K31425K47303m45948
$$ 826539 753720 1204905 1871117 1975941 1333709 512757 169385 400810 648113 202165
41519B02165j288187j467495o33443Q11258J955458J947254P43262n98744r12086
$$ 202165 -1086022 -2553517 -3186960 -2375702 -420244 1527010 2270272 1671528 759442
41510G59442l60913j55624o15277o33295L13938R61139K35007q03074o39733J20958
$$ 759442 398529 242905 -372372 -1005667 -691729 269410 504417 -298657 -938390 -817432
41500h17432n4046o59832P9151J771812K057752N66689l12261M30738N66147j364166
$$ -817432 -871478 -1531310 -1452159 319653 2377405 2944094 2631833 3062571 3628718 2264552
41490B264552k992385j626848J321083K349155Q90234o67695j060463j151661
$$ 2264552 -727833 -2354681 -1033598 1315557 2205791 1538096 477633 -674028
41482f74028j236330m41201R10511J114940n6404o86602K75840J410675J142262
$$ -674028 -1910358 -2351559 -1441048 -326108 -382512 -1069114 -793274 617401 1759663
41473A759663j42693j188292j464646q81490M81285J571595R38550j026755k048578
$$ 1759663 1616970 428678 -1035968 -1917458 -1436173 135422 1073972 47217 -2001361
41464b001361j059310L63951O53207M89178J038923J713337J366213L14764n09893
$$ -2001361 -3060671 -2696720 -2043513 -1554335 -515412 1197925 2564138 2878902 2369009
41455B369009j149704j740866j418158J17932J318128J052712P43783J900012
$$ 2369009 1219305 -521561 -1939719 -1821787 -503659 549053 1292836 3192848
41447C192848K931077J369325j695805k776443j251750M4466k49216j88093J320740
$$ 3192848 6123925 7493250 5797445 3021002 1769252 1813718 1564502 1376409 2697149
41438B697149K077447L11325j991891j952397K0859J337297J003477l9399j138193
$$ 2697149 4774596 5085921 3094030 1141633 1162492 2499789 3503266 3463867 2325674
41429B325674k124704k150698o49793J034479J114137R7378Q86J074091J493944
$$ 2325674 200970 -1949728 -2599521 -1565042 -450905 -353527 -352641 721450 2215394
41420B215394M21198q04791j022212q34271j021424j044394k27595Q00873R89785
$$ 2215394 2636592 1831801 809589 -24682 -1046106 -2090500 -2318095 -1517222 -527437
41411e27437L48187m21982j092080j779287k158263j693064m41446R67998J948533
$$ -527437 -179250 -601232 -1693312 -3472599 -5630862 -7323926 -7765372 -6797374 -4848841
41402d848841K159366J496935L77699l11265r0841M58658L67838m97555j219264
$$ -4848841 -2689475 -1192540 -814841 -1126106 -1216947 -758289 -390451 -888006 -2107270
41393b107270q36223N32251J557526R09531j099837k431103j574703L85402J057845
$$ -2107270 -2943493 -2411242 -853716 55815 -1044022 -3475125 -5049828 -4664426 -3606581
41384c606581N7502m63494Q56425K345558J708966n13757j709962q69229M07781
$$ -3606581 -3549079 -4012573 -3156148 -810590 898376 384619 -1325343 -2194572 -1786791
41375a786791O11555K31133L89875J031191J362303J127099N46809l00192j185388
$$ -1786791 -1175236 -944103 -554228 476963 1839266 2966365 3513174 3212982 2027594
41366B027594j360627l88573R08124J140004J8759j214232j162023J70794J291408
$$ 2027594 666967 278394 1186518 2326522 2345281 1131049 -30974 139820 1431228
41357A431228P43343j155211k342918j290327R50860J829162M63982j366662j782536
$$ 1431228 2174571 1019360 -1323558 -2613885 -1663025 166137 630119 -736543 -2519079
41348b519079j068704n10579j96412N44862J322060J112868K58682J66307Q61665
$$ -2519079 -3587783 -4098362 -4294774 -3749912 -2427852 -1314984 -1056302 -889995 -28330
41339b8330P68692m35567p25727J129850K967610J877453j386036l095241j754812
$$ -28330 740362 304795 -420932 708918 3676528 5553981 4167945 1072704 -682108
41330f82108j50225j057410k979724k375159Q60264K876519J255957j546962j738614
$$ -682108 -832333 -1889743 -4869467 -7244626 -6384362 -3507843 -2251886 -3798848 -5537462
41321e537462N35137J797127M76476j131526o70492R25440J376214N92147K04460
$$ -5537462 -5002325 -3205198 -2728722 -3860248 -4530740 -3605300 -2229086 -1636939 -1432479
41312a432479N43069L71810n64670r31578j54167N60748L84880L48155J387973
$$ -1432479 -889410 -517600 -1082270 -2013848 -2168015 -1607267 -1222387 -874232 513741
41303E13741K262332J142952j346617k518532j180968P10965O59818j138752k221685
$$ 513741 2776073 3919025 2572408 53876 -1127092 -416127 243691 -895061 -3116746
41294c116746j156784P39650J363545N96980P9173N15970O69272m12336j522473
$$ -3116746 -4273530 -3533880 -2170335 -1573355 -1494182 -978212 -308940 -721276 -2243749
41285b243749r97822N81832J171577M30918R9430Q90885J112184n03344k308375
$$ -2243749 -3241571 -2659739 -1488162 -1057244 -957814 -66929 1045255 541911 -1766464
41276a766464j810934P30619K570821K015160J56115r72983p10077R9362L94714
$$ -1766464 -3577398 -2846779 -275958 1739202 1895317 922334 212257 311619 706333
41267G06333j26432r27786j246324q40024o8815O67745J115392Q67008k38976
$$ 706333 579901 -347885 -1594209 -2434233 -2503048 -1835303 -719911 147097 -91879
41258i1879j234831p00052J089369J923318N49799j369026j521278j32493P70053
$$ -91879 -1326710 -2026762 -937393 985925 1535724 166698 -1354580 -1487073 -717020
41249g17020M76706j817k40204r11037j833054j604077J62710J950688K456922
$$ -717020 -240314 -242131 -482335 -1393372 -3226426 -4830503 -4667793 -2717105 -260183
41240b60183K101831J640798Q01158n93325j478251r44678J19376K20718m78540
$$ -260183 1841648 3482446 4283604 3690279 2212028 1267350 1386726 1607444 1128904
41231A128904n27286M29819J046210K82776j068509j406340k54666J349588K105625
$$ 1128904 601618 1031437 2077647 2360423 1291914 -114426 -369092 980496 3086121
41222C086121J604700L02302j144003k156166k177500j046921M53136J158116
$$ 3086121 4690821 4993123 3849120 1692954 -484546 -1531467 -1078331 79785
41214G9785R85326J043446J730042J743112Q1017j910592k130376q14548j02034
$$ 79785 1065111 2108557 3838599 5581711 5662728 3752136 1621760 807212 705178
41205G05178o53012q85800K4358O63774o2233r17434m09988P07501P69265j34608
$$ 705178 52166 -833634 -809276 -145502 -207735 -1125169 -1535157 -827656 -58391 -192999
41195a92999o24802l43607m4357L1746J93999K13004j53609l2556J343970K641311
$$ -192999 -817801 -1161408 -1205765 -1174019 -980020 -767016 -920625 -953181 390789 3032100
41185C032100J730895r62732k568372j682285j18382O7719o55885p55242j79485
$$ 3032100 4762995 3800263 1231891 -450394 -568776 -501057 -1156942 -1912184 -2091669
41176b091669J58221K33294N06750M83009n65219j883444j946909p03762M74153
$$ -2091669 -1933448 -1700154 -1193404 -710395 -1275614 -3159058 -5105967 -5809729 -5335576
41167e335576R81489J442656J907691J476672K65600j42307P73228J233417r2153
$$ -5335576 -4354087 -2911431 -1003740 472932 738532 596225 1369453 2602870 2510717
41158B510717j643206j209955N41343J120790J39345m54590j1485k06559j671612
$$ 2510717 867511 -342444 198899 1319689 1459034 1004444 992959 786400 -885212
41149h85212k309958n11875K108584L040450K213568J080592k9044j378203k003975
$$ -885212 -3195170 -3707045 -1598461 1441989 3655557 4736149 4707105 3328902 1324927
41140A324927j041358P4692n05700j640179p50126J515319J701481q44701k422361
$$ 1324927 283569 358261 -147439 -1787618 -2537744 -1022425 679056 -165645 -2588006
41131b588006n24629K312698K454258L36990j000015o27847k9682J04930M29249
$$ -2588006 -3112635 -799937 1654321 1991311 991296 363449 333767 438697 867946
41122H67946P66548P4598j358299j873376q24568P63533J971625K642482K243090
$$ 867946 1634494 1709092 350793 -1522583 -2347151 -1583618 388007 3030489 5273579
41113E273579J44085k464029k962692o94569J611225J153531j328697k772854
$$ 5273579 5417664 2953635 -9057 -703626 907599 2061130 732433 -2040421
41105b040421j909199m04984P2241J17705R94950K094216J672334k20250j412089
$$ -2040421 -3949620 -4354604 -4282363 -4164658 -3169708 -1075492 596842 376592 -1035497
41096a035497p01037M57822M42402j2836M45483R81005N5503j202802l49773J796923
$$ -1035497 -1736534 -1278712 -836310 -849146 -403663 577342 632845 -569957 -919730 877193
41086H77193J618745j412291l127189q84660K157130J898402n69155j351354m5880
$$ 877193 2495938 1083647 -2043542 -2928202 -771072 1127330 558175 -793179 -839059
41077h39059N37275l38058o74145m699j59650j398570j557127J04988J530858
$$ -839059 -301784 -639842 -1313987 -1318686 -1478336 -2876906 -4434033 -4329045 -2798187
41068b798187J337969O02922J39038r01470k332003j913334J033078L612241L159407
$$ -2798187 -1460218 -857296 -718258 -1619728 -3951731 -5865065 -4831987 -1219746 1939661
41059A939661R34433j90326J42084L21503o5322j31193J62173K4591m96506p10299
$$ 1939661 2874094 2683768 2825852 3147355 3082033 2950840 3113013 3137604 2641098 1930799
41049A930799o82435q67972q88877j94694N92848M88928j77325l33211L4182P1514
$$ 1930799 1248364 380392 -508485 -703179 -110331 378597 201272 -131939 -97757 -26243
41039b6243l18480m63987k69698k15042j74123M43815J371713J480827K91497
$$ -26243 -344723 -808710 -1078408 -1293450 -1467573 -1023758 347955 1828782 2120279
41030B120279j336443k160513j694660m97358L04658Q8630m48698j84032N97317
$$ 2120279 783836 -1376677 -3071337 -3568695 -3264037 -3175407 -3624105 -3808137 -3210820
41021c210820M65561o14262o78048J175907K819611J995877j93053r81149j88420
$$ -3210820 -2745259 -3359521 -4037569 -2861662 -42051 1953826 1760773 779624 591204
41012E91204j12661j452060k145369q50706Q71067J018871j8806m69025J99555
$$ 591204 478543 -973517 -3118886 -3969592 -3098525 -2079654 -2098460 -2567485 -2367930
41003b367930R86947J019552M17631j96057l74780j66735K0564P0303M47735J271356
$$ -2367930 -1380983 -361431 56200 -139857 -514637 -681372 -660808 -590505 -142770 1128586
40993A128586J512000K31446j570955j788699r7681J450869J226376m7391r12696
$$ 1128586 2640586 2872032 1301077 -487622 -585303 865566 2091942 2044551 1131855
40984A131855j247537j513728j221198J77240J580289J249456n85679j760155
$$ 1131855 -115682 -1629410 -2850608 -2673368 -1093079 156377 -429302 -2189457
40976b189457j071527K76814O80796L35556M76479J232946J438916M42867q57730
$$ -2189457 -3260984 -2984170 -2303374 -1967818 -1491339 -258393 1180523 1623390 765660
40967G65660j064721J33345J665313K119546R90878q76840k021218j699905m78125
$$ 765660 -299061 -165716 1499597 3619143 4610021 3733181 1711963 12058 -466067
40958d66067O25756J239789J441864R19318o26631k241485k187763k43145J611314
$$ -466067 159689 1399478 2841342 3760660 3134029 892544 -1295219 -1538364 72950
40949G2950J659440N29860k81983p69863j594648j886717k56972K226571K667673
$$ 72950 1732390 2262250 1980267 1210404 -384244 -2270961 -2527933 -301362 2366311
40940B366311M87952j475506j068720K30351L4664j213066j323800Q6382J354227
$$ 2366311 2854263 1378757 310037 540388 575052 -638014 -1961814 -1875432 -521205
40931e21205J455021R31511M06578p9464k89907J62228R13573J158673Q16639
$$ -521205 933816 1865327 2271905 2192441 1902534 2064762 2978335 4137008 4953647
40922D953647L86158j09968r29535j636546j522134q25802l88720k74040R4480
$$ 4953647 5339805 5229837 4300302 2663756 1141622 315820 -72900 -346940 -252460
40913b52460N86342M04686n17553j252536j061286k5962J269282J889363R51724
$$ -252460 333882 738568 221015 -1031521 -2092807 -2118769 -849487 1039876 1991600
40904A991600j054027k060582r03292P46484O10773p91699j107611L1421P34565
$$ 1991600 937573 -1123009 -2026301 -1279817 -669044 -1460743 -2568354 -2536933 -1802368
40895a802368L23172K48502J041779J204779K02985j59652J083145J983307P75634
$$ -1802368 -1479196 -1230694 -188915 1015864 1218849 1059197 2142342 4125649 4901283
40886D901283j065808j226545l21932n94611j933928k034183k13951J513391J474604
$$ 4901283 3835475 2608930 2286998 1692387 -241541 -2275724 -2489675 -976284 498320
40877D98320L65116k90345p6346N38257J120382J328348Q83423n0537r88867j715539
$$ 498320 863436 573091 496745 1035002 2155384 3483732 4367155 4316618 3327751 1612212
40867A612212k193377k062577j039536K86495R23519P10873K67285j48374p12337
$$ 1612212 -581165 -2643742 -3683278 -3396783 -2473264 -1762391 -1495106 -1643480 -2355817
40858b355817j041306l72430R79054J564706Q03674m0872K42575Q38783Q0162
$$ -2355817 -3397123 -3769553 -2790499 -1225793 -422119 -462991 -220416 618367 698529
40849F98529j807336k594061j039916J189049J555954k0878j170815m51976O89049
$$ 698529 -1108807 -3702868 -4742784 -3553735 -1997781 -2018659 -3189474 -3641450 -2952401
40840b952401K53999j101240r10602J265893K811378J642329p72688j439080J01611
$$ -2952401 -2698402 -3799642 -4710244 -3444351 -632973 1009356 236668 -1202412 -1100801
40831a100801J489324R87209n66574j474349j250114l37260Q75868J779204J370034
$$ -1100801 388523 1375732 809158 -665191 -1915305 -2252565 -1376697 402507 1772541
40822A772541l67246j637942q53797R04352J082726o57025j804209p26838Q58074
$$ 1772541 1405295 -232647 -1086444 -182092 900634 243609 -1560600 -2287438 -1429364
40813a429364O55169n07487r3614J735049J976110m97978k799200k054771N71658
$$ -1429364 -774195 -1281682 -1375296 359753 2335863 1837885 -961315 -3016086 -2444428
40804b444428J934146J405645Q27807Q66128K71978j157366j624922l02104R10605
$$ -2444428 -510282 895363 1723170 2589298 2861276 1703910 78988 -223116 687489
40795F87489N5643j922696k522943j141302M28009O77558J42942J70819R05589
$$ 687489 743132 -1179564 -3702507 -4843809 -4415800 -3738242 -3595300 -3424481 -2518892
40786b518892J227301M64597n37092n15567L88370Q30593M26414M73211J672222
$$ -2518892 -1291591 -826994 -1364086 -1879653 -1491283 -660690 -234276 238935 1911157
40777A911157K380397P63992k073146l175566j798122k37344k65925q95486n70356
$$ 1911157 4291554 5055546 2982400 -193166 -1991288 -2228632 -2494557 -3390043 -3960399
40768c960399L89012R02595J117378J622905J760926M86514j582412k545279j588133
$$ -3960399 -3571387 -2668792 -1551414 71491 1832417 2318931 736519 -1808760 -3396893
40759c396893J64470J199732J155198O91162M33045L24875j3462l78648O4943
$$ -3396893 -3232423 -2032691 -877493 -186331 246714 571589 558127 179479 244422
40750B44422J376699J971373L81665k315979l328268j590768J055945K421038
$$ 244422 1621121 3592494 3974159 1658180 -1670088 -3260856 -2204911 216127
40742B16127K139754Q83709q33553k241607k320956j225679l36862j21610M78784
$$ 216127 2355881 3239590 2406037 164430 -2156526 -3382205 -3719067 -3840677 -3361893
40733c361893J737273K175213J102614J06486M25084P86240k21991j449695j109902
$$ -3361893 -1624620 550593 1653207 1759693 2184777 2971017 2749026 1299331 189429
40724A89429J37174M67924J5154J91619R04993R77685N33570M89100M11557o40033
$$ 189429 326603 794527 809681 1001300 1906293 2883978 3417548 3906648 4318205 3678172
40714C678172j891313j998620j547348j640654j047376J766036M507164L220599
$$ 3678172 1786859 -211761 -1759109 -3399763 -4447139 -2681103 1826061 5046660
40706E046660j223031l312330q31252J750749J57624l249255l300061L42150L236441
$$ 5046660 3823629 511299 -319953 1430796 1588420 -1660835 -4960896 -4618746 -1382305
40697a382305K662192M48814o71111n64119o18263j072429q54968M56122J658951
$$ -1382305 1279887 1728701 1057590 493471 -124792 -1197221 -2052189 -1596067 62884
40688F2884J400532J80820j55237P92940J079959n80831k308026j515989J106302
$$ 62884 1463416 1644236 1488999 2281939 3361898 2781067 473041 -1042948 63354
40679F3354K553289J872367P68684N2025j274004k918648k711534l33522J475380
$$ 63354 2616643 4489010 5257694 5309719 4035715 1117067 -1594467 -1927989 -452609
40670d52609J045596J95310O47655R74722m12709j864420j098650Q11776J265474
$$ -452609 592987 788297 1435952 2410674 1997965 133545 -965105 -153329 1112145
40661A112145M39511M61239J282837P97527j228188k505893j780308l93920J78319
$$ 1112145 1551656 2012895 3295732 4093259 2865071 359178 -1421130 -1815050 -1636731
40652a636731J35425J19796M1089k28133l68998k63750o6074M04190J256006J768023
$$ -1636731 -1501306 -1381510 -1340421 -1568554 -1937552 -2201302 -2267376 -1863186 -607180 1160843
40642A160843J297811O04369Q15230J427971J008053l47914j088233p63691o15828
$$ 1160843 2458654 3063023 3878253 5306224 6314277 5966363 4878130 4114439 3498611
40633C498611j300393j835687j389958m97084K06987R75906J840008J853323N44308
$$ 3498611 2198218 362531 -1027427 -1524511 -1317524 -341618 1498390 3351713 3896021
40624C896021q87031j010839j82757M0549p87013j422838q70150N3729j55457
$$ 3896021 3008990 1998151 1815394 1855943 1068930 -353908 -1224058 -1170329 -1325786
40615a325786j367642j700290j21007J819240J923259L69762p28753n31470l06360
$$ -1325786 -2693428 -4393718 -4514725 -2695485 -772226 -402464 -1131217 -1662687 -1969047
40606a969047p72417p66752M26117J409160Q53933k98903n26229j56912k48044
$$ -1969047 -2741464 -3508216 -3082099 -1672939 -819006 -1117909 -1644138 -1801050 -2049094
40597b049094l58244M31570J345379J010201q9804m86537l04180o34352j036722
$$ -2049094 -2407338 -1975768 -630389 379812 290008 -196529 -500709 -1135061 -2171783
40588b171783k41066J106338J115823r2385n45685J53339M01181j34438J95539
$$ -2171783 -2412849 -1306511 -190688 -283073 -828758 -675419 -274238 -408676 -213137
40579b13137J721103K326933Q20032j080398j469597q08337m37801n45616q85113
$$ -213137 1507966 3834899 4654931 3574533 2104936 1296599 858798 313182 -571931
40570e71931j595247k060050r25481J401052K287903N04073j599014j349884M85441
$$ -571931 -2167178 -4227228 -5152709 -3751657 -1463754 -959681 -2558695 -3908579 -3423138
40561c423138J221127J92411q98248p21995L88324J336614J169612k26131j426758
$$ -3423138 -2202011 -2009600 -2907848 -3629843 -3241519 -1904905 -735293 -961424 -2388182
40552b388182n94877J787921K840184J135821j074875j075210N98647J567780
$$ -2388182 -2983059 -1195138 1645046 2780867 1705992 630782 1229429 2797209
40544B797209J154383L15098n78072j473552j321170M07900J814091Q64924j162431
$$ 2797209 3951592 4266690 3688618 2215066 893896 1301796 3115887 3980811 2818380
40535B818380j397945K6033K96566j247634k041323p16377P00771L99979k88405
$$ 2818380 1420435 1446468 1743034 495400 -1545923 -2262300 -1561529 -1161550 -1449955
40526a449955M57241J642494J172297n48314j151011J16098J428231J092677l07436
$$ -1449955 -992714 649780 1822077 1273763 122752 238850 1667081 2759758 2452322
40517B452322r51420j12993J078291R92080o50571k412188k679631j315909M89988
$$ 2452322 1500902 1387909 2466200 3458280 2807709 395521 -2284110 -3600019 -3110031
40508c110031J654618J934463J517014O16699m97026j506794k010620j384930
$$ -3110031 -1455413 479050 1996064 2612763 2115737 608943 -1401677 -2786607
40500b786607O16212K764031K981895R82756q81002p05924K59461j76722j431318
$$ -2786607 -2170395 593636 3575531 4558287 3677285 2971361 3230822 3054100 1622782
40491A622782j193263M86691J177889J83343m70259J79373M15348o68952j114827
$$ 1622782 429519 916210 2094099 2277442 1807183 1986556 2401904 1732952 618125
40482F18125M34614J859405P64476j489912j905741n76717j55388j318770j937810
$$ 618125 1052739 2912144 3676620 2186708 280967 -295750 -451138 -1769908 -3707718
40473c707718q21211N71425P91237M31662N68689R92735J005725O00639n1703
$$ -3707718 -4528929 -3957504 -3166267 -2734605 -2165916 -1173181 -167456 433183 381480
40464C81480j098246k095542j687363O94145L422020M033703J907957j023589
$$ 381480 -716766 -2812308 -4499671 -3805526 -383506 3650197 5558154 4534565
40456D534565k276084j270046K69397M16943n94280p72947O33102J693600M96558
$$ 4534565 2258481 988435 1257832 1674775 1080495 307548 940650 2634250 3130808
40447C130808j679262j846505K85782J684236L89849j646790j558528L12853J274961
$$ 3130808 1451546 -394959 -109177 1575059 1964908 318118 -1240410 -927557 347404
40438C47404L01910r80067j090497m27459J41641O26510J046206O68389p02794
$$ 347404 649314 -330753 -1421250 -1848709 -1707068 -1080558 -34352 634037 -68757
40429f8757j669588q64601Q58848J302774l4400j195790n04772J144428J652994
$$ -68757 -1738345 -2602946 -1744098 -441324 -475724 -1671514 -2176286 -1031858 621136
40420F21136N71640n99580o77996j59300j10514o69603j149596j055164n17241
$$ 621136 1192776 593196 -84800 -244100 -354614 -1024217 -2173813 -3228977 -3746218
40411c746218l8469o1053m49178l35447R13464K426443K373163K78753k006748
$$ -3746218 -3784687 -3845740 -4294918 -4630365 -3716901 -1290458 1082705 1361458 -645290
40402f45290k411341j079306J76268L40528M9642K13687Q62297J438308J436803
$$ -645290 -3056631 -4135937 -3959669 -3619141 -3569499 -3355812 -2493515 -1055207 381596
40393C81596O84549l82729q13881j77922O74139O11427k74066r95392j125696
$$ 381596 1066145 683416 -130465 -308387 365752 977179 703113 -292279 -1417975
40384a417975q63418o3498J361862K300529J422312n81330j533390q56342j69043
$$ -1417975 -2281393 -2344891 -983029 1317500 2739812 2158482 625092 -231250 -400293
40375d00293k85798P0040J440731J942180L00439j492689j020188O53755P49712
$$ -400293 -686091 -616051 824680 2766860 3067299 1574610 554422 1208177 1957889
40366A957889o37007q68038P07474J771538R15015m48707q38652p70500j018355
$$ 1957889 1320882 452844 1160318 2931856 3846871 3398164 2559512 1789012 770657
40357G70657j113712p50699o30833p71344m5167J390029J462992m45908j797090
$$ 770657 -343055 -1093754 -1724587 -2495931 -2541098 -1151069 311923 -133985 -1931075
40348a931075n86415J383072J409143J72296J12083R84072N29680j136220j500297
$$ -1931075 -2517490 -1134418 274725 447021 559104 1543176 2072856 936636 -563661
40339e63661j20174M45639r91398k170646j073999J015190J844564J349926O75493
$$ -563661 -683835 -238196 -1229594 -3400240 -4474239 -3459049 -1614485 -264559 410934
40330D10934l0319q68645q48312N65713J744880R14776r15385j191058M42359
$$ 410934 380615 -488030 -1336342 -770629 974251 1889027 973642 -217416 224943
40321B24943J711367J032636n69115j202092l56740J021848J698166J044513m83578
$$ 224943 1936310 2968946 2399831 1197739 840999 1862847 3561013 4605526 4121948
40312D121948j604731j496014p02521k30210j81299j00941j16913n53640q16100
$$ 4121948 2517217 1021203 318682 88472 -92827 -193768 -310681 -864321 -1680421
40303a680421q3673J009785R13929m42542j302470o04937N28767N84471k35262
$$ -1680421 -1764094 -754309 159620 -282922 -1585392 -2190329 -1661562 -1077091 -1312353
40294a312353o53577k48455K78771L24723J7241j96108k4615M80540Q98041P85763
$$ -1312353 -1965930 -2214385 -1935614 -1610891 -1593650 -1789758 -1814373 -1333833 -435792 349971
40284C49971K32657k29812l54060m01723n70180o97336o36174l98364J14757Q86719
$$ 349971 582628 352816 -1244 -402967 -973147 -1670483 -2306657 -2705021 -2590264 -1703545
40274a703545J274464N56562q34957j522366r37207J514L38413K94237M99827
$$ -1703545 -429081 127481 -707476 -2229842 -3167049 -3165535 -2827122 -2532885 -2033058
40265b033058Q71006R01317M38495l27483j016694r22591L47469J770587J657049
$$ -2033058 -1162052 -260735 177760 -149723 -1166417 -2089008 -1741539 29048 1686097
40256A686097L7000j101013p43524l86599j351386k238215j024924J522197K833135
$$ 1686097 1723097 622084 -121440 -508039 -1859425 -4097640 -5122564 -3600367 -767232
40247g67232K203812J138147M61027m03476j297888j074377K2564J47624j076118
$$ -767232 1436580 2574727 3035754 2632278 1334390 260013 282577 430201 -645917
40238f45917j517202J53628K051071J641010o54551k170734j526518J12320R16609
$$ -645917 -2163119 -2009491 41580 1682590 1028039 -1142695 -2669213 -2556893 -1640284
40229a640284K96358j010636j934689k015732j508680n60913J120692L070833
$$ -1640284 -1343926 -2354562 -4289251 -6304983 -7813663 -8374576 -7253884 -4183051
40221d183051L435523J203211j515775j713159J72463Q72006m69368r92737P65464
$$ -4183051 -747528 455683 -1060092 -2773251 -2600788 -1728782 -2198150 -3190887 -2425423
40212b425423K077611O71170j135400k77149J698151J166640j367035k012700
$$ -2425423 -347812 323358 -812042 -1089191 608960 1775600 408565 -1604135
40204a604135J81104J909960Q74129j372771k492007k067317n50107J545299K707560
$$ -1604135 -1423031 486929 1361058 -11713 -2503720 -4571037 -5121144 -3575845 -868285
40195h68285J533278n88854p43901J036313J753042N57529J67880J805339K599281
$$ -868285 664993 76139 -667762 368551 2121593 2679122 2847002 4652341 7251622
40186G251622L50161k573535k977221j566119p61709l25718J218460K655337J471251
$$ 7251622 7601783 5028248 2051027 484908 -276801 -602519 615941 3271278 4742529
40177D742529j674939l367942k081126L95131J905918J818730L06211j807560
$$ 4742529 3067590 -300352 -2381478 -1986347 -80429 1738301 2044512 236952
40169B36952k688039j212916J107953J858597R19803K3195j79007l64701n03393
$$ 236952 -2451087 -3664003 -2556050 -697453 222350 245545 66538 -298163 -801556
40160h01556K6736P32346P35859O75917J486149J999151N61318j581311j697596
$$ -801556 -774820 -42474 693385 1369302 2855451 4854602 5415920 3834609 2137013
40151B137013o4995L84445j035056j841735q68014L4202k44279k31207P87552
$$ 2137013 2072018 2456463 1421407 -420328 -1288342 -1254140 -1498419 -1729626 -942074
40142i42074J084822m4661m64734R73926J923409M76341j217838l63662J746338
$$ -942074 142748 98087 -366647 607279 2530688 3007029 1789191 1425529 3171867
40133C171867J815798k29320j557105j069196m20604o68928q64450k75569L43633
$$ 3171867 4987665 4758345 3201240 2132044 1711440 1042512 178062 -97507 246126
40124B46126K63270j50373l61180m40780n94836p60139p94055n58502k0203M51530
$$ 246126 509396 359023 -2157 -442937 -1037773 -1797912 -2591967 -3150469 -3170672 -2719142
40114b719142M76921N02242J183280J775837P83198j281715j831997K0876J763991
$$ -2719142 -2242221 -1739979 -556699 1219138 2002336 720621 -1111376 -1090500 673491
40105F73491J139524n49883q42523K3318J52173m95750l56897P48522J389540
$$ 673491 1813015 1263132 420609 443927 596100 100350 -256547 491975 1881515
40096A881515Q76478k11357j334185k003261j310178N98011J570135K03408j486541
$$ 1881515 2757993 2546636 1212451 -790810 -2100988 -1502977 67158 270566 -1215975
40087a215975p20429J624633K218095M01360j072006n03795O01449M49555o19484
$$ -1215975 -1936404 -311771 1906324 2307684 1235678 731883 1333332 1782887 1163403
40078A163403j420835j498099p59841N86569J358469N00467r56752r72618M22271
$$ 1163403 -257432 -1755531 -2515372 -1928803 -570334 -69867 -1026619 -1999237 -1576966
40069a576966J227585O68117l4367j91191m61662q52429m38305M88032N00996
$$ -1576966 -349381 318736 284369 93178 -368484 -1220913 -1659218 -1171186 -670190
40060f70190k94788l04766M37094J19982j228511j198094Q14465K138817J157693
$$ -670190 -964978 -1269744 -832650 -712668 -1941179 -3139273 -2324808 -185991 971702
40051I71702n1981N40623J448702M36526j637545k398476j534974l69663N51103
$$ 971702 919721 1460344 2909046 3345572 1708027 -690449 -2225423 -2595086 -2043983
40042b043983J231357J140155L88957L66308J295808J135710r51648k323260q04679
$$ -2043983 -812626 327529 716486 1082794 2378602 3514312 2562664 239404 -565275
40033e65275J293902N51179j909608k088961N31923K402205J513344k91477j071114
$$ -565275 728627 1279806 -629802 -2718763 -2186840 215365 1728709 1437232 366118
40024C66118j269595j490316r53407M47785J110099K20207p34665l02900Q24500
$$ 366118 -903477 -2393793 -3347200 -2899415 -1789316 -1569109 -2303774 -2606674 -1782174
40015a782174J284939J034236O18209j13778j229005j799672j128747o8478J19689
$$ -1782174 -497235 537001 1155210 1041432 -187573 -1987245 -3115992 -3184470 -3064781
40006c064781l70897l10737O26322J383075J010356l9854l74507P08872K166077
$$ -3064781 -3435678 -3746415 -3120093 -1737018 -726662 -766516 -1141023 -432151 1733926
39997A733926K073810j49843k703665l164368j172015J222971J855956N63007
$$ 1733926 3807736 3657893 954228 -2210140 -3382155 -2159184 -303228 259779
39989B59779r91925j154719R6553J176864O91952q29607j624707j143390o45012
$$ 259779 -732146 -1886865 -1790312 -613448 78504 -751103 -2375810 -3519200 -4164212
39980d164212q61112n56324J314990L294332L124339J065922m92573m74702j16010
$$ -4164212 -5025324 -5581648 -4266658 -972326 2152013 3217935 2725362 2250660 2134650
39971B134650l96616n55258J27230Q24999N52794j95143l68276n0846l0109k05158
$$ 2134650 1738034 1182776 1310006 2135005 2687799 2492656 2124380 2073534 2043425 1838267
39961A838267L13816J528805K059417Q51190j185832k013180r65653L06511p3790
$$ 1838267 2152083 3680888 5740305 6591495 5405663 3392483 2426830 2733341 2659551
39952B659551j686866k309286q25371J412792K403098J689222K70004p94385j058210
$$ 2659551 972685 -1336601 -2161972 -749180 1653918 3343140 3613144 2818759 1760549
39943A760549o58071j90977j38342j78369K52369P46323M39285k17066J67430
$$ 1760549 1102478 911501 773159 594790 847159 1593482 2032767 1815701 1983131
39934A983131J366190J270928r10525l064393l023985j285540M55914J648287
$$ 1983131 3349321 4620249 3709724 645331 -2378654 -3664194 -3208280 -1559993
39926a559993K181026J292863p77626j810340n77657Q00808j7409j680212j278500
$$ -1559993 621033 1913896 1136270 -674070 -1251727 -450919 -468328 -2148540 -3427040
39917c427040Q63853J835815Q46488r0008L9137J3185q21371j452382j361338
$$ -3427040 -2563187 -727372 119116 29108 68245 81430 -739941 -2192323 -3553661
39908c553661j258130j261856o02941O27637J499321J920085K244021J772031
$$ -3553661 -4811791 -6073647 -6676588 -6048951 -4549630 -2629545 -385524 1386507
39900A386507R2850r15816M93213K277042J063296k144781k940419l42219J861602
$$ 1386507 1479357 563541 1056754 3333796 4397092 2252311 -688108 -1030327 831275
39891H31275J376837L55046O14012N37627r96154j821228m13153J029746L85492
$$ 831275 2208112 2563158 3177170 3714797 2718643 897415 484262 1514008 1899500
39882A899500p53341k55287P31104K97839n60756m7697R94423Q62400P7666k45351
$$ 1899500 1146159 890872 1621976 1919815 1359059 1311362 2305785 3168185 3245851 3000500
39872C000500q75853k311477k527974k27798J929797J016104j256726j209461
$$ 3000500 2124647 -186830 -2714804 -2942602 -1012805 3299 -1253427 -2462888
39864b462888R36494J969430J128355M07543L14574m65670j603780j312047J41699
$$ -2462888 -1526394 443036 1571391 1978934 2293508 1827838 224058 -1087989 -946290
39855i46290P42961L68498O02970J252531P38214l30957M6491J026299j79189
$$ -946290 -203329 165169 768139 2020670 2758884 2427927 2474418 3500717 3321528
39846C321528k855410k923308L79579K594966P62831k167626k220107m9710J309756
$$ 3321528 466118 -2457190 -2077611 517355 1280186 -887440 -3107547 -3157257 -1847501
39837a847501J364658J430376J177336m98146k357684j950880M61416J917890
$$ -1847501 -482843 947533 2124869 1626723 -730961 -2681841 -2220425 -302535
39829c02535R01635p58782p35423P05686J448218N48115n84541k13657J199073
$$ -302535 599100 -159682 -895105 -189419 1258799 1806914 1222373 1008716 2207789
39820B207789J473089j76785j790835j383509J58006N03664o01134j274633o28709
$$ 2207789 3680878 3504093 1713258 329749 487755 991419 390285 -884348 -1513057
39811a513057K34357N22908R11714J771156K092211J101968m20711j314184j484574
$$ -1513057 -1278700 -755792 155922 1927078 4019289 5121257 4700546 3386362 1901788
39802A901788j479878j426766r92981J1954J193597J588357O25337o74721o00583
$$ 1901788 421910 -1004856 -1997837 -1985883 -792286 796071 1421408 746687 146104
39793A46104N85611O33161r58589j529853M05286K041245O54849j352978r7242
$$ 146104 731715 1364876 406287 -1123566 -718280 1322965 1977814 624836 527594
39784E27594K921901K828266n74016k503375j163005P500p29576l66159K460319
$$ 527594 3449495 6277761 5703745 3200370 2037365 2044865 1315289 949130 3409449
39775C409449L802772P98009l084183l338334j024250J48867j22981L7487M10263
$$ 3409449 7212221 8010230 4926047 1587713 563463 712330 589349 626836 1037099
39766A037099M6363K92874K079246K728729P3129k732457j614815J359241J049138
$$ 1037099 1083462 1376336 3455582 6184311 6257440 3524983 1910168 3269409 4318547
39757D318547k122683k848284J58404K278058Q14880j180245o74417Q52955R85217
$$ 4318547 2195864 -652420 -494016 1784042 2598922 1418677 744260 1597215 2582432
39748B582432K45261r258j24706m11402P1903J083733N70945j649953k641701
$$ 2582432 2827693 2818435 2693729 2282327 2354230 3437963 4008908 2358955 -282746
39739b82746q53538J102780N59745j069137r37717P55627J743015J348905N19174
$$ -282746 -1136284 -33504 526241 -542896 -1480613 -724986 1018029 2366934 2886108
39730B886108l76284j361168j718769j144598p41219j003486m77611J499155K663040
$$ 2886108 2509824 1148656 -570113 -1714711 -2455930 -3459416 -3937027 -2437872 225168
39721B25168J083150j198138r20159J332998K240837J020422o2322q2069n20423
$$ 225168 1308318 110180 -809979 523019 2763856 3784278 3721956 3639887 3119464
39712C119464j624840j476051K78279J179947p1556j470026j268992p92113j496842
$$ 3119464 1494624 18573 296852 1476799 1405243 -64783 -1333775 -2125888 -3622730
39703c622730j919791l40295J665311J549810J58727K96608J823569J909080Q3009
$$ -3622730 -5542521 -5882816 -4217505 -2667695 -2508968 -2212360 -388791 1520289 1603298
39694A603298p82294O32329J789365N69062j220659r54906N92331R24267J2257
$$ 1603298 821004 1453333 3242698 3811760 2591101 1636195 2228526 3152793 3165050
39685C165050k30021L17490p0786j480723j840104l98105R02290N10891m49814
$$ 3165050 2935029 3252519 3181733 1701010 -139094 -537199 365091 875982 426168
39676D26168k69075P05612R58948J49757q27315j344970j424016j112411m19448
$$ 426168 157093 862705 1821653 1971410 1144095 -200875 -1624891 -2737302 -3156750
39667c156750M01365J016584J178185O79791k30260n86664Q9684O06493l23622
$$ -3156750 -2755385 -1738801 -560616 119175 -111085 -697749 -608065 -1572 -325194
39658c25194j549854p51259J566653K160172J28183j189840N86039K714988J456932
$$ -325194 -1875048 -2626307 -1059654 1100518 1228701 38861 624900 3339888 4796820
39649D796820j864521k718527j12060K461104K544881J392138O50598o6056j108826
$$ 4796820 2932299 213772 101712 2562816 5107697 6499835 7150433 7084377 5975551
39640E975551j300310j54512O93008o2231j298419j369788n74096j79428k40940
$$ 5975551 4675241 4520729 5213737 5151506 3853087 2483299 1909203 1729775 1488835
39631A488835N1316P01987R72239N99613l7270n25160n32627R1746Q09994O73617
$$ 1488835 1540151 2242138 3214377 3813990 3776720 3251560 2718933 2810679 3620673 4294290
39621D294290m03143j357782j358402p07407q8042J93110l5503p54977j161830
$$ 4294290 3891147 2533365 1174963 467556 379514 572624 537121 -217856 -1379686
39612a379686k94886J355405K078280J236700P3513k72410j89352l67489n22424
$$ -1379686 -1674572 -319167 1759113 2995813 3069326 2796916 2607564 2240075 1717651
39603A717651k19597J73769J77677j54719p89093j684412j863734k13961K188607
$$ 1717651 1498054 1671823 1849500 1694781 905688 -778724 -2642458 -2856419 -667812
39594f67812K587842M07360j551410j188062r6215m79289j328131m78992J232011
$$ -667812 1920030 2327390 775980 -412082 -508297 -987586 -2315717 -2794709 -1562698
39585a562698J222583l41267p74978N92206J491657P27836r2684J80783J92244
$$ -1562698 -340115 -681382 -1456360 -864154 627503 1355339 1262655 1443438 1635682
39576A635682j170957k427231j847528l09956L11714K97948J318851L141433L417939
$$ 1635682 464725 -1962506 -3810034 -4119990 -3808276 -3510328 -2191477 949956 4367895
39567D367895J066422j873098k606405q86914R22709P67080q88006j954751j324583
$$ 4367895 5434317 3561219 954814 67900 990609 1757689 869683 -1085068 -2409651
39558b409651Q9488Q95729R38713Q71749P37475R7940o52818l96215R60129J876111
$$ -2409651 -2320163 -1424434 -485721 386028 1123503 1221443 568625 172410 1132539 3008650
39548C008650R63847j221459k733734k238890j65983J750311J868837Q7108j830946
$$ 3008650 3972497 2751038 17304 -2221586 -2387569 -637258 1231579 1318687 -512259
39539e12259j857577O6924J884581J808123L04779p63762m53407M98115R35965
$$ -512259 -2369836 -2302912 -418331 1389792 1694571 930809 477402 975517 1911482
39530A911482N42043k43988r28157j248987j079339m51670L02003O94772N39585
$$ 1911482 2453525 2209537 1281380 32393 -1046946 -1498616 -1196613 -501841 37744
39521C7744J67250J2390M8312q4613l82930l52624J70662N09907j3095r56368
$$ 37744 204994 217384 265696 181083 -201847 -554471 -383809 126098 113003 -843365
39511h43365j159070l34698M12888P0511p69587n74337J005455K437049K187625
$$ -843365 -2002435 -2337133 -1924245 -1853734 -2623321 -3197658 -2192203 244846 2432471
39502B432471P59833k3939L78663N37822n72235j762990j422579k11459j52060
$$ 2432471 3192304 3168365 3547028 4084850 3512615 1749625 327046 115587 -36473
39493c6473j295370j420048M24538K136678J580775k44834p78280M30503J507906
$$ -36473 -1331843 -2751891 -2327353 -190675 1390100 1145266 366986 797489 2305395
39484B305395J223754L42784J510K29407L56361j29118j240080k223947j884818
$$ 2305395 3529149 3871933 3873443 4102850 4459211 4330093 3090013 866066 -1018752
39475a018752j27416J241451N57880j159187j319951N66965K107589J413121l67080
$$ -1018752 -1146168 95283 653163 -506024 -1825975 -1259010 848579 2261700 1894620
39466A894620q83394K41177J268459P87207p00672j537935p93713O37612R74894
$$ 1894620 1011226 1252403 2520862 3308069 2607397 1069462 275749 913361 1888255
39457A888255j71813j103389m28202O91010K76124j109333j058202O32412J381812
$$ 1888255 1716442 613053 184851 875861 1151985 42652 -1015550 -383138 998674
39448I98674J31419o69438Q31246K458265J392232j043768j371044M15035R74427
$$ 998674 1130093 460655 1291901 3750166 5142398 4098630 2727586 3142621 4117048
39439D117048p53415j910178o68091P20964j85110j892776j461092O85850J448782
$$ 4117048 3363633 1453455 785364 1506328 1321218 -571558 -2032650 -1346800 101982
39430A01982j91698j958677j890142p00231J15868N01555J047136J423349R50057
$$ 101982 -89716 -2048393 -3938535 -4638766 -4522898 -4021343 -2974207 -1550858 -600801
39421f00801l0111m95634q9205O89041J235505J073925j40951j883151k413768
$$ -600801 -630912 -1126546 -1215751 -526710 708795 1782720 1641769 -241382 -2655150
39412b655150m53218K715433M050413K194078q32129k101245j197327j80414n71126
$$ -2655150 -3108368 -392935 3657478 5851556 5019427 2918182 1720855 1540441 969315
39403I69315j604040j714790p53306M9373r4744n97237n39710j1492J75698j17659
$$ 969315 -634725 -2349515 -3102821 -3053448 -3148192 -3745429 -4285139 -4296631 -4120933 -4238592
39393d238592k9393R36568J871656J511556J3389j162387j107083l13612M84538
$$ -4238592 -4267985 -3331417 -1459761 51795 65184 -1097203 -2204286 -2517898 -2033360
39384b033360J323853K305950K721085J766616k13941j932962k437908j754712
$$ -2033360 -709507 1596443 4317528 6084144 5870203 3937241 1499333 -255379
39376b55379n87158J70363K0372n24757l22488R03332J945375J582840J23031
$$ -255379 -842537 -672174 -651802 -1176559 -1499047 -595715 1349660 2932500 3055531
39367C055531j191378j691720j414477m65831O75445R01558j82421j216543p94503
$$ 3055531 1864153 172433 -1242044 -1707875 -1032430 -130872 -313293 -1529836 -2324339
39358b324339L61195O09737J93362O12520J450069N94257j814675k592016j66262
$$ -2324339 -1963144 -1353407 -1160045 -547525 902544 1496801 -317874 -2909890 -3076152
39349c076152K545653K147718l23231j189222M18820J835116J151353n88514j756559
$$ -3076152 -530499 1617219 1293988 104766 523586 2358702 3510055 2921541 1164982
39340A164982k216186k244053j419920K55588J576609J619107R99825O86194M98313
$$ 1164982 -1051204 -3295257 -4715177 -4459589 -2882980 -1263873 -264048 422146 920459
39331I20459j44308p83111n04869M16151P15081k0661q00321p79682l73698k56635
$$ 920459 776151 -6960 -511829 -95678 619403 598742 -201579 -981261 -1354959 -1611594
39321a611594r4364P43951J665719J342782j49462j005032j62075J104943J161860
$$ -1611594 -1705958 -962007 703712 2046494 1897032 892000 729925 1834868 2996728
39312B996728M62145L74733M57930p65130k562236k331546J45873J650243K57139
$$ 2996728 3458873 3833606 4291536 3526406 964170 -1367376 -1221503 428740 685879
39303F85879j538965p71170J246793J276956l76142o00865R54931J218744q70245
$$ 685879 -853086 -1624256 -377463 899493 523351 -77514 877417 2096161 1225916
39294A225916k280022q66956J025426L90555j679233j962530o1949J616573J806253
$$ 1225916 -1054106 -1921062 -895636 -505081 -2184314 -4146844 -4208793 -2592220 -785967
39285g85967J402430R95915J21660r47094j071590l30813j63102r00691j098463
$$ -785967 616463 1612378 1734038 786944 -284646 -615459 -778561 -1679252 -2777715
39276b777715l7009R60074P48759K63269Q18169J779645J554927J56136q71311
$$ -2777715 -2814724 -1854650 -1105891 -842622 -24453 1755192 3310119 3466255 2594944
39267B594944q10707n38216p83523r41224j66472J211672K054728J782005Q34928
$$ 2594944 1784237 1246021 462498 -478726 -645198 566474 2621202 4403207 5238135
39258E238135k9670m70864o01014o10899n38933l84232l03257m96772q49078r11107
$$ 5238135 5208465 4737601 4136587 3525688 2986755 2602523 2299266 1802494 953416 42309
39248D2309m64404O2967P7206l28791l89045L45477J341181J614285P33079q46385
$$ 42309 -422095 -359128 -281922 -610713 -999758 -654281 686900 2301185 3034264 2187879
39238B187879k157372k232390o92114J581090K623513J170270j510638k478803
$$ 2187879 30507 -2201883 -2893997 -1312907 1310606 2480876 970238 -1508565
39230a508565n25389J971864J721890j208068l232245j828279J102687J778138
$$ -1508565 -2033954 -62090 1659800 451732 -2780513 -4608792 -3506105 -1727967
39222a727967l19786j738593J37002L315021L685596M46592k839514k843900m24410
$$ -1727967 -2047753 -3786346 -3649344 -334323 3351273 3797865 958351 -1885549 -2309959
39213b309959J109932N07883l85358J90546J548693J978926J085414l33290j660138
$$ -2309959 -1200027 -692144 -1077502 -886956 661737 2640663 3726077 3392787 1732649
39204A732649k434065j801488L35373K015294R98168j910676l208738j146489
$$ 1732649 -701416 -2502904 -2167531 -152237 845931 -1064745 -4273483 -5419972
$$ [...]
##END NTUPLES=NMR SPECTRUM
##END=
